<?xml version="1.0" encoding="UTF-8" standalone="no"?>
<!-- Created with Inkscape (http://www.inkscape.org/) -->

<svg
   xmlns:dc="http://purl.org/dc/elements/1.1/"
   xmlns:cc="http://creativecommons.org/ns#"
   xmlns:rdf="http://www.w3.org/1999/02/22-rdf-syntax-ns#"
   xmlns:svg="http://www.w3.org/2000/svg"
   xmlns="http://www.w3.org/2000/svg"
   xmlns:sodipodi="http://sodipodi.sourceforge.net/DTD/sodipodi-0.dtd"
   xmlns:inkscape="http://www.inkscape.org/namespaces/inkscape"
   width="744.09448819"
   height="1052.3622047"
   id="svg4229"
   version="1.1"
   inkscape:version="0.47 r22583"
   sodipodi:docname="Новый документ 13">
  <defs
     id="defs4231">
    <inkscape:perspective
       sodipodi:type="inkscape:persp3d"
       inkscape:vp_x="0 : 526.18109 : 1"
       inkscape:vp_y="0 : 1000 : 0"
       inkscape:vp_z="744.09448 : 526.18109 : 1"
       inkscape:persp3d-origin="372.04724 : 350.78739 : 1"
       id="perspective4237" />
    <inkscape:perspective
       id="perspective4183"
       inkscape:persp3d-origin="0.5 : 0.33333333 : 1"
       inkscape:vp_z="1 : 0.5 : 1"
       inkscape:vp_y="0 : 1000 : 0"
       inkscape:vp_x="0 : 0.5 : 1"
       sodipodi:type="inkscape:persp3d" />
  </defs>
  <sodipodi:namedview
     id="base"
     pagecolor="#ffffff"
     bordercolor="#666666"
     borderopacity="1.0"
     inkscape:pageopacity="0.0"
     inkscape:pageshadow="2"
     inkscape:zoom="0.7"
     inkscape:cx="67.296587"
     inkscape:cy="807.81091"
     inkscape:document-units="px"
     inkscape:current-layer="layer1"
     showgrid="false"
     inkscape:window-width="1280"
     inkscape:window-height="735"
     inkscape:window-x="-4"
     inkscape:window-y="19"
     inkscape:window-maximized="1" />
  <metadata
     id="metadata4234">
    <rdf:RDF>
      <cc:Work
         rdf:about="">
        <dc:format>image/svg+xml</dc:format>
        <dc:type
           rdf:resource="http://purl.org/dc/dcmitype/StillImage" />
        <dc:title></dc:title>
      </cc:Work>
    </rdf:RDF>
  </metadata>
  <g
     inkscape:label="Layer 1"
     inkscape:groupmode="layer"
     id="layer1">
    <g
       transform="matrix(0.75147057,0,0,0.66102163,140.0721,45.183601)"
       id="g4083">
      <rect
         style="fill:#ffffff"
         x="-120.125"
         y="-39.7812"
         width="174"
         height="38"
         id="rect4085" />
      <rect
         style="fill:none;stroke:#000000;stroke-width:2"
         x="-120.125"
         y="-39.7812"
         width="174"
         height="38"
         id="rect4087" />
      <text
         style="font-size:12.80000019px;font-style:normal;font-weight:normal;text-anchor:middle;fill:#000000;font-family:sanserif"
         x="-33.125"
         y="-16.881201"
         id="text4089">
        <tspan
           x="-33.125"
           y="-16.881201"
           id="tspan4091" />
      </text>
    </g>
    <g
       transform="matrix(0.75147057,0,0,0.66102163,140.0721,45.183601)"
       id="g4093">
      <line
         style="fill:none;stroke:#000000;stroke-width:2"
         x1="-170.373"
         y1="-20.856199"
         x2="-129.86099"
         y2="-20.7957"
         id="line4095" />
      <polygon
         style="fill:#000000"
         points="-129.861,-20.7957 -132.354,-25.7995 -122.361,-20.7845 -132.369,-15.7995 "
         id="polygon4097" />
      <polygon
         style="fill:none;stroke:#000000;stroke-width:2"
         points="-129.861,-20.7957 -132.354,-25.7995 -122.361,-20.7845 -132.369,-15.7995 "
         id="polygon4099" />
    </g>
    <g
       transform="matrix(0.75147057,0,0,0.66102163,140.0721,45.183601)"
       id="g4101">
      <rect
         style="fill:#ffffff"
         x="-120.255"
         y="15.1188"
         width="174"
         height="38"
         id="rect4103" />
      <rect
         style="fill:none;stroke:#000000;stroke-width:2"
         x="-120.255"
         y="15.1188"
         width="174"
         height="38"
         id="rect4105" />
      <text
         style="font-size:12.80000019px;font-style:normal;font-weight:normal;text-anchor:middle;fill:#000000;font-family:sanserif"
         x="-33.255199"
         y="38.018799"
         id="text4107">
        <tspan
           x="-33.255199"
           y="38.018799"
           id="tspan4109" />
      </text>
    </g>
    <g
       transform="matrix(0.75147057,0,0,0.66102163,140.0721,45.183601)"
       id="g4111">
      <line
         style="fill:none;stroke:#000000;stroke-width:2"
         x1="-160.88699"
         y1="34.340599"
         x2="-120.255"
         y2="34.118801"
         id="line4113" />
      <polygon
         style="fill:#000000"
         points="-160.887,34.3406 -158.36,39.3269 -168.387,34.3816 -158.414,29.3271 "
         id="polygon4115" />
      <polygon
         style="fill:none;stroke:#000000;stroke-width:2"
         points="-160.887,34.3406 -158.36,39.3269 -168.387,34.3816 -158.414,29.3271 "
         id="polygon4117" />
    </g>
    <g
       transform="matrix(0.75147057,0,0,0.66102163,140.0721,45.183601)"
       id="g4119">
      <line
         style="fill:none;stroke:#000000;stroke-width:2"
         x1="100.877"
         y1="33.893799"
         x2="63.480801"
         y2="34.0723"
         id="line4121" />
      <polygon
         style="fill:#000000"
         points="63.4808,34.0723 66.0046,39.0603 55.9808,34.1081 65.9569,29.0604 "
         id="polygon4123" />
      <polygon
         style="fill:none;stroke:#000000;stroke-width:2"
         points="63.4808,34.0723 66.0046,39.0603 55.9808,34.1081 65.9569,29.0604 "
         id="polygon4125" />
    </g>
    <g
       transform="matrix(0.75147057,0,0,0.66102163,140.0721,45.183601)"
       id="g4127">
      <rect
         style="fill:#ffffff"
         x="166.10201"
         y="-39.9562"
         width="174"
         height="38"
         id="rect4129" />
      <rect
         style="fill:none;stroke:#000000;stroke-width:2"
         x="166.10201"
         y="-39.9562"
         width="174"
         height="38"
         id="rect4131" />
      <text
         style="font-size:12.80000019px;font-style:normal;font-weight:normal;text-anchor:middle;fill:#000000;font-family:sanserif"
         x="253.10201"
         y="-17.0562"
         id="text4133">
        <tspan
           x="253.10201"
           y="-17.0562"
           id="tspan4135" />
      </text>
    </g>
    <g
       transform="matrix(0.75147057,0,0,0.66102163,140.0721,45.183601)"
       id="g4137">
      <line
         style="fill:none;stroke:#000000;stroke-width:2"
         x1="377.49799"
         y1="-21.134701"
         x2="340.10199"
         y2="-20.9562"
         id="line4139" />
      <polygon
         style="fill:#000000"
         points="377.498,-21.1347 374.974,-26.1227 384.998,-21.1705 375.022,-16.1228 "
         id="polygon4141" />
      <polygon
         style="fill:none;stroke:#000000;stroke-width:2"
         points="377.498,-21.1347 374.974,-26.1227 384.998,-21.1705 375.022,-16.1228 "
         id="polygon4143" />
    </g>
    <g
       transform="matrix(0.75147057,0,0,0.66102163,140.0721,45.183601)"
       id="g4145">
      <rect
         style="fill:#ffffff"
         x="166.16299"
         y="-40.0438"
         width="40"
         height="38"
         id="rect4147" />
      <rect
         style="fill:none;stroke:#000000;stroke-width:2"
         x="166.16299"
         y="-40.0438"
         width="40"
         height="38"
         id="rect4149" />
      <text
         style="font-size:12.80000019px;font-style:normal;font-weight:normal;text-anchor:middle;fill:#000000;font-family:sanserif"
         x="186.16299"
         y="-17.143801"
         id="text4151">
        <tspan
           x="186.16299"
           y="-17.143801"
           id="tspan4153">S</tspan>
      </text>
    </g>
    <g
       transform="matrix(0.75147057,0,0,0.66102163,140.0721,45.183601)"
       id="g4155">
      <polyline
         style="fill:none;stroke:#000000;stroke-width:2"
         points="166.102,-20.9562 138.492,-20.7312 138.492,30.2688 186.492,29.7688 186.264,7.69181 "
         id="polyline4157" />
      <polygon
         style="fill:#000000"
         points="186.264,7.69181 181.29,10.2434 186.186,0.192208 191.289,10.1399 "
         id="polygon4159" />
      <polygon
         style="fill:none;stroke:#000000;stroke-width:2"
         points="186.264,7.69181 181.29,10.2434 186.186,0.192208 191.289,10.1399 "
         id="polygon4161" />
    </g>
    <text
       style="font-size:9.02139759px;font-style:normal;font-weight:normal;text-anchor:start;fill:#000000;font-family:sanserif"
       x="266.33511"
       y="84.662292"
       id="text4163"
       transform="scale(1.0662233,0.93788985)">
      <tspan
         x="266.33511"
         y="84.662292"
         id="tspan4165">Заполнение знаком</tspan>
    </text>
  </g>
</svg>
