<?xml version="1.0" encoding="UTF-8" standalone="no"?>
<!-- Created with Inkscape (http://www.inkscape.org/) -->

<svg
   xmlns:dc="http://purl.org/dc/elements/1.1/"
   xmlns:cc="http://creativecommons.org/ns#"
   xmlns:rdf="http://www.w3.org/1999/02/22-rdf-syntax-ns#"
   xmlns:svg="http://www.w3.org/2000/svg"
   xmlns="http://www.w3.org/2000/svg"
   xmlns:sodipodi="http://sodipodi.sourceforge.net/DTD/sodipodi-0.dtd"
   xmlns:inkscape="http://www.inkscape.org/namespaces/inkscape"
   width="128"
   height="128"
   id="svg2991"
   version="1.1"
   inkscape:version="0.48.0 r9654"
   sodipodi:docname="contactList.svg">
  <defs
     id="defs2993" />
  <sodipodi:namedview
     id="base"
     pagecolor="#000000"
     bordercolor="#666666"
     borderopacity="1.0"
     inkscape:pageopacity="1"
     inkscape:pageshadow="2"
     inkscape:zoom="3.9590209"
     inkscape:cx="32.79143"
     inkscape:cy="65.584507"
     inkscape:current-layer="layer1"
     showgrid="true"
     inkscape:grid-bbox="true"
     inkscape:document-units="px"
     inkscape:window-width="1360"
     inkscape:window-height="824"
     inkscape:window-x="2152"
     inkscape:window-y="0"
     inkscape:window-maximized="0" />
  <metadata
     id="metadata2996">
    <rdf:RDF>
      <cc:Work
         rdf:about="">
        <dc:format>image/svg+xml</dc:format>
        <dc:type
           rdf:resource="http://purl.org/dc/dcmitype/StillImage" />
        <dc:title></dc:title>
      </cc:Work>
    </rdf:RDF>
  </metadata>
  <g
     id="layer1"
     inkscape:label="Layer 1"
     inkscape:groupmode="layer"
     transform="translate(0,96)">
    <path
       style="fill:none;stroke:#ffffff;stroke-width:4.67700005;stroke-linecap:round;stroke-linejoin:round;stroke-miterlimit:4;stroke-opacity:1;stroke-dasharray:none"
       d="m 21.031669,-34.184869 c -0.504391,-29.966243 15.40332,-29.297343 30.057937,-30.563113 15.267751,-2.297519 25.648131,8.544754 29.047591,14.650087 4.43143,7.976349 -0.50518,9.850921 1.26293,15.40785 0.75777,3.536228 9.59833,11.871623 8.08281,15.913026 -3.03105,4.293991 -12.12421,-0.505176 -12.12421,2.778465 -1.24334,7.930489 1.70728,28.766508 -15.913025,27.279469 C 40.240265,9.491325 22.547196,-22.060659 21.031669,-34.184869 z"
       id="path3772-4"
       inkscape:connector-curvature="0"
       sodipodi:nodetypes="ccccccsc" />
    <path
       style="fill:none;stroke:#ffffff;stroke-width:3.66245484;stroke-linecap:round;stroke-linejoin:round;stroke-miterlimit:4;stroke-opacity:1;stroke-dasharray:none"
       d="m 68.748896,-70.877992 c 4.499335,-2.926186 10.482504,-3.043035 16.220355,-3.538633 11.955841,-1.799137 20.084489,6.691207 22.746529,11.472157 3.47016,6.246102 -0.39559,7.714038 0.98897,12.065545 0.5934,2.769142 7.51624,9.296405 6.32947,12.461137 -2.37354,3.362529 -9.4942,-0.395592 -9.4942,2.175755 -0.97363,6.210189 -0.93635,23.284176 -14.734427,22.119709"
       id="path3772-4-5"
       inkscape:connector-curvature="0"
       sodipodi:nodetypes="ccccccc" />
    <path
       style="fill:none;stroke:#ffffff;stroke-width:4.04778051;stroke-linecap:round;stroke-linejoin:round;stroke-miterlimit:4;stroke-opacity:1;stroke-dasharray:none"
       d="m 45.909769,-64.384237 c 5.37741,-4.329455 13.449124,-5.378544 19.760893,-6.201095 13.114916,-2.560242 22.497708,6.42447 25.666459,11.575703 4.13135,6.73023 -0.06665,8.536572 1.670949,13.274927 0.788081,3.029122 8.74527,9.904124 7.58673,13.455465 -2.459441,3.82669 -10.502163,0.01878 -10.378779,2.857971 -0.777061,6.903809 2.557115,24.8087809 -12.734144,24.1851071"
       id="path3772-4-0"
       inkscape:connector-curvature="0"
       sodipodi:nodetypes="ccccccc" />
  </g>
</svg>
