<?xml version="1.0" encoding="UTF-8" standalone="no"?>
<!-- Created with Inkscape (http://www.inkscape.org/) -->

<svg
   xmlns:dc="http://purl.org/dc/elements/1.1/"
   xmlns:cc="http://creativecommons.org/ns#"
   xmlns:rdf="http://www.w3.org/1999/02/22-rdf-syntax-ns#"
   xmlns:svg="http://www.w3.org/2000/svg"
   xmlns="http://www.w3.org/2000/svg"
   xmlns:sodipodi="http://sodipodi.sourceforge.net/DTD/sodipodi-0.dtd"
   xmlns:inkscape="http://www.inkscape.org/namespaces/inkscape"
   width="128"
   height="128"
   id="svg2"
   inkscape:label="Pozadí"
   version="1.1"
   inkscape:version="0.48.1 r9760"
   sodipodi:docname="minimalize.svg"
   inkscape:export-filename="/media/data/cecko/QT/makneto/ui/mobile/declarative/img/minimalize.png"
   inkscape:export-xdpi="90"
   inkscape:export-ydpi="90">
  <defs
     id="defs3">
    <filter
       id="filter3798"
       inkscape:label="Fancy blur"
       inkscape:menu="Blurs"
       inkscape:menu-tooltip="Smooth colorized contour which allows desaturation and hue rotation"
       color-interpolation-filters="sRGB">
      <feGaussianBlur
         id="feGaussianBlur3800"
         stdDeviation="5"
         result="result1" />
      <feComposite
         id="feComposite3802"
         in2="result1"
         operator="arithmetic"
         k2="2"
         in="result1" />
    </filter>
    <filter
       id="filter3877"
       inkscape:label="Fancy blur"
       inkscape:menu="Blurs"
       inkscape:menu-tooltip="Smooth colorized contour which allows desaturation and hue rotation"
       color-interpolation-filters="sRGB">
      <feGaussianBlur
         id="feGaussianBlur3879"
         stdDeviation="5"
         result="result1" />
      <feComposite
         id="feComposite3881"
         in2="result1"
         operator="arithmetic"
         k2="2"
         in="result1" />
    </filter>
  </defs>
  <sodipodi:namedview
     id="base"
     pagecolor="#000000"
     bordercolor="#666666"
     borderopacity="1.0"
     inkscape:pageopacity="0"
     inkscape:pageshadow="2"
     inkscape:zoom="2.8"
     inkscape:cx="41.285733"
     inkscape:cy="46.35334"
     inkscape:document-units="px"
     inkscape:current-layer="g3762-6"
     showgrid="false"
     inkscape:window-width="1600"
     inkscape:window-height="852"
     inkscape:window-x="-4"
     inkscape:window-y="-3"
     inkscape:window-maximized="1" />
  <metadata
     id="metadata6">
    <rdf:RDF>
      <cc:Work
         rdf:about="">
        <dc:format>image/svg+xml</dc:format>
        <dc:type
           rdf:resource="http://purl.org/dc/dcmitype/StillImage" />
        <dc:title></dc:title>
      </cc:Work>
    </rdf:RDF>
  </metadata>
  <g
     inkscape:label="Vrstva 1"
     inkscape:groupmode="layer"
     id="layer1"
     transform="translate(0,-924.36218)">
    <g
       id="g3762-6"
       transform="matrix(0.98832809,0,0,1.2645657,50.426215,-312.24102)">
      <g
         id="g3854"
         style="filter:url(#filter3877)">
        <rect
           ry="12.558324"
           y="979.02789"
           x="6.9211836"
           height="56.512474"
           width="73.535835"
           id="rect2986-2"
           style="color:#000000;fill:none;stroke:#ffffff;stroke-width:4.94943904999999962;stroke-linecap:round;stroke-linejoin:round;stroke-miterlimit:4;stroke-opacity:1;stroke-dasharray:none;stroke-dashoffset:0;marker:none;visibility:visible;display:inline;overflow:visible;enable-background:accumulate"
           transform="matrix(1.0118098,0,0,0.79078533,-51.021736,246.91562)" />
        <g
           id="g3848">
          <g
             id="g3845"
             transform="translate(-4.3438493,2.196738)">
            <path
               style="color:#000000;fill:none;stroke:#ffffff;stroke-width:3.5999999;stroke-linecap:round;stroke-linejoin:round;stroke-miterlimit:4;stroke-opacity:1;stroke-dasharray:none;stroke-dashoffset:0;marker:none;visibility:visible;display:inline;overflow:visible;enable-background:accumulate"
               d="M 35,86.928571 71.285935,59.502475"
               id="path2988-6"
               inkscape:connector-curvature="0"
               transform="translate(0,924.36218)"
               sodipodi:nodetypes="cc" />
          </g>
          <path
             inkscape:connector-curvature="0"
             id="path2992-9"
             d="m 45.299008,1013.1303 -14.642857,0 0.40063,-11.4476"
             style="color:#000000;fill:none;stroke:#ffffff;stroke-width:3.9000001;stroke-linecap:round;stroke-linejoin:round;stroke-miterlimit:4;stroke-opacity:1;stroke-dasharray:none;stroke-dashoffset:0;marker:none;visibility:visible;display:inline;overflow:visible;enable-background:accumulate"
             sodipodi:nodetypes="ccc" />
        </g>
      </g>
      <g
         transform="translate(0.60861646,0.66947507)"
         id="g3854-5">
        <rect
           ry="12.558324"
           y="979.02789"
           x="6.9211836"
           height="56.512474"
           width="73.535835"
           id="rect2986-2-0"
           style="color:#000000;fill:none;stroke:#ffffff;stroke-width:4.94943905;stroke-linecap:round;stroke-linejoin:round;stroke-miterlimit:4;stroke-opacity:1;stroke-dasharray:none;stroke-dashoffset:0;marker:none;visibility:visible;display:inline;overflow:visible;enable-background:accumulate"
           transform="matrix(1.0118098,0,0,0.79078533,-51.021736,246.91562)" />
        <g
           id="g3848-4">
          <g
             id="g3845-8"
             transform="translate(-4.3438493,2.196738)">
            <path
               style="color:#000000;fill:none;stroke:#ffffff;stroke-width:3.5999999;stroke-linecap:round;stroke-linejoin:round;stroke-miterlimit:4;stroke-opacity:1;stroke-dasharray:none;stroke-dashoffset:0;marker:none;visibility:visible;display:inline;overflow:visible;enable-background:accumulate"
               d="M 35,86.928571 71.285935,59.502475"
               id="path2988-6-7"
               inkscape:connector-curvature="0"
               transform="translate(0,924.36218)"
               sodipodi:nodetypes="cc" />
          </g>
          <path
             inkscape:connector-curvature="0"
             id="path2992-9-1"
             d="m 45.299008,1013.1303 -14.642857,0 0.40063,-11.4476"
             style="color:#000000;fill:none;stroke:#ffffff;stroke-width:3.9000001;stroke-linecap:round;stroke-linejoin:round;stroke-miterlimit:4;stroke-opacity:1;stroke-dasharray:none;stroke-dashoffset:0;marker:none;visibility:visible;display:inline;overflow:visible;enable-background:accumulate"
             sodipodi:nodetypes="ccc" />
        </g>
      </g>
    </g>
  </g>
</svg>
