<?xml version="1.0" encoding="UTF-8" standalone="no"?>
<!-- Created with Inkscape (http://www.inkscape.org/) -->

<svg
   xmlns:dc="http://purl.org/dc/elements/1.1/"
   xmlns:cc="http://creativecommons.org/ns#"
   xmlns:rdf="http://www.w3.org/1999/02/22-rdf-syntax-ns#"
   xmlns:svg="http://www.w3.org/2000/svg"
   xmlns="http://www.w3.org/2000/svg"
   xmlns:sodipodi="http://sodipodi.sourceforge.net/DTD/sodipodi-0.dtd"
   xmlns:inkscape="http://www.inkscape.org/namespaces/inkscape"
   width="128"
   height="128"
   id="svg2991"
   version="1.1"
   inkscape:version="0.48.0 r9654"
   sodipodi:docname="call.svg">
  <defs
     id="defs2993" />
  <sodipodi:namedview
     id="base"
     pagecolor="#000000"
     bordercolor="#666666"
     borderopacity="1.0"
     inkscape:pageopacity="0"
     inkscape:pageshadow="2"
     inkscape:zoom="5.598901"
     inkscape:cx="31.490517"
     inkscape:cy="78.188762"
     inkscape:current-layer="layer1"
     showgrid="true"
     inkscape:grid-bbox="true"
     inkscape:document-units="px"
     inkscape:window-width="1600"
     inkscape:window-height="852"
     inkscape:window-x="1916"
     inkscape:window-y="-3"
     inkscape:window-maximized="1" />
  <metadata
     id="metadata2996">
    <rdf:RDF>
      <cc:Work
         rdf:about="">
        <dc:format>image/svg+xml</dc:format>
        <dc:type
           rdf:resource="http://purl.org/dc/dcmitype/StillImage" />
        <dc:title />
      </cc:Work>
    </rdf:RDF>
  </metadata>
  <g
     id="layer1"
     inkscape:label="Layer 1"
     inkscape:groupmode="layer"
     transform="translate(0,96)">
    <path
       style="fill:none;stroke:#ffffff;stroke-width:5;stroke-linecap:round;stroke-linejoin:round;stroke-miterlimit:4;stroke-opacity:1;stroke-dasharray:none"
       d="M 9.8509205,96.931713 29.300174,76.724696 c 0,0 10.608683,11.619035 19.449253,7.577631 C 57.589997,80.260924 88.405696,49.445224 85.879819,42.120181 83.353942,34.795137 75.776311,28.227856 75.776311,28.227856 L 93.710038,7.7682525 c 0,0 22.732892,7.8302195 22.985482,27.7846475 0.19035,15.037843 -46.728726,70.72456 -62.894339,78.55478 C 37.635567,121.9379 9.8509205,96.931713 9.8509205,96.931713 z"
       id="path3772"
       inkscape:connector-curvature="0"
       transform="translate(0,-96)"
       sodipodi:nodetypes="ccssccssc" />
  </g>
</svg>
