உங்கள் சந்தா $ பட்டியல் பெயர் அஞ்சல் பட்டியலில் முடக்கப்பட்டுள்ளது, ஏனெனில் அது உள்ளது
 வழங்குவதில் சிக்கல் இருக்கலாம் என்பதைக் குறிக்கும் பல பவுன்களைப் பெற்றது
 $ sender_email க்கு செய்திகள். உங்கள் அஞ்சல் நிர்வாகியுடன் நீங்கள் சரிபார்க்க விரும்பலாம்
 மேலும் உதவிக்கு.

 உங்களிடம் ஏதேனும் கேள்விகள் அல்லது சிக்கல்கள் இருந்தால், நீங்கள் அஞ்சல் பட்டியல் உரிமையாளரை தொடர்பு கொள்ளலாம்

 $ உரிமையாளர்_மெயில்
