"$ Display_name" அஞ்சல் பட்டியலுக்கு வருக!

 இந்த பட்டியலில் இடுகையிட, உங்கள் செய்தியை இதற்கு அனுப்பவும்:

 $ பட்டியல் பெயர்

 அனுப்புவதன் மூலம் மின்னஞ்சல் வழியாக உங்கள் விருப்பங்களில் நீங்கள் குழுவிலகலாம் அல்லது மாற்றங்களைச் செய்யலாம்
 இதற்கு ஒரு செய்தி:

 $ request_email

 பொருள் அல்லது உடலில் 'உதவி' என்ற வார்த்தையுடன் (மேற்கோள்களை சேர்க்க வேண்டாம்), மற்றும்
 அறிவுறுத்தல்களுடன் ஒரு செய்தியை நீங்கள் திரும்பப் பெறுவீர்கள். உங்கள் கடவுச்சொல் உங்களுக்குத் தேவைப்படும்
 உங்கள் விருப்பங்களை மாற்றவும், ஆனால் பாதுகாப்பு நோக்கங்களுக்காக, இந்த கடவுச்சொல் சேர்க்கப்படவில்லை
 இங்கே. உங்கள் கடவுச்சொல்லை நீங்கள் மறந்துவிட்டால், அதை மீட்டமைக்க வேண்டும்
 வலை இடைமுகம்.
