<?xml version="1.0" encoding="utf-8"?>
<!-- Generator: Adobe Illustrator 14.0.0, SVG Export Plug-In . SVG Version: 6.00 Build 43363)  -->
<!DOCTYPE svg PUBLIC "-//W3C//DTD SVG 1.0//EN" "http://www.w3.org/TR/2001/REC-SVG-20010904/DTD/svg10.dtd">
<svg version="1.0" id="Layer_1" xmlns="http://www.w3.org/2000/svg" xmlns:xlink="http://www.w3.org/1999/xlink" x="0px" y="0px"
	 width="64px" height="64px" viewBox="0 0 64 64" enable-background="new 0 0 64 64" xml:space="preserve">
<path d="M0-0.42"/>
<g>
	<linearGradient id="SVGID_1_" gradientUnits="userSpaceOnUse" x1="26.5283" y1="1.3628" x2="33.0144" y2="54.2233">
		<stop  offset="0" style="stop-color:#FAAB66"/>
		<stop  offset="1" style="stop-color:#F67200"/>
	</linearGradient>
	<polygon fill="url(#SVGID_1_)" points="0,-0.42 2.542,60.414 63.446,47.699 49.984,-0.214 	"/>
	<polyline fill="#FFFFFF" points="49.847,-0.215 0,-0.42 4.021,58.229 63.896,45.603 49.847,-0.215 	"/>
	<linearGradient id="SVGID_2_" gradientUnits="userSpaceOnUse" x1="22.8999" y1="-1.9487" x2="34.5589" y2="49.9617">
		<stop  offset="0" style="stop-color:#FAAB66"/>
		<stop  offset="1" style="stop-color:#F67200"/>
	</linearGradient>
	<polyline fill="url(#SVGID_2_)" points="49.954,1.521 0.108,1.315 5.713,55.975 63.446,44.132 49.954,1.521 	"/>
	<g>
		<g enable-background="new    ">
			<defs>
				<polygon id="SVGID_3_" enable-background="new    " points="6.427,54.472 0,-0.42 50.007,-0.028 63.896,42.313 				"/>
			</defs>
			<clipPath id="SVGID_4_">
				<use xlink:href="#SVGID_3_"  overflow="visible"/>
			</clipPath>
			<g clip-path="url(#SVGID_4_)">
				<path fill="#FFFFFF" d="M48.986,36.657c-0.063,0.01-0.121,0.027-0.175,0.05c-0.055,0.025-0.104,0.054-0.148,0.09
					c-0.046,0.037-0.087,0.08-0.122,0.129c-0.038,0.05-0.07,0.105-0.097,0.168c-0.027,0.062-0.048,0.13-0.062,0.201
					c-0.016,0.073-0.022,0.151-0.022,0.232c0,0.084,0.009,0.172,0.022,0.266c0.016,0.094,0.037,0.192,0.064,0.296
					c0.029,0.104,0.063,0.201,0.099,0.291s0.076,0.173,0.121,0.25c0.044,0.074,0.09,0.145,0.143,0.205
					c0.051,0.063,0.105,0.116,0.163,0.164c0.06,0.049,0.117,0.09,0.179,0.122c0.06,0.034,0.12,0.06,0.182,0.078
					c0.06,0.017,0.123,0.029,0.184,0.032c0.062,0.002,0.124-0.002,0.188-0.014c0.063-0.012,0.12-0.028,0.175-0.053
					c0.055-0.025,0.104-0.056,0.149-0.092c0.045-0.039,0.085-0.083,0.121-0.133c0.035-0.049,0.068-0.106,0.095-0.17
					c0.026-0.063,0.045-0.131,0.057-0.204s0.019-0.151,0.017-0.234c-0.003-0.083-0.01-0.174-0.025-0.267
					c-0.016-0.094-0.039-0.194-0.067-0.298c-0.029-0.102-0.062-0.197-0.098-0.284c-0.037-0.088-0.076-0.17-0.119-0.243
					c-0.042-0.073-0.09-0.141-0.139-0.2c-0.05-0.062-0.104-0.114-0.16-0.162c-0.058-0.047-0.117-0.088-0.175-0.12
					c-0.06-0.034-0.119-0.06-0.181-0.077c-0.06-0.019-0.121-0.03-0.182-0.033C49.11,36.644,49.048,36.647,48.986,36.657
					 M44.524,37.354c-0.06,0.01-0.113,0.025-0.165,0.048c-0.051,0.023-0.099,0.051-0.143,0.086
					c-0.042,0.036-0.081,0.077-0.115,0.125c-0.034,0.047-0.064,0.102-0.092,0.161c-0.025,0.06-0.046,0.126-0.06,0.197
					s-0.021,0.147-0.021,0.231c0.002,0.083,0.007,0.172,0.021,0.265c0.015,0.096,0.035,0.196,0.063,0.302
					c0.03,0.115,0.062,0.221,0.094,0.319c0.034,0.097,0.068,0.186,0.104,0.267c0.036,0.08,0.075,0.153,0.112,0.216
					c0.039,0.064,0.08,0.119,0.121,0.167c0.06,0.066,0.122,0.122,0.185,0.17c0.065,0.046,0.13,0.083,0.196,0.11
					s0.134,0.045,0.204,0.051c0.071,0.007,0.141,0.004,0.214-0.01c0.058-0.01,0.112-0.027,0.163-0.051
					c0.05-0.024,0.096-0.055,0.138-0.09c0.041-0.038,0.08-0.08,0.114-0.132c0.032-0.049,0.063-0.105,0.088-0.166
					c0.025-0.064,0.045-0.133,0.057-0.208c0.012-0.074,0.017-0.154,0.015-0.243c-0.003-0.086-0.01-0.178-0.026-0.276
					c-0.016-0.098-0.038-0.201-0.066-0.312c-0.032-0.122-0.068-0.234-0.105-0.337c-0.038-0.102-0.078-0.195-0.119-0.28
					c-0.044-0.083-0.089-0.158-0.138-0.225c-0.046-0.064-0.097-0.119-0.149-0.167c-0.055-0.046-0.109-0.086-0.163-0.118
					c-0.057-0.034-0.112-0.06-0.169-0.078c-0.058-0.018-0.115-0.029-0.175-0.033C44.646,37.339,44.586,37.343,44.524,37.354
					 M56.986,35.249c-0.05,0.009-0.096,0.022-0.136,0.039c-0.041,0.02-0.078,0.041-0.112,0.068c-0.034,0.029-0.063,0.06-0.09,0.099
					c-0.026,0.037-0.048,0.08-0.066,0.126c-0.02,0.048-0.032,0.099-0.039,0.151c-0.011,0.055-0.014,0.11-0.011,0.17
					c0.002,0.06,0.009,0.121,0.021,0.187s0.029,0.135,0.051,0.206l1.326-0.231c-0.023-0.074-0.051-0.145-0.08-0.209
					c-0.03-0.064-0.061-0.124-0.097-0.18c-0.034-0.055-0.071-0.104-0.11-0.148s-0.08-0.083-0.124-0.117s-0.089-0.064-0.133-0.087
					c-0.044-0.023-0.088-0.042-0.133-0.056c-0.044-0.014-0.088-0.021-0.132-0.024C57.075,35.241,57.03,35.242,56.986,35.249
					 M34.434,38.771c-0.043,0.007-0.084,0.018-0.124,0.029c-0.04,0.01-0.079,0.025-0.114,0.041
					c-0.036,0.017-0.071,0.035-0.105,0.058c-0.034,0.021-0.064,0.046-0.096,0.071c-0.03,0.027-0.06,0.056-0.086,0.09
					c-0.029,0.032-0.057,0.07-0.084,0.11c-0.027,0.039-0.053,0.084-0.078,0.131c-0.025,0.048-0.049,0.099-0.074,0.153
					c-0.024,0.055-0.046,0.112-0.065,0.174c-0.02,0.061-0.037,0.126-0.053,0.193c-0.015,0.066-0.028,0.138-0.039,0.213
					c-0.012,0.073-0.02,0.151-0.028,0.231c-0.007,0.078-0.012,0.156-0.014,0.229c-0.002,0.074-0.002,0.146,0.002,0.216
					c0.001,0.069,0.007,0.136,0.015,0.199c0.009,0.063,0.019,0.122,0.031,0.18c0.019,0.078,0.035,0.153,0.054,0.225
					c0.021,0.071,0.041,0.138,0.062,0.199c0.021,0.061,0.043,0.119,0.066,0.172s0.048,0.1,0.073,0.143
					c0.025,0.044,0.051,0.085,0.08,0.122c0.03,0.039,0.061,0.075,0.093,0.109c0.032,0.032,0.068,0.064,0.105,0.093
					c0.039,0.029,0.078,0.057,0.121,0.08c0.043,0.024,0.085,0.043,0.128,0.058c0.044,0.016,0.088,0.027,0.134,0.034
					c0.044,0.007,0.09,0.011,0.14,0.011c0.046-0.002,0.094-0.007,0.143-0.016c0.082-0.016,0.158-0.041,0.229-0.076
					c0.073-0.038,0.142-0.085,0.204-0.145c0.063-0.059,0.121-0.128,0.175-0.21c0.053-0.081,0.104-0.171,0.148-0.275
					c0.06-0.136,0.107-0.278,0.141-0.425c0.036-0.146,0.057-0.298,0.066-0.454c0.009-0.154,0.006-0.314-0.01-0.479
					c-0.016-0.166-0.043-0.336-0.083-0.512c-0.021-0.09-0.045-0.172-0.073-0.248c-0.029-0.078-0.062-0.149-0.099-0.214
					c-0.038-0.066-0.078-0.126-0.124-0.179c-0.046-0.055-0.096-0.103-0.15-0.145c-0.054-0.043-0.108-0.078-0.166-0.107
					c-0.057-0.029-0.114-0.051-0.174-0.066c-0.06-0.015-0.12-0.025-0.182-0.027C34.561,38.756,34.498,38.759,34.434,38.771
					 M30.026,39.468c-0.058,0.011-0.114,0.022-0.167,0.039c-0.053,0.018-0.104,0.037-0.153,0.06
					c-0.049,0.023-0.097,0.051-0.143,0.082c-0.046,0.028-0.09,0.063-0.133,0.099c-0.042,0.037-0.082,0.078-0.119,0.12
					c-0.039,0.045-0.075,0.092-0.109,0.142c-0.034,0.051-0.068,0.104-0.097,0.161c-0.032,0.057-0.061,0.116-0.086,0.179
					c-0.027,0.063-0.053,0.128-0.073,0.194c-0.022,0.067-0.041,0.136-0.056,0.205c-0.015,0.071-0.027,0.145-0.036,0.218
					c-0.008,0.075-0.015,0.153-0.017,0.231c-0.003,0.076-0.005,0.153-0.003,0.226c0,0.073,0.003,0.144,0.007,0.213
					c0.005,0.068,0.012,0.136,0.019,0.199c0.009,0.064,0.019,0.126,0.031,0.186c0.022,0.11,0.051,0.212,0.082,0.308
					c0.032,0.095,0.07,0.182,0.112,0.26c0.041,0.08,0.088,0.151,0.14,0.214c0.051,0.063,0.107,0.119,0.168,0.169
					c0.062,0.046,0.126,0.087,0.19,0.119c0.066,0.03,0.133,0.056,0.203,0.073c0.07,0.017,0.141,0.026,0.214,0.028
					c0.073,0,0.146-0.005,0.223-0.021c0.039-0.005,0.078-0.015,0.117-0.027c0.038-0.012,0.077-0.025,0.114-0.04
					c0.038-0.018,0.073-0.036,0.111-0.057c0.036-0.021,0.071-0.042,0.107-0.067c0.036-0.024,0.07-0.05,0.104-0.079
					c0.034-0.026,0.066-0.059,0.097-0.092c0.031-0.032,0.061-0.065,0.088-0.104c0.029-0.035,0.056-0.074,0.082-0.115
					s0.049-0.083,0.073-0.128c0.022-0.042,0.044-0.087,0.063-0.133c0.021-0.044,0.039-0.09,0.056-0.138
					c0.017-0.046,0.032-0.093,0.046-0.141c0.014-0.05,0.027-0.099,0.039-0.148c0.01-0.051,0.021-0.102,0.029-0.154
					c0.008-0.051,0.015-0.102,0.022-0.156c0.005-0.053,0.01-0.105,0.014-0.16c0.005-0.074,0.008-0.147,0.01-0.219
					c0.001-0.073,0-0.145-0.005-0.215c-0.003-0.069-0.009-0.138-0.019-0.206c-0.008-0.067-0.021-0.134-0.034-0.2
					c-0.022-0.104-0.049-0.199-0.08-0.289c-0.032-0.089-0.07-0.17-0.11-0.246c-0.041-0.075-0.087-0.145-0.14-0.206
					c-0.051-0.062-0.107-0.117-0.168-0.165c-0.061-0.05-0.122-0.09-0.187-0.124c-0.064-0.032-0.129-0.058-0.197-0.076
					c-0.068-0.02-0.136-0.029-0.208-0.033C30.174,39.451,30.101,39.456,30.026,39.468 M38.915,37.98
					c-0.053,0.008-0.104,0.021-0.152,0.037c-0.05,0.016-0.098,0.034-0.142,0.056c-0.046,0.022-0.089,0.048-0.131,0.075
					c-0.041,0.029-0.08,0.062-0.115,0.095c-0.039,0.036-0.073,0.073-0.107,0.114s-0.066,0.087-0.097,0.135
					c-0.029,0.047-0.059,0.099-0.084,0.152c-0.027,0.053-0.051,0.111-0.073,0.171C37.99,38.876,37.97,38.938,37.953,39
					c-0.018,0.063-0.032,0.13-0.045,0.197c-0.01,0.066-0.02,0.137-0.025,0.206c-0.005,0.071-0.007,0.145-0.007,0.22
					c0,0.074,0,0.147,0.004,0.216c0.003,0.069,0.009,0.138,0.016,0.204c0.007,0.064,0.015,0.127,0.025,0.19
					c0.01,0.06,0.023,0.118,0.037,0.177c0.023,0.105,0.055,0.202,0.087,0.292c0.034,0.09,0.071,0.174,0.113,0.248
					c0.041,0.077,0.087,0.145,0.138,0.206c0.05,0.062,0.104,0.114,0.162,0.16c0.06,0.046,0.119,0.085,0.18,0.115
					c0.063,0.03,0.126,0.055,0.19,0.071c0.065,0.018,0.13,0.027,0.197,0.029c0.068,0.002,0.137-0.004,0.208-0.018
					c0.035-0.007,0.073-0.015,0.108-0.025c0.036-0.012,0.071-0.025,0.105-0.04c0.034-0.016,0.068-0.033,0.101-0.052
					c0.034-0.021,0.066-0.04,0.099-0.064c0.032-0.023,0.063-0.048,0.092-0.074c0.03-0.026,0.058-0.055,0.085-0.086
					c0.027-0.03,0.053-0.064,0.076-0.099c0.025-0.033,0.05-0.071,0.071-0.11c0.024-0.039,0.045-0.078,0.066-0.12
					c0.021-0.041,0.039-0.084,0.055-0.126c0.018-0.044,0.032-0.087,0.048-0.131c0.014-0.046,0.025-0.091,0.037-0.137
					s0.021-0.093,0.029-0.141c0.01-0.048,0.017-0.097,0.021-0.145c0.006-0.051,0.011-0.101,0.014-0.149
					c0.004-0.051,0.007-0.103,0.009-0.153c0.002-0.071,0.002-0.141-0.002-0.211c-0.001-0.069-0.007-0.136-0.014-0.204
					c-0.005-0.066-0.014-0.131-0.025-0.195c-0.01-0.064-0.023-0.129-0.039-0.192c-0.023-0.097-0.053-0.19-0.085-0.275
					s-0.069-0.163-0.11-0.236c-0.041-0.071-0.087-0.138-0.136-0.197c-0.05-0.06-0.104-0.112-0.16-0.159
					c-0.06-0.046-0.119-0.086-0.181-0.118c-0.061-0.032-0.122-0.058-0.187-0.074c-0.063-0.018-0.129-0.027-0.194-0.032
					C39.052,37.965,38.983,37.968,38.915,37.98 M19.162,37.533l-8.224,1.244l1.331,9.496l9.359-1.79l-0.977-5.612
					c-0.058,0.147-0.117,0.297-0.175,0.446c-0.059,0.148-0.119,0.3-0.178,0.449c-0.06,0.149-0.12,0.301-0.179,0.452
					c-0.06,0.151-0.12,0.305-0.18,0.458c-0.068,0.17-0.137,0.343-0.206,0.515c-0.068,0.172-0.137,0.346-0.206,0.519
					c-0.07,0.174-0.139,0.346-0.208,0.521c-0.069,0.175-0.139,0.351-0.208,0.525c-0.016,0.041-0.034,0.082-0.053,0.121
					c-0.019,0.039-0.039,0.076-0.061,0.112c-0.022,0.035-0.045,0.071-0.069,0.105c-0.024,0.032-0.049,0.064-0.075,0.097
					c-0.026,0.03-0.053,0.061-0.081,0.088c-0.028,0.029-0.057,0.057-0.087,0.08c-0.03,0.027-0.06,0.051-0.091,0.075
					c-0.031,0.021-0.063,0.046-0.097,0.066c-0.032,0.021-0.065,0.037-0.099,0.056c-0.034,0.018-0.067,0.034-0.103,0.048
					c-0.035,0.016-0.07,0.028-0.105,0.041c-0.035,0.012-0.07,0.023-0.106,0.032c-0.011,0.003-0.023,0.007-0.035,0.01
					c-0.012,0.004-0.023,0.005-0.035,0.009c-0.012,0.003-0.023,0.005-0.036,0.009c-0.011,0.001-0.023,0.005-0.034,0.007
					c-0.025,0.005-0.05,0.008-0.074,0.012c-0.025,0.003-0.05,0.005-0.075,0.008c-0.025,0.002-0.05,0.002-0.075,0.004
					c-0.024,0.002-0.05,0.002-0.075,0.002c-0.018,0-0.035,0-0.053,0c-0.018-0.002-0.035-0.004-0.051-0.006
					c-0.017-0.001-0.035-0.003-0.051-0.005c-0.017-0.003-0.034-0.005-0.05-0.008c-0.019-0.002-0.036-0.006-0.054-0.009
					c-0.018-0.004-0.035-0.007-0.052-0.009c-0.017-0.005-0.034-0.01-0.05-0.014c-0.017-0.005-0.033-0.01-0.049-0.016
					c-0.016-0.006-0.032-0.012-0.048-0.017c-0.016-0.007-0.032-0.012-0.048-0.021c-0.016-0.005-0.031-0.012-0.047-0.019
					s-0.03-0.014-0.045-0.022c-0.015-0.007-0.03-0.017-0.045-0.023c-0.015-0.009-0.03-0.019-0.044-0.027s-0.029-0.019-0.044-0.027
					c-0.015-0.008-0.028-0.019-0.042-0.028c-0.071-0.052-0.143-0.104-0.214-0.155c-0.072-0.053-0.143-0.104-0.214-0.154
					c-0.071-0.053-0.142-0.105-0.213-0.156c-0.071-0.053-0.141-0.105-0.211-0.157c-0.071-0.053-0.143-0.104-0.214-0.156
					c-0.071-0.053-0.142-0.104-0.213-0.156c-0.071-0.051-0.142-0.102-0.213-0.154c-0.071-0.052-0.141-0.104-0.211-0.155
					c-0.072-0.051-0.143-0.102-0.214-0.154c-0.071-0.051-0.143-0.103-0.214-0.153c-0.071-0.053-0.142-0.104-0.212-0.154
					c-0.071-0.053-0.141-0.104-0.212-0.155c-0.071-0.053-0.142-0.104-0.213-0.154c-0.071-0.052-0.142-0.104-0.213-0.155
					c-0.071-0.051-0.141-0.104-0.212-0.154c-0.071-0.053-0.142-0.103-0.214-0.155c-0.073-0.053-0.137-0.112-0.192-0.173
					c-0.055-0.062-0.101-0.126-0.139-0.192c-0.038-0.066-0.068-0.138-0.09-0.209c-0.022-0.071-0.038-0.145-0.045-0.218
					c-0.007-0.075-0.006-0.151,0.001-0.227c0.007-0.076,0.02-0.15,0.04-0.228c0.019-0.074,0.044-0.149,0.075-0.225
					c0.031-0.074,0.067-0.147,0.108-0.221c0.041-0.069,0.086-0.138,0.136-0.202c0.049-0.066,0.103-0.131,0.16-0.19
					c0.057-0.062,0.118-0.119,0.181-0.174c0.063-0.053,0.13-0.102,0.199-0.146c0.049-0.033,0.099-0.064,0.15-0.093
					c0.052-0.027,0.104-0.053,0.158-0.075s0.108-0.041,0.164-0.056c0.055-0.018,0.111-0.029,0.167-0.038
					c0.021-0.003,0.042-0.007,0.063-0.01c0.021-0.002,0.042-0.004,0.063-0.005c0.021-0.002,0.042-0.002,0.063-0.002
					c0.021,0,0.042,0,0.063,0c0.015,0,0.03,0,0.045,0c0.015,0.002,0.03,0.002,0.044,0.003c0.015,0,0.029,0.002,0.044,0.004
					c0.014,0.002,0.029,0.005,0.043,0.009c0.015,0.001,0.03,0.005,0.045,0.008c0.015,0.004,0.03,0.007,0.044,0.011
					c0.015,0.003,0.029,0.008,0.043,0.012c0.015,0.005,0.028,0.01,0.043,0.017c0.014,0.004,0.028,0.009,0.043,0.014
					c0.014,0.005,0.029,0.011,0.043,0.016c0.015,0.007,0.029,0.014,0.043,0.021c0.015,0.007,0.03,0.015,0.045,0.023l0.168,0.103
					c0.04,0.028,0.079,0.056,0.118,0.083c0.039,0.029,0.078,0.056,0.116,0.085c0.039,0.027,0.077,0.056,0.115,0.083
					c0.039,0.027,0.077,0.057,0.115,0.084c0.04,0.028,0.079,0.058,0.118,0.085c0.039,0.028,0.078,0.056,0.117,0.085
					c0.038,0.027,0.077,0.054,0.115,0.083c0.038,0.025,0.077,0.055,0.115,0.082c0.04,0.028,0.079,0.058,0.118,0.085
					c0.039,0.028,0.078,0.056,0.117,0.085c0.039,0.027,0.078,0.056,0.117,0.083c0.039,0.029,0.078,0.058,0.118,0.085
					c0.038,0.029,0.077,0.058,0.116,0.085c0.039,0.029,0.078,0.058,0.116,0.085c0.039,0.027,0.078,0.057,0.117,0.085
					c0.039,0.027,0.077,0.057,0.116,0.085c0.054-0.129,0.109-0.258,0.163-0.389c0.055-0.13,0.108-0.259,0.162-0.388
					c0.053-0.13,0.106-0.259,0.16-0.387c0.052-0.129,0.105-0.258,0.157-0.388c0.054-0.125,0.107-0.253,0.16-0.381
					c0.053-0.127,0.106-0.253,0.159-0.381c0.053-0.125,0.105-0.251,0.158-0.375c0.053-0.126,0.104-0.252,0.156-0.374
					c0.046-0.111,0.092-0.222,0.138-0.332s0.091-0.22,0.136-0.33c0.045-0.108,0.09-0.219,0.136-0.328
					C19.073,37.751,19.118,37.64,19.162,37.533 M27.278,11.331c-0.027,0.001-0.056,0.002-0.084,0.004
					c-0.028,0.001-0.056,0.003-0.084,0.005c-0.027,0.002-0.055,0.004-0.083,0.007c-0.027,0.002-0.056,0.005-0.083,0.008
					c-0.007,0.001-0.014,0.002-0.023,0.003c-0.008,0.001-0.019,0.003-0.03,0.004c-0.01,0.002-0.021,0.003-0.031,0.005
					c-0.011,0.001-0.021,0.003-0.03,0.005c-0.009,0.002-0.017,0.003-0.025,0.005c-0.007,0.001-0.016,0.004-0.024,0.006
					c-0.007,0.001-0.015,0.003-0.023,0.006c-0.008,0.002-0.016,0.004-0.023,0.007c-0.028,0.007-0.056,0.013-0.083,0.021
					c-0.027,0.007-0.054,0.014-0.082,0.023c-0.027,0.008-0.054,0.017-0.08,0.026c-0.027,0.009-0.053,0.019-0.078,0.03
					c-0.001,0-0.002,0-0.003,0.001c-0.001,0-0.002,0.001-0.003,0.002c-0.001,0-0.001,0-0.003,0.001
					c-0.001,0-0.001,0.001-0.003,0.002c-0.008,0.006-0.019,0.011-0.029,0.017c-0.01,0.006-0.021,0.012-0.031,0.019
					c-0.009,0.007-0.02,0.013-0.03,0.02c-0.01,0.007-0.021,0.014-0.03,0.022c-0.004,0.003-0.009,0.006-0.014,0.009
					c-0.004,0.002-0.009,0.006-0.013,0.009c-0.005,0.003-0.01,0.006-0.014,0.01c-0.005,0.003-0.009,0.006-0.014,0.01
					c-0.002,0.003-0.005,0.006-0.008,0.009c-0.002,0.002-0.005,0.006-0.008,0.008c-0.002,0.003-0.005,0.006-0.008,0.009
					c-0.001,0.003-0.004,0.005-0.006,0.007l-0.069,0.088c-0.003,0.008-0.007,0.016-0.009,0.024c-0.004,0.008-0.007,0.016-0.01,0.024
					s-0.006,0.016-0.009,0.024c-0.003,0.008-0.006,0.016-0.009,0.025l-0.007,0.045c-0.001,0.014-0.002,0.026-0.002,0.04
					c-0.002,0.013-0.003,0.026-0.003,0.039c0,0.014-0.001,0.026-0.002,0.04c0,0.014-0.001,0.027-0.001,0.041
					c0.001,0.002,0.001,0.003,0.001,0.003c0,0.001,0,0.003,0.001,0.003c0,0.001,0,0.002,0.001,0.003c0,0.001,0,0.002,0,0.003
					c0.003,0.019,0.007,0.038,0.01,0.057c0.003,0.019,0.007,0.038,0.01,0.056c0.004,0.019,0.009,0.038,0.012,0.056
					c0.003,0.018,0.008,0.037,0.012,0.054c0.002,0.008,0.005,0.017,0.009,0.027s0.007,0.021,0.012,0.033
					c0.003,0.011,0.008,0.023,0.012,0.034c0.003,0.011,0.007,0.022,0.01,0.031c0.01,0.022,0.02,0.043,0.029,0.065
					c0.01,0.022,0.021,0.043,0.031,0.064c0.011,0.022,0.022,0.043,0.032,0.065c0.012,0.021,0.024,0.042,0.035,0.063
					c0.009,0.017,0.02,0.033,0.03,0.05c0.01,0.018,0.02,0.035,0.029,0.052s0.02,0.035,0.031,0.053
					c0.011,0.018,0.021,0.035,0.032,0.053c0.001,0.001,0.001,0.002,0.003,0.003c0.001,0.002,0.001,0.002,0.003,0.005
					c0,0,0.001,0.002,0.003,0.004c0.001,0.001,0.002,0.002,0.003,0.004c0.023,0.029,0.046,0.059,0.068,0.087
					c0.024,0.03,0.047,0.059,0.071,0.087c0.023,0.029,0.048,0.058,0.071,0.086c0.025,0.028,0.05,0.055,0.075,0.083
					c0.012,0.01,0.022,0.021,0.033,0.032c0.011,0.011,0.021,0.022,0.032,0.033c0.011,0.011,0.021,0.023,0.032,0.033
					c0.01,0.011,0.021,0.022,0.032,0.033l0.059,0.054c0.026,0.021,0.053,0.042,0.079,0.062c0.025,0.021,0.052,0.04,0.078,0.06
					c0.027,0.021,0.054,0.039,0.081,0.059c0.028,0.019,0.055,0.038,0.083,0.055c0.003,0.002,0.004,0.002,0.008,0.003
					c0.002,0.001,0.004,0.002,0.007,0.003c0.003,0.001,0.005,0.002,0.008,0.003c0.003,0.002,0.005,0.003,0.009,0.004
					c0.014,0.007,0.029,0.014,0.043,0.022c0.014,0.006,0.029,0.013,0.043,0.02c0.014,0.006,0.029,0.012,0.042,0.018
					c0.015,0.006,0.029,0.012,0.043,0.017c0.001,0.001,0.001,0.001,0.003,0.002c0,0,0.001,0.001,0.002,0.001
					c0,0,0.001,0,0.002,0.001c0.001,0,0.001,0,0.003,0.001c0.005,0.001,0.012,0.002,0.019,0.004c0.006,0,0.012,0.002,0.019,0.003
					c0.006,0.001,0.012,0.002,0.019,0.003c0.006,0.001,0.012,0.002,0.019,0.003c0,0,0,0,0.001,0s0.001-0.001,0.001-0.001h0.001
					l0.001-0.001c0.002-0.001,0.004-0.002,0.006-0.004c0.002,0,0.004-0.002,0.007-0.004c0.001-0.002,0.003-0.003,0.005-0.004
					c0.003-0.001,0.004-0.002,0.007-0.004c0.001-0.001,0.002-0.003,0.003-0.006c0.002-0.001,0.003-0.003,0.004-0.005
					c0.001-0.003,0.002-0.004,0.005-0.006c0.001-0.002,0.003-0.005,0.004-0.007c0.003-0.005,0.008-0.01,0.012-0.017
					c0.003-0.006,0.007-0.013,0.012-0.019c0.004-0.007,0.008-0.014,0.014-0.021c0.003-0.008,0.007-0.015,0.012-0.021
					c0.009-0.02,0.015-0.039,0.024-0.058c0.007-0.02,0.015-0.039,0.022-0.059c0.007-0.021,0.014-0.04,0.021-0.06
					c0.007-0.021,0.012-0.04,0.018-0.061c0-0.006,0.002-0.022,0.006-0.043c0.003-0.021,0.008-0.047,0.014-0.075
					c0.004-0.027,0.008-0.056,0.013-0.081c0.004-0.024,0.007-0.046,0.009-0.059c0.001-0.026,0.004-0.053,0.007-0.079
					c0.001-0.025,0.004-0.052,0.006-0.077c0.001-0.026,0.003-0.052,0.004-0.079c0.001-0.025,0.002-0.051,0.003-0.078
					c0-0.029,0.001-0.058,0.001-0.087c0-0.029,0-0.059,0-0.087c0-0.03,0-0.06-0.001-0.089c0-0.03-0.001-0.06-0.002-0.089
					c-0.001-0.015-0.001-0.029-0.001-0.043c0-0.015,0-0.031-0.001-0.045c-0.001-0.016-0.001-0.031-0.002-0.045
					c0-0.016-0.002-0.031-0.003-0.046c0,0.002,0,0.005,0,0.007c0,0.002,0,0.004,0,0.006c0,0.002,0,0.003,0,0.004
					c0,0,0,0.001,0,0.001c0,0,0-0.001,0-0.003c0-0.003-0.001-0.008-0.002-0.014c0-0.005,0-0.014-0.001-0.023
					s-0.002-0.021-0.003-0.036c-0.009-0.105-0.003-0.208,0.015-0.303c0.018-0.095,0.051-0.183,0.098-0.26
					c0.047-0.077,0.109-0.145,0.187-0.197c0.076-0.053,0.168-0.091,0.275-0.112c-0.007,0-0.012-0.001-0.019-0.001
					c-0.005-0.001-0.011-0.001-0.017-0.002c-0.006-0.001-0.012-0.001-0.018-0.002c-0.006,0-0.012,0-0.018-0.001
					c-0.007-0.002-0.024-0.002-0.046-0.005c-0.022-0.002-0.048-0.005-0.073-0.007c-0.025-0.003-0.051-0.005-0.07-0.007
					c-0.02-0.002-0.032-0.003-0.035-0.003c-0.045-0.003-0.089-0.007-0.134-0.009c-0.045-0.002-0.09-0.004-0.135-0.006
					c-0.044-0.001-0.09-0.002-0.134-0.002c-0.045-0.001-0.09,0-0.135,0.001c-0.016,0-0.032,0-0.048,0.001
					c-0.017,0-0.033,0-0.049,0.001c-0.016,0.001-0.033,0.001-0.048,0.001C27.31,11.33,27.295,11.33,27.278,11.331 M30.34,43.792
					c-0.085,0.015-0.17,0.027-0.253,0.032c-0.083,0.005-0.165,0.005-0.247,0s-0.164-0.016-0.243-0.03
					c-0.082-0.016-0.162-0.036-0.24-0.063c-0.08-0.027-0.155-0.058-0.226-0.094c-0.073-0.037-0.141-0.078-0.206-0.124
					c-0.064-0.044-0.125-0.095-0.184-0.151c-0.059-0.054-0.114-0.115-0.166-0.18s-0.099-0.133-0.142-0.204
					c-0.044-0.073-0.083-0.148-0.117-0.227c-0.036-0.08-0.066-0.161-0.093-0.248c-0.026-0.085-0.049-0.175-0.067-0.269
					c-0.046-0.228-0.075-0.449-0.085-0.663s-0.002-0.42,0.022-0.617c0.025-0.199,0.069-0.39,0.131-0.573
					c0.06-0.182,0.139-0.358,0.235-0.527c0.079-0.138,0.169-0.262,0.27-0.37c0.102-0.11,0.212-0.206,0.335-0.289
					c0.122-0.082,0.257-0.149,0.399-0.206c0.145-0.055,0.299-0.095,0.464-0.122c0.129-0.022,0.255-0.031,0.377-0.029
					c0.121,0.002,0.238,0.016,0.352,0.041c0.112,0.025,0.221,0.063,0.326,0.112c0.105,0.048,0.206,0.108,0.303,0.18
					c0.097,0.072,0.186,0.151,0.267,0.242c0.08,0.09,0.153,0.188,0.216,0.297c0.064,0.109,0.121,0.227,0.168,0.354
					c0.047,0.125,0.086,0.263,0.119,0.407c0.027,0.131,0.049,0.261,0.063,0.39c0.016,0.128,0.024,0.257,0.024,0.383
					c0.002,0.127-0.003,0.253-0.015,0.377c-0.012,0.124-0.031,0.249-0.055,0.369c-0.025,0.124-0.058,0.241-0.097,0.354
					s-0.087,0.22-0.138,0.32c-0.053,0.102-0.112,0.197-0.179,0.287c-0.066,0.088-0.138,0.172-0.218,0.25
					c-0.08,0.08-0.163,0.151-0.248,0.216c-0.087,0.064-0.175,0.121-0.269,0.17c-0.092,0.05-0.187,0.092-0.284,0.126
					C30.544,43.746,30.444,43.773,30.34,43.792 M39.369,42.106c-0.078,0.014-0.158,0.024-0.234,0.029
					c-0.078,0.005-0.155,0.005-0.231-0.002c-0.076-0.003-0.153-0.015-0.227-0.03c-0.074-0.016-0.149-0.036-0.223-0.063
					c-0.074-0.025-0.146-0.054-0.214-0.09c-0.068-0.034-0.133-0.073-0.195-0.117c-0.063-0.044-0.121-0.092-0.177-0.145
					c-0.057-0.055-0.109-0.11-0.158-0.174c-0.051-0.063-0.099-0.129-0.142-0.197c-0.044-0.067-0.083-0.139-0.119-0.216
					c-0.035-0.074-0.067-0.152-0.097-0.234c-0.028-0.082-0.053-0.168-0.073-0.257c-0.051-0.219-0.085-0.43-0.102-0.634
					c-0.019-0.204-0.019-0.399-0.002-0.59c0.017-0.188,0.051-0.369,0.101-0.545c0.051-0.175,0.117-0.342,0.2-0.501
					c0.068-0.131,0.146-0.248,0.236-0.353c0.091-0.105,0.19-0.195,0.301-0.273c0.111-0.078,0.231-0.145,0.364-0.195
					c0.131-0.051,0.273-0.091,0.425-0.114c0.121-0.021,0.236-0.028,0.351-0.027c0.112,0.004,0.223,0.018,0.328,0.043
					s0.209,0.061,0.308,0.108c0.101,0.046,0.195,0.104,0.289,0.174c0.092,0.067,0.176,0.146,0.254,0.232
					c0.078,0.087,0.147,0.181,0.211,0.284c0.064,0.104,0.12,0.216,0.17,0.339c0.047,0.122,0.09,0.251,0.124,0.391
					c0.032,0.124,0.056,0.248,0.074,0.371c0.019,0.124,0.032,0.246,0.038,0.365c0.007,0.122,0.007,0.241,0,0.36
					s-0.02,0.236-0.039,0.353c-0.02,0.117-0.046,0.229-0.077,0.336c-0.032,0.107-0.071,0.209-0.115,0.305
					c-0.044,0.097-0.096,0.187-0.155,0.271c-0.058,0.087-0.122,0.165-0.193,0.239c-0.071,0.075-0.145,0.144-0.221,0.204
					c-0.077,0.06-0.157,0.114-0.242,0.16c-0.083,0.046-0.17,0.087-0.258,0.119C39.558,42.063,39.465,42.088,39.369,42.106
					 M49.962,40.128c-0.083,0.015-0.166,0.025-0.253,0.03c-0.083,0.005-0.17,0.003-0.257-0.003c-0.087-0.007-0.174-0.021-0.262-0.04
					c-0.087-0.017-0.175-0.04-0.264-0.071c-0.089-0.03-0.175-0.066-0.257-0.106c-0.081-0.043-0.161-0.091-0.238-0.145
					c-0.076-0.055-0.149-0.114-0.219-0.181c-0.07-0.066-0.137-0.14-0.201-0.216c-0.063-0.078-0.122-0.16-0.179-0.248
					c-0.056-0.089-0.108-0.183-0.157-0.281c-0.048-0.1-0.092-0.205-0.133-0.314c-0.041-0.11-0.077-0.226-0.11-0.349
					c-0.026-0.093-0.046-0.185-0.06-0.278c-0.016-0.092-0.025-0.186-0.029-0.277c-0.005-0.094-0.003-0.186,0.004-0.277
					c0.006-0.092,0.017-0.185,0.033-0.277c0.018-0.092,0.039-0.182,0.066-0.263c0.027-0.085,0.062-0.164,0.099-0.238
					c0.038-0.075,0.082-0.145,0.131-0.211c0.05-0.064,0.104-0.126,0.163-0.184c0.062-0.057,0.126-0.109,0.192-0.155
					c0.068-0.046,0.138-0.086,0.211-0.122c0.076-0.035,0.153-0.066,0.234-0.092c0.082-0.025,0.167-0.044,0.256-0.06
					c0.138-0.021,0.27-0.03,0.402-0.027c0.131,0.006,0.261,0.024,0.386,0.055c0.126,0.032,0.249,0.078,0.368,0.136
					c0.122,0.058,0.239,0.131,0.354,0.216c0.114,0.089,0.222,0.184,0.318,0.286c0.097,0.104,0.186,0.216,0.266,0.335
					c0.079,0.121,0.151,0.25,0.212,0.386c0.063,0.138,0.116,0.282,0.16,0.438c0.044,0.154,0.076,0.308,0.095,0.454
					c0.021,0.147,0.027,0.29,0.021,0.428s-0.025,0.272-0.058,0.401c-0.034,0.13-0.078,0.255-0.136,0.376s-0.126,0.228-0.202,0.325
					c-0.077,0.097-0.164,0.182-0.261,0.256c-0.097,0.072-0.204,0.133-0.319,0.184C50.225,40.064,50.099,40.103,49.962,40.128
					 M52.382,35.889c0.041-0.128,0.094-0.241,0.154-0.342c0.062-0.101,0.132-0.187,0.211-0.259c0.078-0.072,0.167-0.132,0.264-0.178
					s0.202-0.078,0.316-0.098c0.051-0.008,0.101-0.014,0.149-0.015c0.05-0.004,0.101-0.004,0.15,0
					c0.047,0.003,0.097,0.008,0.146,0.017c0.05,0.009,0.097,0.021,0.146,0.034c0.048,0.014,0.092,0.029,0.136,0.048
					c0.045,0.019,0.085,0.037,0.124,0.06c0.039,0.021,0.075,0.044,0.111,0.069c0.035,0.025,0.067,0.055,0.1,0.083
					c0.031,0.027,0.062,0.06,0.091,0.092c0.028,0.031,0.056,0.063,0.081,0.099c0.027,0.034,0.053,0.07,0.075,0.107
					c0.023,0.037,0.046,0.075,0.066,0.115c0.021,0.041,0.042,0.085,0.063,0.135c0.022,0.049,0.044,0.105,0.066,0.163
					c0.022,0.06,0.044,0.122,0.066,0.19c0.023,0.068,0.046,0.14,0.068,0.218l0.765,2.525l-0.918,0.17l-0.624-2.088
					c-0.032-0.109-0.064-0.21-0.094-0.298c-0.029-0.09-0.056-0.17-0.082-0.24c-0.025-0.069-0.049-0.129-0.072-0.178
					c-0.022-0.05-0.043-0.091-0.062-0.121c-0.021-0.03-0.041-0.058-0.062-0.085c-0.021-0.025-0.044-0.05-0.067-0.071
					c-0.024-0.024-0.048-0.045-0.073-0.062c-0.025-0.019-0.051-0.034-0.08-0.048c-0.027-0.014-0.055-0.025-0.082-0.034
					c-0.028-0.01-0.058-0.017-0.086-0.02c-0.029-0.006-0.059-0.007-0.089-0.007c-0.03,0.001-0.062,0.003-0.092,0.008
					c-0.039,0.007-0.076,0.018-0.114,0.031c-0.035,0.012-0.069,0.028-0.102,0.047c-0.032,0.02-0.062,0.041-0.09,0.066
					c-0.027,0.024-0.055,0.053-0.079,0.084c-0.023,0.03-0.046,0.063-0.064,0.097s-0.034,0.069-0.046,0.107
					c-0.012,0.035-0.021,0.074-0.025,0.115c-0.007,0.041-0.009,0.083-0.007,0.126c0,0.046,0.004,0.099,0.012,0.159
					c0.009,0.062,0.022,0.133,0.039,0.213c0.018,0.08,0.038,0.167,0.063,0.264s0.055,0.202,0.088,0.314l0.55,1.869l-0.94,0.175
					l-1.192-4.109l0.866-0.144L52.382,35.889 M58.069,38.614c-0.147,0.027-0.291,0.039-0.427,0.034
					c-0.138-0.005-0.271-0.025-0.396-0.063c-0.127-0.037-0.25-0.092-0.365-0.161c-0.117-0.069-0.229-0.156-0.335-0.26
					c-0.085-0.082-0.163-0.17-0.238-0.268c-0.074-0.097-0.145-0.198-0.207-0.311c-0.063-0.112-0.123-0.229-0.175-0.355
					c-0.053-0.126-0.101-0.257-0.144-0.396c-0.051-0.167-0.09-0.326-0.115-0.476c-0.027-0.151-0.043-0.296-0.044-0.433
					c-0.004-0.136,0.005-0.264,0.026-0.386c0.021-0.121,0.053-0.234,0.098-0.34c0.046-0.105,0.099-0.201,0.159-0.282
					c0.062-0.083,0.131-0.156,0.21-0.218c0.078-0.062,0.164-0.112,0.258-0.151c0.096-0.041,0.197-0.068,0.31-0.089
					c0.124-0.019,0.245-0.026,0.362-0.02c0.119,0.005,0.234,0.023,0.347,0.056c0.112,0.03,0.223,0.076,0.33,0.135
					c0.107,0.058,0.211,0.129,0.313,0.212c0.101,0.085,0.199,0.186,0.291,0.298c0.09,0.114,0.177,0.241,0.257,0.384
					c0.081,0.144,0.158,0.3,0.228,0.472c0.071,0.172,0.137,0.356,0.195,0.558l-2.217,0.393c0.025,0.078,0.055,0.151,0.085,0.22
					c0.032,0.069,0.066,0.132,0.104,0.19c0.038,0.06,0.077,0.112,0.119,0.158c0.043,0.049,0.089,0.092,0.136,0.129
					c0.048,0.037,0.098,0.069,0.146,0.095c0.048,0.025,0.097,0.046,0.148,0.06c0.049,0.016,0.1,0.024,0.149,0.025
					c0.051,0.002,0.102-0.001,0.153-0.01c0.035-0.007,0.067-0.017,0.099-0.027c0.03-0.012,0.058-0.025,0.085-0.042
					c0.025-0.016,0.047-0.034,0.069-0.057c0.021-0.021,0.039-0.048,0.056-0.074c0.018-0.027,0.031-0.059,0.043-0.091
					c0.012-0.034,0.021-0.069,0.025-0.108c0.007-0.041,0.011-0.082,0.012-0.128c0-0.046,0-0.095-0.005-0.146l0.934,0.015
					c0.002,0.103,0,0.197-0.01,0.289c-0.009,0.092-0.026,0.179-0.046,0.261c-0.021,0.083-0.048,0.159-0.082,0.23
					c-0.032,0.071-0.071,0.14-0.115,0.201c-0.046,0.063-0.098,0.119-0.153,0.17c-0.057,0.051-0.119,0.097-0.188,0.138
					c-0.068,0.039-0.144,0.073-0.225,0.102C58.248,38.575,58.161,38.598,58.069,38.614 M26.8,37.772l-0.007,1.718l0.739-0.123
					l-0.003,0.628l-0.738,0.122l-0.01,2.672c0.001,0.086,0.002,0.164,0.002,0.232c0.001,0.069,0.001,0.131,0.004,0.182
					c0.001,0.052,0.003,0.094,0.005,0.128c0.002,0.034,0.005,0.058,0.008,0.073c0.005,0.025,0.011,0.048,0.019,0.067
					c0.007,0.021,0.015,0.041,0.025,0.059c0.01,0.017,0.022,0.032,0.034,0.046c0.014,0.015,0.027,0.027,0.043,0.037
					c0.016,0.009,0.033,0.017,0.052,0.022c0.02,0.007,0.041,0.01,0.062,0.012c0.023,0.003,0.047,0.003,0.072,0.002
					c0.025-0.002,0.054-0.006,0.083-0.011c0.042-0.009,0.083-0.017,0.125-0.025c0.039-0.01,0.078-0.021,0.115-0.03
					c0.036-0.013,0.072-0.024,0.105-0.038c0.034-0.014,0.067-0.027,0.099-0.042l0.003,0.687c-0.044,0.021-0.087,0.041-0.131,0.06
					c-0.043,0.018-0.086,0.034-0.129,0.05c-0.044,0.014-0.086,0.027-0.13,0.039c-0.042,0.012-0.086,0.021-0.128,0.028
					c-0.077,0.014-0.149,0.022-0.221,0.025c-0.069,0.002-0.138-0.001-0.204-0.01c-0.065-0.009-0.128-0.022-0.187-0.043
					c-0.06-0.02-0.116-0.046-0.168-0.076c-0.039-0.022-0.075-0.051-0.107-0.081c-0.031-0.031-0.06-0.065-0.085-0.104
					c-0.025-0.037-0.046-0.078-0.063-0.124c-0.018-0.042-0.032-0.092-0.041-0.141c-0.005-0.029-0.01-0.063-0.014-0.109
					c-0.005-0.044-0.008-0.097-0.01-0.159c-0.003-0.062-0.005-0.131-0.005-0.213c-0.002-0.078-0.003-0.167-0.002-0.266l0.022-2.82
					l-0.605,0.102l0.005-0.632l0.604-0.101l0.007-1.168L26.8,37.772 M36.196,36.219l0.241,6.327l-0.657,0.122l-0.021-0.684
					c-0.073,0.146-0.15,0.277-0.231,0.391c-0.083,0.116-0.17,0.215-0.262,0.298c-0.094,0.083-0.19,0.151-0.293,0.204
					c-0.102,0.053-0.209,0.089-0.321,0.11c-0.1,0.019-0.197,0.025-0.294,0.024c-0.097-0.004-0.19-0.018-0.284-0.043
					c-0.094-0.023-0.184-0.06-0.271-0.105c-0.091-0.046-0.177-0.104-0.262-0.17c-0.086-0.069-0.162-0.149-0.235-0.239
					c-0.071-0.089-0.138-0.189-0.195-0.3c-0.06-0.11-0.112-0.232-0.158-0.364c-0.046-0.131-0.086-0.271-0.119-0.425
					c-0.03-0.138-0.052-0.275-0.068-0.411c-0.017-0.135-0.024-0.267-0.025-0.398c-0.002-0.132,0.005-0.26,0.019-0.388
					c0.014-0.127,0.034-0.251,0.063-0.375c0.027-0.123,0.061-0.238,0.099-0.348c0.038-0.108,0.078-0.21,0.126-0.308
					c0.046-0.095,0.099-0.185,0.154-0.267c0.057-0.083,0.117-0.158,0.184-0.228c0.066-0.07,0.133-0.131,0.203-0.186
					c0.069-0.055,0.139-0.103,0.212-0.143c0.071-0.041,0.145-0.075,0.22-0.101c0.074-0.027,0.151-0.048,0.228-0.06
					c0.129-0.022,0.254-0.025,0.374-0.01c0.121,0.013,0.236,0.046,0.349,0.095c0.112,0.051,0.221,0.119,0.325,0.206
					c0.104,0.085,0.202,0.188,0.297,0.31l-0.078-2.429L36.196,36.219 M45.283,36.948l-0.551-2.071l0.982-0.154l1.567,5.803
					l-0.927,0.172l-0.168-0.633c-0.022,0.07-0.046,0.135-0.073,0.195c-0.028,0.063-0.06,0.121-0.094,0.176
					c-0.033,0.053-0.069,0.104-0.11,0.151c-0.039,0.046-0.081,0.088-0.126,0.129c-0.044,0.039-0.09,0.076-0.138,0.11
					c-0.046,0.032-0.095,0.062-0.143,0.087c-0.049,0.025-0.101,0.046-0.151,0.064c-0.053,0.018-0.105,0.031-0.159,0.041
					c-0.109,0.021-0.218,0.027-0.327,0.022c-0.108-0.007-0.218-0.027-0.326-0.06c-0.107-0.034-0.214-0.08-0.321-0.14
					s-0.213-0.135-0.318-0.22c-0.105-0.086-0.202-0.184-0.292-0.294c-0.091-0.108-0.174-0.229-0.248-0.362
					c-0.077-0.133-0.145-0.277-0.206-0.434c-0.06-0.154-0.114-0.321-0.16-0.501c-0.046-0.183-0.08-0.355-0.102-0.521
					c-0.022-0.163-0.031-0.318-0.029-0.461c0.004-0.145,0.019-0.28,0.048-0.406c0.027-0.124,0.066-0.241,0.119-0.347
					c0.051-0.107,0.112-0.203,0.18-0.288c0.068-0.085,0.145-0.157,0.229-0.221c0.083-0.063,0.177-0.114,0.275-0.154
					c0.1-0.041,0.207-0.071,0.323-0.091c0.104-0.019,0.209-0.021,0.314-0.014c0.104,0.009,0.209,0.029,0.313,0.063
					s0.207,0.08,0.312,0.14C45.077,36.792,45.181,36.863,45.283,36.948 M19.923,35.702c0.01-0.022,0.018-0.045,0.027-0.065
					c0.009-0.021,0.018-0.044,0.026-0.066c0.009-0.02,0.018-0.042,0.026-0.064c0.009-0.021,0.018-0.042,0.026-0.064
					c0.017-0.037,0.033-0.076,0.049-0.114c0.016-0.037,0.031-0.074,0.047-0.111c0.016-0.04,0.032-0.075,0.048-0.112
					c0.016-0.038,0.032-0.075,0.049-0.111c0.015-0.037,0.03-0.074,0.044-0.111c0.016-0.04,0.031-0.077,0.046-0.114
					s0.031-0.075,0.046-0.112c0.016-0.039,0.032-0.076,0.048-0.114c0.016-0.037,0.03-0.074,0.045-0.11
					c0.015-0.037,0.03-0.074,0.046-0.11c0.016-0.037,0.03-0.075,0.046-0.112c0.016-0.036,0.032-0.073,0.048-0.11l0.057-0.14
					l0.057-0.133l0.056-0.138l0.056-0.138c0.016-0.039,0.033-0.076,0.051-0.112c0.018-0.034,0.037-0.069,0.057-0.102
					s0.04-0.064,0.06-0.096c0.021-0.028,0.042-0.06,0.063-0.086c0.023-0.027,0.046-0.053,0.071-0.077
					c0.023-0.023,0.047-0.048,0.072-0.069c0.025-0.022,0.051-0.042,0.076-0.063c0.026-0.019,0.052-0.038,0.08-0.055
					c0.027-0.017,0.054-0.034,0.082-0.047s0.055-0.027,0.083-0.039c0.028-0.012,0.057-0.022,0.085-0.032
					c0.029-0.009,0.059-0.017,0.089-0.026c0.011-0.001,0.022-0.005,0.034-0.008c0.011-0.002,0.022-0.005,0.034-0.007
					c0.012-0.003,0.023-0.003,0.034-0.007c0.012-0.001,0.023-0.003,0.035-0.005c0.018-0.002,0.035-0.003,0.054-0.005
					c0.018-0.001,0.035-0.003,0.054-0.005c0.018,0,0.036,0,0.054,0c0.019,0,0.036,0,0.055,0c0.034,0.003,0.068,0.007,0.102,0.012
					c0.034,0.005,0.067,0.01,0.101,0.019c0.033,0.007,0.066,0.014,0.099,0.024s0.065,0.021,0.097,0.032
					c0.031,0.01,0.063,0.024,0.095,0.039c0.031,0.014,0.062,0.029,0.091,0.046c0.03,0.017,0.06,0.034,0.089,0.053
					c0.029,0.021,0.058,0.041,0.085,0.062s0.054,0.042,0.079,0.066c0.026,0.021,0.05,0.048,0.073,0.073
					c0.023,0.023,0.046,0.051,0.067,0.078c0.021,0.027,0.042,0.056,0.06,0.087c0.019,0.026,0.038,0.058,0.055,0.086
					c0.016,0.032,0.032,0.063,0.046,0.096s0.027,0.066,0.038,0.101c0.012,0.035,0.021,0.069,0.03,0.106
					c0.003,0.016,0.008,0.031,0.011,0.046c0.004,0.018,0.006,0.032,0.009,0.048c0.003,0.017,0.005,0.032,0.007,0.05
					c0.001,0.017,0.003,0.033,0.003,0.051c0.002,0.015,0.003,0.032,0.004,0.049c0.001,0.016,0.001,0.032,0.001,0.051
					c0,0.016-0.001,0.034-0.001,0.052c-0.001,0.019-0.002,0.035-0.003,0.053c-0.002,0.019-0.004,0.035-0.007,0.054
					c-0.002,0.02-0.004,0.038-0.007,0.055c-0.003,0.021-0.007,0.037-0.012,0.057c-0.003,0.019-0.009,0.037-0.014,0.056
					c-0.003,0.017-0.009,0.036-0.014,0.055c-0.005,0.019-0.011,0.039-0.017,0.058c-0.005,0.019-0.012,0.039-0.019,0.058
					c-0.007,0.021-0.014,0.039-0.022,0.06c-0.018,0.046-0.036,0.09-0.054,0.136c-0.017,0.046-0.036,0.092-0.054,0.137
					c-0.019,0.046-0.037,0.092-0.055,0.138c-0.019,0.046-0.037,0.092-0.054,0.139c-0.018,0.045-0.036,0.091-0.054,0.137
					c-0.019,0.046-0.038,0.092-0.055,0.138c-0.019,0.046-0.037,0.092-0.055,0.138c-0.019,0.046-0.037,0.094-0.054,0.14
					c-0.018,0.046-0.036,0.093-0.054,0.138c-0.019,0.047-0.037,0.093-0.056,0.141c-0.019,0.046-0.037,0.092-0.056,0.14
					c-0.018,0.046-0.037,0.092-0.055,0.138c-0.018,0.046-0.036,0.092-0.055,0.14c-0.019,0.046-0.038,0.093-0.056,0.139
					c-0.019,0.048-0.038,0.094-0.056,0.142c-0.019,0.046-0.037,0.094-0.055,0.14c-0.037,0.092-0.074,0.184-0.11,0.275
					s-0.073,0.184-0.11,0.277c-0.037,0.092-0.074,0.185-0.11,0.276c-0.037,0.094-0.073,0.186-0.11,0.279l1.818,10.088l-13.024,2.595
					L8.875,37.297L19.923,35.702 M36.297,24.709c-1.344,0.141-2.819,0.042-4.298-0.268c-1.497-0.312-2.991-0.84-4.355-1.55
					c-1.371-0.713-2.599-1.606-3.554-2.643c-0.952-1.035-1.625-2.205-1.888-3.469c-0.031-0.146-0.027-0.276,0.003-0.388
					c0.03-0.113,0.086-0.208,0.163-0.287c0.075-0.079,0.169-0.14,0.275-0.183c0.105-0.043,0.223-0.069,0.343-0.076
					c0.121-0.007,0.245,0.004,0.365,0.033c0.121,0.03,0.238,0.077,0.344,0.145c0.106,0.067,0.201,0.153,0.277,0.258
					c0.076,0.106,0.133,0.231,0.165,0.377c0.213,0.985,0.771,1.897,1.563,2.703c0.792,0.808,1.813,1.503,2.949,2.06
					c1.132,0.554,2.372,0.967,3.608,1.215c1.228,0.246,2.445,0.327,3.547,0.22c0.454-0.043,0.888-0.119,1.292-0.228
					c0.406-0.108,0.782-0.249,1.126-0.425c0.34-0.175,0.647-0.384,0.913-0.628c0.264-0.244,0.488-0.523,0.663-0.838
					c0.03-0.053,0.064-0.101,0.101-0.141c0.037-0.041,0.076-0.074,0.119-0.101c0.04-0.027,0.086-0.048,0.132-0.063
					c0.046-0.016,0.094-0.025,0.142-0.03c0.156-0.014,0.323,0.027,0.479,0.107c0.158,0.08,0.304,0.199,0.42,0.341
					c0.114,0.142,0.199,0.308,0.232,0.481c0.031,0.174,0.011,0.356-0.083,0.531c-0.228,0.421-0.514,0.795-0.85,1.121
					c-0.337,0.328-0.727,0.608-1.156,0.844c-0.433,0.236-0.906,0.427-1.415,0.573C37.409,24.548,36.864,24.65,36.297,24.709
					 M33.725,11.859c0.03-0.023,0.064-0.044,0.1-0.062c0.036-0.019,0.071-0.034,0.11-0.047c0.041-0.013,0.08-0.023,0.121-0.031
					c0.043-0.007,0.085-0.012,0.129-0.014c0.043-0.002,0.089,0,0.133,0.003c0.046,0.003,0.091,0.01,0.135,0.02
					c0.046,0.008,0.09,0.021,0.134,0.037c0.045,0.014,0.087,0.032,0.13,0.053c0.081,0.011,0.165,0.026,0.25,0.042
					c0.081,0.018,0.166,0.039,0.251,0.063c0.084,0.024,0.17,0.051,0.255,0.082c0.086,0.031,0.171,0.065,0.256,0.102
					c0.232,0.101,0.395,0.247,0.493,0.409c0.1,0.163,0.138,0.344,0.122,0.514c-0.014,0.17-0.082,0.329-0.194,0.448
					c-0.11,0.12-0.265,0.2-0.455,0.21c-0.019,0.001-0.039,0.001-0.06,0.001c-0.021-0.001-0.041-0.002-0.062-0.004
					c-0.021-0.002-0.042-0.004-0.063-0.008c-0.022-0.003-0.045-0.008-0.066-0.013c0.017,0.172,0.027,0.345,0.03,0.516
					c0.005,0.172,0.002,0.343-0.007,0.514c-0.008,0.171-0.023,0.341-0.048,0.51c-0.021,0.17-0.052,0.338-0.09,0.508
					c-0.015,0.073-0.046,0.138-0.083,0.194c-0.039,0.057-0.09,0.104-0.146,0.144c-0.058,0.04-0.122,0.07-0.19,0.093
					c-0.069,0.022-0.145,0.036-0.221,0.041c-0.038,0.002-0.078,0.003-0.117,0.001c-0.041-0.001-0.08-0.006-0.119-0.012
					c-0.039-0.007-0.078-0.016-0.117-0.026c-0.039-0.011-0.077-0.023-0.114-0.04c-0.326-0.133-0.638-0.321-0.913-0.547
					c-0.277-0.226-0.517-0.49-0.699-0.774c-0.18-0.284-0.305-0.589-0.349-0.898c-0.044-0.309-0.008-0.62,0.127-0.917
					c0.068-0.151,0.15-0.288,0.243-0.409c0.092-0.122,0.196-0.228,0.31-0.32c0.114-0.092,0.236-0.169,0.369-0.233
					C33.44,11.944,33.578,11.895,33.725,11.859 M27.854,15.504c-0.09,0.005-0.183,0.005-0.275-0.001
					c-0.093-0.007-0.187-0.021-0.282-0.039c-0.095-0.02-0.191-0.045-0.287-0.078c-0.097-0.032-0.193-0.07-0.289-0.116
					c-0.355-0.166-0.692-0.387-0.998-0.647c-0.305-0.259-0.579-0.557-0.808-0.877c-0.229-0.32-0.413-0.663-0.539-1.01
					c-0.127-0.348-0.196-0.7-0.195-1.044c0.001-0.379,0.089-0.693,0.243-0.95c0.153-0.257,0.372-0.458,0.633-0.615
					c0.263-0.155,0.57-0.265,0.899-0.338c0.33-0.074,0.682-0.112,1.04-0.125c0.151-0.005,0.303-0.006,0.455-0.002
					c0.15,0.002,0.301,0.01,0.448,0.02c0.148,0.01,0.293,0.024,0.435,0.04s0.28,0.034,0.413,0.055
					c0.124,0.019,0.241,0.064,0.347,0.128c0.105,0.063,0.199,0.147,0.277,0.24c0.08,0.094,0.141,0.198,0.182,0.306
					c0.041,0.107,0.062,0.218,0.056,0.324c-0.005,0.1-0.029,0.19-0.068,0.268c-0.039,0.079-0.094,0.146-0.16,0.202
					c-0.066,0.056-0.145,0.101-0.231,0.132c-0.087,0.031-0.184,0.049-0.284,0.054l0,0h-0.001l0,0l0,0
					c0.083,0.031,0.165,0.073,0.241,0.123c0.077,0.049,0.148,0.106,0.209,0.169c0.061,0.064,0.114,0.133,0.153,0.208
					c0.039,0.074,0.064,0.153,0.073,0.235c0.024,0.231,0.046,0.479,0.056,0.732c0.012,0.253,0.008,0.511-0.017,0.761
					c-0.027,0.25-0.078,0.493-0.165,0.716c-0.086,0.224-0.209,0.428-0.381,0.599c-0.078,0.081-0.162,0.152-0.251,0.215
					c-0.091,0.063-0.186,0.116-0.285,0.161c-0.1,0.045-0.204,0.081-0.313,0.107C28.079,15.48,27.967,15.497,27.854,15.504
					 M35.615,30.737c-1.752,0.231-3.634,0.267-5.547,0.082c-1.937-0.189-3.897-0.605-5.77-1.273
					c-1.888-0.675-3.675-1.602-5.242-2.802c-1.568-1.2-2.904-2.663-3.889-4.396c-0.942-1.66-1.316-3.264-1.265-4.778
					c0.05-1.493,0.514-2.89,1.25-4.165c0.723-1.253,1.707-2.387,2.817-3.379c1.09-0.976,2.303-1.816,3.516-2.507
					c1.114-0.637,2.294-1.24,3.518-1.785c1.205-0.536,2.452-1.017,3.724-1.419c1.252-0.395,2.529-0.715,3.814-0.936
					c1.267-0.218,2.543-0.342,3.815-0.351c0.182,0,0.363,0,0.546,0.004c0.182,0.003,0.363,0.009,0.544,0.018
					c0.182,0.008,0.362,0.019,0.542,0.032c0.183,0.014,0.362,0.03,0.541,0.048c0.248,0.025,0.461,0.132,0.626,0.277
					c0.165,0.145,0.284,0.33,0.343,0.512c0.062,0.183,0.062,0.363-0.008,0.499c-0.071,0.136-0.215,0.227-0.44,0.23
					c-0.009,0-0.018,0-0.027,0c-0.009-0.001-0.017-0.001-0.025-0.001c-0.011-0.001-0.019-0.002-0.027-0.002
					c-0.01,0-0.021-0.001-0.029-0.002c-0.17-0.017-0.342-0.031-0.513-0.042s-0.342-0.021-0.514-0.028s-0.344-0.011-0.518-0.014
					c-0.171-0.002-0.345-0.002-0.517,0c-1.086,0.015-2.177,0.119-3.261,0.296c-1.095,0.181-2.187,0.436-3.256,0.75
					c-1.085,0.32-2.15,0.7-3.179,1.125c-1.044,0.43-2.052,0.906-3.009,1.412c-1.017,0.538-2.162,1.213-3.268,2.016
					c-1.126,0.816-2.215,1.766-3.09,2.837c-0.891,1.091-1.559,2.304-1.814,3.624c-0.26,1.337-0.093,2.776,0.691,4.289
					c0.829,1.595,1.99,2.95,3.376,4.07c1.385,1.119,2.984,1.995,4.688,2.639c1.69,0.641,3.474,1.051,5.244,1.248
					c1.751,0.195,3.482,0.184,5.1-0.015c0.352-0.044,0.697-0.096,1.035-0.157c0.339-0.06,0.67-0.129,0.995-0.206
					c0.323-0.078,0.639-0.163,0.945-0.256c0.308-0.093,0.605-0.194,0.895-0.302c0.918-0.346,1.827-0.801,2.652-1.359
					c0.814-0.552,1.544-1.203,2.117-1.949c0.567-0.738,0.982-1.569,1.176-2.491c0.192-0.911,0.169-1.912-0.138-3.001
					c-0.285-1.012-0.7-1.986-1.214-2.92c-0.51-0.929-1.117-1.82-1.788-2.674c-0.67-0.85-1.405-1.664-2.172-2.439
					c-0.765-0.772-1.564-1.508-2.363-2.203c-0.167-0.146-0.272-0.306-0.325-0.466c-0.054-0.159-0.056-0.317-0.019-0.457
					c0.036-0.14,0.112-0.262,0.216-0.35c0.103-0.087,0.233-0.141,0.378-0.145c0.046-0.001,0.094,0.002,0.141,0.011
					c0.05,0.009,0.098,0.023,0.148,0.043c0.049,0.021,0.101,0.046,0.151,0.078c0.053,0.032,0.104,0.071,0.154,0.116
					c0.337,0.292,0.672,0.588,1.002,0.889c0.331,0.3,0.658,0.604,0.98,0.914s0.638,0.625,0.947,0.946
					c0.31,0.322,0.61,0.65,0.901,0.986c0.656,0.756,1.317,1.575,1.929,2.438c0.611,0.864,1.176,1.774,1.642,2.707
					c0.467,0.938,0.832,1.902,1.041,2.87c0.211,0.977,0.266,1.961,0.105,2.934c-0.158,0.976-0.475,1.859-0.918,2.653
					c-0.447,0.804-1.027,1.519-1.704,2.148c-0.687,0.636-1.474,1.185-2.329,1.65c-0.865,0.471-1.801,0.859-2.77,1.163
					c-0.256,0.08-0.514,0.155-0.779,0.225s-0.535,0.134-0.811,0.194c-0.276,0.06-0.557,0.116-0.841,0.163
					C36.198,30.653,35.909,30.699,35.615,30.737 M49.869-0.028L0.021-0.234l6.663,54.651L63.825,42.1L49.869-0.028"/>
				<path d="M36.356,3.027c-1.272,0.009-2.549,0.133-3.815,0.351c-1.286,0.221-2.563,0.541-3.814,0.936
					c-1.272,0.402-2.519,0.883-3.724,1.419c-1.224,0.545-2.403,1.148-3.518,1.785c-1.213,0.691-2.426,1.532-3.516,2.507
					c-1.11,0.993-2.094,2.126-2.817,3.379c-0.736,1.275-1.2,2.672-1.25,4.165c-0.051,1.514,0.323,3.118,1.265,4.778
					c0.985,1.734,2.321,3.197,3.889,4.396c1.567,1.2,3.354,2.126,5.242,2.802c1.872,0.668,3.833,1.084,5.77,1.273
					c1.913,0.186,3.795,0.149,5.547-0.082c0.294-0.038,0.583-0.083,0.868-0.133c0.284-0.047,0.564-0.104,0.841-0.163
					c0.275-0.06,0.545-0.124,0.811-0.194s0.523-0.145,0.779-0.225c0.969-0.304,1.904-0.692,2.77-1.163
					c0.855-0.465,1.643-1.015,2.329-1.65c0.677-0.63,1.257-1.344,1.704-2.148c0.443-0.794,0.76-1.677,0.918-2.653
					c0.16-0.973,0.105-1.957-0.105-2.934c-0.209-0.968-0.574-1.932-1.041-2.87c-0.466-0.933-1.03-1.842-1.642-2.707
					c-0.611-0.862-1.272-1.682-1.929-2.438c-0.291-0.336-0.592-0.664-0.901-0.986c-0.31-0.321-0.625-0.637-0.947-0.946
					s-0.649-0.614-0.98-0.914c-0.33-0.3-0.665-0.596-1.002-0.889c-0.051-0.045-0.102-0.083-0.154-0.116
					c-0.051-0.032-0.103-0.058-0.151-0.078c-0.051-0.021-0.099-0.034-0.148-0.043c-0.047-0.008-0.095-0.012-0.141-0.011
					c-0.145,0.004-0.275,0.058-0.378,0.145c-0.104,0.088-0.18,0.209-0.216,0.35c-0.037,0.14-0.035,0.297,0.019,0.457
					c0.053,0.16,0.158,0.32,0.325,0.466c0.799,0.695,1.599,1.43,2.363,2.203c0.767,0.775,1.502,1.589,2.172,2.439
					c0.671,0.854,1.278,1.745,1.788,2.674c0.514,0.934,0.929,1.908,1.214,2.92c0.307,1.089,0.33,2.09,0.138,3.001
					c-0.193,0.922-0.608,1.753-1.176,2.491c-0.573,0.747-1.303,1.397-2.117,1.949c-0.825,0.558-1.734,1.013-2.652,1.359
					c-0.289,0.108-0.587,0.209-0.895,0.302c-0.307,0.093-0.622,0.178-0.945,0.256c-0.325,0.077-0.656,0.146-0.995,0.206
					c-0.338,0.061-0.684,0.112-1.035,0.157c-1.617,0.199-3.348,0.21-5.1,0.015c-1.77-0.197-3.554-0.606-5.244-1.248
					c-1.704-0.645-3.303-1.52-4.688-2.639c-1.386-1.121-2.547-2.476-3.376-4.07c-0.784-1.513-0.951-2.952-0.691-4.289
					c0.255-1.32,0.923-2.533,1.814-3.624c0.875-1.071,1.964-2.021,3.09-2.837c1.106-0.803,2.251-1.478,3.268-2.016
					c0.957-0.505,1.965-0.981,3.009-1.412c1.029-0.426,2.094-0.806,3.179-1.125c1.069-0.314,2.161-0.569,3.256-0.75
					c1.084-0.177,2.175-0.281,3.261-0.296c0.172-0.002,0.346-0.002,0.517,0c0.174,0.002,0.346,0.007,0.518,0.014
					s0.343,0.016,0.514,0.028s0.343,0.025,0.513,0.042c0.009,0.001,0.02,0.002,0.029,0.002c0.009,0,0.017,0.001,0.027,0.002
					c0.009,0,0.017,0,0.025,0.001c0.01,0,0.019,0,0.027,0c0.226-0.003,0.369-0.095,0.44-0.23c0.069-0.135,0.069-0.315,0.008-0.499
					c-0.059-0.183-0.178-0.367-0.343-0.512c-0.165-0.146-0.378-0.252-0.626-0.277c-0.179-0.019-0.358-0.035-0.541-0.048
					c-0.18-0.014-0.36-0.024-0.542-0.032c-0.181-0.009-0.362-0.015-0.544-0.018C36.72,3.027,36.538,3.026,36.356,3.027"/>
				<path d="M26.829,11.372c0.009-0.001,0.02-0.003,0.03-0.005c0.01-0.002,0.021-0.003,0.031-0.005c0.011,0,0.021-0.002,0.03-0.004
					c0.009-0.001,0.016-0.002,0.023-0.003c0.028-0.003,0.056-0.006,0.083-0.008c0.028-0.002,0.056-0.005,0.083-0.007
					c0.028-0.001,0.056-0.003,0.084-0.005c0.028-0.002,0.057-0.003,0.084-0.004c0.017-0.001,0.032-0.001,0.049-0.002
					c0.015,0,0.032,0,0.048-0.001c0.017-0.001,0.032-0.001,0.049-0.001c0.016-0.001,0.032-0.001,0.048-0.001
					c0.045-0.001,0.09-0.002,0.135-0.001c0.044,0,0.09,0.001,0.134,0.002c0.045,0.002,0.09,0.003,0.135,0.006
					c0.045,0.002,0.089,0.005,0.134,0.009c0.002,0,0.015,0.001,0.035,0.003c0.019,0.001,0.044,0.004,0.07,0.007
					c0.025,0.002,0.051,0.005,0.073,0.007c0.022,0.003,0.039,0.003,0.046,0.005c0.006,0.001,0.012,0.001,0.018,0.001
					c0.006,0.001,0.012,0.001,0.018,0.002c0.006,0.001,0.012,0.001,0.017,0.002c0.006,0,0.012,0.001,0.019,0.001
					c-0.107,0.021-0.2,0.06-0.275,0.112c-0.078,0.053-0.14,0.12-0.187,0.197c-0.046,0.078-0.08,0.165-0.098,0.26
					c-0.019,0.095-0.024,0.197-0.015,0.303c0.001,0.014,0.002,0.026,0.003,0.036s0.001,0.018,0.001,0.023
					c0.001,0.006,0.002,0.01,0.002,0.014c0,0.002,0,0.003,0,0.003c0,0,0-0.001,0-0.001c0-0.001,0-0.002,0-0.004
					c0-0.001,0-0.004,0-0.006c0-0.002,0-0.005,0-0.007c0.001,0.015,0.003,0.03,0.003,0.046c0.001,0.014,0.001,0.029,0.002,0.045
					c0.001,0.014,0.001,0.03,0.001,0.045c0,0.015,0,0.029,0.001,0.043c0.001,0.03,0.002,0.06,0.002,0.089
					c0.001,0.03,0.001,0.06,0.001,0.089c0,0.029,0,0.059,0,0.087c0,0.03-0.001,0.059-0.001,0.087
					c-0.001,0.027-0.002,0.053-0.003,0.078c-0.001,0.026-0.003,0.052-0.004,0.079c-0.002,0.025-0.004,0.052-0.006,0.077
					c-0.002,0.026-0.005,0.053-0.007,0.079c-0.002,0.013-0.005,0.034-0.009,0.059c-0.004,0.025-0.009,0.054-0.013,0.081
					c-0.005,0.028-0.01,0.054-0.014,0.075c-0.003,0.021-0.005,0.038-0.006,0.043c-0.006,0.021-0.011,0.04-0.018,0.061
					c-0.007,0.02-0.014,0.039-0.021,0.06c-0.007,0.02-0.015,0.039-0.022,0.059c-0.009,0.019-0.015,0.038-0.024,0.058
					c-0.004,0.007-0.008,0.014-0.012,0.021c-0.005,0.007-0.009,0.014-0.014,0.021c-0.004,0.006-0.008,0.013-0.012,0.019
					c-0.004,0.007-0.009,0.012-0.012,0.017c-0.001,0.002-0.003,0.004-0.004,0.007c-0.002,0.002-0.004,0.003-0.005,0.006
					c-0.001,0.001-0.002,0.003-0.004,0.005c-0.001,0.002-0.002,0.004-0.003,0.006c-0.002,0.002-0.004,0.003-0.007,0.004
					c-0.001,0.001-0.003,0.002-0.005,0.004c-0.002,0.001-0.005,0.003-0.007,0.004c-0.001,0.002-0.003,0.003-0.006,0.004
					l-0.001,0.001H27.51c0,0,0,0.001-0.001,0.001s-0.001,0-0.001,0c-0.007-0.001-0.013-0.002-0.019-0.003
					c-0.007-0.001-0.013-0.002-0.019-0.003c-0.007-0.001-0.013-0.003-0.019-0.003c-0.007-0.002-0.014-0.003-0.019-0.004
					c-0.002-0.001-0.002-0.001-0.003-0.001c-0.001-0.001-0.002-0.001-0.002-0.001c-0.001,0-0.002-0.001-0.002-0.001
					c-0.002-0.001-0.002-0.001-0.003-0.002c-0.014-0.005-0.028-0.011-0.043-0.017c-0.013-0.006-0.029-0.012-0.042-0.018
					c-0.014-0.007-0.029-0.014-0.043-0.02c-0.015-0.008-0.029-0.015-0.043-0.022c-0.003-0.001-0.006-0.002-0.009-0.004
					c-0.003-0.001-0.005-0.002-0.008-0.003c-0.002-0.001-0.005-0.002-0.007-0.003c-0.003-0.001-0.005-0.001-0.008-0.003
					c-0.028-0.018-0.055-0.037-0.083-0.055c-0.027-0.02-0.054-0.038-0.081-0.059c-0.026-0.02-0.053-0.039-0.078-0.06
					c-0.026-0.021-0.053-0.042-0.079-0.062l-0.059-0.054c-0.011-0.011-0.022-0.022-0.032-0.033c-0.011-0.01-0.021-0.022-0.032-0.033
					c-0.01-0.011-0.021-0.022-0.032-0.033c-0.011-0.011-0.021-0.022-0.033-0.032c-0.024-0.028-0.049-0.055-0.075-0.083
					c-0.023-0.028-0.048-0.057-0.071-0.086c-0.024-0.028-0.047-0.057-0.071-0.087c-0.022-0.029-0.045-0.059-0.068-0.087
					c-0.001-0.002-0.002-0.003-0.003-0.004c-0.001-0.001-0.002-0.003-0.003-0.004c-0.002-0.003-0.002-0.003-0.003-0.005
					c-0.002-0.001-0.002-0.002-0.003-0.003c-0.01-0.018-0.021-0.035-0.032-0.053c-0.011-0.018-0.021-0.036-0.031-0.053
					s-0.02-0.034-0.029-0.052c-0.01-0.017-0.021-0.033-0.03-0.05c-0.011-0.021-0.023-0.042-0.035-0.063
					c-0.01-0.021-0.021-0.042-0.032-0.065c-0.01-0.021-0.021-0.042-0.031-0.064c-0.009-0.022-0.019-0.043-0.029-0.065
					c-0.003-0.009-0.007-0.021-0.01-0.031c-0.004-0.011-0.008-0.023-0.012-0.034c-0.004-0.012-0.008-0.023-0.012-0.033
					s-0.006-0.02-0.009-0.027c-0.003-0.018-0.008-0.037-0.012-0.054c-0.003-0.019-0.008-0.038-0.012-0.056
					c-0.003-0.019-0.007-0.038-0.01-0.056c-0.003-0.02-0.006-0.038-0.01-0.057c0-0.001,0-0.002,0-0.003
					c-0.001-0.001-0.001-0.002-0.001-0.003c-0.001,0-0.001-0.002-0.001-0.003c0,0,0-0.001-0.001-0.003
					c0-0.013,0.001-0.027,0.001-0.041c0.001-0.014,0.002-0.026,0.002-0.04c0-0.013,0.001-0.026,0.003-0.039
					c0-0.014,0.001-0.026,0.002-0.04l0.007-0.045c0.003-0.009,0.005-0.017,0.009-0.025c0.003-0.008,0.006-0.017,0.009-0.024
					s0.006-0.016,0.01-0.024c0.002-0.008,0.006-0.016,0.009-0.024l0.069-0.088c0.002-0.002,0.004-0.004,0.006-0.007
					c0.003-0.003,0.005-0.005,0.008-0.009c0.002-0.002,0.006-0.006,0.008-0.008c0.003-0.002,0.006-0.006,0.008-0.009
					c0.004-0.003,0.008-0.007,0.014-0.01c0.003-0.003,0.008-0.007,0.014-0.01c0.003-0.003,0.008-0.007,0.013-0.009
					c0.004-0.003,0.009-0.006,0.014-0.009c0.009-0.008,0.02-0.015,0.03-0.022c0.01-0.007,0.021-0.013,0.03-0.02
					c0.01-0.007,0.021-0.013,0.031-0.019c0.01-0.006,0.021-0.011,0.029-0.017c0.002-0.001,0.002-0.002,0.003-0.002
					c0.002-0.001,0.002-0.001,0.003-0.001c0.001-0.001,0.002-0.002,0.003-0.002c0.001-0.001,0.002-0.001,0.003-0.001
					c0.025-0.011,0.051-0.021,0.078-0.03c0.026-0.009,0.053-0.018,0.08-0.026c0.027-0.009,0.054-0.016,0.082-0.023
					c0.027-0.008,0.055-0.014,0.083-0.021c0.007-0.002,0.015-0.005,0.023-0.007c0.008-0.002,0.016-0.004,0.023-0.006
					c0.008-0.002,0.017-0.004,0.024-0.006C26.812,11.375,26.82,11.374,26.829,11.372 M26.997,9.663
					c-0.358,0.013-0.71,0.051-1.04,0.125c-0.33,0.074-0.637,0.184-0.899,0.338c-0.262,0.156-0.48,0.358-0.633,0.615
					c-0.154,0.257-0.242,0.571-0.243,0.95c-0.001,0.344,0.068,0.696,0.195,1.044c0.126,0.348,0.31,0.69,0.539,1.01
					c0.229,0.32,0.503,0.618,0.808,0.877c0.306,0.26,0.643,0.481,0.998,0.647c0.096,0.046,0.192,0.084,0.289,0.116
					c0.095,0.032,0.191,0.058,0.287,0.078c0.095,0.019,0.189,0.032,0.282,0.039c0.092,0.007,0.185,0.007,0.275,0.001
					c0.114-0.007,0.225-0.024,0.333-0.049c0.108-0.026,0.212-0.062,0.313-0.107c0.099-0.044,0.194-0.098,0.285-0.161
					c0.09-0.063,0.173-0.134,0.251-0.215c0.172-0.171,0.294-0.375,0.381-0.599c0.087-0.223,0.138-0.465,0.165-0.716
					c0.025-0.25,0.029-0.508,0.017-0.761c-0.01-0.252-0.032-0.5-0.056-0.732c-0.009-0.083-0.034-0.162-0.073-0.235
					c-0.039-0.074-0.092-0.144-0.153-0.208c-0.062-0.063-0.133-0.12-0.209-0.169c-0.076-0.049-0.158-0.091-0.241-0.123l0,0l0,0
					h0.001l0,0c0.101-0.004,0.197-0.023,0.284-0.054c0.086-0.031,0.165-0.076,0.231-0.132c0.066-0.056,0.121-0.123,0.16-0.202
					c0.039-0.078,0.063-0.168,0.068-0.268c0.005-0.106-0.015-0.217-0.056-0.324c-0.041-0.108-0.102-0.212-0.182-0.306
					c-0.079-0.093-0.172-0.177-0.277-0.24c-0.105-0.064-0.223-0.11-0.347-0.128c-0.133-0.021-0.271-0.039-0.413-0.055
					s-0.287-0.03-0.435-0.04c-0.147-0.01-0.298-0.018-0.448-0.02C27.3,9.657,27.148,9.657,26.997,9.663"/>
				<path d="M34.185,11.706c-0.044,0.002-0.086,0.007-0.129,0.014c-0.041,0.008-0.08,0.018-0.121,0.031
					c-0.039,0.013-0.074,0.028-0.11,0.047c-0.035,0.018-0.069,0.039-0.1,0.062c-0.146,0.036-0.284,0.085-0.415,0.149
					c-0.133,0.063-0.255,0.141-0.369,0.233c-0.114,0.092-0.218,0.199-0.31,0.32c-0.093,0.122-0.175,0.258-0.243,0.409
					c-0.136,0.297-0.172,0.608-0.127,0.917c0.044,0.309,0.168,0.614,0.349,0.898c0.182,0.285,0.421,0.548,0.699,0.774
					c0.275,0.226,0.587,0.414,0.913,0.547c0.037,0.016,0.075,0.029,0.114,0.04c0.039,0.01,0.078,0.019,0.117,0.026
					c0.039,0.006,0.078,0.01,0.119,0.012c0.039,0.002,0.079,0.001,0.117-0.001c0.076-0.005,0.151-0.019,0.221-0.041
					c0.068-0.022,0.133-0.053,0.19-0.093c0.057-0.039,0.107-0.087,0.146-0.144c0.037-0.056,0.068-0.121,0.083-0.194
					c0.038-0.169,0.068-0.338,0.09-0.508c0.024-0.169,0.04-0.339,0.048-0.51c0.009-0.17,0.012-0.342,0.007-0.514
					c-0.003-0.171-0.014-0.344-0.03-0.516c0.021,0.005,0.044,0.009,0.066,0.013c0.021,0.003,0.042,0.006,0.063,0.008
					c0.021,0.002,0.041,0.003,0.062,0.004c0.021,0,0.041,0,0.06-0.001c0.19-0.01,0.345-0.09,0.455-0.21
					c0.112-0.119,0.181-0.278,0.194-0.448c0.016-0.17-0.022-0.351-0.122-0.514c-0.099-0.163-0.261-0.309-0.493-0.409
					c-0.085-0.037-0.17-0.071-0.256-0.102c-0.085-0.03-0.171-0.058-0.255-0.082c-0.085-0.024-0.17-0.045-0.251-0.063
					c-0.085-0.017-0.169-0.031-0.25-0.042c-0.043-0.021-0.085-0.039-0.13-0.053c-0.044-0.016-0.088-0.028-0.134-0.037
					c-0.044-0.009-0.089-0.016-0.135-0.02C34.273,11.706,34.228,11.704,34.185,11.706"/>
				<path d="M22.986,15.847c-0.121,0.007-0.238,0.033-0.343,0.076c-0.105,0.043-0.2,0.104-0.275,0.183
					c-0.076,0.078-0.133,0.173-0.163,0.287c-0.03,0.112-0.034,0.242-0.003,0.388c0.263,1.264,0.936,2.434,1.888,3.469
					c0.955,1.037,2.183,1.929,3.554,2.643c1.364,0.709,2.858,1.238,4.355,1.55c1.479,0.31,2.955,0.409,4.298,0.268
					c0.567-0.06,1.112-0.162,1.622-0.309c0.509-0.146,0.982-0.336,1.415-0.573c0.43-0.236,0.819-0.516,1.156-0.844
					c0.336-0.326,0.622-0.7,0.85-1.121c0.094-0.174,0.114-0.356,0.083-0.531c-0.033-0.173-0.118-0.339-0.232-0.481
					c-0.116-0.142-0.262-0.261-0.42-0.341c-0.156-0.08-0.323-0.121-0.479-0.107c-0.048,0.004-0.096,0.014-0.142,0.03
					c-0.046,0.015-0.092,0.036-0.132,0.063c-0.043,0.027-0.082,0.061-0.119,0.101c-0.036,0.04-0.07,0.088-0.101,0.141
					c-0.175,0.315-0.399,0.594-0.663,0.838c-0.266,0.245-0.573,0.453-0.913,0.628c-0.344,0.176-0.72,0.317-1.126,0.425
					c-0.404,0.109-0.838,0.185-1.292,0.228c-1.102,0.106-2.319,0.025-3.547-0.22c-1.236-0.248-2.476-0.661-3.608-1.215
					c-1.136-0.557-2.157-1.252-2.949-2.06c-0.792-0.805-1.35-1.717-1.563-2.703c-0.031-0.146-0.088-0.271-0.165-0.377
					c-0.077-0.105-0.171-0.191-0.277-0.258c-0.105-0.067-0.223-0.115-0.344-0.145C23.231,15.851,23.107,15.84,22.986,15.847"/>
				<path d="M19.923,35.702L8.875,37.297l1.766,13.245l13.024-2.595l-1.818-10.088c-0.027,0.068-0.054,0.136-0.081,0.204
					c-0.026,0.068-0.053,0.136-0.08,0.204c-0.027,0.068-0.054,0.138-0.08,0.206c-0.027,0.067-0.054,0.136-0.081,0.203
					c-0.065,0.162-0.13,0.325-0.196,0.488s-0.131,0.326-0.196,0.491c-0.066,0.164-0.132,0.328-0.198,0.495
					c-0.066,0.165-0.132,0.332-0.198,0.498c-0.008,0.019-0.015,0.038-0.022,0.055c-0.007,0.019-0.014,0.037-0.022,0.056
					c-0.007,0.02-0.015,0.038-0.022,0.055c-0.006,0.019-0.014,0.037-0.021,0.057l0.977,5.612l-9.359,1.79l-1.331-9.496l8.224-1.244
					c0.006-0.016,0.013-0.031,0.019-0.046c0.006-0.014,0.012-0.029,0.018-0.045c0.006-0.014,0.013-0.028,0.019-0.044
					s0.012-0.028,0.018-0.044c0.052-0.122,0.104-0.245,0.154-0.365c0.052-0.123,0.102-0.245,0.153-0.366
					c0.05-0.122,0.1-0.243,0.15-0.363c0.051-0.121,0.101-0.242,0.15-0.361c0.007-0.017,0.014-0.033,0.021-0.051
					c0.006-0.015,0.014-0.032,0.021-0.049c0.007-0.016,0.014-0.032,0.02-0.048C19.91,35.734,19.917,35.719,19.923,35.702"/>
				<path d="M26.8,37.772l-0.755,0.674l-0.007,1.168l-0.604,0.101l-0.005,0.632l0.605-0.102l-0.022,2.82
					c-0.001,0.099,0,0.188,0.002,0.266c0,0.082,0.001,0.151,0.005,0.213c0.002,0.063,0.005,0.115,0.01,0.159
					c0.003,0.046,0.008,0.08,0.014,0.109c0.008,0.049,0.023,0.099,0.041,0.141c0.017,0.046,0.038,0.087,0.063,0.124
					c0.025,0.039,0.054,0.073,0.085,0.104c0.033,0.03,0.068,0.059,0.107,0.081c0.053,0.03,0.109,0.057,0.168,0.076
					c0.059,0.021,0.122,0.034,0.187,0.043c0.065,0.009,0.134,0.012,0.204,0.01c0.072-0.003,0.145-0.012,0.221-0.025
					c0.042-0.007,0.086-0.017,0.128-0.028c0.043-0.012,0.086-0.025,0.13-0.039c0.043-0.016,0.086-0.032,0.129-0.05
					c0.043-0.019,0.087-0.039,0.131-0.06l-0.003-0.687c-0.031,0.015-0.064,0.028-0.099,0.042c-0.034,0.014-0.069,0.025-0.105,0.038
					c-0.037,0.01-0.076,0.021-0.115,0.03c-0.041,0.009-0.082,0.017-0.125,0.025c-0.029,0.005-0.058,0.009-0.083,0.011
					c-0.025,0.001-0.049,0.001-0.072-0.002c-0.021-0.002-0.042-0.005-0.062-0.012c-0.019-0.006-0.036-0.014-0.052-0.022
					c-0.017-0.01-0.03-0.022-0.043-0.037c-0.012-0.014-0.024-0.029-0.034-0.046c-0.01-0.018-0.019-0.038-0.025-0.059
					c-0.008-0.02-0.014-0.042-0.019-0.067c-0.003-0.016-0.005-0.039-0.008-0.073c-0.002-0.034-0.004-0.076-0.005-0.128
					c-0.002-0.051-0.002-0.112-0.004-0.182c0-0.068-0.001-0.146-0.002-0.232l0.01-2.672l0.738-0.122l0.003-0.628l-0.739,0.123
					L26.8,37.772"/>
				<path d="M30.222,43.171c-0.077,0.016-0.15,0.021-0.223,0.021c-0.073-0.002-0.145-0.012-0.214-0.028
					c-0.07-0.018-0.136-0.043-0.203-0.073c-0.064-0.032-0.129-0.073-0.19-0.119c-0.061-0.05-0.117-0.105-0.168-0.169
					c-0.051-0.063-0.099-0.134-0.14-0.214c-0.042-0.078-0.08-0.165-0.112-0.26c-0.03-0.096-0.06-0.197-0.082-0.308
					c-0.012-0.06-0.022-0.121-0.031-0.186c-0.007-0.063-0.013-0.131-0.019-0.199c-0.003-0.069-0.007-0.14-0.007-0.213
					c-0.001-0.072,0-0.149,0.003-0.226c0.002-0.078,0.009-0.156,0.017-0.231c0.008-0.073,0.021-0.146,0.036-0.218
					c0.015-0.069,0.034-0.138,0.056-0.205c0.021-0.066,0.046-0.132,0.073-0.194c0.025-0.063,0.054-0.122,0.086-0.179
					c0.029-0.058,0.063-0.11,0.097-0.161c0.034-0.05,0.07-0.097,0.109-0.142c0.037-0.042,0.076-0.083,0.119-0.12
					c0.043-0.036,0.087-0.07,0.133-0.099c0.046-0.031,0.094-0.059,0.143-0.082c0.049-0.022,0.1-0.042,0.153-0.06
					c0.053-0.017,0.109-0.028,0.167-0.039c0.075-0.012,0.148-0.017,0.219-0.016c0.072,0.004,0.14,0.014,0.208,0.033
					c0.068,0.019,0.133,0.044,0.197,0.076c0.065,0.034,0.126,0.074,0.187,0.124c0.062,0.048,0.118,0.104,0.168,0.165
					c0.053,0.062,0.099,0.131,0.14,0.206c0.041,0.076,0.078,0.157,0.11,0.246c0.031,0.09,0.058,0.186,0.08,0.289
					c0.013,0.066,0.025,0.133,0.034,0.2c0.01,0.068,0.016,0.137,0.019,0.206c0.005,0.07,0.006,0.142,0.005,0.215
					c-0.002,0.071-0.005,0.145-0.01,0.219c-0.003,0.055-0.008,0.107-0.014,0.16c-0.007,0.055-0.014,0.105-0.022,0.156
					c-0.008,0.053-0.019,0.104-0.029,0.154c-0.012,0.05-0.025,0.099-0.039,0.148c-0.014,0.048-0.029,0.095-0.046,0.141
					c-0.017,0.048-0.036,0.094-0.056,0.138c-0.019,0.046-0.041,0.091-0.063,0.133c-0.024,0.045-0.048,0.087-0.073,0.128
					s-0.053,0.08-0.082,0.115c-0.027,0.038-0.058,0.071-0.088,0.104c-0.031,0.033-0.063,0.065-0.097,0.092
					c-0.034,0.029-0.068,0.055-0.104,0.079c-0.036,0.025-0.071,0.047-0.107,0.067c-0.038,0.021-0.073,0.039-0.111,0.057
					c-0.037,0.015-0.076,0.028-0.114,0.04C30.3,43.156,30.261,43.166,30.222,43.171 M29.929,38.866
					c-0.165,0.027-0.32,0.067-0.464,0.122c-0.143,0.057-0.277,0.124-0.399,0.206c-0.123,0.083-0.233,0.179-0.335,0.289
					c-0.101,0.108-0.191,0.232-0.27,0.37c-0.096,0.169-0.175,0.346-0.235,0.527c-0.062,0.184-0.105,0.374-0.131,0.573
					c-0.025,0.197-0.033,0.403-0.022,0.617s0.039,0.436,0.085,0.663c0.018,0.094,0.041,0.184,0.067,0.269
					c0.026,0.087,0.057,0.168,0.093,0.248c0.034,0.078,0.073,0.153,0.117,0.227c0.043,0.071,0.09,0.14,0.142,0.204
					s0.107,0.126,0.166,0.18c0.058,0.057,0.119,0.107,0.184,0.151c0.065,0.046,0.133,0.087,0.206,0.124
					c0.071,0.036,0.146,0.066,0.226,0.094c0.078,0.027,0.158,0.048,0.24,0.063c0.08,0.015,0.162,0.025,0.243,0.03
					s0.163,0.005,0.247,0c0.083-0.005,0.168-0.018,0.253-0.032c0.104-0.019,0.204-0.046,0.303-0.08
					c0.097-0.034,0.192-0.076,0.284-0.126c0.093-0.049,0.182-0.105,0.269-0.17c0.085-0.064,0.168-0.136,0.248-0.216
					c0.08-0.078,0.151-0.162,0.218-0.25c0.066-0.09,0.126-0.186,0.179-0.287c0.051-0.101,0.099-0.208,0.138-0.32
					s0.071-0.229,0.097-0.354c0.024-0.12,0.042-0.245,0.055-0.369c0.012-0.124,0.017-0.25,0.015-0.377
					c0-0.126-0.008-0.255-0.024-0.383c-0.013-0.129-0.036-0.259-0.063-0.39c-0.033-0.145-0.072-0.282-0.119-0.407
					c-0.048-0.128-0.104-0.245-0.168-0.354c-0.063-0.108-0.136-0.207-0.216-0.297c-0.082-0.091-0.17-0.17-0.267-0.242
					c-0.097-0.071-0.197-0.132-0.303-0.18c-0.105-0.05-0.214-0.087-0.326-0.112c-0.114-0.025-0.231-0.039-0.352-0.041
					C30.184,38.835,30.058,38.844,29.929,38.866"/>
				<path d="M34.719,42.319c-0.049,0.009-0.097,0.014-0.143,0.016c-0.05,0-0.096-0.004-0.14-0.011
					c-0.046-0.007-0.09-0.019-0.134-0.034c-0.043-0.015-0.085-0.033-0.128-0.058c-0.043-0.023-0.082-0.051-0.121-0.08
					c-0.037-0.028-0.073-0.061-0.105-0.093c-0.032-0.034-0.063-0.07-0.093-0.109c-0.029-0.037-0.055-0.078-0.08-0.122
					c-0.025-0.043-0.05-0.09-0.073-0.143s-0.046-0.111-0.066-0.172c-0.021-0.062-0.041-0.128-0.062-0.199
					c-0.019-0.071-0.035-0.146-0.054-0.225c-0.013-0.058-0.022-0.117-0.031-0.18c-0.008-0.063-0.014-0.13-0.015-0.199
					c-0.004-0.07-0.004-0.142-0.002-0.216c0.002-0.073,0.007-0.151,0.014-0.229c0.009-0.08,0.017-0.158,0.028-0.231
					c0.011-0.075,0.024-0.146,0.039-0.213c0.016-0.067,0.033-0.133,0.053-0.193c0.02-0.062,0.041-0.119,0.065-0.174
					c0.025-0.055,0.049-0.105,0.074-0.153c0.025-0.047,0.051-0.092,0.078-0.131c0.027-0.04,0.055-0.078,0.084-0.11
					c0.026-0.034,0.056-0.063,0.086-0.09c0.031-0.025,0.062-0.051,0.096-0.071c0.034-0.022,0.069-0.041,0.105-0.058
					c0.035-0.016,0.074-0.031,0.114-0.041c0.04-0.012,0.081-0.022,0.124-0.029c0.064-0.012,0.127-0.015,0.188-0.014
					c0.062,0.002,0.122,0.013,0.182,0.027c0.06,0.016,0.117,0.037,0.174,0.066c0.058,0.029,0.112,0.064,0.166,0.107
					c0.055,0.042,0.104,0.09,0.15,0.145c0.046,0.053,0.086,0.112,0.124,0.179c0.037,0.064,0.069,0.136,0.099,0.214
					c0.028,0.076,0.053,0.158,0.073,0.248c0.04,0.176,0.067,0.346,0.083,0.512c0.016,0.165,0.019,0.325,0.01,0.479
					c-0.01,0.156-0.03,0.308-0.066,0.454c-0.033,0.146-0.081,0.289-0.141,0.425c-0.044,0.104-0.096,0.194-0.148,0.275
					c-0.054,0.082-0.111,0.151-0.175,0.21c-0.063,0.06-0.131,0.106-0.204,0.145C34.877,42.278,34.801,42.304,34.719,42.319
					 M36.196,36.219l-0.684,0.108l0.078,2.429c-0.095-0.121-0.193-0.225-0.297-0.31c-0.104-0.087-0.213-0.155-0.325-0.206
					c-0.112-0.049-0.228-0.082-0.349-0.095c-0.12-0.016-0.245-0.013-0.374,0.01c-0.076,0.012-0.153,0.032-0.228,0.06
					c-0.075,0.025-0.148,0.06-0.22,0.101c-0.073,0.04-0.143,0.088-0.212,0.143c-0.07,0.055-0.137,0.115-0.203,0.186
					c-0.066,0.069-0.127,0.145-0.184,0.228c-0.056,0.082-0.108,0.172-0.154,0.267c-0.048,0.098-0.088,0.199-0.126,0.308
					c-0.038,0.109-0.071,0.225-0.099,0.348c-0.029,0.124-0.049,0.248-0.063,0.375c-0.014,0.128-0.021,0.256-0.019,0.388
					c0.001,0.132,0.008,0.264,0.025,0.398c0.016,0.136,0.038,0.273,0.068,0.411c0.033,0.153,0.073,0.294,0.119,0.425
					c0.046,0.132,0.099,0.254,0.158,0.364c0.058,0.11,0.124,0.211,0.195,0.3c0.073,0.09,0.149,0.17,0.235,0.239
					c0.085,0.066,0.171,0.124,0.262,0.17c0.088,0.046,0.178,0.082,0.271,0.105c0.094,0.025,0.188,0.039,0.284,0.043
					c0.097,0.001,0.194-0.006,0.294-0.024c0.112-0.021,0.22-0.058,0.321-0.11c0.103-0.053,0.199-0.121,0.293-0.204
					c0.092-0.083,0.179-0.182,0.262-0.298c0.081-0.113,0.158-0.244,0.231-0.391l0.021,0.684l0.657-0.122L36.196,36.219"/>
				<path d="M39.233,41.515c-0.071,0.014-0.14,0.02-0.208,0.018c-0.067-0.002-0.132-0.012-0.197-0.029
					c-0.064-0.017-0.127-0.041-0.19-0.071c-0.061-0.03-0.12-0.069-0.18-0.115c-0.058-0.046-0.112-0.099-0.162-0.16
					c-0.051-0.062-0.097-0.129-0.138-0.206c-0.042-0.074-0.079-0.158-0.113-0.248c-0.032-0.09-0.063-0.187-0.087-0.292
					c-0.014-0.059-0.027-0.117-0.037-0.177c-0.011-0.063-0.019-0.126-0.025-0.19c-0.007-0.066-0.013-0.135-0.016-0.204
					c-0.004-0.068-0.004-0.142-0.004-0.216c0-0.075,0.002-0.148,0.007-0.22c0.006-0.069,0.016-0.14,0.025-0.206
					c0.013-0.067,0.027-0.134,0.045-0.197c0.017-0.063,0.037-0.124,0.061-0.185c0.022-0.06,0.046-0.118,0.073-0.171
					c0.025-0.054,0.055-0.105,0.084-0.152c0.03-0.048,0.063-0.094,0.097-0.135s0.068-0.078,0.107-0.114
					c0.035-0.033,0.074-0.065,0.115-0.095c0.042-0.027,0.085-0.053,0.131-0.075c0.044-0.021,0.092-0.04,0.142-0.056
					c0.049-0.016,0.1-0.029,0.152-0.037c0.068-0.013,0.137-0.016,0.202-0.014c0.065,0.005,0.132,0.015,0.194,0.032
					c0.064,0.017,0.126,0.042,0.187,0.074c0.062,0.032,0.121,0.072,0.181,0.118c0.056,0.047,0.11,0.1,0.16,0.159
					c0.049,0.06,0.095,0.126,0.136,0.197c0.041,0.073,0.078,0.151,0.11,0.236s0.062,0.179,0.085,0.275
					c0.016,0.063,0.029,0.128,0.039,0.192c0.012,0.064,0.021,0.129,0.025,0.195c0.007,0.068,0.013,0.135,0.014,0.204
					c0.004,0.07,0.004,0.14,0.002,0.211c-0.002,0.051-0.005,0.103-0.009,0.153c-0.003,0.049-0.008,0.099-0.014,0.149
					c-0.005,0.048-0.012,0.097-0.021,0.145c-0.009,0.048-0.018,0.095-0.029,0.141s-0.023,0.091-0.037,0.137
					c-0.016,0.044-0.03,0.087-0.048,0.131c-0.016,0.042-0.034,0.085-0.055,0.126c-0.021,0.042-0.042,0.081-0.066,0.12
					c-0.021,0.039-0.046,0.077-0.071,0.11c-0.023,0.034-0.049,0.068-0.076,0.099c-0.027,0.031-0.055,0.06-0.085,0.086
					c-0.029,0.026-0.06,0.051-0.092,0.074c-0.032,0.024-0.064,0.044-0.099,0.064c-0.032,0.019-0.066,0.036-0.101,0.052
					c-0.034,0.015-0.069,0.028-0.105,0.04C39.307,41.5,39.269,41.508,39.233,41.515 M38.803,37.405
					c-0.151,0.023-0.294,0.063-0.425,0.114c-0.133,0.051-0.253,0.117-0.364,0.195c-0.11,0.078-0.21,0.168-0.301,0.273
					c-0.09,0.104-0.168,0.222-0.236,0.353c-0.083,0.159-0.149,0.326-0.2,0.501c-0.05,0.176-0.084,0.357-0.101,0.545
					c-0.017,0.19-0.017,0.386,0.002,0.59c0.017,0.204,0.051,0.415,0.102,0.634c0.021,0.089,0.045,0.175,0.073,0.257
					c0.029,0.082,0.062,0.16,0.097,0.234c0.036,0.077,0.075,0.148,0.119,0.216c0.043,0.068,0.091,0.135,0.142,0.197
					c0.049,0.063,0.102,0.119,0.158,0.174c0.056,0.053,0.113,0.101,0.177,0.145c0.063,0.044,0.127,0.083,0.195,0.117
					c0.068,0.036,0.14,0.064,0.214,0.09c0.073,0.027,0.148,0.048,0.223,0.063c0.073,0.016,0.15,0.027,0.227,0.03
					c0.076,0.007,0.153,0.007,0.231,0.002c0.076-0.005,0.156-0.016,0.234-0.029c0.096-0.019,0.188-0.044,0.279-0.074
					c0.088-0.032,0.175-0.073,0.258-0.119c0.085-0.046,0.165-0.101,0.242-0.16c0.076-0.061,0.149-0.129,0.221-0.204
					c0.071-0.074,0.136-0.152,0.193-0.239c0.06-0.084,0.111-0.174,0.155-0.271c0.044-0.096,0.083-0.197,0.115-0.305
					c0.031-0.106,0.058-0.219,0.077-0.336c0.02-0.116,0.032-0.233,0.039-0.353s0.007-0.238,0-0.36
					c-0.006-0.119-0.02-0.241-0.038-0.365c-0.019-0.123-0.042-0.247-0.074-0.371c-0.034-0.14-0.077-0.269-0.124-0.391
					c-0.05-0.123-0.105-0.235-0.17-0.339c-0.063-0.104-0.133-0.197-0.211-0.284c-0.078-0.086-0.162-0.165-0.254-0.232
					c-0.094-0.07-0.188-0.128-0.289-0.174c-0.099-0.048-0.202-0.083-0.308-0.108s-0.216-0.039-0.328-0.043
					C39.039,37.377,38.924,37.385,38.803,37.405"/>
				<path fill="#F78A0A" d="M45.242,40.06c-0.073,0.014-0.143,0.017-0.214,0.01c-0.07-0.006-0.138-0.023-0.204-0.051
					s-0.131-0.064-0.196-0.11c-0.063-0.048-0.125-0.104-0.185-0.17c-0.041-0.048-0.082-0.103-0.121-0.167
					c-0.037-0.063-0.076-0.136-0.112-0.216c-0.035-0.081-0.069-0.17-0.104-0.267c-0.032-0.099-0.063-0.204-0.094-0.319
					c-0.027-0.105-0.048-0.206-0.063-0.302c-0.014-0.093-0.019-0.182-0.021-0.265c0-0.084,0.007-0.16,0.021-0.231
					s0.034-0.138,0.06-0.197c0.027-0.06,0.058-0.114,0.092-0.161c0.034-0.048,0.073-0.089,0.115-0.125
					c0.044-0.035,0.092-0.063,0.143-0.086c0.052-0.022,0.105-0.038,0.165-0.048c0.062-0.012,0.121-0.016,0.181-0.011
					c0.06,0.004,0.117,0.016,0.175,0.033c0.057,0.019,0.112,0.044,0.169,0.078c0.054,0.032,0.108,0.072,0.163,0.118
					c0.053,0.048,0.104,0.103,0.149,0.167c0.049,0.066,0.094,0.142,0.138,0.225c0.041,0.085,0.081,0.179,0.119,0.28
					c0.037,0.103,0.073,0.215,0.105,0.337c0.028,0.11,0.051,0.214,0.066,0.312c0.017,0.099,0.023,0.19,0.026,0.276
					c0.002,0.089-0.003,0.169-0.015,0.243c-0.012,0.075-0.031,0.144-0.057,0.208c-0.025,0.061-0.056,0.117-0.088,0.166
					c-0.034,0.052-0.073,0.094-0.114,0.132c-0.042,0.035-0.088,0.065-0.138,0.09C45.354,40.032,45.3,40.05,45.242,40.06
					 M45.715,34.723l-0.982,0.154l0.551,2.071c-0.103-0.085-0.206-0.156-0.308-0.216c-0.104-0.06-0.208-0.105-0.312-0.14
					s-0.209-0.055-0.313-0.063c-0.105-0.008-0.21-0.005-0.314,0.014c-0.116,0.02-0.224,0.05-0.323,0.091
					c-0.099,0.04-0.192,0.092-0.275,0.154c-0.084,0.063-0.16,0.136-0.229,0.221c-0.067,0.085-0.129,0.181-0.18,0.288
					c-0.053,0.105-0.092,0.223-0.119,0.347c-0.029,0.126-0.044,0.262-0.048,0.406c-0.002,0.143,0.007,0.298,0.029,0.461
					c0.021,0.165,0.056,0.338,0.102,0.521c0.046,0.18,0.101,0.347,0.16,0.501c0.062,0.156,0.129,0.301,0.206,0.434
					c0.074,0.133,0.157,0.254,0.248,0.362c0.09,0.11,0.187,0.208,0.292,0.294c0.105,0.085,0.211,0.16,0.318,0.22
					s0.214,0.105,0.321,0.14c0.108,0.032,0.218,0.053,0.326,0.06c0.109,0.005,0.218-0.002,0.327-0.022
					c0.054-0.01,0.106-0.023,0.159-0.041c0.051-0.019,0.103-0.039,0.151-0.064c0.048-0.025,0.097-0.055,0.143-0.087
					c0.048-0.034,0.094-0.071,0.138-0.11c0.045-0.041,0.087-0.083,0.126-0.129c0.041-0.048,0.077-0.099,0.11-0.151
					c0.034-0.055,0.065-0.112,0.094-0.176c0.027-0.061,0.051-0.125,0.073-0.195l0.168,0.633l0.927-0.172L45.715,34.723"/>
				<path fill="#F78A0A" d="M49.704,39.218c-0.063,0.012-0.126,0.016-0.188,0.014c-0.061-0.003-0.124-0.016-0.184-0.032
					c-0.062-0.019-0.122-0.044-0.182-0.078c-0.062-0.032-0.119-0.073-0.179-0.122c-0.058-0.048-0.112-0.101-0.163-0.164
					c-0.053-0.061-0.099-0.131-0.143-0.205c-0.045-0.077-0.085-0.16-0.121-0.25s-0.069-0.188-0.099-0.291
					c-0.027-0.104-0.049-0.202-0.064-0.296c-0.014-0.094-0.022-0.182-0.022-0.266c0-0.081,0.007-0.159,0.022-0.232
					c0.014-0.071,0.034-0.14,0.062-0.201c0.026-0.063,0.059-0.118,0.097-0.168c0.035-0.049,0.076-0.092,0.122-0.129
					c0.044-0.036,0.094-0.064,0.148-0.09c0.054-0.022,0.112-0.04,0.175-0.05c0.062-0.01,0.124-0.014,0.186-0.01
					c0.061,0.003,0.122,0.015,0.182,0.033c0.062,0.018,0.121,0.043,0.181,0.077c0.058,0.032,0.117,0.073,0.175,0.12
					c0.056,0.048,0.11,0.101,0.16,0.162c0.049,0.06,0.097,0.127,0.139,0.2c0.043,0.073,0.082,0.155,0.119,0.243
					c0.036,0.087,0.068,0.183,0.098,0.284c0.028,0.104,0.052,0.204,0.067,0.298c0.016,0.093,0.022,0.184,0.025,0.267
					c0.002,0.083-0.005,0.161-0.017,0.234s-0.03,0.142-0.057,0.204c-0.026,0.063-0.06,0.121-0.095,0.17
					c-0.036,0.05-0.076,0.094-0.121,0.133c-0.046,0.036-0.095,0.066-0.149,0.092C49.824,39.189,49.767,39.206,49.704,39.218
					 M48.733,35.77c-0.089,0.016-0.174,0.034-0.256,0.06c-0.081,0.025-0.158,0.057-0.234,0.092
					c-0.073,0.036-0.143,0.076-0.211,0.122c-0.066,0.046-0.131,0.099-0.192,0.155c-0.059,0.058-0.113,0.119-0.163,0.184
					c-0.049,0.066-0.093,0.136-0.131,0.211c-0.037,0.074-0.071,0.153-0.099,0.238c-0.027,0.081-0.049,0.171-0.066,0.263
					c-0.017,0.093-0.027,0.186-0.033,0.277c-0.007,0.092-0.009,0.184-0.004,0.277c0.004,0.092,0.014,0.186,0.029,0.277
					c0.014,0.094,0.033,0.186,0.06,0.278c0.033,0.123,0.069,0.238,0.11,0.349c0.041,0.109,0.085,0.215,0.133,0.314
					c0.049,0.099,0.102,0.192,0.157,0.281c0.057,0.088,0.116,0.17,0.179,0.248c0.064,0.076,0.131,0.149,0.201,0.216
					c0.069,0.066,0.143,0.126,0.219,0.181c0.077,0.054,0.157,0.102,0.238,0.145c0.082,0.04,0.168,0.076,0.257,0.106
					c0.089,0.031,0.177,0.055,0.264,0.071c0.088,0.02,0.175,0.033,0.262,0.04c0.087,0.006,0.174,0.008,0.257,0.003
					c0.087-0.005,0.17-0.016,0.253-0.03c0.137-0.025,0.263-0.063,0.378-0.111c0.115-0.051,0.223-0.111,0.319-0.184
					c0.097-0.074,0.184-0.159,0.261-0.256c0.076-0.098,0.145-0.204,0.202-0.325s0.102-0.246,0.136-0.376
					c0.032-0.129,0.051-0.264,0.058-0.401s0-0.28-0.021-0.428c-0.019-0.146-0.051-0.3-0.095-0.454
					c-0.044-0.155-0.097-0.3-0.16-0.438c-0.061-0.136-0.133-0.265-0.212-0.386c-0.08-0.119-0.169-0.231-0.266-0.335
					c-0.097-0.103-0.204-0.197-0.318-0.286c-0.115-0.085-0.232-0.158-0.354-0.216c-0.119-0.058-0.242-0.104-0.368-0.136
					c-0.125-0.03-0.255-0.049-0.386-0.055C49.003,35.739,48.871,35.748,48.733,35.77"/>
				<path fill="#F78A0A" d="M53.327,35.013c-0.114,0.02-0.22,0.052-0.316,0.098s-0.186,0.105-0.264,0.178
					c-0.079,0.072-0.149,0.158-0.211,0.259c-0.061,0.101-0.113,0.214-0.154,0.342l-0.175-0.594l-0.866,0.144l1.192,4.109l0.94-0.175
					l-0.55-1.869c-0.033-0.112-0.063-0.218-0.088-0.314s-0.046-0.184-0.063-0.264c-0.017-0.08-0.03-0.151-0.039-0.213
					c-0.008-0.061-0.012-0.113-0.012-0.159c-0.002-0.043,0-0.085,0.007-0.126c0.005-0.041,0.014-0.08,0.025-0.115
					c0.012-0.038,0.027-0.073,0.046-0.107s0.041-0.066,0.064-0.097c0.024-0.031,0.052-0.06,0.079-0.084
					c0.028-0.025,0.058-0.047,0.09-0.066c0.032-0.019,0.066-0.035,0.102-0.047c0.038-0.014,0.075-0.024,0.114-0.031
					c0.03-0.005,0.062-0.007,0.092-0.008c0.03,0,0.06,0.001,0.089,0.007c0.028,0.003,0.058,0.01,0.086,0.02
					c0.027,0.009,0.055,0.021,0.082,0.034c0.029,0.014,0.055,0.029,0.08,0.048c0.025,0.017,0.049,0.037,0.073,0.062
					c0.023,0.021,0.046,0.046,0.067,0.071c0.021,0.027,0.041,0.055,0.062,0.085c0.019,0.03,0.039,0.071,0.062,0.121
					c0.023,0.049,0.047,0.108,0.072,0.178c0.026,0.07,0.053,0.15,0.082,0.24c0.029,0.088,0.062,0.188,0.094,0.298l0.624,2.088
					l0.918-0.17l-0.765-2.525c-0.022-0.078-0.045-0.149-0.068-0.218c-0.022-0.068-0.044-0.131-0.066-0.19
					c-0.022-0.058-0.044-0.114-0.066-0.163c-0.021-0.05-0.041-0.094-0.063-0.135c-0.021-0.04-0.043-0.078-0.066-0.115
					c-0.022-0.037-0.048-0.073-0.075-0.107c-0.025-0.035-0.053-0.067-0.081-0.099c-0.029-0.032-0.06-0.064-0.091-0.092
					c-0.032-0.028-0.064-0.058-0.1-0.083c-0.036-0.025-0.072-0.048-0.111-0.069c-0.039-0.022-0.079-0.041-0.124-0.06
					c-0.044-0.019-0.088-0.034-0.136-0.048c-0.05-0.014-0.097-0.025-0.146-0.034c-0.049-0.009-0.099-0.014-0.146-0.017
					c-0.05-0.004-0.101-0.004-0.15,0C53.428,34.999,53.378,35.005,53.327,35.013"/>
				<path fill="#F78A0A" d="M56.604,36.295c-0.021-0.071-0.039-0.141-0.051-0.206s-0.019-0.127-0.021-0.187
					c-0.003-0.06,0-0.115,0.011-0.17c0.007-0.053,0.02-0.104,0.039-0.151c0.019-0.046,0.04-0.089,0.066-0.126
					c0.026-0.039,0.056-0.069,0.09-0.099c0.034-0.027,0.071-0.049,0.112-0.068c0.04-0.017,0.086-0.03,0.136-0.039
					c0.044-0.007,0.089-0.008,0.135-0.007c0.044,0.004,0.088,0.011,0.132,0.024c0.045,0.014,0.089,0.032,0.133,0.056
					c0.044,0.022,0.089,0.053,0.133,0.087s0.085,0.073,0.124,0.117s0.076,0.094,0.11,0.148c0.036,0.056,0.066,0.115,0.097,0.18
					c0.029,0.064,0.057,0.135,0.08,0.209L56.604,36.295 M56.684,34.46c-0.112,0.021-0.214,0.048-0.31,0.089
					c-0.094,0.039-0.18,0.09-0.258,0.151c-0.079,0.062-0.148,0.135-0.21,0.218c-0.061,0.081-0.113,0.177-0.159,0.282
					c-0.045,0.105-0.077,0.219-0.098,0.34c-0.021,0.122-0.03,0.25-0.026,0.386c0.001,0.137,0.017,0.281,0.044,0.433
					c0.025,0.149,0.064,0.309,0.115,0.476c0.043,0.14,0.091,0.271,0.144,0.396c0.052,0.126,0.111,0.243,0.175,0.355
					c0.063,0.112,0.133,0.214,0.207,0.311c0.075,0.098,0.153,0.186,0.238,0.268c0.105,0.104,0.218,0.19,0.335,0.26
					c0.115,0.069,0.238,0.124,0.365,0.161c0.126,0.038,0.259,0.059,0.396,0.063c0.136,0.005,0.279-0.007,0.427-0.034
					c0.092-0.017,0.179-0.039,0.259-0.068c0.081-0.028,0.156-0.063,0.225-0.102c0.069-0.041,0.132-0.087,0.188-0.138
					c0.056-0.051,0.107-0.107,0.153-0.17c0.044-0.062,0.083-0.13,0.115-0.201c0.034-0.071,0.062-0.147,0.082-0.23
					c0.02-0.082,0.037-0.169,0.046-0.261c0.01-0.092,0.012-0.187,0.01-0.289l-0.934-0.015c0.005,0.051,0.005,0.1,0.005,0.146
					c-0.001,0.046-0.005,0.087-0.012,0.128c-0.005,0.039-0.014,0.074-0.025,0.108c-0.012,0.032-0.025,0.063-0.043,0.091
					c-0.017,0.026-0.035,0.053-0.056,0.074c-0.022,0.022-0.044,0.041-0.069,0.057c-0.027,0.017-0.055,0.03-0.085,0.042
					c-0.031,0.011-0.063,0.021-0.099,0.027c-0.052,0.009-0.103,0.012-0.153,0.01c-0.05-0.001-0.101-0.01-0.149-0.025
					c-0.052-0.014-0.101-0.034-0.148-0.06c-0.049-0.025-0.099-0.058-0.146-0.095c-0.047-0.037-0.093-0.08-0.136-0.129
					c-0.042-0.046-0.081-0.099-0.119-0.158c-0.037-0.059-0.071-0.121-0.104-0.19c-0.03-0.068-0.06-0.142-0.085-0.22l2.217-0.393
					c-0.059-0.201-0.124-0.386-0.195-0.558c-0.069-0.172-0.146-0.328-0.228-0.472c-0.08-0.143-0.167-0.27-0.257-0.384
					c-0.092-0.112-0.19-0.213-0.291-0.298c-0.102-0.083-0.205-0.154-0.313-0.212c-0.107-0.059-0.218-0.104-0.33-0.135
					c-0.112-0.032-0.228-0.051-0.347-0.056C56.929,34.434,56.808,34.441,56.684,34.46"/>
				<path fill="#F78A0A" d="M21.822,32.718c-0.012,0.001-0.023,0.003-0.035,0.005c-0.011,0.003-0.022,0.003-0.034,0.007
					c-0.011,0.002-0.023,0.005-0.034,0.007c-0.012,0.003-0.023,0.007-0.034,0.008c-0.03,0.009-0.06,0.017-0.089,0.026
					c-0.029,0.01-0.057,0.02-0.085,0.032c-0.029,0.012-0.056,0.025-0.083,0.039s-0.055,0.031-0.082,0.047
					c-0.027,0.017-0.054,0.036-0.08,0.055c-0.025,0.021-0.051,0.041-0.076,0.063c-0.025,0.021-0.049,0.046-0.072,0.069
					c-0.024,0.024-0.048,0.05-0.071,0.077c-0.021,0.026-0.042,0.058-0.063,0.086c-0.02,0.031-0.041,0.063-0.06,0.096
					s-0.039,0.067-0.057,0.102c-0.018,0.036-0.035,0.073-0.051,0.112l-0.056,0.138l-0.056,0.138l-0.057,0.133l-0.057,0.14
					c-0.016,0.037-0.032,0.074-0.048,0.11c-0.016,0.037-0.031,0.075-0.046,0.112c-0.016,0.036-0.031,0.073-0.046,0.11
					c-0.015,0.036-0.03,0.073-0.045,0.11c-0.016,0.038-0.032,0.075-0.048,0.114c-0.016,0.037-0.031,0.075-0.046,0.112
					s-0.03,0.074-0.046,0.114c-0.015,0.037-0.03,0.074-0.044,0.111c-0.017,0.036-0.033,0.073-0.049,0.111
					c-0.016,0.037-0.032,0.072-0.048,0.112c-0.016,0.037-0.031,0.074-0.047,0.111c-0.016,0.038-0.033,0.077-0.049,0.114
					c-0.008,0.022-0.017,0.044-0.026,0.064c-0.008,0.022-0.017,0.045-0.026,0.064c-0.009,0.022-0.018,0.045-0.026,0.066
					c-0.009,0.021-0.017,0.043-0.027,0.065c-0.007,0.017-0.013,0.032-0.02,0.049c-0.006,0.016-0.013,0.032-0.02,0.048
					c-0.007,0.017-0.014,0.034-0.021,0.049c-0.007,0.018-0.015,0.034-0.021,0.051c-0.049,0.119-0.099,0.24-0.15,0.361
					c-0.05,0.12-0.1,0.241-0.15,0.363c-0.051,0.121-0.101,0.243-0.153,0.366c-0.051,0.12-0.103,0.243-0.154,0.365
					c-0.006,0.016-0.012,0.028-0.018,0.044s-0.012,0.03-0.019,0.044c-0.006,0.016-0.012,0.031-0.018,0.045
					c-0.006,0.015-0.012,0.03-0.019,0.046c-0.044,0.106-0.089,0.218-0.133,0.324c-0.045,0.109-0.09,0.22-0.136,0.328
					c-0.044,0.11-0.09,0.22-0.136,0.33s-0.092,0.221-0.138,0.332c-0.052,0.122-0.104,0.248-0.156,0.374
					c-0.052,0.124-0.104,0.25-0.158,0.375c-0.053,0.128-0.105,0.254-0.159,0.381c-0.053,0.128-0.106,0.256-0.16,0.381
					c-0.052,0.13-0.105,0.259-0.157,0.388c-0.053,0.128-0.106,0.257-0.16,0.387c-0.054,0.129-0.107,0.258-0.162,0.388
					c-0.054,0.131-0.108,0.26-0.163,0.389c-0.039-0.028-0.077-0.058-0.116-0.085c-0.039-0.028-0.078-0.058-0.117-0.085
					c-0.039-0.027-0.077-0.056-0.116-0.085c-0.039-0.027-0.078-0.056-0.116-0.085c-0.04-0.027-0.079-0.056-0.118-0.085
					c-0.04-0.027-0.078-0.056-0.117-0.083c-0.039-0.029-0.078-0.057-0.117-0.085c-0.04-0.027-0.079-0.057-0.118-0.085
					c-0.038-0.027-0.077-0.057-0.115-0.082c-0.038-0.029-0.077-0.056-0.115-0.083c-0.039-0.029-0.078-0.057-0.117-0.085
					c-0.039-0.027-0.078-0.057-0.118-0.085c-0.038-0.027-0.076-0.057-0.115-0.084c-0.038-0.027-0.077-0.056-0.115-0.083
					c-0.039-0.029-0.077-0.056-0.116-0.085c-0.039-0.027-0.078-0.055-0.118-0.083l-0.168-0.103c-0.015-0.009-0.03-0.017-0.045-0.023
					c-0.014-0.007-0.029-0.014-0.043-0.021c-0.014-0.005-0.029-0.011-0.043-0.016c-0.015-0.005-0.029-0.01-0.043-0.014
					c-0.015-0.007-0.029-0.012-0.043-0.017c-0.014-0.004-0.028-0.009-0.043-0.012c-0.014-0.004-0.029-0.007-0.044-0.011
					c-0.015-0.003-0.03-0.007-0.045-0.008c-0.014-0.004-0.029-0.007-0.043-0.009c-0.015-0.002-0.029-0.004-0.044-0.004
					c-0.015-0.001-0.03-0.001-0.044-0.003c-0.015,0-0.03,0-0.045,0c-0.021,0-0.042,0-0.063,0c-0.021,0-0.042,0-0.063,0.002
					c-0.021,0.001-0.042,0.003-0.063,0.005c-0.021,0.003-0.042,0.007-0.063,0.01c-0.056,0.009-0.112,0.021-0.167,0.038
					c-0.055,0.015-0.11,0.033-0.164,0.056s-0.106,0.048-0.158,0.075c-0.051,0.028-0.102,0.06-0.15,0.093
					c-0.069,0.045-0.136,0.094-0.199,0.146c-0.063,0.055-0.124,0.112-0.181,0.174c-0.057,0.06-0.111,0.124-0.16,0.19
					c-0.05,0.064-0.095,0.133-0.136,0.202c-0.041,0.073-0.077,0.146-0.108,0.221c-0.03,0.075-0.056,0.15-0.075,0.225
					c-0.02,0.077-0.033,0.151-0.04,0.228c-0.007,0.075-0.008,0.151-0.001,0.227c0.008,0.073,0.023,0.146,0.045,0.218
					c0.022,0.071,0.052,0.143,0.09,0.209c0.038,0.066,0.084,0.131,0.139,0.192c0.055,0.061,0.119,0.12,0.192,0.173
					c0.072,0.053,0.143,0.103,0.214,0.155c0.071,0.051,0.142,0.104,0.212,0.154c0.071,0.052,0.142,0.104,0.213,0.155
					c0.071,0.051,0.142,0.102,0.213,0.154c0.071,0.051,0.141,0.103,0.212,0.155c0.07,0.051,0.142,0.102,0.212,0.154
					c0.071,0.051,0.143,0.103,0.214,0.153c0.071,0.053,0.143,0.104,0.214,0.154c0.07,0.051,0.14,0.104,0.211,0.155
					c0.071,0.053,0.142,0.104,0.213,0.154c0.071,0.053,0.142,0.104,0.213,0.156c0.072,0.053,0.143,0.104,0.214,0.156
					c0.07,0.052,0.141,0.104,0.211,0.157c0.071,0.051,0.142,0.104,0.213,0.156c0.071,0.051,0.142,0.102,0.214,0.154
					c0.071,0.052,0.143,0.104,0.214,0.155c0.014,0.01,0.028,0.021,0.042,0.028c0.015,0.009,0.029,0.019,0.044,0.027
					s0.03,0.019,0.044,0.027c0.015,0.007,0.03,0.017,0.045,0.023c0.015,0.009,0.03,0.016,0.045,0.022s0.031,0.014,0.047,0.019
					c0.016,0.009,0.032,0.014,0.048,0.021c0.016,0.005,0.032,0.011,0.048,0.017c0.016,0.006,0.032,0.011,0.049,0.016
					c0.016,0.004,0.033,0.009,0.05,0.014c0.017,0.002,0.034,0.005,0.052,0.009c0.018,0.003,0.036,0.007,0.054,0.009
					c0.017,0.003,0.034,0.005,0.05,0.008c0.017,0.002,0.034,0.004,0.051,0.005c0.017,0.002,0.034,0.004,0.051,0.006
					c0.018,0,0.035,0,0.053,0c0.025,0,0.05,0,0.075-0.002c0.025-0.002,0.05-0.002,0.075-0.004c0.025-0.003,0.049-0.005,0.075-0.008
					c0.024-0.004,0.049-0.007,0.074-0.012c0.011-0.002,0.023-0.006,0.034-0.007c0.013-0.004,0.023-0.006,0.036-0.009
					c0.011-0.004,0.023-0.005,0.035-0.009c0.012-0.003,0.023-0.007,0.035-0.01c0.036-0.009,0.071-0.021,0.106-0.032
					c0.036-0.013,0.071-0.025,0.105-0.041c0.035-0.014,0.069-0.03,0.103-0.048c0.034-0.019,0.067-0.035,0.099-0.056
					c0.034-0.021,0.066-0.045,0.097-0.066c0.032-0.024,0.062-0.048,0.091-0.075c0.03-0.023,0.059-0.051,0.087-0.08
					c0.028-0.027,0.054-0.058,0.081-0.088c0.026-0.032,0.051-0.064,0.075-0.097c0.024-0.034,0.047-0.07,0.069-0.105
					c0.021-0.036,0.042-0.073,0.061-0.112c0.02-0.039,0.038-0.08,0.053-0.121c0.069-0.175,0.139-0.351,0.208-0.525
					c0.069-0.175,0.138-0.347,0.208-0.521c0.069-0.173,0.138-0.347,0.206-0.519c0.069-0.172,0.137-0.345,0.206-0.515
					c0.06-0.153,0.12-0.307,0.18-0.458c0.06-0.151,0.119-0.303,0.179-0.452c0.059-0.149,0.119-0.301,0.178-0.449
					c0.059-0.149,0.117-0.299,0.175-0.446c0.007-0.02,0.015-0.038,0.021-0.057c0.007-0.017,0.015-0.035,0.022-0.055
					c0.008-0.019,0.015-0.037,0.022-0.056c0.007-0.017,0.014-0.036,0.022-0.055c0.066-0.166,0.132-0.333,0.198-0.498
					c0.066-0.167,0.132-0.331,0.198-0.495c0.065-0.165,0.131-0.328,0.196-0.491s0.13-0.326,0.196-0.488
					c0.027-0.067,0.054-0.136,0.081-0.203c0.026-0.068,0.053-0.138,0.08-0.206c0.026-0.068,0.053-0.136,0.08-0.204
					c0.027-0.068,0.054-0.136,0.081-0.204c0.037-0.094,0.073-0.186,0.11-0.279c0.036-0.092,0.073-0.185,0.11-0.276
					c0.037-0.094,0.074-0.186,0.11-0.277s0.073-0.184,0.11-0.275c0.018-0.046,0.037-0.094,0.055-0.14
					c0.019-0.048,0.037-0.094,0.056-0.142c0.018-0.046,0.037-0.093,0.056-0.139c0.019-0.048,0.037-0.094,0.055-0.14
					c0.018-0.046,0.037-0.092,0.055-0.138c0.019-0.048,0.037-0.094,0.056-0.14c0.019-0.048,0.037-0.094,0.056-0.141
					c0.018-0.045,0.036-0.092,0.054-0.138c0.018-0.046,0.036-0.094,0.054-0.14c0.018-0.046,0.037-0.092,0.055-0.138
					c0.018-0.046,0.037-0.092,0.055-0.138c0.018-0.046,0.036-0.092,0.054-0.137c0.017-0.047,0.035-0.093,0.054-0.139
					c0.018-0.046,0.036-0.092,0.055-0.138c0.019-0.045,0.037-0.091,0.054-0.137c0.019-0.046,0.037-0.09,0.054-0.136
					c0.009-0.021,0.016-0.039,0.022-0.06c0.007-0.019,0.014-0.039,0.019-0.058c0.006-0.019,0.012-0.039,0.017-0.058
					c0.005-0.019,0.01-0.038,0.014-0.055c0.005-0.019,0.01-0.037,0.014-0.056c0.005-0.02,0.008-0.036,0.012-0.057
					c0.002-0.017,0.005-0.035,0.007-0.055c0.002-0.019,0.005-0.035,0.007-0.054c0.001-0.018,0.002-0.034,0.003-0.053
					c0-0.018,0.001-0.036,0.001-0.052c0-0.019,0-0.035-0.001-0.051c0-0.017-0.001-0.034-0.004-0.049
					c0-0.018-0.002-0.034-0.003-0.051c-0.002-0.018-0.003-0.033-0.007-0.05c-0.003-0.016-0.005-0.03-0.009-0.048
					c-0.003-0.015-0.008-0.03-0.011-0.046c-0.008-0.037-0.018-0.071-0.03-0.106c-0.011-0.034-0.024-0.068-0.038-0.101
					s-0.03-0.063-0.046-0.096c-0.017-0.028-0.036-0.06-0.055-0.086c-0.019-0.031-0.039-0.06-0.06-0.087
					c-0.021-0.027-0.044-0.055-0.067-0.078c-0.023-0.025-0.047-0.052-0.073-0.073c-0.025-0.024-0.051-0.046-0.079-0.066
					s-0.056-0.041-0.085-0.062c-0.029-0.019-0.059-0.036-0.089-0.053c-0.03-0.017-0.06-0.032-0.091-0.046
					c-0.031-0.015-0.063-0.029-0.095-0.039c-0.032-0.012-0.064-0.022-0.097-0.032s-0.066-0.017-0.099-0.024
					c-0.033-0.008-0.067-0.013-0.101-0.019c-0.034-0.005-0.068-0.008-0.102-0.012c-0.019,0-0.036,0-0.055,0
					c-0.018,0-0.036,0-0.054,0c-0.019,0.001-0.036,0.003-0.054,0.005C21.857,32.714,21.84,32.716,21.822,32.718"/>
			</g>
		</g>
	</g>
	<path fill="#F78A0A" d="M43.368,12.393c-0.161-0.114-0.33-0.216-0.503-0.311c-0.002-0.141-0.007-0.282-0.014-0.422
		c-0.14-2.601-1.048-5.153-3.237-6.689c-1.056-0.74-2.257-1.105-3.473-1.151c-1.134-0.787-2.444-1.287-3.792-1.337
		c-2.382-0.089-4.619,0.874-6.351,2.426c-2.515-0.326-4.738,0.629-6.453,2.248c-1.664,1.141-3.146,2.695-4.235,4.195
		c-1.162,1.598-0.478,3.939,0.932,5.16c0.388,1.568,1.259,2.996,2.428,4.01c0.013,0.55,0.074,1.096,0.195,1.62
		c0.752,3.252,2.94,5.702,6.402,5.845c0.105,0.004,0.208-0.006,0.311-0.01c0.173,0.091,0.35,0.175,0.529,0.256
		c1.088,2.848,4.365,4.306,7.29,3.889c1.22-0.175,2.404-0.632,3.489-1.287c1.986,0.403,4.132-0.27,5.635-1.806
		c0.519-0.527,0.922-1.14,1.225-1.8C48.647,23.523,48.479,16.009,43.368,12.393z"/>
	<g>
		<path d="M36.356,2.815c-1.272,0.007-2.549,0.132-3.815,0.35c-1.286,0.222-2.563,0.542-3.814,0.937
			c-1.272,0.401-2.519,0.881-3.724,1.418c-1.224,0.545-2.403,1.148-3.518,1.785c-1.213,0.691-2.426,1.532-3.516,2.507
			c-1.11,0.993-2.094,2.126-2.817,3.379c-0.736,1.275-1.2,2.673-1.25,4.165c-0.051,1.513,0.323,3.118,1.265,4.779
			c0.985,1.733,2.321,3.197,3.889,4.396c1.567,1.2,3.354,2.127,5.242,2.801c1.872,0.668,3.833,1.085,5.77,1.274
			c1.913,0.187,3.795,0.151,5.547-0.082c0.294-0.038,0.583-0.082,0.868-0.131c0.284-0.049,0.564-0.105,0.841-0.165
			c0.275-0.06,0.545-0.125,0.811-0.194c0.266-0.07,0.523-0.145,0.779-0.225c0.969-0.304,1.904-0.69,2.77-1.163
			c0.855-0.466,1.643-1.015,2.329-1.651c0.677-0.629,1.257-1.343,1.704-2.147c0.443-0.795,0.76-1.678,0.918-2.653
			c0.16-0.973,0.105-1.958-0.105-2.934c-0.209-0.969-0.574-1.933-1.041-2.87c-0.466-0.933-1.03-1.842-1.642-2.708
			c-0.611-0.862-1.272-1.682-1.929-2.437c-0.291-0.336-0.592-0.665-0.901-0.986c-0.31-0.322-0.625-0.637-0.947-0.947
			C39.747,9.004,39.42,8.7,39.089,8.4c-0.33-0.3-0.665-0.595-1.002-0.888c-0.051-0.045-0.102-0.083-0.154-0.116
			c-0.051-0.031-0.103-0.058-0.151-0.077c-0.051-0.021-0.099-0.035-0.148-0.043c-0.047-0.009-0.095-0.013-0.141-0.012
			c-0.145,0.004-0.275,0.058-0.378,0.146c-0.104,0.087-0.18,0.209-0.216,0.35c-0.037,0.139-0.035,0.297,0.019,0.457
			c0.053,0.16,0.158,0.32,0.325,0.467c0.799,0.693,1.599,1.429,2.363,2.203c0.767,0.774,1.502,1.588,2.172,2.439
			c0.671,0.853,1.278,1.745,1.788,2.674c0.514,0.934,0.929,1.907,1.214,2.92c0.307,1.089,0.33,2.089,0.138,3.001
			c-0.193,0.921-0.608,1.752-1.176,2.49c-0.573,0.746-1.303,1.398-2.117,1.949c-0.825,0.558-1.734,1.013-2.652,1.358
			c-0.289,0.109-0.587,0.209-0.895,0.303c-0.307,0.093-0.622,0.177-0.945,0.255c-0.325,0.077-0.656,0.147-0.995,0.207
			c-0.338,0.06-0.684,0.113-1.035,0.155c-1.617,0.2-3.348,0.211-5.1,0.017c-1.77-0.198-3.554-0.608-5.244-1.249
			c-1.704-0.644-3.303-1.52-4.688-2.639c-1.386-1.12-2.547-2.475-3.376-4.071c-0.784-1.512-0.951-2.952-0.691-4.289
			c0.255-1.318,0.923-2.532,1.814-3.623c0.875-1.071,1.964-2.021,3.09-2.837c1.106-0.803,2.251-1.478,3.268-2.016
			c0.957-0.504,1.965-0.981,3.009-1.411c1.029-0.425,2.094-0.806,3.179-1.125c1.069-0.315,2.161-0.571,3.256-0.751
			c1.084-0.178,2.175-0.281,3.261-0.296c0.172-0.002,0.346-0.002,0.517,0c0.174,0.002,0.346,0.006,0.518,0.013
			s0.343,0.016,0.514,0.029c0.171,0.011,0.343,0.025,0.513,0.042c0.009,0,0.02,0,0.029,0.001c0.009,0.001,0.017,0.002,0.027,0.002
			c0.009,0,0.017,0,0.025,0c0.01,0,0.019,0,0.027,0c0.226-0.003,0.369-0.094,0.44-0.229C39.56,4.07,39.56,3.89,39.498,3.707
			c-0.059-0.182-0.178-0.366-0.343-0.513c-0.165-0.145-0.378-0.251-0.626-0.277c-0.179-0.019-0.358-0.034-0.541-0.048
			c-0.18-0.014-0.36-0.024-0.542-0.033c-0.181-0.008-0.362-0.014-0.544-0.018C36.72,2.815,36.538,2.813,36.356,2.815"/>
		<path d="M26.829,11.16c0.009-0.002,0.02-0.003,0.03-0.005c0.01-0.001,0.021-0.002,0.031-0.005c0.011-0.001,0.021-0.002,0.03-0.004
			c0.009,0,0.016-0.001,0.023-0.002c0.028-0.002,0.056-0.005,0.083-0.008c0.028-0.003,0.056-0.004,0.083-0.006
			c0.028-0.003,0.056-0.004,0.084-0.006c0.028,0,0.057-0.002,0.084-0.003c0.017,0,0.032-0.001,0.049-0.002
			c0.015,0,0.032-0.001,0.048-0.001c0.017,0,0.032-0.001,0.049-0.001c0.016-0.001,0.032-0.001,0.048-0.001
			c0.045-0.001,0.09-0.001,0.135-0.001c0.044,0,0.09,0.001,0.134,0.003c0.045,0.001,0.09,0.003,0.135,0.006
			c0.045,0.001,0.089,0.005,0.134,0.008c0.002,0,0.015,0.001,0.035,0.003c0.019,0.002,0.044,0.005,0.07,0.007
			c0.025,0.003,0.051,0.006,0.073,0.008c0.022,0.002,0.039,0.004,0.046,0.005c0.006,0,0.012,0.001,0.018,0.001
			c0.006,0.001,0.012,0.001,0.018,0.002c0.006,0,0.012,0.001,0.017,0.002c0.006,0,0.012,0,0.019,0.001
			c-0.107,0.021-0.2,0.06-0.275,0.112c-0.078,0.053-0.14,0.12-0.187,0.197c-0.046,0.077-0.08,0.165-0.098,0.26
			c-0.019,0.095-0.024,0.198-0.015,0.303c0.001,0.014,0.002,0.026,0.003,0.035s0.001,0.018,0.001,0.023
			c0.001,0.006,0.002,0.01,0.002,0.013c0,0.002,0,0.003,0,0.003c0,0,0-0.001,0-0.001c0-0.001,0-0.002,0-0.004
			c0-0.001,0-0.003,0-0.006s0-0.005,0-0.008c0.001,0.016,0.003,0.031,0.003,0.046c0.001,0.016,0.001,0.03,0.002,0.045
			c0.001,0.015,0.001,0.029,0.001,0.045c0,0.014,0,0.029,0.001,0.044c0.001,0.03,0.002,0.06,0.002,0.089
			c0.001,0.029,0.001,0.059,0.001,0.088s0,0.059,0,0.088c0,0.029-0.001,0.058-0.001,0.088c-0.001,0.026-0.002,0.052-0.003,0.078
			c-0.001,0.025-0.003,0.052-0.004,0.077c-0.002,0.026-0.004,0.052-0.006,0.078c-0.002,0.026-0.005,0.052-0.007,0.079
			c-0.002,0.013-0.005,0.034-0.009,0.06c-0.004,0.024-0.009,0.052-0.013,0.08c-0.005,0.028-0.01,0.055-0.014,0.076
			c-0.003,0.021-0.005,0.038-0.006,0.043c-0.006,0.021-0.011,0.041-0.018,0.061c-0.007,0.02-0.014,0.04-0.021,0.059
			c-0.007,0.02-0.015,0.04-0.022,0.059c-0.009,0.02-0.015,0.038-0.024,0.058c-0.004,0.007-0.008,0.015-0.012,0.021
			c-0.005,0.006-0.009,0.014-0.014,0.021s-0.008,0.014-0.012,0.02c-0.004,0.006-0.009,0.012-0.012,0.016
			c-0.001,0.002-0.003,0.004-0.004,0.007c-0.002,0.002-0.004,0.004-0.005,0.006c-0.001,0.003-0.002,0.004-0.004,0.006
			c-0.001,0.002-0.002,0.003-0.003,0.005c-0.002,0.001-0.004,0.003-0.007,0.005c-0.001,0.001-0.003,0.003-0.005,0.004
			c-0.002,0.001-0.005,0.002-0.007,0.004c-0.001,0.001-0.003,0.002-0.006,0.004h-0.001H27.51c0,0,0,0-0.001,0s-0.001,0-0.001,0.001
			c-0.007-0.001-0.013-0.002-0.019-0.003c-0.007-0.001-0.013-0.002-0.019-0.003c-0.007-0.001-0.013-0.002-0.019-0.004
			c-0.007,0-0.014-0.002-0.019-0.004c-0.002,0-0.002-0.001-0.003-0.001c-0.001-0.001-0.002-0.001-0.002-0.001
			c-0.001-0.001-0.002-0.001-0.002-0.001c-0.002,0-0.002-0.001-0.003-0.001c-0.014-0.006-0.028-0.011-0.043-0.017
			c-0.013-0.006-0.029-0.012-0.042-0.019c-0.014-0.006-0.029-0.013-0.043-0.02c-0.015-0.007-0.029-0.015-0.043-0.021
			c-0.003-0.001-0.006-0.003-0.009-0.004c-0.003-0.002-0.005-0.003-0.008-0.004c-0.002-0.001-0.005-0.002-0.007-0.002
			c-0.003-0.002-0.005-0.003-0.008-0.003c-0.028-0.019-0.055-0.038-0.083-0.056c-0.027-0.019-0.054-0.039-0.081-0.058
			c-0.026-0.02-0.053-0.04-0.078-0.06c-0.026-0.021-0.053-0.041-0.079-0.062l-0.059-0.054c-0.011-0.01-0.022-0.021-0.032-0.033
			c-0.011-0.01-0.021-0.021-0.032-0.032c-0.01-0.011-0.021-0.022-0.032-0.033c-0.011-0.011-0.021-0.022-0.033-0.033
			c-0.024-0.027-0.049-0.055-0.075-0.083c-0.023-0.028-0.048-0.056-0.071-0.085c-0.024-0.029-0.047-0.058-0.071-0.087
			c-0.022-0.029-0.045-0.058-0.068-0.087c-0.001-0.002-0.002-0.003-0.003-0.005c-0.001-0.002-0.002-0.003-0.003-0.004
			c-0.002-0.001-0.002-0.003-0.003-0.005c-0.002-0.001-0.002-0.002-0.003-0.003c-0.01-0.018-0.021-0.035-0.032-0.053
			c-0.011-0.018-0.021-0.035-0.031-0.052c-0.01-0.018-0.02-0.035-0.029-0.052c-0.01-0.017-0.021-0.034-0.03-0.051
			c-0.011-0.021-0.023-0.042-0.035-0.064c-0.01-0.02-0.021-0.042-0.032-0.063c-0.01-0.021-0.021-0.043-0.031-0.065
			c-0.009-0.022-0.019-0.044-0.029-0.065c-0.003-0.01-0.007-0.02-0.01-0.032c-0.004-0.011-0.008-0.022-0.012-0.034
			c-0.004-0.011-0.008-0.023-0.012-0.033s-0.006-0.02-0.009-0.027c-0.003-0.019-0.008-0.037-0.012-0.055
			c-0.003-0.019-0.008-0.037-0.012-0.056c-0.003-0.02-0.007-0.037-0.01-0.057c-0.003-0.019-0.006-0.038-0.01-0.057
			c0-0.001,0-0.002,0-0.003c-0.001-0.001-0.001-0.002-0.001-0.002c-0.001-0.002-0.001-0.002-0.001-0.003
			c0-0.002,0-0.002-0.001-0.003c0-0.014,0.001-0.027,0.001-0.041c0.001-0.013,0.002-0.027,0.002-0.04
			c0-0.014,0.001-0.026,0.003-0.04c0-0.013,0.001-0.026,0.002-0.04l0.007-0.045c0.003-0.009,0.005-0.017,0.009-0.025
			c0.003-0.008,0.006-0.016,0.009-0.024c0.003-0.008,0.006-0.016,0.01-0.024c0.002-0.008,0.006-0.015,0.009-0.024l0.069-0.087
			c0.002-0.002,0.004-0.005,0.006-0.008c0.003-0.003,0.005-0.006,0.008-0.008c0.002-0.003,0.006-0.006,0.008-0.009
			c0.003-0.003,0.006-0.006,0.008-0.009c0.004-0.003,0.008-0.006,0.014-0.009c0.003-0.003,0.008-0.007,0.014-0.01
			c0.003-0.003,0.008-0.006,0.013-0.009s0.009-0.006,0.014-0.008c0.009-0.008,0.02-0.016,0.03-0.022s0.021-0.014,0.03-0.021
			c0.01-0.006,0.021-0.013,0.031-0.018c0.01-0.006,0.021-0.012,0.029-0.017c0.002-0.001,0.002-0.001,0.003-0.002
			c0.002,0,0.002-0.001,0.003-0.002c0.001,0,0.002,0,0.003-0.001s0.002-0.001,0.003-0.002c0.025-0.011,0.051-0.02,0.078-0.03
			c0.026-0.009,0.053-0.018,0.08-0.026c0.027-0.007,0.054-0.015,0.082-0.023c0.027-0.006,0.055-0.013,0.083-0.02
			c0.007-0.002,0.015-0.004,0.023-0.007c0.008-0.002,0.016-0.004,0.023-0.006c0.008-0.002,0.017-0.003,0.024-0.006
			C26.812,11.163,26.82,11.161,26.829,11.16 M26.997,9.45c-0.358,0.013-0.71,0.051-1.04,0.125c-0.33,0.074-0.637,0.184-0.899,0.339
			c-0.262,0.156-0.48,0.357-0.633,0.614c-0.154,0.258-0.242,0.571-0.243,0.951c-0.001,0.343,0.068,0.697,0.195,1.044
			c0.126,0.349,0.31,0.69,0.539,1.01c0.229,0.321,0.503,0.619,0.808,0.878c0.306,0.259,0.643,0.48,0.998,0.647
			c0.096,0.045,0.192,0.084,0.289,0.116c0.095,0.032,0.191,0.058,0.287,0.077c0.095,0.019,0.189,0.032,0.282,0.039
			c0.092,0.007,0.185,0.008,0.275,0.002c0.114-0.007,0.225-0.023,0.333-0.049c0.108-0.026,0.212-0.062,0.313-0.106
			c0.099-0.045,0.194-0.099,0.285-0.162c0.09-0.063,0.173-0.134,0.251-0.214c0.172-0.172,0.294-0.376,0.381-0.6
			c0.087-0.224,0.138-0.466,0.165-0.717c0.025-0.25,0.029-0.507,0.017-0.76c-0.01-0.252-0.032-0.501-0.056-0.733
			c-0.009-0.082-0.034-0.162-0.073-0.235c-0.039-0.074-0.092-0.144-0.153-0.207c-0.062-0.064-0.133-0.121-0.209-0.17
			c-0.076-0.048-0.158-0.09-0.241-0.122l0,0l0,0h0.001l0,0c0.101-0.004,0.197-0.022,0.284-0.054
			c0.086-0.032,0.165-0.075,0.231-0.131c0.066-0.056,0.121-0.124,0.16-0.203c0.039-0.079,0.063-0.167,0.068-0.267
			c0.005-0.107-0.015-0.218-0.056-0.325c-0.041-0.108-0.102-0.212-0.182-0.306C29.293,9.837,29.2,9.755,29.094,9.69
			c-0.105-0.063-0.223-0.109-0.347-0.128c-0.133-0.02-0.271-0.038-0.413-0.054s-0.287-0.03-0.435-0.039
			c-0.147-0.011-0.298-0.018-0.448-0.021C27.3,9.444,27.148,9.445,26.997,9.45"/>
		<path d="M34.185,11.495c-0.044,0.001-0.086,0.006-0.129,0.014c-0.041,0.007-0.08,0.017-0.121,0.03
			c-0.039,0.013-0.074,0.029-0.11,0.047c-0.035,0.018-0.069,0.039-0.1,0.062c-0.146,0.036-0.284,0.085-0.415,0.148
			c-0.133,0.064-0.255,0.141-0.369,0.234c-0.114,0.092-0.218,0.198-0.31,0.32c-0.093,0.122-0.175,0.257-0.243,0.409
			c-0.136,0.298-0.172,0.61-0.127,0.917c0.044,0.309,0.168,0.614,0.349,0.898c0.182,0.285,0.421,0.549,0.699,0.775
			c0.275,0.226,0.587,0.414,0.913,0.547c0.037,0.015,0.075,0.028,0.114,0.039s0.078,0.02,0.117,0.026
			c0.039,0.006,0.078,0.01,0.119,0.012c0.039,0.002,0.079,0.002,0.117,0c0.076-0.005,0.151-0.019,0.221-0.041
			c0.068-0.023,0.133-0.054,0.19-0.093c0.057-0.04,0.107-0.087,0.146-0.145c0.037-0.056,0.068-0.121,0.083-0.194
			c0.038-0.168,0.068-0.337,0.09-0.506c0.024-0.169,0.04-0.34,0.048-0.511c0.009-0.17,0.012-0.342,0.007-0.513
			c-0.003-0.171-0.014-0.344-0.03-0.517c0.021,0.005,0.044,0.009,0.066,0.014c0.021,0.002,0.042,0.006,0.063,0.007
			c0.021,0.003,0.041,0.003,0.062,0.003c0.021,0.001,0.041,0,0.06,0c0.19-0.01,0.345-0.09,0.455-0.209
			c0.112-0.12,0.181-0.279,0.194-0.449c0.016-0.17-0.022-0.35-0.122-0.514c-0.099-0.163-0.261-0.31-0.493-0.41
			c-0.085-0.037-0.17-0.071-0.256-0.101c-0.085-0.031-0.171-0.058-0.255-0.083c-0.085-0.024-0.17-0.045-0.251-0.063
			c-0.085-0.017-0.169-0.031-0.25-0.042c-0.043-0.021-0.085-0.039-0.13-0.054c-0.044-0.014-0.088-0.027-0.134-0.037
			c-0.044-0.009-0.089-0.016-0.135-0.02C34.273,11.493,34.228,11.491,34.185,11.495"/>
		<path d="M22.986,15.635c-0.121,0.008-0.238,0.032-0.343,0.077c-0.105,0.042-0.2,0.104-0.275,0.182
			c-0.076,0.078-0.133,0.174-0.163,0.286c-0.03,0.113-0.034,0.243-0.003,0.389c0.263,1.264,0.936,2.434,1.888,3.469
			c0.955,1.036,2.183,1.93,3.554,2.642c1.364,0.71,2.858,1.238,4.355,1.551c1.479,0.311,2.955,0.409,4.298,0.268
			c0.567-0.061,1.112-0.163,1.622-0.31c0.509-0.146,0.982-0.337,1.415-0.572c0.43-0.236,0.819-0.517,1.156-0.844
			c0.336-0.327,0.622-0.7,0.85-1.121c0.094-0.175,0.114-0.357,0.083-0.531c-0.033-0.173-0.118-0.339-0.232-0.481
			c-0.116-0.142-0.262-0.26-0.42-0.341c-0.156-0.08-0.323-0.12-0.479-0.106c-0.048,0.003-0.096,0.014-0.142,0.029
			s-0.092,0.036-0.132,0.063c-0.043,0.027-0.082,0.061-0.119,0.101c-0.036,0.041-0.07,0.087-0.101,0.142
			c-0.175,0.315-0.399,0.594-0.663,0.837c-0.266,0.245-0.573,0.454-0.913,0.628c-0.344,0.176-0.72,0.317-1.126,0.426
			c-0.404,0.109-0.838,0.184-1.292,0.227c-1.102,0.107-2.319,0.025-3.547-0.22c-1.236-0.248-2.476-0.661-3.608-1.215
			c-1.136-0.557-2.157-1.252-2.949-2.059c-0.792-0.806-1.35-1.718-1.563-2.704c-0.031-0.146-0.088-0.271-0.165-0.377
			c-0.077-0.105-0.171-0.192-0.277-0.259c-0.105-0.067-0.223-0.115-0.344-0.145C23.231,15.638,23.107,15.627,22.986,15.635"/>
	</g>
</g>
</svg>
