; RUN: opt -indvars -polly-analyze-ir  -analyze %s | FileCheck %s
; RUN: opt -polly-analyze-ir  -analyze %s | FileCheck %s
; XFAIL: *

;void f(long a[][128], long N, long M) {
;  long i, j;
;  for (j = 0; j < (4*N + 7*M +3); ++j)
;    for (i = 0; i < (5*N*M + 2); ++i)
;        ...
;}

define void @f([128 x i64]* nocapture %a, i64 %N, i64 %M) nounwind {
entry:
  %0 = shl i64 %N, 2                              ; <i64> [#uses=2]
  %1 = mul i64 %M, 7                              ; <i64> [#uses=2]
  %2 = or i64 %0, 3                               ; <i64> [#uses=1]
  %3 = add nsw i64 %2, %1                         ; <i64> [#uses=1]
  %4 = icmp sgt i64 %3, 0                         ; <i1> [#uses=1]
  br i1 %4, label %bb.nph8, label %return

bb1:                                              ; preds = %bb2.preheader, %bb1
  %i.06 = phi i64 [ 0, %bb2.preheader ], [ %5, %bb1 ] ; <i64> [#uses=2]
  %scevgep = getelementptr [128 x i64]* %a, i64 %i.06, i64 %11 ; <i64*> [#uses=1]
  store i64 0, i64* %scevgep, align 8
  %5 = add nsw i64 %i.06, 1                       ; <i64> [#uses=2]
  %exitcond = icmp eq i64 %5, %tmp10              ; <i1> [#uses=1]
  br i1 %exitcond, label %bb3, label %bb1

bb3:                                              ; preds = %bb1
  %6 = add i64 %11, 1                             ; <i64> [#uses=2]
  %exitcond15 = icmp eq i64 %6, %tmp14            ; <i1> [#uses=1]
  br i1 %exitcond15, label %return, label %bb2.preheader

bb.nph8:                                          ; preds = %entry
  %7 = mul i64 %N, 5                              ; <i64> [#uses=1]
  %8 = mul i64 %7, %M                             ; <i64> [#uses=1]
  %9 = add nsw i64 %8, 2                          ; <i64> [#uses=1]
  %10 = icmp sgt i64 %9, 0                        ; <i1> [#uses=1]
  br i1 %10, label %bb.nph8.split, label %return

bb.nph8.split:                                    ; preds = %bb.nph8
  %tmp = mul i64 %M, %N                           ; <i64> [#uses=1]
  %tmp9 = mul i64 %tmp, 5                         ; <i64> [#uses=1]
  %tmp10 = add i64 %tmp9, 2                       ; <i64> [#uses=1]
  %tmp13 = add i64 %1, %0                         ; <i64> [#uses=1]
  %tmp14 = add i64 %tmp13, 3                      ; <i64> [#uses=1]
  br label %bb2.preheader

bb2.preheader:                                    ; preds = %bb.nph8.split, %bb3
  %11 = phi i64 [ 0, %bb.nph8.split ], [ %6, %bb3 ] ; <i64> [#uses=2]
  br label %bb1

return:                                           ; preds = %bb.nph8, %bb3, %entry
  ret void
}

; CHECK: TO BE WRITTEN
