; RUN: opt -O3 -indvars -polly-analyze-ir -polly-print-temp-scop-in-detail -print-top-scop-only  -analyze %s | FileCheck %s
; XFAIL: *

target datalayout = "e-p:64:64:64-i1:8:8-i8:8:8-i16:16:16-i32:32:32-i64:64:64-f32:32:32-f64:64:64-v64:64:64-v128:128:128-a0:0:64-s0:64:64-f80:128:128-n8:16:32:64"
target triple = "x86_64-unknown-linux-gnu"
%struct._IO_FILE = type { i32, i8*, i8*, i8*, i8*, i8*, i8*, i8*, i8*, i8*, i8*, i8*, %struct._IO_marker*, %struct._IO_FILE*, i32, i32, i64, i16, i8, [1 x i8], i8*, i64, i8*, i8*, i8*, i8*, i64, i32, [20 x i8] }
%struct._IO_marker = type { %struct._IO_marker*, %struct._IO_FILE*, i32 }
@x = common global [8000 x double] zeroinitializer, align 32 ; <[8000 x double]*> [#uses=4]
@A = common global [8000 x [8000 x double]] zeroinitializer, align 32 ; <[8000 x [8000 x double]]*> [#uses=6]
@y = common global [8000 x double] zeroinitializer, align 32 ; <[8000 x double]*> [#uses=6]
@stderr = external global %struct._IO_FILE*       ; <%struct._IO_FILE**> [#uses=6]
@.str = private constant [8 x i8] c"%0.2lf \00", align 1 ; <[8 x i8]*> [#uses=1]
@tmp = common global [8000 x double] zeroinitializer, align 32 ; <[8000 x double]*> [#uses=2]
define void @scop_func() nounwind {
bb.nph16:
  br label %bb

bb:                                               ; preds = %bb, %bb.nph16
  %storemerge15 = phi i64 [ 0, %bb.nph16 ], [ %0, %bb ] ; <i64> [#uses=2]
  %scevgep26 = getelementptr [8000 x double]* @y, i64 0, i64 %storemerge15 ; <double*> [#uses=1]
  store double 0.000000e+00, double* %scevgep26, align 8
  %0 = add nsw i64 %storemerge15, 1               ; <i64> [#uses=2]
  %exitcond25 = icmp eq i64 %0, 8000              ; <i1> [#uses=1]
  br i1 %exitcond25, label %bb.nph, label %bb

bb.nph:                                           ; preds = %bb9, %bb
  %storemerge17 = phi i64 [ %11, %bb9 ], [ 0, %bb ] ; <i64> [#uses=4]
  %scevgep24 = getelementptr [8000 x double]* @tmp, i64 0, i64 %storemerge17 ; <double*> [#uses=2]
  store double 0.000000e+00, double* %scevgep24, align 8
  br label %bb4

bb4:                                              ; preds = %bb4, %bb.nph
  %.tmp.0 = phi double [ 0.000000e+00, %bb.nph ], [ %4, %bb4 ] ; <double> [#uses=1]
  %storemerge24 = phi i64 [ 0, %bb.nph ], [ %5, %bb4 ] ; <i64> [#uses=3]
  %scevgep17 = getelementptr [8000 x [8000 x double]]* @A, i64 0, i64 %storemerge17, i64 %storemerge24 ; <double*> [#uses=1]
  %scevgep = getelementptr [8000 x double]* @x, i64 0, i64 %storemerge24 ; <double*> [#uses=1]
  %1 = load double* %scevgep17, align 8           ; <double> [#uses=1]
  %2 = load double* %scevgep, align 8             ; <double> [#uses=1]
  %3 = fmul double %1, %2                         ; <double> [#uses=1]
  %4 = fadd double %.tmp.0, %3                    ; <double> [#uses=3]
  %5 = add nsw i64 %storemerge24, 1               ; <i64> [#uses=2]
  %exitcond = icmp eq i64 %5, 8000                ; <i1> [#uses=1]
  br i1 %exitcond, label %bb8.loopexit, label %bb4

bb7:                                              ; preds = %bb8.loopexit, %bb7
  %storemerge35 = phi i64 [ %10, %bb7 ], [ 0, %bb8.loopexit ] ; <i64> [#uses=3]
  %scevgep19 = getelementptr [8000 x [8000 x double]]* @A, i64 0, i64 %storemerge17, i64 %storemerge35 ; <double*> [#uses=1]
  %scevgep20 = getelementptr [8000 x double]* @y, i64 0, i64 %storemerge35 ; <double*> [#uses=2]
  %6 = load double* %scevgep20, align 8           ; <double> [#uses=1]
  %7 = load double* %scevgep19, align 8           ; <double> [#uses=1]
  %8 = fmul double %7, %4                         ; <double> [#uses=1]
  %9 = fadd double %6, %8                         ; <double> [#uses=1]
  store double %9, double* %scevgep20, align 8
  %10 = add nsw i64 %storemerge35, 1              ; <i64> [#uses=2]
  %exitcond18 = icmp eq i64 %10, 8000             ; <i1> [#uses=1]
  br i1 %exitcond18, label %bb9, label %bb7

bb8.loopexit:                                     ; preds = %bb4
  store double %4, double* %scevgep24
  br label %bb7

bb9:                                              ; preds = %bb7
  %11 = add nsw i64 %storemerge17, 1              ; <i64> [#uses=2]
  %exitcond21 = icmp eq i64 %11, 8000             ; <i1> [#uses=1]
  br i1 %exitcond21, label %return, label %bb.nph

return:                                           ; preds = %bb9
  ret void
}

; CHECK: SCoP: bb.nph => return Parameters: (), Max Loop Depth: 2
; CHECK: Bounds of Loop: bb.nph:        { 1 * {0,+,1}<%bb.nph> + 0 >= 0, -1 * {0,+,1}<%bb.nph> + 7999 >= 0}
; CHECK:   BB: bb.nph{
; CHECK:     Writes @tmp[8 * {0,+,1}<%bb.nph> + 0]
; CHECK:   }
; CHECK:   Bounds of Loop: bb4: { 1 * {0,+,1}<%bb4> + 0 >= 0, -1 * {0,+,1}<%bb4> + 7999 >= 0}
; CHECK:     BB: bb4{
; CHECK:       Reads %4[]
; CHECK:       Reads @A[8 * {0,+,1}<%bb4> + 64000 * {0,+,1}<%bb.nph> + 0]
; CHECK:       Reads @x[8 * {0,+,1}<%bb4> + 0]
; CHECK:       Writes %4[]
; CHECK:     }
; CHECK:   BB: bb8.loopexit{
; CHECK:     Reads %4[]
; CHECK:     Writes %.lcssa[]
; CHECK:     Writes @tmp[8 * {0,+,1}<%bb.nph> + 0]
; CHECK:   }
; CHECK:   Bounds of Loop: bb7: { 1 * {0,+,1}<%bb7> + 0 >= 0, -1 * {0,+,1}<%bb7> + 7999 >= 0}
; CHECK:     BB: bb7{
; CHECK:       Reads @y[8 * {0,+,1}<%bb7> + 0]
; CHECK:       Reads @A[64000 * {0,+,1}<%bb.nph> + 8 * {0,+,1}<%bb7> + 0]
; CHECK:       Reads %.lcssa[]
; CHECK:       Writes @y[8 * {0,+,1}<%bb7> + 0]
; CHECK:     }
