%% Do not edit this file; it is auto-generated from LSR http://lsr.dsi.unimi.it
%% This file is in the public domain.
\version "2.13.1"

\header {
  lsrtags = "text, keyboards, template"

  texidoces = "
En lugar de tener un pentagrama dedicado a la melodía y la letra, ésta
se puede centrar entre los pentagramas de un sistema de piano.

"
  doctitlees = "Plantilla de piano con letra centrada"
  
  texidocde = "
Anstatt ein eigenes System für Melodie und Text zu schreiben, können 
Sie den Text auch zwischen die beiden Klaviersysteme schreiben
(und damit das zusätzliche System für die Gesangstimme auslassen).
"

  texidocja = "
旋律と歌詞のための譜表を持つ代わりに、歌詞をピアノ譜の 2 つの譜の間に置くことができます。
"

  texidoc = "
Instead of having a full staff for the melody and lyrics, lyrics can be
centered between the staves of a piano staff.

"
  doctitle = "Piano template with centered lyrics"
} % begin verbatim

upper = \relative c'' {
  \clef treble
  \key c \major
  \time 4/4
  
  a4 b c d  
}

lower = \relative c {
  \clef bass
  \key c \major
  \time 4/4
  
  a2 c  
}

text = \lyricmode {
  Aaa Bee Cee Dee
}

\score {
  \new GrandStaff <<
    \new Staff = upper { \new Voice = "singer" \upper }
    \new Lyrics \lyricsto "singer" \text
    \new Staff = lower { \lower }
  >>
  \layout {
    \context {
      \GrandStaff
      \accepts "Lyrics"
    }
    \context {
      \Lyrics
      \consists "Bar_engraver"
    }
  }
  \midi { }
}
