%% Do not edit this file; it is auto-generated from LSR http://lsr.dsi.unimi.it
%% This file is in the public domain.
\version "2.13.1"

\header {
  lsrtags = "repeats"

  texidoces = "
De forma predeterminada, los corchetes de primera y segunda vez se
trazan encima de los finales alternativos completos, pero es posible
acortartlos estableciendo un valor cierto para
@code{voltaSpannerDuration}.  En el ejemplo siguiente, el corchete
sólo dura un compás, que corresponde a una duración de 3/4.

"
  doctitlees = "Shortening volta brackets"

%% Translation of GIT committish :<0364058d18eb91836302a567c18289209d6e9706>
  texidocde = "
Volta-Klammern werden normalerweise über alle Noten der Klammer gezogen, aber
es ist möglich sie zu verkürzen.  Hierzu muss
@code{voltaSpannerDuration} definiert werden, in dem Beispiel etwa als
3/4, sodass die Klammer nur einen Takt dauert. 

"
  doctitlede = "Volta-Klammern verkürzen"

  texidoc = "
By default, the volta brackets will be drawn over all of the
alternative music, but it is possible to shorten them by setting
@code{voltaSpannerDuration}.  In the next example, the bracket only
lasts one measure, which is a duration of 3/4. 

"
  doctitle = "Shortening volta brackets"
} % begin verbatim

\relative c'' {
  \time 3/4
  c4 c c
  \set Score.voltaSpannerDuration = #(ly:make-moment 3 4)
  \repeat volta 5 { d4 d d }
  \alternative {
    {
      e4 e e
      f4 f f
    }
    { g4 g g }
  }
}
