%% Do not edit this file; it is auto-generated from LSR http://lsr.dsi.unimi.it
%% This file is in the public domain.
\version "2.13.1"

\header {
  lsrtags = "editorial-annotations, fretted-strings"

  texidoc = "
Fingering instructions can be entered using a simple syntax.

"
  doctitle = "Adding fingerings to a score"
} % begin verbatim

\relative c'' {
  c4-1 d-2 f-4 e-3
}
