%% Do not edit this file; it is auto-generated from input/new
%% This file is in the public domain.
%% Note: this file works from version 2.12.0
\version "2.13.1"

\header {
texidoces = "
La creación de un grupeto circular de anticipación entre dos notas,
donde la nota inferior del grupeto utiliza una alteración, requiere
varias sobreescriturasw de propiedades.  La propiedad
@code{outside-staff-priority} se debe establecer al valor #f, pues en
caso contrario tendría prioridad sobre la propiedad @code{avoid-slur
property}.  El valor de @code{halign} se utiliza para colocar el
grupeto horizontalmente.

"

doctitlees = "Crear un grupeto de anticipación"


%% Translation of GIT committish :0364058d18eb91836302a567c18289209d6e9706
  texidocde = "
Einen Doppelschlag mit Vorhalt zu erstellen, wobei die untere Note das
Vorzeichen benutzt, erfordert einige Einstellungsänderungen.  Die
@code{outside-staff-priority}-Eigenschaft muss auf falsch (@code{#f})
gesetzt werden, weil sie sonst über die Eigenschaft
@code{avoid-slur property} dominieren würde.  Der Wert von @code{halign}
wird benutzt, um den Doppelschlag horizontal zu positionieren.
"

  doctitlede = "Einen  Doppelschlag mit Vorhalt erstellen"

  lsrtags = "expressive-marks, editorial-annotations, tweaks-and-overrides"

  texidoc = "
Creating a delayed turn, where the lower note of the
turn uses the accidental, requires several overrides.  The
@code{outside-staff-priority} property must be set to @code{#f},
as otherwise this would take precedence over the
@code{avoid-slur property}.  The value of @code{halign} is used
to position the turn horizontally."

  doctitle = "Creating a delayed turn"
} % begin verbatim


\relative c'' {
  \once \override TextScript #'avoid-slur = #'inside
  \once \override TextScript #'outside-staff-priority = ##f
  c2(^\markup \tiny \override #'(baseline-skip . 1) {
    \halign #-4
    \center-column {
      \sharp
      \musicglyph #"scripts.turn"
    }
  }
  d4.) c8
}
