%% Do not edit this file; it is auto-generated from LSR http://lsr.dsi.unimi.it
%% This file is in the public domain.
\version "2.13.1"

\header {
  lsrtags = "simultaneous-notes"

  texidoces = "
Al utilizar la posibilidad de combinación automática de partes, se
puede modificar el texto que se imprime para las secciones de solo
y de unísono:

"
  doctitlees = "Cambiar los textos de partcombine"

%% Translation of GIT committish :<0364058d18eb91836302a567c18289209d6e9706>
  texidocde = "
Wenn Stimmen automatisch kombiniert werden, kann der Text, der für
Solo- und Unisono-Stellen ausgegeben wird, geändert werden:

"
  doctitlede = "Partcombine-Text ändern"

  texidoc = "
When using the automatic part combining feature, the printed text for
the solo and unison sections may be changed:

"
  doctitle = "Changing partcombine texts"
} % begin verbatim

\new Staff <<
  \set Staff.soloText = #"girl"
  \set Staff.soloIIText = #"boy"
  \set Staff.aDueText = #"together"
  \partcombine
    \relative c'' {
      g4 g r r
      a2 g
    }
    \relative c'' {
      r4 r a( b)
      a2 g
    }
>>
