%% Do not edit this file; it is auto-generated from LSR http://lsr.dsi.unimi.it
%% This file is in the public domain.
\version "2.13.1"

\header {
  lsrtags = "keyboards, template"

  texidoces = "
Presentamos a continuación una plantilla de piano sencilla con algunas
notas.

"
  doctitlees = "Plantilla de piano (sencilla)"
  
  texidocde = "
Hier ein einfaches Klaviersystem.

"
  doctitlede = "Vorlage für einfache Klaviernotation"

  texidoc = "
Here is a simple piano staff with some notes.

"
  doctitle = "Piano template (simple)"
} % begin verbatim

upper = \relative c'' {
  \clef treble
  \key c \major
  \time 4/4
  
  a4 b c d  
}

lower = \relative c {
  \clef bass
  \key c \major
  \time 4/4
  
  a2 c  
}

\score {
  \new PianoStaff <<
    \set PianoStaff.instrumentName = #"Piano  "
    \new Staff = "upper" \upper
    \new Staff = "lower" \lower
  >>
  \layout { }
  \midi { }
}
