%% Do not edit this file; it is auto-generated from input/new
%% This file is in the public domain.
%% Note: this file works from version 2.12.0
\version "2.13.1"

\header {
  texidoces = "
Muchas partituras de piano tienen las indicaciones dinámicas
centradas entre los dos pentagramas.  Esto requiere un poco de
trucaje, pero puesto que la plantilla está aquí mismo, no tenemos
que hacer este trucaje por nuestra cuenta.

"
  doctitlees = "Plantilla de piano con matices centrados"
  
  texidocde = "
In der meisten Klaviernotation werden die Dynamikzeichen zwischen 
den beiden Systemen zentriert. Für LilyPond muss man die Einstellungen 
etwas anpassen, aber Sie können ja das angepasste Beispiel von hier 
kopieren.
"

  texidocja = "
多くのピアノ譜は、強弱記号を 2 つの譜の間に置きます。これを実現するにはちょっ@c
とした調整が必要ですが、そのテンプレートがここにあるので、あなた自身が調整を行@c
う必要はありません。
"

  lsrtags = "expressive-marks,keyboards,template"
  texidoc = "
Many piano scores have the dynamics centered between the two staves.
This requires a bit of tweaking to implement, but since the template is
right here, you don't have to do the tweaking yourself.
"
  doctitle = "Piano template with centered dynamics"
} % begin verbatim


global = {
  \key c \major
  \time 4/4
}

upper = \relative c'' {
  \clef treble
  a4 b c d
}

lower = \relative c {
  \clef bass
  a2 c
}

dynamics = {
  s2\fff\> s4 s\!\pp
}

pedal = {
  s2\sustainOn s\sustainOff
}

\score {
  \new PianoStaff = "PianoStaff_pf" <<
    \new Staff = "Staff_pfUpper" \upper
    \new Dynamics = "Dynamics_pf" \dynamics
    \new Staff = "Staff_pfLower" << \lower >>
    \new Dynamics = "pedal" \pedal
  >>

  \layout {
    % define Dynamics context
    \context {
      \type "Engraver_group"
      \name Dynamics
      \alias Voice
      \consists "Output_property_engraver"
      \consists "Piano_pedal_engraver"
      \consists "Script_engraver"
      \consists "New_dynamic_engraver"
      \consists "Dynamic_align_engraver"
      \consists "Text_engraver"
      \consists "Skip_event_swallow_translator"
      \consists "Axis_group_engraver"

      pedalSustainStrings = #'("Ped." "*Ped." "*")
      pedalUnaCordaStrings = #'("una corda" "" "tre corde")
      \override DynamicLineSpanner #'Y-offset = #0
      \override TextScript #'font-size = #2
      \override TextScript #'font-shape = #'italic
      \override VerticalAxisGroup #'minimum-Y-extent = #'(-1 . 1)
    }
    % modify PianoStaff context to accept Dynamics context
    \context {
      \PianoStaff
      \accepts Dynamics
    }
  }
}

\score {
  \new PianoStaff = "PianoStaff_pf" <<
    \new Staff = "Staff_pfUpper" << \global \upper \dynamics \pedal >>
    \new Staff = "Staff_pfLower" << \global \lower \dynamics \pedal >>
  >>
  \midi { }
}
