%% Do not edit this file; it is auto-generated from input/new
%% This file is in the public domain.
%% Note: this file works from version 2.12.0
\version "2.13.1"

\header {
  texidoces = "
Mediante la especificación del contexto, el efecto de
@code{beatGrouping} puede limitarse al contexto especificado, y
sobreescribirse los valores establecidos en contextos de niveles más
altos:

"
  doctitlees = "Especificar el contexto con beatGrouping"

%% Translation of GIT committish :<0364058d18eb91836302a567c18289209d6e9706>
  texidocde = "
Wenn der Kontext angegeben wird, kann die Auswirkung von @code{beatGrouping}
auf den angegebenen Kontext beschränkt werden und die Werte, die in Kontexten
auf höhrer Ebene angegeben wurden, können verändert werden.  Der
@code{\\set}-Befehl muss @emph{nach} den @code{\\time}-Befehl geschrieben
werden:
"
  doctitlede = "Den Kontext für beatGrouping angeben"

  lsrtags = "rhythms"
  texidoc = "
By specifying the context, the effect of @code{beatGrouping} can be
limited to the context specified, and the values which may have
been set in higher-level contexts can be overridden.  The
@code{\\set} commands must be placed @emph{after} all @code{\\time}
commands:
"
  doctitle = "Specifying context with beatGrouping"
} % begin verbatim


\score {
  \new Staff <<
    \time 7/8
    \new Voice {
      \relative c'' {
        \set Staff.beatGrouping = #'(2 3 2)
        a8 a a a a a a
      }
    }
    \new Voice {
      \relative c' {
        \voiceTwo
        \set beatGrouping = #'(1 3 3)
        f8 f f f f f f
      }
    }
  >>
}
