%% Do not edit this file; it is auto-generated from LSR http://lsr.dsi.unimi.it
%% This file is in the public domain.
\version "2.13.1"

\header {
  lsrtags = "expressive-marks"

  texidoces = "
Se puede tipografiar un gissando contemporáneo sin nota final
utilizando una nota oculta y temporalización de cadenza.

"
  doctitlees = "Glissando contemporáneo"
  
%% Translation of GIT committish :<6ce7f350682dfa99af97929be1dec6b9f1cbc01a>
texidocde = "
Ein modernes Glissando ohne eine Endnote kann gesetzt werden, indem
eine Kadenz eingesetzt wird und die Endnote unsichtbar gemacht wird.

"
  doctitlede = "Moderne Glissandi"

  texidoc = "
A contemporary glissando without a final note can be typeset using a
hidden note and cadenza timing.

"
  doctitle = "Contemporary glissando"
} % begin verbatim

\relative c'' {
  \time 3/4
  \override Glissando #'style = #'zigzag
  c4 c
  \cadenzaOn
  c4\glissando
  \hideNotes
  c,,4 
  \unHideNotes
  \cadenzaOff
  \bar "|"
}
