%% Do not edit this file; it is auto-generated from input/new
%% This file is in the public domain.
%% Note: this file works from version 2.12.0
\version "2.13.1"
\header {
  texidoces = "
Se pueden mostrar los contadores de las repeticiones del tipo
porcentaje a intervalos regulares mediante el establecimiento de
la propiedad de contexto @code{repeatCountVisibility}.

"
  doctitlees = "Visibilidad del contador de repeticiones de tipo porcentaje"

%% Translation of GIT committish :<0364058d18eb91836302a567c18289209d6e9706>
  texidocde = "
Prozentwiederholungszähler können in regelmäßigen Intervallen angezeigt
werden, indem man die Eigenschaft @code{repeatCountVisibility} beeinflusst.
"
  doctitlede = "Sichtbarkeit von Prozent-Wiederholungen"

  lsrtags = "repeats, tweaks-and-overrides"
  texidoc = "
Percent repeat counters can be shown at regular intervals by setting
the context property @code{repeatCountVisibility}.
"
  doctitle = "Percent repeat count visibility"
} % begin verbatim


\relative c'' {
  \set countPercentRepeats = ##t
  \set repeatCountVisibility = #(every-nth-repeat-count-visible 5)
  \repeat percent 10 { c1 } \break
  \set repeatCountVisibility = #(every-nth-repeat-count-visible 2)
  \repeat percent 6 { c1 d1 }
}
