%% Do not edit this file; it is auto-generated from input/new
%% This file is in the public domain.
%% Note: this file works from version 2.12.0
\version "2.13.1"

\header {
  texidoces = "
Se pueden crear indicaciones metronómicas nuevas en modo de
marcado, pero no cambian el tempo en la salida MIDI.

"
  doctitlees = "Crear indicaciones metronómicas en modo de marcado"

%% Translation of GIT committish :<0364058d18eb91836302a567c18289209d6e9706>
  texidocde = "
Neue Metronombezeichnungen können als Textbeschriftung erstellt werden,
aber sie ändern nicht das Tempo für die MIDI-Ausgabe.

"

  doctitlede = "Eine Metronombezeichnung als Textbeschriftung erstellen"

  lsrtags = "staff-notation"
  texidoc = "New metronome marks can be created in markup mode,
but they will not change the tempo in MIDI output."

  doctitle = "Creating metronome marks in markup mode"
} % begin verbatim


\relative c' {
  \tempo \markup {
    \concat {
      (
      \smaller \general-align #Y #DOWN \note #"16." #1
      " = "
      \smaller \general-align #Y #DOWN \note #"8" #1
      )
    }
  }
  c1
  c4 c' c,2
}
