%% Do not edit this file; it is auto-generated from input/new
%% This file is in the public domain.
%% Note: this file works from version 2.13.1
\version "2.13.1"

\header {
  texidoces = "

Las ligaduras de expresión se pueden construir con patrones de
discontinuidad complejos mediante la definición de la propiedad
@code{dash-definition}.  @code{dash-definition} es una lista de
@code{elementos de discontinuidad}.  Un @code{elemento de
discontinuidad} es una lista de parámetros que definen el
comportamiento de discontinuidad de un segmento de la ligadura de
expresión.

La ligadura se define en términos del parámetro de bezier t cuyo
rango va de 0 a la izquierda de la ligadura hasta 1 en el extremo
derecho de la ligadura.  Cada @code{elemento de discontinuidad} es
una lista @code{(t-inicio t-final fracción-discontinuidad
período-discontinuidad)}.  La región de la ligadura desde
@code{t-inicio} hasta @code{t-final} tendrá una fracción
@code{fracción-discontinuidad} de cada
@code{período-discontinuidad} de color negro.
@code{período-discontinuidad} se define en términos de espacios de
pentagrama.  @code{fracción-discontinuidad} se establece al valor
de 1 para una ligadura continua.

"

  doctitlees = "Hacer ligaduras de expresión con estructura compleja de discontinuidad"

  lsrtags = "rhythms, expressive-marks"
  texidoc = "
Slurs can be made with complex dash patterns by defining
the @code{dash-definition} property.  @code{dash-definition}
is a list of @code{dash-elements}.  A @code{dash-element} is a
list of parameters defining the dash behavior for a segment of
the slur.

The slur is defined in terms of the bezier parameter t
which ranges from 0
at the left end of the slur to 1 at the right end of the slur.
@code{dash-element} is a list @code{(start-t stop-t dash-fraction
dash-period)}.  The region of the slur from @code{start-t} to
@code{stop-t} will have a fraction @code{dash-fraction}
of each @code{dash-period} black.  @code{dash-period} is
defined in terms of staff spaces.  @code{dash-fraction} is
set to 1 for a solid slur.
"
  doctitle = "Making slurs with complex dash structure"
} % begin verbatim


\relative c' {
  \once \override
    Slur #'dash-definition = #'((0 0.3 0.1 0.75)
                                (0.3 0.6 1 1)
                                (0.65 1.0 0.4 0.75))
  c( d e f)
  \once \override
    Slur #'dash-definition = #'((0 0.25 1 1)
                                (0.3 0.7 0.4 0.75)
                                (0.75 1.0 1 1))
  c( d e f)
}
