%% Do not edit this file; it is auto-generated from LSR http://lsr.dsi.unimi.it
%% This file is in the public domain.
\version "2.13.1"

\header {
  lsrtags = "chords"

%% Translation of GIT committish :33f623301a41fcc53efadf96bca1c72834763415
 texidocde = "
Das Aussehen des großen Septakkords kann mit @code{majorSevenSymbol} verändert werden.

"

  doctitlede = "Akkordbezeichnung maj7"

  texidoc = "
The layout of the major 7 can be tuned with @code{majorSevenSymbol}. 

"
  doctitle = "chord name major7"
} % begin verbatim

\chords {
  c:7+
  \set majorSevenSymbol = \markup { j7 }
  c:7+
}
