%% Do not edit this file; it is auto-generated from input/new
%% This file is in the public domain.
%% Note: this file works from version 2.12.0
\version "2.13.1"

\header {
  texidoces = "
Para cambiar el tempo en la salida MIDI sin
imprimir nada, hacemos invisible la indicación metronómica:

"

  doctitlees = "Cambiar el tempo sin indicación metronómica"

%% Translation of GIT committish :<0364058d18eb91836302a567c18289209d6e9706>
  texidocde = "
Um das Tempo für die MIDI-Ausgabe zu ändern, ohne eine Tempoangabe in den
Noten auszugeben, kann die Metronombezeichnung unsichtbar gemacht werden:

"

  doctitlede = "Das Tempo ohne Metronom-Angabe verändern"

  lsrtags = "staff-notation"
  texidoc = "To change the tempo in MIDI output without printing
anything, make the metronome mark invisible:"

  doctitle = "Changing the tempo without a metronome mark"
} % begin verbatim


\score {
  \new Staff \relative c' {
    \tempo 4 = 160
    c4 e g b
    c4 b d c
    \set Score.tempoHideNote = ##t
    \tempo 4 = 96
    d,4 fis a cis
    d4 cis e d
  }
  \layout { }
  \midi { }
}
