%% Do not edit this file; it is auto-generated from LSR http://lsr.dsi.unimi.it
%% This file is in the public domain.
\version "2.13.1"

\header {
  lsrtags = "expressive-marks"

  texidoces = "
Los cambios de dinámica con estilo de texto (como cresc. y dim.)
se imprimen con una línea intermitente que muestra su alcance.
Esta línea se puede suprimir de la siguiente manera:

"
  doctitlees = "Ocultar la línea de extensión de las expresiones textuales de dinámica"
  
%% Translation of GIT committish :<6ce7f350682dfa99af97929be1dec6b9f1cbc01a>
texidocde = "
Dynamik-Texte (wie cresc. und dim.) werden mit einer gestrichelten Linie
gesetzt, die ihre Dauer anzeigt.  Diese Linie kann auf foldenge Weise
unterdrückt werden:

"
  doctitlede = "Crescendo-Linien von Dynamik-Texten unterdrücken"

  texidoc = "
Text style dynamic changes (such as cresc. and dim.) are printed with a
dashed line showing their extent.  This line can be suppressed in the
following way: 

"
  doctitle = "Hiding the extender line for text dynamics"
} % begin verbatim

\relative c'' {
  \override DynamicTextSpanner #'dash-period = #-1.0
  \crescTextCresc
  c1\< | d | b | c\!
}
