%% Do not edit this file; it is auto-generated from LSR http://lsr.dsi.unimi.it
%% This file is in the public domain.
\version "2.13.1"

\header {
  lsrtags = "chords"

  texidoces = "
Al juntar nombres de acorde en cifrado americano, melodía y letra,
obtenemos una hoja guía de acordes o «lead sheet»:

"
  doctitlees = "Hoja guía de acordes o «lead sheet» sencilla"

%% Translation of GIT committish: 33f623301a41fcc53efadf96bca1c72834763415
 texidocde = "
Ein Liedblatt besteht aus Akkordbezeichnungen, einer Melodie und dem Liedtext:

"
  doctitlede = "Ein einfaches Liedblatt"

  texidoc = "
When put together, chord names, a melody, and lyrics form a lead sheet:

"
  doctitle = "Simple lead sheet"
} % begin verbatim

<<
  \chords { c2 g:sus4 f e }
  \relative c'' {
    a4 e c8 e r4
    b2 c4( d)
  }
  \addlyrics { One day this shall be free __ }
>>
