%% Do not edit this file; it is auto-generated from LSR http://lsr.dsi.unimi.it
%% This file is in the public domain.
\version "2.13.1"

\header {
  lsrtags = "rhythms"

  texidoces = "

Es posible aplicar la barrita que cruza la barra de las
acciaccaturas, en otras situaciones.

"

  doctitlees = "Utilizar la barra que tacha las notas de adorno con notas normales"

  texidoc = "
The slash through the stem found in acciaccaturas can be applied in
other situations.

"
  doctitle = "Using grace note slashes with normal heads"
} % begin verbatim

\relative c'' {
  \override Stem #'stroke-style = #"grace"
  c8( d2) e8( f4)
}
