%% Do not edit this file; it is auto-generated from LSR http://lsr.dsi.unimi.it
%% This file is in the public domain.
\version "2.13.1"

\header {
  lsrtags = "rhythms, expressive-marks, staff-notation, tweaks-and-overrides"

  texidoces = "
De forma predeterminada, las indicaciones metronómicas y las
letras de ensayo se imprimen encima del pentagrama.  Para
colocarlas debajo del pentagrama, simplemente ajustamos
adecuadamente las propiedades @code{side-axis} y @code{direction}
de @code{MetronomeMark} o de @code{RehearsalMark}.

"

  doctitlees = "Impresión de indicaciones metronómicas y letras de ensayo debajo del pentagrama"

  
%% Translation of GIT committish :<0364058d18eb91836302a567c18289209d6e9706>
  texidocde = "
Normalerweise werden Metronom- und Übungszeichen über dem Notensystem ausgegeben.
Um sie unter das System zu setzen, muss die @code{direction}-Eigenschaft
von @code{MetronomeMark} oder @code{RehearsalMark} entsprechend verändert werden.

"
  doctitlede = "Metronom- und Übungszeichen unter das System setzen"

  texidoc = "
By default, metronome and rehearsal marks are printed above the staff. 
To place them below the staff simply set the @code{direction} property
of @code{MetronomeMark} or @code{RehearsalMark} appropriately.

"
  doctitle = "Printing metronome and rehearsal marks below the staff"
} % begin verbatim

\layout { ragged-right = ##f }

{
  % Metronome marks below the staff 
  \override Score.MetronomeMark #'direction = #DOWN
  \tempo 8. = 120
  c''1

  % Rehearsal marks below the staff
  \override Score.RehearsalMark #'direction = #DOWN
  \mark \default
  c''1
}
