%% Do not edit this file; it is auto-generated from LSR http://lsr.dsi.unimi.it
%% This file is in the public domain.
\version "2.13.1"

\header {
  lsrtags = "rhythms"

  texidoces = "
Normalmente están prohibidos los saltos de línea si las barras
atraviesan las líneas divisorias.  Se puede cambiar este
comportamiento como se muestra aquí:

"
  doctitle = "Barras que atraviesan saltos de línea"
  
%% Translation of GIT committish :<6ce7f350682dfa99af97929be1dec6b9f1cbc01a>
  
texidocde = "
Zeilenumbrüche sind normalerweise während Balken verboten.  Das kann geändert
werden.

"
  doctitlede = "Balken über Zeilenumbrüche"

  texidoc = "
Line breaks are normally forbidden when beams cross bar lines. This
behavior can be changed as shown: 

"
  doctitle = "Beams across line breaks"
} % begin verbatim

\relative c'' {
  \override Beam #'breakable = ##t
  c8 c[ c] c[ c] c[ c] c[ \break  
  c8] c[ c] c[ c] c[ c] c
}

