\version "2.12.0"
\header {
  lsrtags = "repeats,staff-notation,chords"
  texidoc = "By adding the @code{Volta_engraver} to the relevant
staff, volte can be put under chords."
  doctitle = "Volta under chords"
}

\score {
  <<
    \chords {
      c1
      c1
    }
    \new Staff \with {
      \consists "Volta_engraver"
    }
    {
      \repeat volta 2 { c'1 }
      \alternative { c' }
    }
  >>
  \layout {
    \context {
      \Score
      \remove "Volta_engraver"
    }
  }
}
