%% Do not edit this file; it is auto-generated from LSR http://lsr.dsi.unimi.it
%% This file is in the public domain.
\version "2.13.1"

\header {
  lsrtags = "expressive-marks, tweaks-and-overrides"

  texidoces = "
A veces se denota una «cesura» con una doble marca de respiración
parecida a las vías del tren, con un calderón encima. Este
fragmento de código presenta una combinación de estas dos marcas,
visualmente satisfactoria.

"
  doctitlees = "Cesura tipo \"vías del tren\" con calderón"

  texidoc = "
A caesura is sometimes denoted by a double \"railtracks\" breath mark
with a fermata sign positioned above. This snippet should present an
optically pleasing combination of railtracks and fermata.

"
  doctitle = "Caesura (\"railtracks\") with fermata"
} % begin verbatim

\relative c'' {
  c2.
  % construct the symbol
  \override BreathingSign #'text = \markup {
    \line {
      \musicglyph #"scripts.caesura.curved"
      \translate #'(-1.75 . 1.6)
      \musicglyph #"scripts.ufermata"
    }
  }
  \breathe c4
  % set the breathe mark back to normal
  \revert BreathingSign #'text
  c2. \breathe c4
  \bar "|."
}
