%% Do not edit this file; it is auto-generated from LSR http://lsr.dsi.unimi.it
%% This file is in the public domain.
\version "2.13.1"

\header {
  lsrtags = "chords"

  texidoces = "
Las alteraciones y los signos «más» pueden aparecer antes o
después de los números, según el valor de las propiedades
@code{figuredBassAlterationDirection} y
@code{figuredBassPlusDirection}.

"
  doctitlees = "Cambiar las posiciones de las alteraciones del bajo cifrado"

%% Translation of GIT committish: 33f623301a41fcc53efadf96bca1c72834763415
  texidocde = "
Versetzungszeichen und Pluszeichen können vor oder nach den Ziffern erscheinen,
je nach den Einstellungen der @code{figuredBassAlterationDirection} und
@code{figuredBassPlusDirection}-Eigenschaften.

"
  doctitlede = "Positionen von Generalbass-Alterationszeichen verändern"

  texidoc = "
Accidentals and plus signs can appear before or after the numbers,
depending on the @code{figuredBassAlterationDirection} and
@code{figuredBassPlusDirection} properties.

"
  doctitle = "Changing the positions of figured bass alterations"
} % begin verbatim

\figures {
  <6\+> <5+> <6 4-> r
  \set figuredBassAlterationDirection = #RIGHT
  <6\+> <5+> <6 4-> r
  \set figuredBassPlusDirection = #RIGHT
  <6\+> <5+> <6 4-> r
  \set figuredBassAlterationDirection = #LEFT
  <6\+> <5+> <6 4-> r
}
