%% Do not edit this file; it is auto-generated from LSR http://lsr.dsi.unimi.it
%% This file is in the public domain.
\version "2.13.1"

\header {
  lsrtags = "rhythms"

  texidoces = "
Se insertan automáticamente barras en ángulo cuando se detecta un
intervalo muy grande entre las notas.  Se puede hacer un ajuste
fino de este comportamiento a través de la propiedad
@code{auto-knee-gap}.  Se traza una barra doblada si el salto es
mayor que el valor de @code{auto-knee-gap} más el ancho del objeto
barra (que depende de la duración de las notas y de la inclinación
de la barra).  De forma predeterminada @code{auto-knee-gap} está
establecido a 5.5 espacios de pentagrama.

"
  doctitlees = "Cambiar el salto de las barras en ángulo"
  
%% Translation of GIT committish :<6ce7f350682dfa99af97929be1dec6b9f1cbc01a>
texidocde = "
Balken mit Hälsen in unterschiedliche Richtungen werden automatisch
erstellt, wenn ein großer Sprung zwischen Tonhöhen gefunden wird.  Dieses
Verhalten kann durch die @code{auto-knee-gap}-Eigenschaft beeinflusst
werden.  Ein derartiger Knie-Balken wird erstellt, wenn der Abstand größer
ist als der Wert von @code{auto-knee-gap} plus der Dicke des Balkens
(was von der Notendauer und der Neigung des Balkens abhängt).  Der
Standardwert von @code{auto-knee-gap} ist 5.5 Notensystemabstände.

"
  doctitlede = "Balken für weit auseinander liegende Noten ändern"

  texidoc = "
Kneed beams are inserted automatically when a large gap is detected
between the note heads.  This behavior can be tuned through the
@code{auto-knee-gap} property.  A kneed beam is drawn if the gap is
larger than the value of @code{auto-knee-gap} plus the width of the
beam object  (which depends on the duration of the notes and the slope
of the beam). By default @code{auto-knee-gap} is set to 5.5 staff
spaces. 

"
  doctitle = "Changing beam knee gap"
} % begin verbatim

{
  f8 f''8 f8 f''8
  \override Beam #'auto-knee-gap = #6
  f8 f''8 f8 f''8
}
