<?xml version="1.0" encoding="iso-8859-1"?>
<!-- Generator: Adobe Illustrator 11 Build 196, SVG Export Plug-In . SVG Version: 6.0.0 Build 78)  -->
<!DOCTYPE svg PUBLIC "-//W3C//DTD SVG 1.0//EN"    "http://www.w3.org/TR/2001/REC-SVG-20010904/DTD/svg10.dtd" [
	<!ENTITY ns_flows "http://ns.adobe.com/Flows/1.0/">
	<!ENTITY ns_svg "http://www.w3.org/2000/svg">
	<!ENTITY ns_xlink "http://www.w3.org/1999/xlink">
]>
<svg  
	 width="148.043" height="166.619" viewBox="0 0 148.043 166.619"
	 style="overflow:visible;enable-background:new 0 0 148.043 166.619" xml:space="preserve">
	<style type="text/css">
	
	</style>
	<g id="Layer_1">
		
			<linearGradient id="XMLID_4_" gradientUnits="userSpaceOnUse" x1="82.0117" y1="141.1494" x2="82.5442" y2="160.0878" gradientTransform="matrix(1 0 0 1 -29.7185 -73)">
			<stop  offset="0" style="stop-color:#FFFFFF"/>
			<stop  offset="0.5" style="stop-color:#868686"/>
			<stop  offset="1" style="stop-color:#FFFFFF"/>
			<midPointStop  offset="0" style="stop-color:#FFFFFF"/>
			<midPointStop  offset="0.5" style="stop-color:#FFFFFF"/>
			<midPointStop  offset="0.5" style="stop-color:#868686"/>
			<midPointStop  offset="0.5" style="stop-color:#868686"/>
			<midPointStop  offset="1" style="stop-color:#FFFFFF"/>
		</linearGradient>
		<path style="fill:url(#XMLID_4_);" d="M21.896,70.737v0.375c-1.652,0.413-2.937,3.556-2.937,7.375s1.285,6.962,2.937,7.375v0.125
			h64.102v-15.25H21.896z"/>
		<polygon style="fill:#FFFFFF;stroke:#000000;stroke-width:0.5;" points="91.335,85.262 91.335,65.887 83.059,72.712 
			83.059,92.087 "/>
		<linearGradient id="XMLID_5_" gradientUnits="userSpaceOnUse" x1="104.5771" y1="93.7373" x2="104.5771" y2="71.7373">
			<stop  offset="0" style="stop-color:#FFFFFF"/>
			<stop  offset="0.5" style="stop-color:#868686"/>
			<stop  offset="1" style="stop-color:#FFFFFF"/>
			<midPointStop  offset="0" style="stop-color:#FFFFFF"/>
			<midPointStop  offset="0.5" style="stop-color:#FFFFFF"/>
			<midPointStop  offset="0.5" style="stop-color:#868686"/>
			<midPointStop  offset="0.5" style="stop-color:#868686"/>
			<midPointStop  offset="1" style="stop-color:#FFFFFF"/>
		</linearGradient>
		<polygon style="fill:url(#XMLID_5_);" points="86.072,80.336 122.708,80.697 123.083,74.697 86.072,76.405 "/>
		
			<radialGradient id="XMLID_6_" cx="51.8218" cy="168.2373" r="7.957" fx="51.8218" fy="168.2373" gradientTransform="matrix(0 -0.75 0.75 0 -2.533 117.3131)" gradientUnits="userSpaceOnUse">
			<stop  offset="0" style="stop-color:#000000"/>
			<stop  offset="1" style="stop-color:#ECECEC"/>
			<midPointStop  offset="0" style="stop-color:#000000"/>
			<midPointStop  offset="0.5" style="stop-color:#000000"/>
			<midPointStop  offset="1" style="stop-color:#ECECEC"/>
		</radialGradient>
		<ellipse style="fill:url(#XMLID_6_);" cx="123.645" cy="78.447" rx="6.099" ry="5.833"/> 
		<path style="fill:none;stroke:#000000;stroke-width:0.5;" d="M22.114,88.205c0,0-0.958,33.282,0,36.032s6.958,2.5,8.208,6.75"/>
		<path style="fill:none;stroke:#000000;stroke-width:0.5;" d="M87.455,88.705c0,0,1.383,31.782,0,35.282s-11.383,3.75-10.883,6.5"
			/>
		<g>
			<text transform="matrix(1 0 0 1 92 129.6021)"><tspan x="0" y="0" style="font-family:Bitstream Vera Sans; font-size:7.650000;">light emitted</tspan></text>
			<text transform="matrix(1 0 0 1 92 140.6021)"><tspan x="0" y="0" style="font-family:Bitstream Vera Sans; font-size:7.650000;">when cathode</tspan></text>
			<text transform="matrix(1 0 0 1 92 151.6021)"><tspan x="0" y="0" style="font-family:Bitstream Vera Sans; font-size:7.650000;">rays hit the</tspan></text>
			<text transform="matrix(1 0 0 1 92 162.6021)"><tspan x="0" y="0" style="font-family:Bitstream Vera Sans; font-size:7.650000;">glass</tspan></text>
		</g>
		<ellipse style="fill:#B4B4B4;" cx="119.051" cy="78.611" rx="1.731" ry="1.094"/> 
		<g>
			<text transform="matrix(1 0 0 1 13.7041 65.333)"><tspan x="0" y="0" style="font-family:Bitstream Vera Sans; font-size:7.650000;">cathode</tspan></text>
		</g>
		<g>
			<text transform="matrix(1 0 0 1 81.2041 65.333)"><tspan x="0" y="0" style="font-family:Bitstream Vera Sans; font-size:7.650000;">anode</tspan></text>
		</g>
		<g>
			<text transform="matrix(1 0 0 1 38.0376 9)"><tspan x="0" y="0" style="font-family:Bitstream Vera Sans; font-size:7.650000;">light emitted</tspan></text>
			<text transform="matrix(1 0 0 1 38.0376 20)"><tspan x="0" y="0" style="font-family:Bitstream Vera Sans; font-size:7.650000;">when cathode</tspan></text>
			<text transform="matrix(1 0 0 1 38.0376 31)"><tspan x="0" y="0" style="font-family:Bitstream Vera Sans; font-size:7.650000;">rays hit air</tspan></text>
			<text transform="matrix(1 0 0 1 38.0376 42)"><tspan x="0" y="0" style="font-family:Bitstream Vera Sans; font-size:7.650000;">molecules</tspan></text>
		</g>
		<path style="fill:none;stroke:#000000;" d="M105.374,57.303H16.322v0.128C7.422,58.499,0.5,66.593,0.5,76.429
			c0,9.836,6.922,17.93,15.822,18.998v0.061h2.028v20.142c0,2.124,1.721,3.845,3.845,3.845s3.845-1.721,3.845-3.845h0.093V95.487
			H83.53v20.142c0,2.124,1.721,3.845,3.845,3.845s3.845-1.721,3.845-3.845h0.093V95.487h14.062c10.544,0,19.092-8.548,19.092-19.092
			C124.466,65.851,115.918,57.303,105.374,57.303z"/>
		<g>
			<g>
				<text transform="matrix(1 0 0 1 20.4536 74.6733)"><tspan x="0" y="0" style="font-family:Bitstream Vera Sans; font-size:7.650000;">&#x2013;</tspan></text>
			</g>
			<g>
				<text transform="matrix(1 0 0 1 19.2036 87.1733)"><tspan x="0" y="0" style="font-family:Bitstream Vera Sans; font-size:7.650000;">&#x2013;</tspan></text>
			</g>
			<g>
				<text transform="matrix(1 0 0 1 20.9536 83.6733)"><tspan x="0" y="0" style="font-family:Bitstream Vera Sans; font-size:7.650000;">&#x2013;</tspan></text>
			</g>
			<g>
				<text transform="matrix(1 0 0 1 18.4536 78.6733)"><tspan x="0" y="0" style="font-family:Bitstream Vera Sans; font-size:7.650000;">&#x2013;</tspan></text>
			</g>
			<polygon style="fill:none;stroke:#000000;stroke-width:0.5;" points="25.91,84.787 25.91,65.412 17.634,72.237 17.634,91.612 "/>
		</g>
		<g>
			<text transform="matrix(1 0 0 1 85.3916 75.6455)"><tspan x="0" y="0" style="font-family:Bitstream Vera Sans; font-size:7.650000;">+</tspan></text>
		</g>
		<g>
			<text transform="matrix(1 0 0 1 83.1416 87.8955)"><tspan x="0" y="0" style="font-family:Bitstream Vera Sans; font-size:7.650000;">+</tspan></text>
		</g>
		<ellipse style="fill:none;stroke:#000000;stroke-width:0.5;" cx="87.822" cy="78.612" rx="1.653" ry="2.855"/> 
		<g>
			<path style="fill:none;stroke:#000000;stroke-width:0.3;" d="M86.384,35.175c13,8.5,24,17.5,22,37"/>
			<path d="M108.196,73.976c-0.228-0.88-0.656-1.986-1.157-2.696l1.366,0.659l1.472-0.368
				C109.242,72.164,108.597,73.161,108.196,73.976z"/>
		</g>
		<g>
			<path style="fill:none;stroke:#000000;stroke-width:0.3;" d="M53.322,44.487c-5.5,11-1.5,21,0.5,25"/>
			<path d="M54.63,71.104c-0.664-0.621-1.619-1.325-2.423-1.656l1.507-0.177l1.045-1.099C54.542,69.014,54.532,70.201,54.63,71.104z
				"/>
		</g>
		<g>
			<path style="fill:none;stroke:#000000;stroke-width:0.3;" d="M110.822,121.487c0.5-12,14-25,14.5-35"/>
			<path d="M125.416,84.68c0.273,0.867,0.759,1.949,1.297,2.632l-1.399-0.587l-1.45,0.444
				C124.466,86.544,125.057,85.515,125.416,84.68z"/>
		</g>
	</g>
</svg>
