<?xml version="1.0" encoding="UTF-8" standalone="no"?>
<!-- Generator: Adobe Illustrator 11 Build 196, SVG Export Plug-In . SVG Version: 6.0.0 Build 78)  -->
<svg
   xmlns:dc="http://purl.org/dc/elements/1.1/"
   xmlns:cc="http://web.resource.org/cc/"
   xmlns:rdf="http://www.w3.org/1999/02/22-rdf-syntax-ns#"
   xmlns:svg="http://www.w3.org/2000/svg"
   xmlns="http://www.w3.org/2000/svg"
   xmlns:sodipodi="http://inkscape.sourceforge.net/DTD/sodipodi-0.dtd"
   xmlns:inkscape="http://www.inkscape.org/namespaces/inkscape"
   width="140.07"
   height="83.275"
   viewBox="0 0 140.07 83.275"
   style="overflow:visible;enable-background:new 0 0 140.07 83.275"
   xml:space="preserve"
   id="svg2"
   sodipodi:version="0.32"
   inkscape:version="0.42.2"
   sodipodi:docname="refr-t-reversal.svg"
   sodipodi:docbase="/home/bcrowell/Documents/writing/lm/trunk/5op/ch04/figs"><metadata
   id="metadata82"><rdf:RDF><cc:Work
       rdf:about=""><dc:format>image/svg+xml</dc:format><dc:type
         rdf:resource="http://purl.org/dc/dcmitype/StillImage" /></cc:Work></rdf:RDF></metadata><defs
   id="defs80">
		
		
		
		
		
		
		
		
		
		
		
		
	</defs><sodipodi:namedview
   inkscape:cy="23.192843"
   inkscape:cx="105.36177"
   inkscape:zoom="1.6594578"
   inkscape:window-height="510"
   inkscape:window-width="712"
   inkscape:pageshadow="2"
   inkscape:pageopacity="0.0"
   borderopacity="1.0"
   bordercolor="#666666"
   pagecolor="#ffffff"
   id="base"
   inkscape:window-x="221"
   inkscape:window-y="221"
   inkscape:current-layer="svg2" />
	<style
   type="text/css"
   id="style4">
	
	</style>
	<rect
   style="fill:#dedede;fill-opacity:1.0000000;fill-rule:evenodd;stroke:none;stroke-width:1.0000000pt;stroke-linecap:butt;stroke-linejoin:miter;stroke-opacity:1.0000000;overflow:visible"
   id="rect2144"
   width="184.25197"
   height="41.154251"
   x="-17.224304"
   y="-4.6566253" /><rect
   style="fill:#aaaaaa;fill-opacity:1.0000000;fill-rule:evenodd;stroke:none;stroke-width:1.0000000pt;stroke-linecap:butt;stroke-linejoin:miter;stroke-opacity:1.0000000"
   id="rect1380"
   width="184.25197"
   height="48.988136"
   x="-17.250816"
   y="36.437908" /><line
   id="line7"
   y2="36.480999"
   x2="165.96967"
   y1="36.480999"
   x1="-17.277954"
   style="fill:none;stroke:#000000" /><g
   id="g9"
   transform="translate(-10.000000,-6.064593e-15)">
			<text
   id="text11"
   transform="translate(6.936000,32.22800)"><tspan
     id="tspan13"
     style="font-size:7.6500001px;font-family:Bitstream Vera Sans"
     y="0"
     x="0">air</tspan></text>

		</g><line
   id="line15"
   y2="36.868000"
   x2="33.949001"
   y1="57.410000"
   x1="39.452999"
   style="fill:#b4b4b4;stroke:#000000" /><g
   id="g17">
			<line
   id="line19"
   y2="22.673000"
   x2="25.997999"
   y1="36.402000"
   x1="33.924000"
   style="fill:#b4b4b4;stroke:#000000" />
			<path
   id="path21"
   d="M 25.122000,21.159000 C 25.798000,21.720000 26.761000,22.344000 27.555000,22.616000 L 26.112000,22.873000 L 25.167000,23.995000 C 25.328000,23.171000 25.269000,22.025000 25.122000,21.159000 z " />
		</g><polygon
   id="polygon23"
   points="42.266000,81.281000 48.540000,79.600000 43.497000,60.776000 45.774000,55.682000 32.474000,59.246000 37.240000,62.522000 42.266000,81.281000 "
   style="fill:#b4b4b4;stroke:#000000" /><g
   id="g25">
			<line
   id="line27"
   y2="37.245998"
   x2="53.641998"
   y1="57.787998"
   x1="59.146000"
   style="fill:#b4b4b4;stroke:#000000" />
			<path
   id="path29"
   d="M 59.601000,59.479000 C 59.093000,58.763000 58.325000,57.911000 57.627000,57.442000 L 59.088000,57.567000 L 60.291000,56.729000 C 59.922000,57.483000 59.683000,58.605000 59.601000,59.479000 z " />
		</g><g
   id="g31">
			<line
   id="line33"
   y2="22.308001"
   x2="45.250999"
   y1="36.036999"
   x1="53.176998"
   style="fill:#b4b4b4;stroke:#000000" />
			<polygon
   id="polygon35"
   points="33.956000,0.69600000 28.634000,4.4220000 39.811000,20.385000 39.413000,25.951000 50.692000,18.054000 45.093000,16.604000 33.956000,0.69600000 "
   style="fill:#b4b4b4;stroke:#000000" />
		</g><g
   id="g37"
   transform="translate(20.00000,-6.064593e-15)">
			<line
   id="line39"
   y2="36.824001"
   x2="91.580002"
   y1="60.933998"
   x1="105.50000"
   style="fill:#b4b4b4;stroke:#000000" />
			<g
   id="g41">
				<line
   id="line43"
   y2="21.148001"
   x2="65.178001"
   y1="36.035000"
   x1="90.962997"
   style="fill:#b4b4b4;stroke:#000000" />
				<path
   id="path45"
   d="M 63.663000,20.272000 C 64.529000,20.419000 65.675000,20.479000 66.499000,20.317000 L 65.377000,21.262000 L 65.120000,22.705000 C 64.848000,21.912000 64.223000,20.949000 63.663000,20.272000 z " />
			</g>
			<polygon
   id="polygon47"
   points="114.54200,82.592000 120.16700,79.344000 110.42300,62.468000 111.30500,56.958000 99.380000,63.843000 104.83200,65.774000 114.54200,82.592000 "
   style="fill:#b4b4b4;stroke:#000000" />
		</g><g
   id="g49"
   transform="translate(20.00000,-6.064593e-15)">
			<g
   id="g51">
				<line
   id="line53"
   y2="36.651001"
   x2="114.87000"
   y1="60.761002"
   x1="128.78999"
   style="fill:#b4b4b4;stroke:#000000" />
				<path
   id="path55"
   d="M 129.66500,62.277000 C 128.98900,61.716000 128.02600,61.092000 127.23100,60.820000 L 128.67500,60.563000 L 129.62000,59.441000 C 129.45800,60.265000 129.51800,61.411000 129.66500,62.277000 z " />
			</g>
			<line
   id="line57"
   y2="20.975000"
   x2="88.469002"
   y1="35.861000"
   x1="114.25300"
   style="fill:#b4b4b4;stroke:#000000" />
			<polygon
   id="polygon59"
   points="69.250000,6.0940000 66.002000,11.719000 82.879000,21.464000 84.870000,26.676000 91.755000,14.751000 86.069000,15.804000 69.250000,6.0940000 "
   style="fill:#b4b4b4;stroke:#000000" />
		</g><g
   id="g61"
   transform="translate(-10.000000,-6.064593e-15)">
			<text
   id="text63"
   transform="translate(3.755900,45.34470)"><tspan
     id="tspan65"
     style="font-size:7.6500001px;font-family:Bitstream Vera Sans"
     y="0"
     x="0">water</tspan></text>

		</g><g
   id="g67">
			<path
   id="path69"
   d="M 86.294000,67.524000 L 87.751000,61.477000 L 84.139000,63.094000 C 83.476000,62.318000 81.706000,61.762000 79.627000,61.762000 C 76.981000,61.762000 74.835000,62.661000 74.835000,63.771000 C 74.835000,64.710000 76.373000,65.499000 78.450000,65.719000 C 79.039000,66.556000 79.793000,66.663000 80.028000,66.722000 C 80.189000,66.762000 79.994000,66.248000 79.788000,65.779000 C 81.096000,65.761000 82.270000,65.523000 83.109000,65.151000 L 86.294000,67.524000 z "
   style="fill:#b4b4b4;stroke:#000000" />
			<ellipse
   sodipodi:ry="0.25799999"
   sodipodi:rx="0.30899999"
   sodipodi:cy="63.116001"
   sodipodi:cx="76.602997"
   id="ellipse71"
   ry="0.25799999"
   rx="0.30899999"
   cy="63.116001"
   cx="76.602997"
   style="fill:#ffffff;stroke:#000000" /> 
		</g><g
   id="g73">
			<path
   id="path75"
   d="M 70.856000,58.132000 L 69.399000,52.085000 L 73.012000,53.703000 C 73.675000,52.927000 75.444000,52.371000 77.523000,52.371000 C 80.169000,52.371000 82.315000,53.270000 82.315000,54.380000 C 82.315000,55.319000 80.777000,56.108000 78.700000,56.328000 C 78.111000,57.165000 77.357000,57.272000 77.123000,57.331000 C 76.962000,57.371000 77.156000,56.857000 77.362000,56.388000 C 76.055000,56.370000 74.880000,56.132000 74.041000,55.760000 L 70.856000,58.132000 z "
   style="fill:#b4b4b4;stroke:#000000" />
			<ellipse
   sodipodi:ry="0.25799999"
   sodipodi:rx="0.30899999"
   sodipodi:cy="53.723999"
   sodipodi:cx="80.546997"
   id="ellipse77"
   ry="0.25799999"
   rx="0.30899999"
   cy="53.723999"
   cx="80.546997"
   style="fill:#ffffff;stroke:#000000" /> 
		</g>
</svg>