<?xml version="1.0" encoding="UTF-8" standalone="no"?>
<!-- Generator: Adobe Illustrator 11 Build 196, SVG Export Plug-In . SVG Version: 6.0.0 Build 78)  -->
<svg
   xmlns:dc="http://purl.org/dc/elements/1.1/"
   xmlns:cc="http://web.resource.org/cc/"
   xmlns:rdf="http://www.w3.org/1999/02/22-rdf-syntax-ns#"
   xmlns:svg="http://www.w3.org/2000/svg"
   xmlns="http://www.w3.org/2000/svg"
   xmlns:sodipodi="http://inkscape.sourceforge.net/DTD/sodipodi-0.dtd"
   xmlns:inkscape="http://www.inkscape.org/namespaces/inkscape"
   width="132.113"
   height="62.71"
   viewBox="0 0 132.113 62.71"
   style="overflow:visible;enable-background:new 0 0 132.113 62.71"
   xml:space="preserve"
   id="svg2"
   sodipodi:version="0.32"
   inkscape:version="0.42.2"
   sodipodi:docname="dq-seasons.svg"
   sodipodi:docbase="/home/bcrowell/Documents/writing/lm/trunk/5op/ch01/figs"><metadata
   id="metadata88"><rdf:RDF><cc:Work
       rdf:about=""><dc:format>image/svg+xml</dc:format><dc:type
         rdf:resource="http://purl.org/dc/dcmitype/StillImage" /></cc:Work></rdf:RDF></metadata><defs
   id="defs86" /><sodipodi:namedview
   inkscape:cy="40.307873"
   inkscape:cx="70.250864"
   inkscape:zoom="2.3706425"
   inkscape:window-height="510"
   inkscape:window-width="712"
   inkscape:pageshadow="2"
   inkscape:pageopacity="0.0"
   borderopacity="1.0"
   bordercolor="#666666"
   pagecolor="#ffffff"
   id="base"
   inkscape:window-x="53"
   inkscape:window-y="53"
   inkscape:current-layer="svg2" />
	<style
   type="text/css"
   id="style4">
	
	</style>
	<rect
   style="fill:#dedede;fill-opacity:1.0000000;fill-rule:evenodd;stroke:none;stroke-width:1.0000000pt;stroke-linecap:butt;stroke-linejoin:miter;stroke-opacity:1.0000000"
   id="rect1386"
   width="184.25197"
   height="95.853630"
   x="-7.5928826"
   y="-23.863443" /><g
   id="Layer_1"
   transform="matrix(1.262415,0.000000,0.000000,1.262415,1.992485,-18.89130)">
		<g
   id="g7">
			<circle
   style="fill:none;stroke:#000000;stroke-width:0.50000000"
   cx="65.509003"
   cy="42.303001"
   r="20.152000"
   id="circle9"
   sodipodi:cx="65.509003"
   sodipodi:cy="42.303001"
   sodipodi:rx="20.152000"
   sodipodi:ry="20.152000" /> 
			<line
   style="fill:none;stroke:#000000;stroke-width:0.50000000"
   x1="46.984001"
   y1="34.438999"
   x2="84.033997"
   y2="50.167000"
   id="line11" />
		</g>
		<g
   id="g13">
			<g
   id="g15">
				<line
   style="fill:none;stroke:#000000;stroke-width:0.50000000"
   x1="0.0000000"
   y1="28.129999"
   x2="20.000000"
   y2="28.129999"
   id="line17" />
				<path
   d="M 23.018000,28.130000 C 21.598000,28.656000 19.836000,29.556000 18.745000,30.507000 L 19.605000,28.130000 L 18.745000,25.753000 C 19.836000,26.704000 21.598000,27.603000 23.018000,28.130000 z "
   id="path19" />
			</g>
			<g
   id="g21">
				<line
   style="fill:none;stroke:#000000;stroke-width:0.50000000"
   x1="0.0000000"
   y1="42.303001"
   x2="20.000000"
   y2="42.303001"
   id="line23" />
				<path
   d="M 23.018000,42.303000 C 21.598000,42.830000 19.836000,43.729000 18.745000,44.681000 L 19.605000,42.303000 L 18.745000,39.926000 C 19.836000,40.877000 21.598000,41.776000 23.018000,42.303000 z "
   id="path25" />
			</g>
			<g
   id="g27">
				<line
   style="fill:none;stroke:#000000;stroke-width:0.50000000"
   x1="0.0000000"
   y1="56.476002"
   x2="20.000000"
   y2="56.476002"
   id="line29" />
				<path
   d="M 23.018000,56.476000 C 21.598000,57.003000 19.836000,57.902000 18.745000,58.853000 L 19.605000,56.476000 L 18.745000,54.099000 C 19.836000,55.050000 21.598000,55.950000 23.018000,56.476000 z "
   id="path31" />
			</g>
		</g>
		<g
   id="g33">
			<g
   id="g35">
				<line
   style="fill:none;stroke:#000000;stroke-width:0.50000000"
   x1="131.01801"
   y1="28.129999"
   x2="111.01800"
   y2="28.129999"
   id="line37" />
				<path
   d="M 108.00000,28.130000 C 109.42000,28.656000 111.18200,29.556000 112.27300,30.507000 L 111.41300,28.130000 L 112.27300,25.753000 C 111.18200,26.704000 109.42000,27.603000 108.00000,28.130000 z "
   id="path39" />
			</g>
			<g
   id="g41">
				<line
   style="fill:none;stroke:#000000;stroke-width:0.50000000"
   x1="131.01801"
   y1="42.303001"
   x2="111.01800"
   y2="42.303001"
   id="line43" />
				<path
   d="M 108.00000,42.303000 C 109.42000,42.830000 111.18200,43.729000 112.27300,44.681000 L 111.41300,42.303000 L 112.27300,39.926000 C 111.18200,40.877000 109.42000,41.776000 108.00000,42.303000 z "
   id="path45" />
			</g>
			<g
   id="g47">
				<line
   style="fill:none;stroke:#000000;stroke-width:0.50000000"
   x1="131.01801"
   y1="56.476002"
   x2="111.01800"
   y2="56.476002"
   id="line49" />
				<path
   d="M 108.00000,56.476000 C 109.42000,57.003000 111.18200,57.902000 112.27300,58.853000 L 111.41300,56.476000 L 112.27300,54.099000 C 111.18200,55.050000 109.42000,55.950000 108.00000,56.476000 z "
   id="path51" />
			</g>
		</g>
		<g
   id="g53">
			<text
   transform="translate(1.000000,10.00000)"
   id="text55"><tspan
     x="0"
     y="0"
     style="font-size:8.5000000px;font-family:Bitstream Vera Sans"
     id="tspan57">winter</tspan></text>

		</g>
		<g
   id="g59">
			<text
   transform="translate(96.00000,10.00000)"
   id="text61"><tspan
     x="0"
     y="0"
     style="font-size:8.5000000px;font-family:Bitstream Vera Sans"
     id="tspan63">summer</tspan></text>

		</g>
		<g
   id="g65">
			<polyline
   style="fill:none;stroke:#000000;stroke-width:0.50000000"
   points="53.916,25.204 54.75,23 52.833,18.746 "
   id="polyline67" />
			<line
   style="fill:none;stroke:#000000;stroke-width:0.50000000"
   x1="52.319000"
   y1="21.308001"
   x2="55.111000"
   y2="20.049000"
   id="line69" />
			<line
   style="fill:none;stroke:#000000;stroke-width:0.50000000"
   x1="54.750000"
   y1="23.000000"
   x2="56.737999"
   y2="24.115000"
   id="line71" />
			
				<ellipse
   transform="matrix(0.410800,0.911700,-0.911700,0.410800,47.13610,-37.23050)"
   style="fill:none;stroke:#000000;stroke-width:0.50000000"
   cx="52.374001"
   cy="17.855000"
   rx="1.3260000"
   ry="1.1930000"
   id="ellipse73"
   sodipodi:cx="52.374001"
   sodipodi:cy="17.855000"
   sodipodi:rx="1.3260000"
   sodipodi:ry="1.1930000" /> 
		</g>
		<g
   id="g75">
			<polyline
   style="fill:none;stroke:#000000;stroke-width:0.50000000"
   points="82.708,32.503 84.998,33.063 88.987,30.643 "
   id="polyline77" />
			<line
   style="fill:none;stroke:#000000;stroke-width:0.50000000"
   x1="86.382004"
   y1="30.444000"
   x2="87.971001"
   y2="33.062000"
   id="line79" />
			<line
   style="fill:none;stroke:#000000;stroke-width:0.50000000"
   x1="84.998001"
   y1="33.063000"
   x2="84.133003"
   y2="35.172001"
   id="line81" />
			
				<ellipse
   transform="matrix(-0.854900,0.518800,-0.518800,-0.854900,182.2033,9.197400)"
   style="fill:none;stroke:#000000;stroke-width:0.50000000"
   cx="89.815002"
   cy="30.079000"
   rx="1.3260000"
   ry="1.1930000"
   id="ellipse83"
   sodipodi:cx="89.815002"
   sodipodi:cy="30.079000"
   sodipodi:rx="1.3260000"
   sodipodi:ry="1.1930000" /> 
		</g>
	</g>
</svg>