<?xml version="1.0" encoding="UTF-8" standalone="no"?>
<!-- Created with Inkscape (http://www.inkscape.org/) -->
<svg
   xmlns:dc="http://purl.org/dc/elements/1.1/"
   xmlns:cc="http://creativecommons.org/ns#"
   xmlns:rdf="http://www.w3.org/1999/02/22-rdf-syntax-ns#"
   xmlns:svg="http://www.w3.org/2000/svg"
   xmlns="http://www.w3.org/2000/svg"
   xmlns:sodipodi="http://sodipodi.sourceforge.net/DTD/sodipodi-0.dtd"
   xmlns:inkscape="http://www.inkscape.org/namespaces/inkscape"
   width="744.09448819"
   height="1052.3622047"
   id="svg2802"
   sodipodi:version="0.32"
   inkscape:version="0.46"
   sodipodi:docname="area-proof.svg"
   inkscape:output_extension="org.inkscape.output.svg.inkscape">
  <defs
     id="defs2804">
    <inkscape:perspective
       sodipodi:type="inkscape:persp3d"
       inkscape:vp_x="0 : 526.18109 : 1"
       inkscape:vp_y="0 : 1000 : 0"
       inkscape:vp_z="744.09448 : 526.18109 : 1"
       inkscape:persp3d-origin="372.04724 : 350.78739 : 1"
       id="perspective2810" />
  </defs>
  <sodipodi:namedview
     id="base"
     pagecolor="#ffffff"
     bordercolor="#666666"
     borderopacity="1.0"
     gridtolerance="10000"
     guidetolerance="10"
     objecttolerance="10"
     inkscape:pageopacity="0.0"
     inkscape:pageshadow="2"
     inkscape:zoom="0.89104106"
     inkscape:cx="473.35291"
     inkscape:cy="564.17442"
     inkscape:document-units="px"
     inkscape:current-layer="layer1"
     showgrid="false"
     inkscape:window-width="1278"
     inkscape:window-height="996"
     inkscape:window-x="3"
     inkscape:window-y="7" />
  <metadata
     id="metadata2807">
    <rdf:RDF>
      <cc:Work
         rdf:about="">
        <dc:format>image/svg+xml</dc:format>
        <dc:type
           rdf:resource="http://purl.org/dc/dcmitype/StillImage" />
      </cc:Work>
    </rdf:RDF>
  </metadata>
  <g
     inkscape:label="Layer 1"
     inkscape:groupmode="layer"
     id="layer1">
    <rect
       style="fill:#929292;fill-opacity:1;stroke:none;stroke-width:1;stroke-miterlimit:4;stroke-dasharray:none"
       id="rect2981"
       width="89.86573"
       height="89.841759"
       x="176.49991"
       y="455.60345" />
    <path
       style="opacity:1;fill:#929292;fill-opacity:1;fill-rule:evenodd;stroke:none;stroke-width:1px;stroke-linecap:butt;stroke-linejoin:miter;marker:none;marker-start:none;marker-mid:none;marker-end:none;stroke-miterlimit:4;stroke-dasharray:none;stroke-dashoffset:0;stroke-opacity:1;visibility:visible;display:inline;overflow:visible;enable-background:accumulate"
       d="M 302.75336,544.35779 L 330.1799,442.39563 L 433.11006,414.32377 L 406.65153,516.28593 L 302.75336,544.35779 z"
       id="path2448" />
    <g
       id="g3319"
       transform="matrix(0.8946449,0,0,0.8946449,76.118743,42.761432)">
      <path
         id="path3220"
         d="M 419.09011,559.51654 L 449.74645,445.54712 L 564.79786,414.16946 L 535.22352,528.13888 L 419.09011,559.51654 z"
         style="opacity:1;fill:#929292;fill-opacity:1;fill-rule:evenodd;stroke:none;stroke-width:1px;stroke-linecap:butt;stroke-linejoin:miter;marker:none;marker-start:none;marker-mid:none;marker-end:none;stroke-miterlimit:4;stroke-dasharray:none;stroke-dashoffset:0;stroke-opacity:1;visibility:visible;display:inline;overflow:visible;enable-background:accumulate" />
      <g
         id="g3276">
        <path
           style="fill:none;fill-opacity:1;fill-rule:evenodd;stroke:#ffffff;stroke-width:1px;stroke-linecap:butt;stroke-linejoin:miter;marker:none;marker-start:none;marker-mid:none;marker-end:none;stroke-miterlimit:4;stroke-dasharray:none;stroke-dashoffset:0;stroke-opacity:1;visibility:visible;display:inline;overflow:visible;enable-background:accumulate"
           d="M 448.22811,447.56501 L 448.22811,554.62223"
           id="path3222"
           sodipodi:nodetypes="cc" />
        <path
           style="fill:none;fill-opacity:1;fill-rule:evenodd;stroke:#ffffff;stroke-width:1px;stroke-linecap:butt;stroke-linejoin:miter;marker:none;marker-start:none;marker-mid:none;marker-end:none;stroke-miterlimit:4;stroke-dasharray:none;stroke-dashoffset:0;stroke-opacity:1;visibility:visible;display:inline;overflow:visible;enable-background:accumulate"
           d="M 458.7351,441.47644 L 458.7351,551.07057"
           id="path3224"
           sodipodi:nodetypes="cc" />
        <path
           style="fill:none;fill-opacity:1;fill-rule:evenodd;stroke:#ffffff;stroke-width:1px;stroke-linecap:butt;stroke-linejoin:miter;marker:none;marker-start:none;marker-mid:none;marker-end:none;stroke-miterlimit:4;stroke-dasharray:none;stroke-dashoffset:0;stroke-opacity:1;visibility:visible;display:inline;overflow:visible;enable-background:accumulate"
           d="M 469.24208,438.17847 L 469.24208,547.7726"
           id="path3226"
           sodipodi:nodetypes="cc" />
        <path
           style="fill:none;fill-opacity:1;fill-rule:evenodd;stroke:#ffffff;stroke-width:1px;stroke-linecap:butt;stroke-linejoin:miter;marker:none;marker-start:none;marker-mid:none;marker-end:none;stroke-miterlimit:4;stroke-dasharray:none;stroke-dashoffset:0;stroke-opacity:1;visibility:visible;display:inline;overflow:visible;enable-background:accumulate"
           d="M 479.74911,435.38788 L 479.74911,544.98201"
           id="path3228"
           sodipodi:nodetypes="cc" />
        <path
           style="fill:none;fill-opacity:1;fill-rule:evenodd;stroke:#ffffff;stroke-width:1px;stroke-linecap:butt;stroke-linejoin:miter;marker:none;marker-start:none;marker-mid:none;marker-end:none;stroke-miterlimit:4;stroke-dasharray:none;stroke-dashoffset:0;stroke-opacity:1;visibility:visible;display:inline;overflow:visible;enable-background:accumulate"
           d="M 490.2561,432.3436 L 490.2561,541.93773"
           id="path3230"
           sodipodi:nodetypes="cc" />
        <path
           style="fill:none;fill-opacity:1;fill-rule:evenodd;stroke:#ffffff;stroke-width:1px;stroke-linecap:butt;stroke-linejoin:miter;marker:none;marker-start:none;marker-mid:none;marker-end:none;stroke-miterlimit:4;stroke-dasharray:none;stroke-dashoffset:0;stroke-opacity:1;visibility:visible;display:inline;overflow:visible;enable-background:accumulate"
           d="M 500.76313,429.04563 L 500.76313,538.63976"
           id="path3232"
           sodipodi:nodetypes="cc" />
        <path
           style="fill:none;fill-opacity:1;fill-rule:evenodd;stroke:#ffffff;stroke-width:1px;stroke-linecap:butt;stroke-linejoin:miter;marker:none;marker-start:none;marker-mid:none;marker-end:none;stroke-miterlimit:4;stroke-dasharray:none;stroke-dashoffset:0;stroke-opacity:1;visibility:visible;display:inline;overflow:visible;enable-background:accumulate"
           d="M 511.2701,426.76242 L 511.2701,536.35655"
           id="path3234"
           sodipodi:nodetypes="cc" />
        <path
           style="fill:none;fill-opacity:1;fill-rule:evenodd;stroke:#ffffff;stroke-width:1px;stroke-linecap:butt;stroke-linejoin:miter;marker:none;marker-start:none;marker-mid:none;marker-end:none;stroke-miterlimit:4;stroke-dasharray:none;stroke-dashoffset:0;stroke-opacity:1;visibility:visible;display:inline;overflow:visible;enable-background:accumulate"
           d="M 521.77708,423.46445 L 521.77708,533.05858"
           id="path3236"
           sodipodi:nodetypes="cc" />
        <path
           style="fill:none;fill-opacity:1;fill-rule:evenodd;stroke:#ffffff;stroke-width:1px;stroke-linecap:butt;stroke-linejoin:miter;marker:none;marker-start:none;marker-mid:none;marker-end:none;stroke-miterlimit:4;stroke-dasharray:none;stroke-dashoffset:0;stroke-opacity:1;visibility:visible;display:inline;overflow:visible;enable-background:accumulate"
           d="M 532.28414,420.42016 L 532.28414,530.01429"
           id="path3238"
           sodipodi:nodetypes="cc" />
        <path
           style="fill:none;fill-opacity:1;fill-rule:evenodd;stroke:#ffffff;stroke-width:1px;stroke-linecap:butt;stroke-linejoin:miter;marker:none;marker-start:none;marker-mid:none;marker-end:none;stroke-miterlimit:4;stroke-dasharray:none;stroke-dashoffset:0;stroke-opacity:1;visibility:visible;display:inline;overflow:visible;enable-background:accumulate"
           d="M 542.7911,416.36112 L 542.7911,502.61576"
           id="path3240"
           sodipodi:nodetypes="cc" />
        <path
           style="fill:none;fill-opacity:1;fill-rule:evenodd;stroke:#ffffff;stroke-width:1px;stroke-linecap:butt;stroke-linejoin:miter;marker:none;marker-start:none;marker-mid:none;marker-end:none;stroke-miterlimit:4;stroke-dasharray:none;stroke-dashoffset:0;stroke-opacity:1;visibility:visible;display:inline;overflow:visible;enable-background:accumulate"
           d="M 553.29809,411.54101 L 553.29809,466.59177"
           id="path3242"
           sodipodi:nodetypes="cc" />
        <path
           style="fill:none;fill-opacity:1;fill-rule:evenodd;stroke:#ffffff;stroke-width:1px;stroke-linecap:butt;stroke-linejoin:miter;marker:none;marker-start:none;marker-mid:none;marker-end:none;stroke-miterlimit:4;stroke-dasharray:none;stroke-dashoffset:0;stroke-opacity:1;visibility:visible;display:inline;overflow:visible;enable-background:accumulate"
           d="M 437.72111,487.90173 L 437.72111,557.66651"
           id="path3244"
           sodipodi:nodetypes="cc" />
        <path
           style="fill:none;fill-opacity:1;fill-rule:evenodd;stroke:#ffffff;stroke-width:1px;stroke-linecap:butt;stroke-linejoin:miter;marker:none;marker-start:none;marker-mid:none;marker-end:none;stroke-miterlimit:4;stroke-dasharray:none;stroke-dashoffset:0;stroke-opacity:1;visibility:visible;display:inline;overflow:visible;enable-background:accumulate"
           d="M 427.21411,520.37406 L 427.21411,561.97924"
           id="path3246"
           sodipodi:nodetypes="cc" />
      </g>
      <g
         transform="matrix(0,-1,-1,0,980.86147,977.39679)"
         id="g3291">
        <path
           style="fill:none;fill-opacity:1;fill-rule:evenodd;stroke:#ffffff;stroke-width:1px;stroke-linecap:butt;stroke-linejoin:miter;marker:none;marker-start:none;marker-mid:none;marker-end:none;stroke-miterlimit:4;stroke-dasharray:none;stroke-dashoffset:0;stroke-opacity:1;visibility:visible;display:inline;overflow:visible;enable-background:accumulate"
           d="M 448.22811,447.56501 L 448.22811,554.62223"
           id="path3293"
           sodipodi:nodetypes="cc" />
        <path
           style="fill:none;fill-opacity:1;fill-rule:evenodd;stroke:#ffffff;stroke-width:1px;stroke-linecap:butt;stroke-linejoin:miter;marker:none;marker-start:none;marker-mid:none;marker-end:none;stroke-miterlimit:4;stroke-dasharray:none;stroke-dashoffset:0;stroke-opacity:1;visibility:visible;display:inline;overflow:visible;enable-background:accumulate"
           d="M 458.7351,441.47644 L 458.7351,551.07057"
           id="path3295"
           sodipodi:nodetypes="cc" />
        <path
           style="fill:none;fill-opacity:1;fill-rule:evenodd;stroke:#ffffff;stroke-width:1px;stroke-linecap:butt;stroke-linejoin:miter;marker:none;marker-start:none;marker-mid:none;marker-end:none;stroke-miterlimit:4;stroke-dasharray:none;stroke-dashoffset:0;stroke-opacity:1;visibility:visible;display:inline;overflow:visible;enable-background:accumulate"
           d="M 469.24208,438.17847 L 469.24208,547.7726"
           id="path3297"
           sodipodi:nodetypes="cc" />
        <path
           style="fill:none;fill-opacity:1;fill-rule:evenodd;stroke:#ffffff;stroke-width:1px;stroke-linecap:butt;stroke-linejoin:miter;marker:none;marker-start:none;marker-mid:none;marker-end:none;stroke-miterlimit:4;stroke-dasharray:none;stroke-dashoffset:0;stroke-opacity:1;visibility:visible;display:inline;overflow:visible;enable-background:accumulate"
           d="M 479.74911,435.38788 L 479.74911,544.98201"
           id="path3299"
           sodipodi:nodetypes="cc" />
        <path
           style="fill:none;fill-opacity:1;fill-rule:evenodd;stroke:#ffffff;stroke-width:1px;stroke-linecap:butt;stroke-linejoin:miter;marker:none;marker-start:none;marker-mid:none;marker-end:none;stroke-miterlimit:4;stroke-dasharray:none;stroke-dashoffset:0;stroke-opacity:1;visibility:visible;display:inline;overflow:visible;enable-background:accumulate"
           d="M 490.2561,432.3436 L 490.2561,541.93773"
           id="path3301"
           sodipodi:nodetypes="cc" />
        <path
           style="fill:none;fill-opacity:1;fill-rule:evenodd;stroke:#ffffff;stroke-width:1px;stroke-linecap:butt;stroke-linejoin:miter;marker:none;marker-start:none;marker-mid:none;marker-end:none;stroke-miterlimit:4;stroke-dasharray:none;stroke-dashoffset:0;stroke-opacity:1;visibility:visible;display:inline;overflow:visible;enable-background:accumulate"
           d="M 500.76313,429.04563 L 500.76313,538.63976"
           id="path3303"
           sodipodi:nodetypes="cc" />
        <path
           style="fill:none;fill-opacity:1;fill-rule:evenodd;stroke:#ffffff;stroke-width:1px;stroke-linecap:butt;stroke-linejoin:miter;marker:none;marker-start:none;marker-mid:none;marker-end:none;stroke-miterlimit:4;stroke-dasharray:none;stroke-dashoffset:0;stroke-opacity:1;visibility:visible;display:inline;overflow:visible;enable-background:accumulate"
           d="M 511.2701,426.76242 L 511.2701,536.35655"
           id="path3305"
           sodipodi:nodetypes="cc" />
        <path
           style="fill:none;fill-opacity:1;fill-rule:evenodd;stroke:#ffffff;stroke-width:1px;stroke-linecap:butt;stroke-linejoin:miter;marker:none;marker-start:none;marker-mid:none;marker-end:none;stroke-miterlimit:4;stroke-dasharray:none;stroke-dashoffset:0;stroke-opacity:1;visibility:visible;display:inline;overflow:visible;enable-background:accumulate"
           d="M 521.77708,423.46445 L 521.77708,533.05858"
           id="path3307"
           sodipodi:nodetypes="cc" />
        <path
           style="fill:none;fill-opacity:1;fill-rule:evenodd;stroke:#ffffff;stroke-width:1px;stroke-linecap:butt;stroke-linejoin:miter;marker:none;marker-start:none;marker-mid:none;marker-end:none;stroke-miterlimit:4;stroke-dasharray:none;stroke-dashoffset:0;stroke-opacity:1;visibility:visible;display:inline;overflow:visible;enable-background:accumulate"
           d="M 532.28414,420.42016 L 532.28414,530.01429"
           id="path3309"
           sodipodi:nodetypes="cc" />
        <path
           style="fill:none;fill-opacity:1;fill-rule:evenodd;stroke:#ffffff;stroke-width:1px;stroke-linecap:butt;stroke-linejoin:miter;marker:none;marker-start:none;marker-mid:none;marker-end:none;stroke-miterlimit:4;stroke-dasharray:none;stroke-dashoffset:0;stroke-opacity:1;visibility:visible;display:inline;overflow:visible;enable-background:accumulate"
           d="M 542.7911,416.36112 L 542.7911,502.61576"
           id="path3311"
           sodipodi:nodetypes="cc" />
        <path
           style="fill:none;fill-opacity:1;fill-rule:evenodd;stroke:#ffffff;stroke-width:1px;stroke-linecap:butt;stroke-linejoin:miter;marker:none;marker-start:none;marker-mid:none;marker-end:none;stroke-miterlimit:4;stroke-dasharray:none;stroke-dashoffset:0;stroke-opacity:1;visibility:visible;display:inline;overflow:visible;enable-background:accumulate"
           d="M 553.29809,411.54101 L 553.29809,466.59177"
           id="path3313"
           sodipodi:nodetypes="cc" />
        <path
           style="fill:none;fill-opacity:1;fill-rule:evenodd;stroke:#ffffff;stroke-width:1px;stroke-linecap:butt;stroke-linejoin:miter;marker:none;marker-start:none;marker-mid:none;marker-end:none;stroke-miterlimit:4;stroke-dasharray:none;stroke-dashoffset:0;stroke-opacity:1;visibility:visible;display:inline;overflow:visible;enable-background:accumulate"
           d="M 437.72111,487.90173 L 437.72111,557.66651"
           id="path3315"
           sodipodi:nodetypes="cc" />
        <path
           style="fill:none;fill-opacity:1;fill-rule:evenodd;stroke:#ffffff;stroke-width:1px;stroke-linecap:butt;stroke-linejoin:miter;marker:none;marker-start:none;marker-mid:none;marker-end:none;stroke-miterlimit:4;stroke-dasharray:none;stroke-dashoffset:0;stroke-opacity:1;visibility:visible;display:inline;overflow:visible;enable-background:accumulate"
           d="M 427.21411,520.37406 L 427.21411,561.97924"
           id="path3317"
           sodipodi:nodetypes="cc" />
      </g>
    </g>
    <g
       id="g3482"
       transform="matrix(0.8946449,0,0,0.8946449,82.360354,56.668995)">
      <g
         transform="matrix(0.9407876,0.269256,0.2630246,0.9630686,-142.50669,-169.82617)"
         id="g3438">
        <g
           id="g3378"
           transform="translate(211.1571,3.4248184)">
          <path
             id="path3380"
             d="M 419.09011,559.51654 L 449.74645,445.54712 L 564.79786,414.16946 L 535.22352,528.13888 L 419.09011,559.51654 z"
             style="opacity:1;fill:#929292;fill-opacity:1;fill-rule:evenodd;stroke:none;stroke-width:1px;stroke-linecap:butt;stroke-linejoin:miter;marker:none;marker-start:none;marker-mid:none;marker-end:none;stroke-miterlimit:4;stroke-dasharray:none;stroke-dashoffset:0;stroke-opacity:1;visibility:visible;display:inline;overflow:visible;enable-background:accumulate" />
          <g
             id="g3382">
            <path
               style="fill:none;fill-opacity:1;fill-rule:evenodd;stroke:#ffffff;stroke-width:1px;stroke-linecap:butt;stroke-linejoin:miter;marker:none;marker-start:none;marker-mid:none;marker-end:none;stroke-miterlimit:4;stroke-dasharray:none;stroke-dashoffset:0;stroke-opacity:1;visibility:visible;display:inline;overflow:visible;enable-background:accumulate"
               d="M 448.22811,447.56501 L 448.22811,554.62223"
               id="path3384"
               sodipodi:nodetypes="cc" />
            <path
               style="fill:none;fill-opacity:1;fill-rule:evenodd;stroke:#ffffff;stroke-width:1px;stroke-linecap:butt;stroke-linejoin:miter;marker:none;marker-start:none;marker-mid:none;marker-end:none;stroke-miterlimit:4;stroke-dasharray:none;stroke-dashoffset:0;stroke-opacity:1;visibility:visible;display:inline;overflow:visible;enable-background:accumulate"
               d="M 458.7351,441.47644 L 458.7351,551.07057"
               id="path3386"
               sodipodi:nodetypes="cc" />
            <path
               style="fill:none;fill-opacity:1;fill-rule:evenodd;stroke:#ffffff;stroke-width:1px;stroke-linecap:butt;stroke-linejoin:miter;marker:none;marker-start:none;marker-mid:none;marker-end:none;stroke-miterlimit:4;stroke-dasharray:none;stroke-dashoffset:0;stroke-opacity:1;visibility:visible;display:inline;overflow:visible;enable-background:accumulate"
               d="M 469.24208,438.17847 L 469.24208,547.7726"
               id="path3388"
               sodipodi:nodetypes="cc" />
            <path
               style="fill:none;fill-opacity:1;fill-rule:evenodd;stroke:#ffffff;stroke-width:1px;stroke-linecap:butt;stroke-linejoin:miter;marker:none;marker-start:none;marker-mid:none;marker-end:none;stroke-miterlimit:4;stroke-dasharray:none;stroke-dashoffset:0;stroke-opacity:1;visibility:visible;display:inline;overflow:visible;enable-background:accumulate"
               d="M 479.74911,435.38788 L 479.74911,544.98201"
               id="path3390"
               sodipodi:nodetypes="cc" />
            <path
               style="fill:none;fill-opacity:1;fill-rule:evenodd;stroke:#ffffff;stroke-width:1px;stroke-linecap:butt;stroke-linejoin:miter;marker:none;marker-start:none;marker-mid:none;marker-end:none;stroke-miterlimit:4;stroke-dasharray:none;stroke-dashoffset:0;stroke-opacity:1;visibility:visible;display:inline;overflow:visible;enable-background:accumulate"
               d="M 490.2561,432.3436 L 490.2561,541.93773"
               id="path3392"
               sodipodi:nodetypes="cc" />
            <path
               style="fill:none;fill-opacity:1;fill-rule:evenodd;stroke:#ffffff;stroke-width:1px;stroke-linecap:butt;stroke-linejoin:miter;marker:none;marker-start:none;marker-mid:none;marker-end:none;stroke-miterlimit:4;stroke-dasharray:none;stroke-dashoffset:0;stroke-opacity:1;visibility:visible;display:inline;overflow:visible;enable-background:accumulate"
               d="M 500.76313,429.04563 L 500.76313,538.63976"
               id="path3394"
               sodipodi:nodetypes="cc" />
            <path
               style="fill:none;fill-opacity:1;fill-rule:evenodd;stroke:#ffffff;stroke-width:1px;stroke-linecap:butt;stroke-linejoin:miter;marker:none;marker-start:none;marker-mid:none;marker-end:none;stroke-miterlimit:4;stroke-dasharray:none;stroke-dashoffset:0;stroke-opacity:1;visibility:visible;display:inline;overflow:visible;enable-background:accumulate"
               d="M 511.2701,426.76242 L 511.2701,536.35655"
               id="path3396"
               sodipodi:nodetypes="cc" />
            <path
               style="fill:none;fill-opacity:1;fill-rule:evenodd;stroke:#ffffff;stroke-width:1px;stroke-linecap:butt;stroke-linejoin:miter;marker:none;marker-start:none;marker-mid:none;marker-end:none;stroke-miterlimit:4;stroke-dasharray:none;stroke-dashoffset:0;stroke-opacity:1;visibility:visible;display:inline;overflow:visible;enable-background:accumulate"
               d="M 521.77708,423.46445 L 521.77708,533.05858"
               id="path3398"
               sodipodi:nodetypes="cc" />
            <path
               style="fill:none;fill-opacity:1;fill-rule:evenodd;stroke:#ffffff;stroke-width:1px;stroke-linecap:butt;stroke-linejoin:miter;marker:none;marker-start:none;marker-mid:none;marker-end:none;stroke-miterlimit:4;stroke-dasharray:none;stroke-dashoffset:0;stroke-opacity:1;visibility:visible;display:inline;overflow:visible;enable-background:accumulate"
               d="M 532.28414,420.42016 L 532.28414,530.01429"
               id="path3400"
               sodipodi:nodetypes="cc" />
            <path
               style="fill:none;fill-opacity:1;fill-rule:evenodd;stroke:#ffffff;stroke-width:1px;stroke-linecap:butt;stroke-linejoin:miter;marker:none;marker-start:none;marker-mid:none;marker-end:none;stroke-miterlimit:4;stroke-dasharray:none;stroke-dashoffset:0;stroke-opacity:1;visibility:visible;display:inline;overflow:visible;enable-background:accumulate"
               d="M 542.7911,416.36112 L 542.7911,502.61576"
               id="path3402"
               sodipodi:nodetypes="cc" />
            <path
               style="fill:none;fill-opacity:1;fill-rule:evenodd;stroke:#ffffff;stroke-width:1px;stroke-linecap:butt;stroke-linejoin:miter;marker:none;marker-start:none;marker-mid:none;marker-end:none;stroke-miterlimit:4;stroke-dasharray:none;stroke-dashoffset:0;stroke-opacity:1;visibility:visible;display:inline;overflow:visible;enable-background:accumulate"
               d="M 553.29809,411.54101 L 553.29809,466.59177"
               id="path3404"
               sodipodi:nodetypes="cc" />
            <path
               style="fill:none;fill-opacity:1;fill-rule:evenodd;stroke:#ffffff;stroke-width:1px;stroke-linecap:butt;stroke-linejoin:miter;marker:none;marker-start:none;marker-mid:none;marker-end:none;stroke-miterlimit:4;stroke-dasharray:none;stroke-dashoffset:0;stroke-opacity:1;visibility:visible;display:inline;overflow:visible;enable-background:accumulate"
               d="M 437.72111,487.90173 L 437.72111,557.66651"
               id="path3406"
               sodipodi:nodetypes="cc" />
            <path
               style="fill:none;fill-opacity:1;fill-rule:evenodd;stroke:#ffffff;stroke-width:1px;stroke-linecap:butt;stroke-linejoin:miter;marker:none;marker-start:none;marker-mid:none;marker-end:none;stroke-miterlimit:4;stroke-dasharray:none;stroke-dashoffset:0;stroke-opacity:1;visibility:visible;display:inline;overflow:visible;enable-background:accumulate"
               d="M 427.21411,520.37406 L 427.21411,561.97924"
               id="path3408"
               sodipodi:nodetypes="cc" />
          </g>
          <g
             transform="matrix(0,-1,-1,0,980.86147,977.39679)"
             id="g3410">
            <path
               style="fill:none;fill-opacity:1;fill-rule:evenodd;stroke:#ffffff;stroke-width:1px;stroke-linecap:butt;stroke-linejoin:miter;marker:none;marker-start:none;marker-mid:none;marker-end:none;stroke-miterlimit:4;stroke-dasharray:none;stroke-dashoffset:0;stroke-opacity:1;visibility:visible;display:inline;overflow:visible;enable-background:accumulate"
               d="M 448.22811,447.56501 L 448.22811,554.62223"
               id="path3412"
               sodipodi:nodetypes="cc" />
            <path
               style="fill:none;fill-opacity:1;fill-rule:evenodd;stroke:#ffffff;stroke-width:1px;stroke-linecap:butt;stroke-linejoin:miter;marker:none;marker-start:none;marker-mid:none;marker-end:none;stroke-miterlimit:4;stroke-dasharray:none;stroke-dashoffset:0;stroke-opacity:1;visibility:visible;display:inline;overflow:visible;enable-background:accumulate"
               d="M 458.7351,441.47644 L 458.7351,551.07057"
               id="path3414"
               sodipodi:nodetypes="cc" />
            <path
               style="fill:none;fill-opacity:1;fill-rule:evenodd;stroke:#ffffff;stroke-width:1px;stroke-linecap:butt;stroke-linejoin:miter;marker:none;marker-start:none;marker-mid:none;marker-end:none;stroke-miterlimit:4;stroke-dasharray:none;stroke-dashoffset:0;stroke-opacity:1;visibility:visible;display:inline;overflow:visible;enable-background:accumulate"
               d="M 469.24208,438.17847 L 469.24208,547.7726"
               id="path3416"
               sodipodi:nodetypes="cc" />
            <path
               style="fill:none;fill-opacity:1;fill-rule:evenodd;stroke:#ffffff;stroke-width:1px;stroke-linecap:butt;stroke-linejoin:miter;marker:none;marker-start:none;marker-mid:none;marker-end:none;stroke-miterlimit:4;stroke-dasharray:none;stroke-dashoffset:0;stroke-opacity:1;visibility:visible;display:inline;overflow:visible;enable-background:accumulate"
               d="M 479.74911,435.38788 L 479.74911,544.98201"
               id="path3418"
               sodipodi:nodetypes="cc" />
            <path
               style="fill:none;fill-opacity:1;fill-rule:evenodd;stroke:#ffffff;stroke-width:1px;stroke-linecap:butt;stroke-linejoin:miter;marker:none;marker-start:none;marker-mid:none;marker-end:none;stroke-miterlimit:4;stroke-dasharray:none;stroke-dashoffset:0;stroke-opacity:1;visibility:visible;display:inline;overflow:visible;enable-background:accumulate"
               d="M 490.2561,432.3436 L 490.2561,541.93773"
               id="path3420"
               sodipodi:nodetypes="cc" />
            <path
               style="fill:none;fill-opacity:1;fill-rule:evenodd;stroke:#ffffff;stroke-width:1px;stroke-linecap:butt;stroke-linejoin:miter;marker:none;marker-start:none;marker-mid:none;marker-end:none;stroke-miterlimit:4;stroke-dasharray:none;stroke-dashoffset:0;stroke-opacity:1;visibility:visible;display:inline;overflow:visible;enable-background:accumulate"
               d="M 500.76313,429.04563 L 500.76313,538.63976"
               id="path3422"
               sodipodi:nodetypes="cc" />
            <path
               style="fill:none;fill-opacity:1;fill-rule:evenodd;stroke:#ffffff;stroke-width:1px;stroke-linecap:butt;stroke-linejoin:miter;marker:none;marker-start:none;marker-mid:none;marker-end:none;stroke-miterlimit:4;stroke-dasharray:none;stroke-dashoffset:0;stroke-opacity:1;visibility:visible;display:inline;overflow:visible;enable-background:accumulate"
               d="M 511.2701,426.76242 L 511.2701,536.35655"
               id="path3424"
               sodipodi:nodetypes="cc" />
            <path
               style="fill:none;fill-opacity:1;fill-rule:evenodd;stroke:#ffffff;stroke-width:1px;stroke-linecap:butt;stroke-linejoin:miter;marker:none;marker-start:none;marker-mid:none;marker-end:none;stroke-miterlimit:4;stroke-dasharray:none;stroke-dashoffset:0;stroke-opacity:1;visibility:visible;display:inline;overflow:visible;enable-background:accumulate"
               d="M 521.77708,423.46445 L 521.77708,533.05858"
               id="path3426"
               sodipodi:nodetypes="cc" />
            <path
               style="fill:none;fill-opacity:1;fill-rule:evenodd;stroke:#ffffff;stroke-width:1px;stroke-linecap:butt;stroke-linejoin:miter;marker:none;marker-start:none;marker-mid:none;marker-end:none;stroke-miterlimit:4;stroke-dasharray:none;stroke-dashoffset:0;stroke-opacity:1;visibility:visible;display:inline;overflow:visible;enable-background:accumulate"
               d="M 532.28414,420.42016 L 532.28414,530.01429"
               id="path3428"
               sodipodi:nodetypes="cc" />
            <path
               style="fill:none;fill-opacity:1;fill-rule:evenodd;stroke:#ffffff;stroke-width:1px;stroke-linecap:butt;stroke-linejoin:miter;marker:none;marker-start:none;marker-mid:none;marker-end:none;stroke-miterlimit:4;stroke-dasharray:none;stroke-dashoffset:0;stroke-opacity:1;visibility:visible;display:inline;overflow:visible;enable-background:accumulate"
               d="M 542.7911,416.36112 L 542.7911,502.61576"
               id="path3430"
               sodipodi:nodetypes="cc" />
            <path
               style="fill:none;fill-opacity:1;fill-rule:evenodd;stroke:#ffffff;stroke-width:1px;stroke-linecap:butt;stroke-linejoin:miter;marker:none;marker-start:none;marker-mid:none;marker-end:none;stroke-miterlimit:4;stroke-dasharray:none;stroke-dashoffset:0;stroke-opacity:1;visibility:visible;display:inline;overflow:visible;enable-background:accumulate"
               d="M 553.29809,411.54101 L 553.29809,466.59177"
               id="path3432"
               sodipodi:nodetypes="cc" />
            <path
               style="fill:none;fill-opacity:1;fill-rule:evenodd;stroke:#ffffff;stroke-width:1px;stroke-linecap:butt;stroke-linejoin:miter;marker:none;marker-start:none;marker-mid:none;marker-end:none;stroke-miterlimit:4;stroke-dasharray:none;stroke-dashoffset:0;stroke-opacity:1;visibility:visible;display:inline;overflow:visible;enable-background:accumulate"
               d="M 437.72111,487.90173 L 437.72111,557.66651"
               id="path3434"
               sodipodi:nodetypes="cc" />
            <path
               style="fill:none;fill-opacity:1;fill-rule:evenodd;stroke:#ffffff;stroke-width:1px;stroke-linecap:butt;stroke-linejoin:miter;marker:none;marker-start:none;marker-mid:none;marker-end:none;stroke-miterlimit:4;stroke-dasharray:none;stroke-dashoffset:0;stroke-opacity:1;visibility:visible;display:inline;overflow:visible;enable-background:accumulate"
               d="M 427.21411,520.37406 L 427.21411,561.97924"
               id="path3436"
               sodipodi:nodetypes="cc" />
          </g>
        </g>
      </g>
      <path
         id="path3472"
         d="M 687.19411,440.33297 L 697.51468,478.30488 L 687.58356,475.18923 L 698.68304,515.88733 L 688.75193,512.77168 L 697.12522,543.14921 L 701.99341,544.31757 L 698.48831,439.94352 L 687.19411,440.33297 z"
         style="opacity:1;fill:#ffffff;fill-opacity:1;fill-rule:evenodd;stroke:none;stroke-width:1px;stroke-linecap:butt;stroke-linejoin:miter;marker:none;marker-start:none;marker-mid:none;marker-end:none;stroke-miterlimit:4;stroke-dasharray:none;stroke-dashoffset:0;stroke-opacity:1;visibility:visible;display:inline;overflow:visible;enable-background:accumulate" />
      <path
         id="path3474"
         d="M 695.5674,542.95448 L 657.79022,532.04973 L 660.12695,541.98084 L 630.52834,533.41282 L 633.25453,543.92812 L 603.46119,535.16537 L 598.39827,515.10842 L 596.45099,542.75975 L 695.5674,542.95448 z"
         style="opacity:1;fill:#ffffff;fill-opacity:1;fill-rule:evenodd;stroke:none;stroke-width:1px;stroke-linecap:butt;stroke-linejoin:miter;marker:none;marker-start:none;marker-mid:none;marker-end:none;stroke-miterlimit:4;stroke-dasharray:none;stroke-dashoffset:0;stroke-opacity:1;visibility:visible;display:inline;overflow:visible;enable-background:accumulate" />
      <path
         id="path3476"
         d="M 597.61936,514.52423 L 608.52411,517.63988 L 596.84045,476.94178 L 607.16102,480.25216 L 597.03517,443.64334 L 597.61936,514.52423 z"
         style="opacity:1;fill:#ffffff;fill-opacity:1;fill-rule:evenodd;stroke:none;stroke-width:1px;stroke-linecap:butt;stroke-linejoin:miter;marker:none;marker-start:none;marker-mid:none;marker-end:none;stroke-miterlimit:4;stroke-dasharray:none;stroke-dashoffset:0;stroke-opacity:1;visibility:visible;display:inline;overflow:visible;enable-background:accumulate" />
      <path
         id="path3478"
         d="M 598.00881,449.29045 L 608.52411,452.79555 L 605.60319,442.08552 L 635.20181,450.84827 L 632.47562,440.72243 L 662.46369,449.48518 L 659.34804,439.35934 L 689.9203,448.12208 L 687.97302,439.94352 L 595.67208,439.16461 L 598.00881,449.29045 z"
         style="opacity:1;fill:#ffffff;fill-opacity:1;fill-rule:evenodd;stroke:none;stroke-width:1px;stroke-linecap:butt;stroke-linejoin:miter;marker:none;marker-start:none;marker-mid:none;marker-end:none;stroke-miterlimit:4;stroke-dasharray:none;stroke-dashoffset:0;stroke-opacity:1;visibility:visible;display:inline;overflow:visible;enable-background:accumulate" />
      <rect
         y="441.6076"
         x="597.8595"
         height="100.42169"
         width="100.44849"
         id="rect3480"
         style="fill:none;fill-opacity:1;stroke:#000000;stroke-width:1;stroke-miterlimit:4;stroke-dasharray:4, 1;stroke-dashoffset:0;stroke-opacity:1" />
    </g>
    <g
       id="g3720"
       transform="matrix(0.8946449,0,0,0.8946449,49.380553,28.630488)">
      <path
         style="fill:none;stroke:#000000;stroke-width:0.75;stroke-miterlimit:4;stroke-dasharray:none"
         d="M 283.96943,462.2022 C 286.83032,460.77621 288.50236,461.55065 289.37448,460.90078 C 290.24598,460.24876 294.60045,458.14628 296.0957,456.70262 C 297.59154,455.25751 301.64045,452.01648 302.69706,451.66349 C 303.75368,451.3105 305.99429,449.91183 306.74109,449.57359 C 307.4879,449.23534 310.29099,446.81402 311.1637,446.16269 C 311.76862,445.71193 313.53022,444.45095 314.08581,444.96412 C 314.64138,445.47729 315.56663,446.58997 315.37662,447.44209 C 315.18604,448.29566 314.24579,450.25393 313.56022,450.8196 C 312.87466,451.38526 307.45321,456.14448 306.89154,456.78176 C 306.32985,457.41903 304.52298,458.87818 303.77597,459.60035 C 303.02715,460.32329 301.51286,465.60726 300.70138,466.48601 C 299.8917,467.364 298.51796,468.88146 296.83415,470.794 C 295.14975,472.70798 291.84784,475.22686 289.92436,475.46104 C 287.99907,475.69597 281.12073,473.83786 281.12073,473.83786"
         id="path667" />
      <path
         style="fill:none;stroke:#000000;stroke-width:0.75;stroke-miterlimit:4;stroke-dasharray:none"
         d="M 296.27368,471.43198 C 296.70803,471.49101 298.6321,471.25537 300.18916,470.03768 C 301.74622,468.81999 303.24328,467.37559 304.42807,465.94453 C 305.61347,464.512 305.6828,463.2043 306.99352,461.46016 C 308.30545,459.71672 309.29536,460.28891 310.4175,459.01365 C 311.54022,457.73695 313.34104,457.43185 313.9033,456.79311 C 314.46498,456.15584 316.26983,455.08137 316.96086,453.36311 C 317.6519,451.64484 315.73271,450.72934 314.43436,449.78505 C 314.43436,449.78505 316.49044,448.08589 317.17744,447.137 C 317.86502,446.18664 319.98175,444.71636 320.60344,444.3058 C 321.22635,443.89595 322.10738,441.32557 322.42128,440.54508 C 322.73576,439.76311 321.19026,438.67775 320.69469,438.39131 C 320.20035,438.10557 319.32477,439.52334 318.51531,440.01739 C 317.70647,440.51361 315.21462,442.53696 313.78204,443.8248 L 305.3154,449.3256 L 301.26792,452.18342"
         id="path669" />
      <path
         style="fill:none;stroke:#000000;stroke-width:0.75;stroke-miterlimit:4;stroke-dasharray:none"
         d="M 320.45157,437.48087 C 321.01325,436.8436 322.38519,435.32688 323.0661,435.52843 C 323.74822,435.73068 325.23249,436.58861 324.85451,437.90815 C 324.47593,439.22915 323.97346,440.47853 322.41497,442.07945"
         id="path671" />
      <line
         style="fill:none;stroke:#000000;stroke-width:0.75;stroke-miterlimit:4;stroke-dasharray:none"
         x1="310.99277"
         y1="455.68866"
         x2="311.29367"
         y2="457.59442"
         id="line673" />
      <path
         style="fill:none;stroke:#000000;stroke-width:0.75;stroke-miterlimit:4;stroke-dasharray:none"
         d="M 286.3175,464.32933 C 286.67762,466.84721 285.42491,469.20275 285.42491,469.20275"
         id="path675" />
      <line
         style="fill:none;stroke:#000000;stroke-width:0.75;stroke-miterlimit:4;stroke-dasharray:none"
         x1="307.36984"
         y1="460.90778"
         x2="306.56995"
         y2="459.48349"
         id="line677" />
      <line
         style="fill:none;stroke:#000000;stroke-width:0.75;stroke-miterlimit:4;stroke-dasharray:none"
         x1="298.63211"
         y1="471.25537"
         x2="291.78842"
         y2="474.99869"
         id="line679" />
    </g>
    <g
       id="g3763"
       transform="matrix(0.8946449,0,0,0.8946449,67.261706,24.6569)">
      <path
         style="fill:none;stroke:#000000;stroke-width:0.75;stroke-miterlimit:4;stroke-dasharray:none"
         d="M 373.92017,569.76501 C 374.28136,567.40646 373.99271,565.81904 375.0276,563.59357 C 376.0617,561.36694 378.86794,555.6946 379.27609,555.14328 C 379.68426,554.59195 382.98779,549.9486 382.98779,549.9486 C 382.98779,549.9486 384.68241,546.38764 384.81433,545.71513 C 384.94625,545.0426 385.6917,541.22855 386.14358,540.45265 C 386.59546,539.67676 388.84427,538.38764 388.84427,538.38764 L 390.29072,539.66973 C 390.29072,539.66973 390.99876,542.17311 390.74679,542.95389 C 390.49364,543.73573 390.52992,546.10614 390.00054,546.76679 C 389.47194,547.42859 387.82103,550.76498 387.82103,550.76498"
         id="path683" />
      <polyline
         transform="matrix(0.7829264,1.1641533,-1.1655976,1.051063,394.7226,346.71178)"
         style="fill:none;stroke:#000000;stroke-width:0.50798279;stroke-miterlimit:4;stroke-dasharray:none"
         points="104.399,73.855 103.609,68.967 102.423,64.911       101.831,61.063 101.633,58.775 102.028,57.319 102.917,57.215 "
         id="polyline685" />
      <path
         style="fill:none;stroke:#000000;stroke-width:0.75;stroke-miterlimit:4;stroke-dasharray:none"
         d="M 394.11389,545.64404 L 399.35775,539.25289 L 403.23437,533.72435 L 406.42815,528.62827 L 409.85539,525.90622 C 409.85539,525.90622 411.89555,525.17553 412.47035,526.31977 C 412.87263,527.11839 412.09847,529.24152 412.09847,529.24152 L 410.6001,530.77781"
         id="path687" />
      <path
         style="fill:none;stroke:#000000;stroke-width:0.75;stroke-miterlimit:4;stroke-dasharray:none"
         d="M 398.24784,543.39372 L 402.48812,537.53724 L 406.28724,531.89344 C 406.28724,531.89344 408.63417,529.59198 409.34089,530.0637 C 410.04762,530.53543 411.18481,531.35768 410.93167,532.13951 C 410.67852,532.92134 410.7024,533.82553 409.93058,534.70479 C 409.15954,535.58522 407.32059,538.35246 407.32059,538.35246 L 405.44784,540.77989"
         id="path689" />
      <polyline
         transform="matrix(0.7829264,1.1641533,-1.1655976,1.051063,394.7226,346.71178)"
         style="fill:none;stroke:#000000;stroke-width:0.50798279;stroke-miterlimit:4;stroke-dasharray:none"
         points="108.746,72.919 108.252,70.111 107.561,66.471       107.956,64.599 109.734,64.08 110.624,65.223 110.821,67.095 111.315,70.215 112.105,73.231 113.291,76.455 116.65,83.215       118.33,90.911 "
         id="polyline691" />
      <line
         style="fill:none;stroke:#000000;stroke-width:0.75;stroke-miterlimit:4;stroke-dasharray:none"
         x1="384.95865"
         y1="546.50885"
         x2="386.88998"
         y2="547.3537"
         id="line693" />
    </g>
    <g
       id="g3721"
       transform="matrix(0,-0.8946449,0.8946449,0,204.85276,822.1518)">
      <path
         style="fill:none;stroke:#000000;stroke-width:0.75;stroke-miterlimit:4;stroke-dasharray:none"
         d="M 283.96943,462.2022 C 286.83032,460.77621 288.50236,461.55065 289.37448,460.90078 C 290.24598,460.24876 294.60045,458.14628 296.0957,456.70262 C 297.59154,455.25751 301.64045,452.01648 302.69706,451.66349 C 303.75368,451.3105 305.99429,449.91183 306.74109,449.57359 C 307.4879,449.23534 310.29099,446.81402 311.1637,446.16269 C 311.76862,445.71193 313.53022,444.45095 314.08581,444.96412 C 314.64138,445.47729 315.56663,446.58997 315.37662,447.44209 C 315.18604,448.29566 314.24579,450.25393 313.56022,450.8196 C 312.87466,451.38526 307.45321,456.14448 306.89154,456.78176 C 306.32985,457.41903 304.52298,458.87818 303.77597,459.60035 C 303.02715,460.32329 301.51286,465.60726 300.70138,466.48601 C 299.8917,467.364 298.51796,468.88146 296.83415,470.794 C 295.14975,472.70798 291.84784,475.22686 289.92436,475.46104 C 287.99907,475.69597 281.12073,473.83786 281.12073,473.83786"
         id="path3723" />
      <path
         style="fill:none;stroke:#000000;stroke-width:0.75;stroke-miterlimit:4;stroke-dasharray:none"
         d="M 296.27368,471.43198 C 296.70803,471.49101 298.6321,471.25537 300.18916,470.03768 C 301.74622,468.81999 303.24328,467.37559 304.42807,465.94453 C 305.61347,464.512 305.6828,463.2043 306.99352,461.46016 C 308.30545,459.71672 309.29536,460.28891 310.4175,459.01365 C 311.54022,457.73695 313.34104,457.43185 313.9033,456.79311 C 314.46498,456.15584 316.26983,455.08137 316.96086,453.36311 C 317.6519,451.64484 315.73271,450.72934 314.43436,449.78505 C 314.43436,449.78505 316.49044,448.08589 317.17744,447.137 C 317.86502,446.18664 319.98175,444.71636 320.60344,444.3058 C 321.22635,443.89595 322.10738,441.32557 322.42128,440.54508 C 322.73576,439.76311 321.19026,438.67775 320.69469,438.39131 C 320.20035,438.10557 319.32477,439.52334 318.51531,440.01739 C 317.70647,440.51361 315.21462,442.53696 313.78204,443.8248 L 305.3154,449.3256 L 301.26792,452.18342"
         id="path3725" />
      <path
         style="fill:none;stroke:#000000;stroke-width:0.75;stroke-miterlimit:4;stroke-dasharray:none"
         d="M 320.45157,437.48087 C 321.01325,436.8436 322.38519,435.32688 323.0661,435.52843 C 323.74822,435.73068 325.23249,436.58861 324.85451,437.90815 C 324.47593,439.22915 323.97346,440.47853 322.41497,442.07945"
         id="path3727" />
      <line
         style="fill:none;stroke:#000000;stroke-width:0.75;stroke-miterlimit:4;stroke-dasharray:none"
         x1="310.99277"
         y1="455.68866"
         x2="311.29367"
         y2="457.59442"
         id="line3729" />
      <path
         style="fill:none;stroke:#000000;stroke-width:0.75;stroke-miterlimit:4;stroke-dasharray:none"
         d="M 286.3175,464.32933 C 286.67762,466.84721 285.42491,469.20275 285.42491,469.20275"
         id="path3731" />
      <line
         style="fill:none;stroke:#000000;stroke-width:0.75;stroke-miterlimit:4;stroke-dasharray:none"
         x1="307.36984"
         y1="460.90778"
         x2="306.56995"
         y2="459.48349"
         id="line3733" />
      <line
         style="fill:none;stroke:#000000;stroke-width:0.75;stroke-miterlimit:4;stroke-dasharray:none"
         x1="298.63211"
         y1="471.25537"
         x2="291.78842"
         y2="474.99869"
         id="line3735" />
    </g>
    <g
       id="g3737"
       transform="matrix(0,-0.8946449,0.8946449,0,226.30096,796.26324)">
      <path
         style="fill:none;stroke:#000000;stroke-width:0.75;stroke-miterlimit:4;stroke-dasharray:none"
         d="M 373.92017,569.76501 C 374.28136,567.40646 373.99271,565.81904 375.0276,563.59357 C 376.0617,561.36694 378.86794,555.6946 379.27609,555.14328 C 379.68426,554.59195 382.98779,549.9486 382.98779,549.9486 C 382.98779,549.9486 384.68241,546.38764 384.81433,545.71513 C 384.94625,545.0426 385.6917,541.22855 386.14358,540.45265 C 386.59546,539.67676 388.84427,538.38764 388.84427,538.38764 L 390.29072,539.66973 C 390.29072,539.66973 390.99876,542.17311 390.74679,542.95389 C 390.49364,543.73573 390.52992,546.10614 390.00054,546.76679 C 389.47194,547.42859 387.82103,550.76498 387.82103,550.76498"
         id="path3739" />
      <polyline
         transform="matrix(0.7829264,1.1641533,-1.1655976,1.051063,394.7226,346.71178)"
         style="fill:none;stroke:#000000;stroke-width:0.50798279;stroke-miterlimit:4;stroke-dasharray:none"
         points="104.399,73.855 103.609,68.967 102.423,64.911       101.831,61.063 101.633,58.775 102.028,57.319 102.917,57.215 "
         id="polyline3741" />
      <path
         style="fill:none;stroke:#000000;stroke-width:0.75;stroke-miterlimit:4;stroke-dasharray:none"
         d="M 394.11389,545.64404 L 399.35775,539.25289 L 403.23437,533.72435 L 406.42815,528.62827 L 409.85539,525.90622 C 409.85539,525.90622 411.89555,525.17553 412.47035,526.31977 C 412.87263,527.11839 412.09847,529.24152 412.09847,529.24152 L 410.6001,530.77781"
         id="path3743" />
      <path
         style="fill:none;stroke:#000000;stroke-width:0.75;stroke-miterlimit:4;stroke-dasharray:none"
         d="M 398.24784,543.39372 L 402.48812,537.53724 L 406.28724,531.89344 C 406.28724,531.89344 408.63417,529.59198 409.34089,530.0637 C 410.04762,530.53543 411.18481,531.35768 410.93167,532.13951 C 410.67852,532.92134 410.7024,533.82553 409.93058,534.70479 C 409.15954,535.58522 407.32059,538.35246 407.32059,538.35246 L 405.44784,540.77989"
         id="path3745" />
      <polyline
         transform="matrix(0.7829264,1.1641533,-1.1655976,1.051063,394.7226,346.71178)"
         style="fill:none;stroke:#000000;stroke-width:0.50798279;stroke-miterlimit:4;stroke-dasharray:none"
         points="108.746,72.919 108.252,70.111 107.561,66.471       107.956,64.599 109.734,64.08 110.624,65.223 110.821,67.095 111.315,70.215 112.105,73.231 113.291,76.455 116.65,83.215       118.33,90.911 "
         id="polyline3747" />
      <line
         style="fill:none;stroke:#000000;stroke-width:0.75;stroke-miterlimit:4;stroke-dasharray:none"
         x1="384.95865"
         y1="546.50885"
         x2="386.88998"
         y2="547.3537"
         id="line3749" />
    </g>
    <g
       id="g2495"
       transform="translate(1.9839343,-9.5228848)">
      <path
         id="rect3751"
         d="M 297.21433,474.73618 L 297.21433,480.97073 L 269.73196,480.97073 L 269.73196,498.86363 L 297.21433,498.86363 L 297.21433,505.09819 L 314.07279,488.26768 L 297.21433,474.73618 z"
         style="fill:none;fill-opacity:1;stroke:#000000;stroke-width:0.89464492;stroke-miterlimit:4;stroke-dasharray:none;stroke-dashoffset:0;stroke-opacity:1" />
      <text
         sodipodi:linespacing="125%"
         id="text3759"
         y="492.67422"
         x="286.7222"
         style="font-size:10px;font-style:normal;font-variant:normal;font-weight:normal;font-stretch:normal;text-align:start;line-height:125%;writing-mode:lr-tb;text-anchor:start;fill:#000000;fill-opacity:1;stroke:none;stroke-width:1px;stroke-linecap:butt;stroke-linejoin:miter;stroke-opacity:1;font-family:Bitstream Vera Sans;-inkscape-font-specification:Bitstream Vera Sans"
         xml:space="preserve"><tspan
           y="492.67422"
           x="286.7222"
           id="tspan3761"
           sodipodi:role="line">v</tspan></text>
    </g>
    <g
       id="g2500"
       transform="translate(-3.9678687,-7.1421636)">
      <path
         id="path3763"
         d="M 600.55994,473.62473 L 600.55994,479.85929 L 573.07757,479.85929 L 573.07757,497.75219 L 600.55994,497.75219 L 600.55994,503.98675 L 617.41841,487.15624 L 600.55994,473.62473 z"
         style="fill:#ffffff;fill-opacity:1;stroke:#000000;stroke-width:0.89464492;stroke-miterlimit:4;stroke-dasharray:none;stroke-dashoffset:0;stroke-opacity:1" />
      <text
         sodipodi:linespacing="125%"
         id="text3765"
         y="491.71021"
         x="589.3075"
         style="font-size:10px;font-style:normal;font-variant:normal;font-weight:normal;font-stretch:normal;text-align:start;line-height:125%;writing-mode:lr-tb;text-anchor:start;fill:#000000;fill-opacity:1;stroke:none;stroke-width:1px;stroke-linecap:butt;stroke-linejoin:miter;stroke-opacity:1;font-family:Bitstream Vera Sans;-inkscape-font-specification:Bitstream Vera Sans"
         xml:space="preserve"><tspan
           y="491.71021"
           x="589.3075"
           id="tspan3767"
           sodipodi:role="line">-v</tspan></text>
    </g>
    <g
       id="g2490"
       transform="translate(6.3485899,126.9718)">
      <path
         id="path2484"
         d="M 441.38072,338.04272 L 441.38072,344.27727 L 413.89835,344.27727 L 413.89835,362.17017 L 441.38072,362.17017 L 441.38072,368.40473 L 458.23918,351.57422 L 441.38072,338.04272 z"
         style="fill:none;fill-opacity:1;stroke:#000000;stroke-width:0.89464492;stroke-miterlimit:4;stroke-dasharray:none;stroke-dashoffset:0;stroke-opacity:1" />
      <text
         sodipodi:linespacing="125%"
         id="text2486"
         y="355.60446"
         x="421.78442"
         style="font-size:10px;font-style:normal;font-variant:normal;font-weight:normal;font-stretch:normal;text-align:start;line-height:125%;writing-mode:lr-tb;text-anchor:start;fill:#000000;fill-opacity:1;stroke:none;stroke-width:1px;stroke-linecap:butt;stroke-linejoin:miter;stroke-opacity:1;font-family:Bitstream Vera Sans;-inkscape-font-specification:Bitstream Vera Sans"
         xml:space="preserve"><tspan
           y="355.60446"
           x="421.78442"
           id="tspan2488"
           sodipodi:role="line">chop</tspan></text>
    </g>
  </g>
</svg>
