<?xml version="1.0" encoding="UTF-8" standalone="no"?>
<!-- Created with Inkscape (http://www.inkscape.org/) -->
<svg
   xmlns:dc="http://purl.org/dc/elements/1.1/"
   xmlns:cc="http://web.resource.org/cc/"
   xmlns:rdf="http://www.w3.org/1999/02/22-rdf-syntax-ns#"
   xmlns:svg="http://www.w3.org/2000/svg"
   xmlns="http://www.w3.org/2000/svg"
   xmlns:xlink="http://www.w3.org/1999/xlink"
   xmlns:sodipodi="http://inkscape.sourceforge.net/DTD/sodipodi-0.dtd"
   xmlns:inkscape="http://www.inkscape.org/namespaces/inkscape"
   width="744.09448819"
   height="1052.3622047"
   id="svg2"
   sodipodi:version="0.32"
   inkscape:version="0.42.2"
   sodipodi:docbase="/home/bcrowell/Documents/writing/lm/trunk/3vw/ch03/figs"
   sodipodi:docname="coil-spring-superposition.svg">
  <defs
     id="defs4" />
  <sodipodi:namedview
     id="base"
     pagecolor="#ffffff"
     bordercolor="#666666"
     borderopacity="1.0"
     inkscape:pageopacity="0.0"
     inkscape:pageshadow="2"
     inkscape:zoom="0.74320988"
     inkscape:cx="381.42857"
     inkscape:cy="610.50790"
     inkscape:document-units="px"
     inkscape:current-layer="layer1"
     inkscape:window-width="712"
     inkscape:window-height="510"
     inkscape:window-x="305"
     inkscape:window-y="305" />
  <metadata
     id="metadata7">
    <rdf:RDF>
      <cc:Work
         rdf:about="">
        <dc:format>image/svg+xml</dc:format>
        <dc:type
           rdf:resource="http://purl.org/dc/dcmitype/StillImage" />
      </cc:Work>
    </rdf:RDF>
  </metadata>
  <g
     inkscape:label="Layer 1"
     inkscape:groupmode="layer"
     id="layer1">
    <text
       xml:space="preserve"
       style="font-size:11.000000px;font-style:normal;font-variant:normal;font-weight:normal;font-stretch:normal;line-height:100.00000%;writing-mode:lr-tb;text-anchor:start;fill:#000000;fill-opacity:1.0000000;stroke:none;stroke-width:1.0000000pt;stroke-linecap:butt;stroke-linejoin:miter;stroke-opacity:1.0000000;font-family:Bitstream Vera Sans"
       x="116.44186"
       y="637.87109"
       id="text1364"
       sodipodi:linespacing="100.00000%"><tspan
         sodipodi:role="line"
         id="tspan1366"
         x="116.44186"
         y="637.87109">1</tspan></text>
    <text
       xml:space="preserve"
       style="font-size:11.000000px;font-style:normal;font-variant:normal;font-weight:normal;font-stretch:normal;line-height:100.00000%;writing-mode:lr-tb;text-anchor:start;fill:#000000;fill-opacity:1.0000000;stroke:none;stroke-width:1.0000000pt;stroke-linecap:butt;stroke-linejoin:miter;stroke-opacity:1.0000000;font-family:Bitstream Vera Sans"
       x="307.54153"
       y="637.9436"
       id="text1368"
       sodipodi:linespacing="100.00000%"><tspan
         sodipodi:role="line"
         id="tspan1370"
         x="307.54153"
         y="637.94360">2</tspan></text>
    <text
       xml:space="preserve"
       style="font-size:11.000000px;font-style:normal;font-variant:normal;font-weight:normal;font-stretch:normal;line-height:100.00000%;writing-mode:lr-tb;text-anchor:start;fill:#000000;fill-opacity:1.0000000;stroke:none;stroke-width:1.0000000pt;stroke-linecap:butt;stroke-linejoin:miter;stroke-opacity:1.0000000;font-family:Bitstream Vera Sans"
       x="493.95016"
       y="637.86572"
       id="text1372"
       sodipodi:linespacing="100.00000%"><tspan
         sodipodi:role="line"
         id="tspan1374"
         x="493.95016"
         y="637.86572">3</tspan></text>
    <image
       id="image1365"
       height="420.00000"
       width="545.00000"
       sodipodi:absref="/home/bcrowell/Documents/writing/lm/trunk/3vw/ch03/figs/coil-spring-superposition-photos.jpg"
       xlink:href="coil-spring-superposition-photos.jpg"
       x="113.66279"
       y="203.24258" />
  </g>
</svg>
