<?xml version="1.0" encoding="UTF-8" standalone="no"?>
<!DOCTYPE svg PUBLIC "-//W3C//DTD SVG 20010904//EN"
"http://www.w3.org/TR/2001/REC-SVG-20010904/DTD/svg10.dtd">
<!-- Created with Inkscape (http://www.inkscape.org/) -->
<svg
   width="112.99999mm"
   height="45.000001mm"
   xmlns="http://www.w3.org/2000/svg"
   xmlns:cc="http://web.resource.org/cc/"
   xmlns:inkscape="http://www.inkscape.org/namespaces/inkscape"
   xmlns:sodipodi="http://sodipodi.sourceforge.net/DTD/sodipodi-0.dtd"
   xmlns:rdf="http://www.w3.org/1999/02/22-rdf-syntax-ns#"
   xmlns:dc="http://purl.org/dc/elements/1.1/"
   xmlns:xlink="http://www.w3.org/1999/xlink"
   id="svg192"
   sodipodi:version="0.32"
   inkscape:version="0.40+cvs"
   sodipodi:docbase="/home/bcrowell/Documents/writing/lm/trunk/1np/ch02/figs"
   sodipodi:docname="tucson.svg">
  <defs
     id="defs3" />
  <sodipodi:namedview
     id="base"
     pagecolor="#ffffff"
     bordercolor="#666666"
     borderopacity="1.0"
     inkscape:pageopacity="0.0"
     inkscape:pageshadow="2"
     inkscape:zoom="1.0000000"
     inkscape:cx="17.260101"
     inkscape:cy="111.98990"
     inkscape:current-layer="layer1"
     inkscape:window-width="768"
     inkscape:window-height="550"
     inkscape:window-x="66"
     inkscape:window-y="22" />
  <metadata
     id="metadata4">
    <rdf:RDF
       id="RDF5">
      <cc:Work
         rdf:about=""
         id="Work6">
        <dc:format
           id="format7">image/svg+xml</dc:format>
        <dc:type
           id="type9"
           rdf:resource="http://purl.org/dc/dcmitype/StillImage" />
      </cc:Work>
    </rdf:RDF>
  </metadata>
  <g
     inkscape:label="Layer 1"
     inkscape:groupmode="layer"
     id="layer1">
    <rect
       style="fill:#e0e0e0;fill-opacity:1.0000000;stroke:none;stroke-width:1.0000000pt;stroke-linecap:butt;stroke-linejoin:miter;stroke-opacity:1.0000000"
       id="rect274"
       width="196.68477"
       height="159.55550"
       x="201.81625"
       y="0.24561901" />
    <rect
       style="fill:#e0e0e0;fill-opacity:1.0000000;stroke:none;stroke-width:1.0000000pt;stroke-linecap:butt;stroke-linejoin:miter;stroke-opacity:1.0000000"
       id="rect200"
       width="196.68477"
       height="159.55550"
       x="0.23486015"
       y="0.24561901" />
    <g
       id="Layer_1"
       transform="matrix(1.210000,0.000000,0.000000,1.210000,14.30935,6.644425)">
		<g
   id="g7">
			<text
   transform="translate(39.50000,57.00000)"
   id="text9"><tspan
     x="0"
     y="0"
     style="font-size:7.6500001;font-family:Bitstream Vera Sans"
     id="tspan10">Enid</tspan></text>

		</g>

		<g
   id="g14">
			<text
   transform="translate(9.000000,90.50000)"
   id="text16"><tspan
     x="0"
     y="0"
     style="font-size:7.6500001;font-family:Bitstream Vera Sans"
     id="tspan17">x=0</tspan></text>

		</g>

		<line
   style="fill:none;stroke:#000000;stroke-miterlimit:1.0000000"
   x1="4.0000000"
   y1="117.50000"
   x2="108.00000"
   y2="15.500000"
   id="line21" />

		<g
   id="g23">
			<text
   transform="translate(95.50000,9.000000)"
   id="text25"><tspan
     x="0"
     y="0"
     style="font-size:7.6500001;font-family:Bitstream Vera Sans"
     id="tspan26">Chicago</tspan></text>

		</g>

		<g
   id="g30">
			<text
   transform="translate(11.50000,121.0000)"
   id="text32"><tspan
     x="0"
     y="0"
     style="font-size:7.6500001;font-family:Bitstream Vera Sans"
     id="tspan33">Tucson</tspan></text>

		</g>

		<g
   id="g37">
			<text
   transform="translate(24.50000,79.00000)"
   id="text39"><tspan
     x="0"
     y="0"
     style="font-size:7.6500001;font-family:Bitstream Vera Sans"
     id="tspan40">x&gt;0</tspan></text>

		</g>

		<g
   id="g44">
			<text
   transform="translate(0.000000,103.5000)"
   id="text46"><tspan
     x="0"
     y="0"
     style="font-size:7.6500001;font-family:Bitstream Vera Sans"
     id="tspan47">x&lt;0</tspan></text>

		</g>

		<g
   id="g51">
			<text
   transform="translate(87.50000,56.00000)"
   id="text53"><tspan
     x="0"
     y="0"
     style="font-size:9.0000000;font-family:'Symbol'"
     id="tspan54">∆</tspan></text>

			<text
   transform="translate(93.00780,56.00000)"
   id="text57"><tspan
     x="0"
     y="0"
     style="font-size:7.6500001;font-family:Bitstream Vera Sans"
     id="tspan58">x&gt;0</tspan></text>

		</g>

		<g
   id="g62">
			<text
   transform="translate(49.50000,37.00000)"
   id="text64"><tspan
     x="0"
     y="0"
     style="font-size:7.6500001;font-family:Bitstream Vera Sans"
     id="tspan65">Joplin</tspan></text>

		</g>

		<line
   style="fill:#ffffff;stroke:#000000"
   x1="26.676001"
   y1="91.341003"
   x2="30.605000"
   y2="95.889999"
   id="line69" />

		<circle
   cx="108.00000"
   cy="15.500000"
   r="2.7579999"
   id="circle71"
   sodipodi:cx="108.00000"
   sodipodi:cy="15.500000"
   sodipodi:rx="2.7579999"
   sodipodi:ry="2.7579999" />
 
		<circle
   cx="88.271004"
   cy="34.667000"
   r="2.7579999"
   id="circle73"
   sodipodi:cx="88.271004"
   sodipodi:cy="34.667000"
   sodipodi:rx="2.7579999"
   sodipodi:ry="2.7579999" />
 
		<circle
   cx="64.938004"
   cy="57.667000"
   r="2.7579999"
   id="circle75"
   sodipodi:cx="64.938004"
   sodipodi:cy="57.667000"
   sodipodi:rx="2.7579999"
   sodipodi:ry="2.7579999" />
 
		<circle
   cx="4.0000000"
   cy="117.50000"
   r="2.7579999"
   id="circle77"
   sodipodi:cx="4.0000000"
   sodipodi:cy="117.50000"
   sodipodi:rx="2.7579999"
   sodipodi:ry="2.7579999" />
 
		<line
   style="fill:none;stroke:#000000;stroke-width:0.50000000;stroke-miterlimit:1.0000000"
   x1="69.831001"
   y1="61.660000"
   x2="90.803001"
   y2="41.796001"
   id="line79" />

		<path
   d="M 92.881000,39.823000 C 92.246000,41.114000 91.618000,42.885000 91.487000,44.255000 L 90.527000,42.053000 L 88.381000,40.975000 C 89.755000,40.918000 91.558000,40.388000 92.881000,39.823000 z "
   id="path81" />

	</g>
    <g
       id="g188"
       transform="matrix(1.210000,0.000000,0.000000,1.210000,237.0875,6.644425)">
		<g
   id="g102">
			<text
   transform="translate(39.50000,57.00000)"
   id="text104"><tspan
     x="0"
     y="0"
     style="font-size:7.6500001;font-family:Bitstream Vera Sans"
     id="tspan105">Enid</tspan></text>

		</g>

		<g
   id="g109">
			<text
   transform="translate(9.000000,90.50000)"
   id="text111"><tspan
     x="0"
     y="0"
     style="font-size:7.6500001;font-family:Bitstream Vera Sans"
     id="tspan112">x=0</tspan></text>

		</g>

		<line
   style="fill:none;stroke:#000000;stroke-miterlimit:1.0000000"
   x1="4.0000000"
   y1="117.50000"
   x2="108.00000"
   y2="15.500000"
   id="line116" />

		<g
   id="g118">
			<text
   transform="translate(95.50000,9.000000)"
   id="text120"><tspan
     x="0"
     y="0"
     style="font-size:7.6500001;font-family:Bitstream Vera Sans"
     id="tspan121">Chicago</tspan></text>

		</g>

		<g
   id="g125">
			<text
   transform="translate(11.50000,121.0000)"
   id="text127"><tspan
     x="0"
     y="0"
     style="font-size:7.6500001;font-family:Bitstream Vera Sans"
     id="tspan128">Tucson</tspan></text>

		</g>

		<g
   id="g132">
			<text
   transform="translate(24.50000,79.00000)"
   id="text134"><tspan
     x="0"
     y="0"
     style="font-size:7.6500001;font-family:Bitstream Vera Sans"
     id="tspan135">x&lt;0</tspan></text>

		</g>

		<g
   id="g139">
			<text
   transform="translate(0.000000,103.5000)"
   id="text141"><tspan
     x="0"
     y="0"
     style="font-size:7.6500001;font-family:Bitstream Vera Sans"
     id="tspan142">x&gt;0</tspan></text>

		</g>

		<g
   id="g146">
			<text
   transform="translate(87.50000,56.00000)"
   id="text148"><tspan
     x="0"
     y="0"
     style="font-size:9.0000000;font-family:'Symbol'"
     id="tspan149">∆</tspan></text>

			<text
   transform="translate(93.00780,56.00000)"
   id="text152"><tspan
     x="0"
     y="0"
     style="font-size:7.6500001;font-family:Bitstream Vera Sans"
     id="tspan153">x&lt;0</tspan></text>

		</g>

		<g
   id="g157">
			<text
   transform="translate(49.50000,37.00000)"
   id="text159"><tspan
     x="0"
     y="0"
     style="font-size:7.6500001;font-family:Bitstream Vera Sans"
     id="tspan160">Joplin</tspan></text>

		</g>

		<line
   style="fill:#ffffff;stroke:#000000"
   x1="26.676001"
   y1="91.341003"
   x2="30.605000"
   y2="95.889999"
   id="line164" />

		<circle
   cx="108.00000"
   cy="15.500000"
   r="2.7579999"
   id="circle166"
   sodipodi:cx="108.00000"
   sodipodi:cy="15.500000"
   sodipodi:rx="2.7579999"
   sodipodi:ry="2.7579999" />
 
		<circle
   cx="88.271004"
   cy="34.667000"
   r="2.7579999"
   id="circle168"
   sodipodi:cx="88.271004"
   sodipodi:cy="34.667000"
   sodipodi:rx="2.7579999"
   sodipodi:ry="2.7579999" />
 
		<circle
   cx="64.938004"
   cy="57.667000"
   r="2.7579999"
   id="circle170"
   sodipodi:cx="64.938004"
   sodipodi:cy="57.667000"
   sodipodi:rx="2.7579999"
   sodipodi:ry="2.7579999" />
 
		<circle
   cx="4.0000000"
   cy="117.50000"
   r="2.7579999"
   id="circle172"
   sodipodi:cx="4.0000000"
   sodipodi:cy="117.50000"
   sodipodi:rx="2.7579999"
   sodipodi:ry="2.7579999" />
 
		<line
   style="fill:none;stroke:#000000;stroke-width:0.50000000;stroke-miterlimit:1.0000000"
   x1="69.831001"
   y1="61.660000"
   x2="90.803001"
   y2="41.796001"
   id="line174" />

		<path
   d="M 92.881000,39.823000 C 92.246000,41.114000 91.618000,42.885000 91.487000,44.255000 L 90.527000,42.053000 L 88.381000,40.975000 C 89.755000,40.918000 91.558000,40.388000 92.881000,39.823000 z "
   id="path176" />

	</g>
    <text
       xml:space="preserve"
       style="font-size:8.0000000;font-style:normal;font-variant:normal;font-weight:normal;font-stretch:normal;fill:#000000;fill-opacity:1.0000000;stroke:none;stroke-width:1.0000000pt;stroke-linecap:butt;stroke-linejoin:miter;stroke-opacity:1.0000000;font-family:Bitstream Vera Sans;text-anchor:start;writing-mode:lr-tb"
       x="12.57475"
       y="18.458385"
       id="text194"
       sodipodi:linespacing="100%"><tspan
         sodipodi:role="line"
         id="tspan195"
         x="12.574750"
         y="18.458385">1</tspan></text>
    <text
       xml:space="preserve"
       style="font-size:8.0000000;font-style:normal;font-variant:normal;font-weight:normal;font-stretch:normal;fill:#000000;fill-opacity:1.0000000;stroke:none;stroke-width:1.0000000pt;stroke-linecap:butt;stroke-linejoin:miter;stroke-opacity:1.0000000;font-family:Bitstream Vera Sans;text-anchor:start;writing-mode:lr-tb"
       x="214.9384"
       y="18.458385"
       id="text197"
       sodipodi:linespacing="100%"><tspan
         sodipodi:role="line"
         id="tspan198"
         x="214.93840"
         y="18.458385">2</tspan></text>
  </g>
</svg>
