<?xml version="1.0" encoding="UTF-8" standalone="no"?>
<!DOCTYPE svg PUBLIC "-//W3C//DTD SVG 20010904//EN"
"http://www.w3.org/TR/2001/REC-SVG-20010904/DTD/svg10.dtd">
<!-- Created with Inkscape (http://www.inkscape.org/) -->
<svg:svg
   width="30.500000mm"
   height="7.4000000mm"
   id="svg194"
   sodipodi:version="0.32"
   inkscape:version="0.40+cvs"
   sodipodi:docbase="/home/bcrowell/Documents/writing/lm/trunk/1np/ch07/figs"
   sodipodi:docname="sc-scale-vector.svg"
   xmlns:cc="http://web.resource.org/cc/"
   xmlns:inkscape="http://www.inkscape.org/namespaces/inkscape"
   xmlns:sodipodi="http://sodipodi.sourceforge.net/DTD/sodipodi-0.dtd"
   xmlns:rdf="http://www.w3.org/1999/02/22-rdf-syntax-ns#"
   xmlns:svg="http://www.w3.org/2000/svg"
   xmlns:dc="http://purl.org/dc/elements/1.1/"
   xmlns:xlink="http://www.w3.org/1999/xlink">
  <svg:metadata
     id="metadata135" />
  <svg:metadata
     id="metadata196" />
  <svg:defs
     id="defs3" />
  <sodipodi:namedview
     id="base"
     pagecolor="#ffffff"
     bordercolor="#666666"
     borderopacity="1.0"
     inkscape:pageopacity="0.0"
     inkscape:pageshadow="2"
     inkscape:zoom="1.3802340"
     inkscape:cx="0.31522851"
     inkscape:cy="21.435893"
     inkscape:current-layer="layer1"
     inkscape:window-width="640"
     inkscape:window-height="536"
     inkscape:window-x="277"
     inkscape:window-y="60" />
  <svg:metadata
     id="metadata4">
    <rdf:RDF
       id="RDF5">
      <cc:Work
         rdf:about=""
         id="Work6">
        <dc:format
           id="format7">image/svg+xml</dc:format>
        <dc:type
           id="type9"
           rdf:resource="http://purl.org/dc/dcmitype/StillImage" />
      </cc:Work>
    </rdf:RDF>
  </svg:metadata>
  <svg:g
     inkscape:label="Layer 1"
     inkscape:groupmode="layer"
     id="layer1">
    <svg:g
       id="g193"
       transform="translate(-137.7683,-542.3125)">
      <svg:path
         style="fill:none;fill-opacity:0.75000000;fill-rule:evenodd;stroke:#000000;stroke-width:0.87500000;stroke-linecap:butt;stroke-linejoin:miter;stroke-miterlimit:4.0000000;stroke-opacity:1.0000000"
         d="M 138.19842,542.75550 L 241.84724,565.78857 L 241.84724,565.78857"
         id="path35" />
      <svg:path
         d="M 245.84776,566.78449 C 244.04704,567.03089 241.74858,567.62412 240.22209,568.45378 L 241.84976,565.89301 L 241.46294,562.88389 C 242.49330,564.28401 244.32163,565.79750 245.84776,566.78449 z "
         id="path167" />
    </svg:g>
    <svg:text
       xml:space="preserve"
       style="font-size:9.0000000;font-style:normal;font-variant:normal;font-weight:bold;font-stretch:normal;fill:#000000;fill-opacity:1.0000000;stroke:none;stroke-width:1.0000000pt;stroke-linecap:butt;stroke-linejoin:miter;stroke-opacity:1.0000000;font-family:Bitstream Vera Sans;text-anchor:start;writing-mode:lr-tb"
       x="37.836353"
       y="21.658188"
       id="text117"
       sodipodi:linespacing="100%"><svg:tspan
         sodipodi:role="line"
         id="tspan118"
         x="37.836353"
         y="21.658188">Q</svg:tspan></svg:text>
  </svg:g>
</svg:svg>
