<?xml version="1.0" encoding="UTF-8" standalone="no"?>
<!-- Created with Inkscape (http://www.inkscape.org/) -->
<svg
   xmlns:xml="http://www.w3.org/XML/1998/namespace"
   xmlns:dc="http://purl.org/dc/elements/1.1/"
   xmlns:cc="http://web.resource.org/cc/"
   xmlns:rdf="http://www.w3.org/1999/02/22-rdf-syntax-ns#"
   xmlns:svg="http://www.w3.org/2000/svg"
   xmlns="http://www.w3.org/2000/svg"
   xmlns:xlink="http://www.w3.org/1999/xlink"
   xmlns:sodipodi="http://inkscape.sourceforge.net/DTD/sodipodi-0.dtd"
   xmlns:inkscape="http://www.inkscape.org/namespaces/inkscape"
   sodipodi:docname="sled.svg"
   sodipodi:docbase="/home/bcrowell/Documents/writing/lm/trunk/1np/ch08/figs"
   inkscape:version="0.41+cvs"
   sodipodi:version="0.32"
   id="svg2"
   height="297mm"
   width="210mm">
  <defs
     id="defs3" />
  <sodipodi:namedview
     inkscape:window-y="14"
     inkscape:window-x="-10"
     inkscape:window-height="576"
     inkscape:window-width="798"
     inkscape:current-layer="layer1"
     inkscape:document-units="px"
     inkscape:cy="988.13047"
     inkscape:cx="222.28336"
     inkscape:zoom="1.2735514"
     inkscape:pageshadow="2"
     inkscape:pageopacity="0.0"
     borderopacity="1.0"
     bordercolor="#666666"
     pagecolor="#ffffff"
     id="base" />
  <metadata
     id="metadata4">
    <rdf:RDF
       id="RDF5">
      <cc:Work
         id="Work6"
         rdf:about="">
        <dc:format
           id="format7">image/svg+xml</dc:format>
        <dc:type
           rdf:resource="http://purl.org/dc/dcmitype/StillImage"
           id="type9" />
      </cc:Work>
    </rdf:RDF>
  </metadata>
  <g
     id="layer1"
     inkscape:groupmode="layer"
     inkscape:label="Layer 1">
    <image
       y="65.431084"
       x="117.64806"
       id="image2376"
       height="76.535431"
       width="184.25197"
       sodipodi:absref="/home/bcrowell/Documents/writing/lm/trunk/1np/ch08/figs/sled-bitmap.jpg"
       xlink:href="sled-bitmap.jpg" />
    <path
       id="path1458"
       d="M 182.34111,77.709665 L 229.64972,77.709665 L 229.64972,60.187955 L 182.34111,77.709665 z "
       style="fill:none;fill-opacity:0.75000000;fill-rule:evenodd;stroke:#000000;stroke-width:0.75000000;stroke-linecap:butt;stroke-linejoin:miter;stroke-miterlimit:4.0000000;stroke-opacity:1.0000000" />
    <text
       sodipodi:linespacing="100%"
       id="text2379"
       y="66.008331"
       x="202.45854"
       style="font-size:10.000000;font-style:normal;font-variant:normal;font-weight:normal;font-stretch:normal;fill:#000000;fill-opacity:1.0000000;stroke:none;stroke-width:1.0000000pt;stroke-linecap:butt;stroke-linejoin:miter;stroke-opacity:1.0000000;font-family:Bitstream Vera Sans;text-anchor:start;writing-mode:lr-tb"
       xml:space="preserve"><tspan
         y="66.008331"
         x="202.45854"
         id="tspan2381"
         sodipodi:role="line">F</tspan></text>
    <text
       sodipodi:linespacing="100%"
       id="text2383"
       y="88.089462"
       x="205.40269"
       style="font-size:10.000000;font-style:normal;font-variant:normal;font-weight:normal;font-stretch:normal;fill:#000000;fill-opacity:1.0000000;stroke:none;stroke-width:1.0000000pt;stroke-linecap:butt;stroke-linejoin:miter;stroke-opacity:1.0000000;font-family:Bitstream Vera Sans;text-anchor:start;writing-mode:lr-tb"
       xml:space="preserve"><tspan
         y="88.089462"
         x="205.40269"
         id="tspan2385"
         sodipodi:role="line">F</tspan></text>
    <text
       sodipodi:linespacing="100%"
       id="text2387"
       y="92.297569"
       x="209.61079"
       style="font-size:9.0000000;font-style:normal;font-variant:normal;font-weight:normal;font-stretch:normal;fill:#000000;fill-opacity:1.0000000;stroke:none;stroke-width:1.0000000pt;stroke-linecap:butt;stroke-linejoin:miter;stroke-opacity:1.0000000;font-family:Bitstream Vera Sans;text-anchor:start;writing-mode:lr-tb"
       xml:space="preserve"><tspan
         y="92.297569"
         x="209.61079"
         id="tspan2389"
         sodipodi:role="line">x</tspan></text>
    <path
       id="path2391"
       d="M 223.44379,61.263984 L 230.07459,59.790525 L 224.23680,63.442713"
       style="fill:#000000;fill-opacity:1.0000000;fill-rule:evenodd;stroke:#000000;stroke-width:0.037500563pt;stroke-linecap:butt;stroke-linejoin:miter;stroke-opacity:1.0000000" />
  </g>
</svg>
