<?xml version="1.0" encoding="UTF-8" standalone="no"?>
<!-- Generator: Adobe Illustrator 11 Build 196, SVG Export Plug-In . SVG Version: 6.0.0 Build 78)  -->
<svg
   xmlns:dc="http://purl.org/dc/elements/1.1/"
   xmlns:cc="http://web.resource.org/cc/"
   xmlns:rdf="http://www.w3.org/1999/02/22-rdf-syntax-ns#"
   xmlns:svg="http://www.w3.org/2000/svg"
   xmlns="http://www.w3.org/2000/svg"
   xmlns:sodipodi="http://inkscape.sourceforge.net/DTD/sodipodi-0.dtd"
   xmlns:inkscape="http://www.inkscape.org/namespaces/inkscape"
   width="145.901"
   height="153.38"
   viewBox="0 0 145.901 153.38"
   style="overflow:visible;enable-background:new 0 0 145.901 153.38"
   xml:space="preserve"
   id="svg2"
   sodipodi:version="0.32"
   inkscape:version="0.42.2"
   sodipodi:docname="eg-shoplifting-mirror.svg"
   sodipodi:docbase="/home/bcrowell/Documents/writing/lm/trunk/5op/ch03/figs"><metadata
   id="metadata130"><rdf:RDF><cc:Work
       rdf:about=""><dc:format>image/svg+xml</dc:format><dc:type
         rdf:resource="http://purl.org/dc/dcmitype/StillImage" /></cc:Work></rdf:RDF></metadata><defs
   id="defs128">
		
		 
		
		
		
		
		 
		
		
		
		 
		
		
		 
		
		
		
		
		
		
		
		
		
		
		
		
		
		
		
		
	
			
		
			
		
			
		
			
		
			
			
		
			
			
		
			
		
			
		
			
			
		
				
				
				
				
				
				
			
				
				
				
				
				
				
			</defs><sodipodi:namedview
   inkscape:cy="52.829940"
   inkscape:cx="68.698274"
   inkscape:zoom="3.5430058"
   inkscape:window-height="996"
   inkscape:window-width="1278"
   inkscape:pageshadow="2"
   inkscape:pageopacity="0.0"
   borderopacity="1.0"
   bordercolor="#666666"
   pagecolor="#ffffff"
   id="base"
   inkscape:window-x="0"
   inkscape:window-y="0"
   inkscape:current-layer="svg2" />
	<style
   type="text/css"
   id="style4">
	
	</style>
	<rect
   style="fill:#dedede;fill-opacity:1.0000000;fill-rule:evenodd;stroke:none;stroke-width:1.0506082pt;stroke-linecap:butt;stroke-linejoin:miter;stroke-opacity:1.0000000;overflow:visible"
   id="rect2258"
   width="184.25197"
   height="95.681465"
   x="-19.947062"
   y="98.829124" /><rect
   style="fill:#dedede;fill-opacity:1.0000000;fill-rule:evenodd;stroke:none;stroke-width:1.0506082pt;stroke-linecap:butt;stroke-linejoin:miter;stroke-opacity:1.0000000"
   id="rect2256"
   width="184.25197"
   height="96.245956"
   x="-19.947062"
   y="-2.9844053" /><path
   id="path11"
   d="M 36.925410,50.830570 C 36.925410,39.050370 35.555494,27.590674 32.975236,16.597534 L 18.291571,16.597534 L 18.291571,85.984546 L 32.745339,85.984546 C 35.466239,74.708768 36.925410,62.942091 36.925410,50.830570 z "
   style="fill:#c2c2c2;fill-opacity:1.0000000" /><path
   id="path13"
   d="M 35.010502,28.993046 L 18.291571,45.711977 L 18.291571,47.318553 L 35.202534,30.407590 C 35.137622,29.935625 35.079471,29.462307 35.010502,28.993046 z "
   style="fill:#d1d1d1;fill-opacity:1.0000000" /><path
   id="path15"
   d="M 36.168102,33.513906 L 18.291571,51.390437 L 18.291571,52.997012 L 36.314154,34.974429 C 36.261413,34.488940 36.224900,33.998042 36.168102,33.513906 z "
   style="fill:#d1d1d1;fill-opacity:1.0000000" /><path
   id="path17"
   d="M 37.148545,48.956232 L 18.291571,67.814558 L 18.291571,69.421134 L 37.179649,50.533056 C 37.176945,50.004292 37.158012,49.480938 37.148545,48.956232 z "
   style="fill:#d1d1d1;fill-opacity:1.0000000" /><path
   id="path19"
   d="M 37.168831,52.446611 L 18.291571,71.323871 L 18.291571,74.535669 L 37.101214,55.726026 C 37.133670,54.636043 37.158012,53.543356 37.168831,52.446611 z "
   style="fill:#d1d1d1;fill-opacity:1.0000000" /><path
   id="path21"
   d="M 36.978151,59.066296 L 18.291571,77.754229 L 18.291571,79.360804 L 36.872669,60.779706 C 36.907830,60.207668 36.949752,59.638334 36.978151,59.066296 z "
   style="fill:#d1d1d1;fill-opacity:1.0000000" /><path
   style="fill:none;stroke:#000000;stroke-width:0.67616802"
   d="M 37.179649,50.531703 C 37.179649,38.751504 35.809733,27.291808 33.229475,16.298668 L 18.545810,16.298668 L 18.545810,85.685680 L 32.999578,85.685680 C 35.719126,74.409901 37.179649,62.641873 37.179649,50.531703 z "
   id="path23" /><circle
   sodipodi:ry="1.6970000"
   sodipodi:rx="1.6970000"
   sodipodi:cy="35.004002"
   sodipodi:cx="137.48900"
   id="circle25"
   r="1.6970000"
   cy="35.004002"
   cx="137.48900"
   transform="matrix(1.352336,0.000000,0.000000,1.352336,-30.17751,3.669201)" /><line
   id="line27"
   y2="51.366096"
   x2="-2.6993902"
   y1="21.283379"
   x1="34.209919"
   style="fill:none;stroke:#000000;stroke-dasharray:2.7046722 " /><line
   id="line29"
   y2="51.366096"
   x2="35.953083"
   y1="51.366096"
   x1="-2.6993902"
   style="fill:none;stroke:#000000;stroke-dasharray:2.7046722 " /><polyline
   id="polyline31"
   points="137.489,34.892 47.712,12.964 61.854,1.52 "
   style="fill:none;stroke:#000000"
   transform="matrix(1.352336,0.000000,0.000000,1.352336,-30.17751,3.669201)" /><path
   id="path33"
   d="M 56.010929,3.6692009 C 54.458447,4.1925549 52.366383,4.6347688 50.800378,4.5779707 L 53.141272,5.9911620 L 54.036518,8.5754762 C 54.305633,7.0324607 55.175185,5.0783351 56.010929,3.6692009 z " /><circle
   sodipodi:ry="1.6970000"
   sodipodi:rx="1.6970000"
   sodipodi:cy="35.419998"
   sodipodi:cx="20.495001"
   id="circle35"
   r="1.6970000"
   cy="35.419998"
   cx="20.495001"
   transform="matrix(1.352336,0.000000,0.000000,1.352336,-30.17751,3.669201)" /><text
   id="text39"
   x="152.50931"
   y="44.876507"><tspan
     x="152.50931"
     y="44.876507"
     style="font-size:11.494857px;font-family:Bitstream Vera Sans"
     id="tspan41">O</tspan></text>

<text
   id="text45"
   x="-10.810297"
   y="54.610214"><tspan
     x="-10.810297"
     y="54.610214"
     style="font-size:11.494857px;font-family:Bitstream Vera Sans"
     id="tspan47">I</tspan></text>

<path
   id="path53"
   d="M 37.166126,151.55662 C 37.166126,139.77642 35.796209,128.31672 33.215952,117.32358 L 18.532287,117.32358 L 18.532287,186.71059 L 32.986055,186.71059 C 35.706955,175.43482 37.166126,163.66814 37.166126,151.55662 z "
   style="fill:#c2c2c2;fill-opacity:1.0000000" /><path
   id="path55"
   d="M 35.251218,129.71909 L 18.532287,146.43802 L 18.532287,148.04460 L 35.443250,131.13364 C 35.378338,130.66167 35.321539,130.18835 35.251218,129.71909 z "
   style="fill:#d1d1d1;fill-opacity:1.0000000" /><path
   id="path57"
   d="M 36.407465,134.23995 L 18.532287,152.11513 L 18.532287,153.72171 L 36.554870,135.69912 C 36.502129,135.21364 36.465616,134.72409 36.407465,134.23995 z "
   style="fill:#d1d1d1;fill-opacity:1.0000000" /><path
   id="path59"
   d="M 37.389261,149.68228 L 18.532287,168.54061 L 18.532287,170.14718 L 37.420365,151.25910 C 37.417660,150.73034 37.398728,150.20699 37.389261,149.68228 z "
   style="fill:#d1d1d1;fill-opacity:1.0000000" /><path
   id="path61"
   d="M 37.409546,153.17266 L 18.532287,172.04992 L 18.532287,175.26172 L 37.341930,156.45207 C 37.375738,155.36209 37.400080,154.26940 37.409546,153.17266 z "
   style="fill:#d1d1d1;fill-opacity:1.0000000" /><path
   id="path63"
   d="M 37.218867,159.79234 L 18.532287,178.47892 L 18.532287,180.08550 L 37.113385,161.50440 C 37.148545,160.93507 37.189116,160.36573 37.218867,159.79234 z "
   style="fill:#d1d1d1;fill-opacity:1.0000000" /><path
   style="fill:none;stroke:#000000;stroke-width:0.67616802"
   d="M 37.420365,151.25775 C 37.420365,139.47755 36.050449,128.01786 33.471544,117.02472 L 18.786526,117.02472 L 18.786526,186.41173 L 33.240294,186.41173 C 35.959842,175.13460 37.420365,163.36792 37.420365,151.25775 z "
   id="path65" /><circle
   sodipodi:ry="1.6970000"
   sodipodi:rx="1.6970000"
   sodipodi:cy="127.48700"
   sodipodi:cx="67.291000"
   id="circle67"
   r="1.6970000"
   cy="127.48700"
   cx="67.291000"
   transform="matrix(1.352336,0.000000,0.000000,1.352336,-30.17751,-20.67285)" /><polyline
   style="fill:none;stroke:#000000"
   points="67.291,127.487 48.896,108.98 52.738,95.34 "
   id="polyline71"
   transform="matrix(1.352336,0.000000,0.000000,1.352336,-30.17751,-20.67285)" /><path
   d="M 42.022365,105.11604 C 42.154894,106.74831 42.574118,108.84579 43.244877,110.26168 L 41.021636,108.66998 L 38.293974,108.86742 C 39.605740,108.01004 41.058149,106.43998 42.022365,105.11604 z "
   id="path73" /><line
   id="line75"
   y2="152.19086"
   x2="28.239351"
   y1="127.11179"
   x1="35.674500"
   style="fill:none;stroke:#000000;stroke-dasharray:2.7046722 " /><circle
   sodipodi:ry="1.6970000"
   sodipodi:rx="1.6970000"
   sodipodi:cy="128.01199"
   sodipodi:cx="43.297001"
   id="circle77"
   r="1.6970000"
   cy="128.01199"
   cx="43.297001"
   transform="matrix(1.352336,0.000000,0.000000,1.352336,-30.17751,-20.67285)" /><text
   id="text81"
   x="62.564487"
   y="146.28252"><tspan
     x="62.564487"
     y="146.28252"
     style="font-size:11.494857px;font-family:Bitstream Vera Sans"
     id="tspan83">O</tspan></text>

<text
   id="text87"
   x="21.343927"
   y="156.08897"><tspan
     x="21.343927"
     y="156.08897"
     style="font-size:11.494857px;font-family:Bitstream Vera Sans"
     id="tspan89">I</tspan></text>

<text
   id="text93"
   y="9.4892998"
   x="-16.15564"><tspan
     x="-16.15564"
     y="9.4892998"
     style="font-size:8.5000000px;font-family:Bitstream Vera Sans"
     id="tspan95">1</tspan></text>

<text
   id="text99"
   y="110.7993"
   x="-15.966797"><tspan
     x="-15.966797"
     y="110.7993"
     style="font-size:8.5000000px;font-family:Bitstream Vera Sans"
     id="tspan101">2</tspan></text>

<line
   id="line103"
   y2="38.320000"
   x2="145.90100"
   y1="25.320000"
   x1="145.90100"
   style="fill:none" /><line
   id="line105"
   y2="50.983383"
   x2="37.179649"
   y1="50.983383"
   x1="155.95670"
   style="fill:none;stroke:#000000" /><path
   id="path107"
   d="M 56.578910,51.040182 C 55.041304,50.474905 53.134510,49.506633 51.951216,48.478857 L 52.887033,51.048296 L 51.962035,53.621791 C 53.141272,52.589959 55.044009,51.613572 56.578910,51.040182 z " /><path
   id="path109"
   d="M 37.808485,51.078047 C 39.346092,51.644676 41.252885,52.612948 42.436180,53.639372 L 41.500363,51.069933 L 42.425361,48.496437 C 41.246124,49.528270 39.343387,50.504657 37.808485,51.078047 z " /><line
   id="line111"
   y2="152.48161"
   x2="35.953083"
   y1="152.48161"
   x1="28.374590"
   style="fill:none;stroke:#000000;stroke-dasharray:2.7046722 " /><line
   id="line113"
   y2="152.09891"
   x2="37.179649"
   y1="152.09891"
   x1="61.647472"
   style="fill:none;stroke:#000000" /><path
   id="path115"
   d="M 53.874238,152.15570 C 52.336632,151.58907 50.429838,150.62080 49.246544,149.59438 L 50.182361,152.16382 L 49.257363,154.73731 C 50.436600,153.70548 52.339337,152.72909 53.874238,152.15570 z " /><path
   id="path117"
   d="M 37.808485,152.19357 C 39.346092,152.76020 41.252885,153.72712 42.436180,154.75489 L 41.500363,152.18545 L 42.425361,149.61196 C 41.246124,150.64379 39.343387,151.62018 37.808485,152.19357 z " /><line
   id="line119"
   y2="18.515146"
   x2="47.236973"
   y1="23.752745"
   x1="21.882021"
   style="fill:none;stroke:#000000;stroke-width:0.67616802" /><line
   id="line121"
   y2="123.66061"
   x2="49.660358"
   y1="129.99362"
   x1="24.556944"
   style="fill:none;stroke:#000000;stroke-width:0.67616802" /><path
   id="path123"
   d="M 50.270262,109.30017 L 51.225012,107.81531 L 44.333507,107.93702 L 47.084159,114.25784 L 47.877980,113.02180 C 50.086345,114.59998 51.826801,116.76642 52.819416,119.31287 L 56.831797,117.42501 C 55.483518,114.12801 53.177785,111.32868 50.270262,109.30017 z "
   style="fill:#a0a0a0;fill-opacity:1.0000000" /><path
   id="path125"
   d="M 57.582344,134.82687 L 59.161872,135.61393 L 53.177785,139.03534 L 52.305528,132.19657 L 53.619999,132.85246 C 54.708629,130.36686 55.096750,127.61486 54.645070,124.91830 L 59.059095,124.48691 C 59.589210,128.01245 59.041514,131.59614 57.582344,134.82687 z "
   style="fill:#a0a0a0;fill-opacity:1.0000000" />
</svg>