<?xml version="1.0" encoding="iso-8859-1"?>
<!-- Generator: Adobe Illustrator 11 Build 196, SVG Export Plug-In . SVG Version: 6.0.0 Build 78)  -->
<!DOCTYPE svg PUBLIC "-//W3C//DTD SVG 1.0//EN"    "http://www.w3.org/TR/2001/REC-SVG-20010904/DTD/svg10.dtd" [
	<!ENTITY ns_flows "http://ns.adobe.com/Flows/1.0/">
	<!ENTITY ns_svg "http://www.w3.org/2000/svg">
	<!ENTITY ns_xlink "http://www.w3.org/1999/xlink">
]>
<svg  
	 width="120.622" height="137.463" viewBox="0 0 120.622 137.463"
	 style="overflow:visible;enable-background:new 0 0 120.622 137.463" xml:space="preserve">
	<style type="text/css">
	
	</style>
	<g id="Layer_1">
		<circle cx="55.654" cy="69.125" r="2.652"/> 
		<circle style="fill:none;stroke:#000000;" cx="55.654" cy="69.125" r="20.152"/> 
		<circle style="fill:none;stroke:#000000;" cx="55.654" cy="69.125" r="15.38"/> 
		<circle style="fill:none;stroke:#000000;" cx="55.654" cy="69.125" r="29.168"/> 
		<circle style="fill:none;stroke:#000000;" cx="55.654" cy="69.125" r="7.425"/> 
		<circle style="fill:none;stroke:#000000;" cx="55.654" cy="69.125" r="44.017"/> 
		<circle style="fill:none;stroke:#000000;" cx="55.654" cy="69.125" r="37.123"/> 
		<circle style="fill:none;stroke:#000000;" cx="55.654" cy="69.125" r="55.154"/> 
		<g>
			<text transform="matrix(1 0 0 1 12.6543 10)"><tspan x="0" y="0" style="font-family:Bitstream Vera Sans; font-size:8.500000;">orbiting electrons</tspan></text>
		</g>
		<g>
			<text transform="matrix(1 0 0 1 86.1543 133)"><tspan x="0" y="0" style="font-family:Bitstream Vera Sans; font-size:8.500000;">nucleus</tspan></text>
		</g>
		<g>
			<path style="fill:none;stroke:#000000;stroke-width:0.5;" d="M84.154,129c-47.5-39.5-6-25-25.5-55.5"/>
			<path d="M57.84,72.232c0.604,0.456,1.458,0.957,2.152,1.16l-1.233,0.278l-0.77,1.003C58.096,73.957,58,72.973,57.84,72.232z"/>
		</g>
	</g>
</svg>
