<?xml version="1.0" encoding="UTF-8" standalone="no"?>
<!-- Created with Inkscape (http://www.inkscape.org/) -->

<svg
   xmlns:dc="http://purl.org/dc/elements/1.1/"
   xmlns:cc="http://creativecommons.org/ns#"
   xmlns:rdf="http://www.w3.org/1999/02/22-rdf-syntax-ns#"
   xmlns:svg="http://www.w3.org/2000/svg"
   xmlns="http://www.w3.org/2000/svg"
   xmlns:sodipodi="http://sodipodi.sourceforge.net/DTD/sodipodi-0.dtd"
   xmlns:inkscape="http://www.inkscape.org/namespaces/inkscape"
   width="110.00000mm"
   height="12.000000mm"
   id="svg38"
   sodipodi:version="0.32"
   inkscape:version="0.47 r22583"
   sodipodi:docname="title-pretty-big.svg"
   version="1.1">
  <metadata
     id="metadata40" />
  <defs
     id="defs3">
    <inkscape:perspective
       sodipodi:type="inkscape:persp3d"
       inkscape:vp_x="0 : 21.259842 : 1"
       inkscape:vp_y="0 : 1000 : 0"
       inkscape:vp_z="389.76379 : 21.259842 : 1"
       inkscape:persp3d-origin="194.8819 : 14.173228 : 1"
       id="perspective10" />
  </defs>
  <sodipodi:namedview
     id="base"
     pagecolor="#ffffff"
     bordercolor="#666666"
     borderopacity="1.0"
     inkscape:pageopacity="0.0"
     inkscape:pageshadow="2"
     inkscape:zoom="1.7954216"
     inkscape:cx="199.1618"
     inkscape:cy="33.162578"
     inkscape:current-layer="layer1"
     inkscape:window-width="1124"
     inkscape:window-height="750"
     inkscape:window-x="79"
     inkscape:window-y="20"
     showgrid="false"
     inkscape:window-maximized="0" />
  <metadata
     id="metadata4">
    <rdf:RDF>
      <cc:Work
         rdf:about="">
        <dc:format>image/svg+xml</dc:format>
        <dc:type
           rdf:resource="http://purl.org/dc/dcmitype/StillImage" />
      </cc:Work>
    </rdf:RDF>
  </metadata>
  <g
     inkscape:label="Layer 1"
     inkscape:groupmode="layer"
     id="layer1">
    <text
       xml:space="preserve"
       style="font-size:40px;font-style:normal;font-variant:normal;font-weight:normal;font-stretch:normal;line-height:100%;writing-mode:lr-tb;text-anchor:start;fill:#000000;fill-opacity:1;stroke:none;font-family:Bitstream Vera Sans"
       x="-3.9112034"
       y="30.386198"
       id="text35"
       sodipodi:linespacing="100%"><tspan
         sodipodi:role="line"
         id="tspan36"
         x="-3.9112034"
         y="30.386198">Light and Matter</tspan></text>
  </g>
</svg>
