<?xml version="1.0" encoding="iso-8859-1"?>
<!-- Generator: Adobe Illustrator 11 Build 196, SVG Export Plug-In . SVG Version: 6.0.0 Build 78)  -->
<!DOCTYPE svg PUBLIC "-//W3C//DTD SVG 1.0//EN"    "http://www.w3.org/TR/2001/REC-SVG-20010904/DTD/svg10.dtd" [
	<!ENTITY ns_flows "http://ns.adobe.com/Flows/1.0/">
	<!ENTITY ns_svg "http://www.w3.org/2000/svg">
	<!ENTITY ns_xlink "http://www.w3.org/1999/xlink">
]>
<svg  
	 width="141.369" height="133.35" viewBox="0 0 141.369 133.35" style="overflow:visible;enable-background:new 0 0 141.369 133.35"
	 xml:space="preserve">
	<style type="text/css">
	
	</style>
	<g id="Layer_1">
		<polygon style="fill:#FFFF80;stroke:#000000;stroke-width:0.25;" points="57.396,11.524 57.396,74.312 120.574,61.053 
			120.184,55.983 122.524,54.813 120.574,40.383 117.454,34.143 116.284,22.054 117.064,19.324 120.964,18.154 124.084,19.713 
			126.034,17.764 128.764,18.543 128.374,20.104 131.884,20.104 135.394,25.563 138.514,26.343 141.244,19.713 141.244,11.524 "/>
		<polygon style="fill:#B3E2B3;stroke:#000000;stroke-width:0.25;" points="0.847,97.322 3.967,96.542 8.257,98.492 11.376,103.171 
			10.207,108.241 13.327,109.412 17.617,107.852 23.076,110.971 28.926,114.481 36.726,122.281 43.454,131.251 125.533,131.251 
			124.864,128.131 120.964,126.181 120.964,115.261 125.644,109.021 124.084,96.542 129.934,89.912 133.444,87.182 135.394,83.282 
			127.204,78.212 120.574,65.342 120.574,61.053 64.909,11.914 0.847,11.914 "/>
		<polygon style="fill:#B4B4B4;" points="15.759,88.211 13.029,89.771 7.959,85.481 2.109,88.601 8.739,92.111 4.839,95.621 
			4.249,96.487 8.349,98.351 11.469,103.031 10.299,108.101 13.419,109.271 17.708,107.71 21.68,109.979 22.778,108.88 
			24.338,101.861 18.489,97.961 21.608,95.621 25.898,97.181 26.678,92.501 17.708,90.941 "/>
		<circle cx="11.948" cy="98.377" r="1.379"/> 
		<polygon style="fill:#B4B4B4;" points="99.515,18.934 104.975,21.273 107.704,15.814 100.685,13.474 "/>
		<circle cx="102.426" cy="17.374" r="1.379"/> 
		<rect x="65.585" y="11.437" style="fill:#FFFF80;" width="75.268" height="1.95"/> 
		<rect x="0.847" y="11.48" style="fill:#B3E2B3;" width="65.908" height="1.95"/> 
		<rect x="0.327" y="11.654" style="fill:#B3E2B3;" width="0.78" height="84.498"/> 
		<polygon style="fill:#FFFF80;" points="66.755,13.43 64.545,11.48 66.755,11.48 "/>
		<line style="fill:none;stroke:#000000;stroke-width:0.25;" x1="66.582" y1="13.43" x2="64.545" y2="11.48"/>
		<g>
			<text transform="matrix(1 0 0 1 0 118.333)"><tspan x="0" y="0" style="font-family:Bitstream Vera Sans; font-size:7.650000;">Los</tspan></text>
			<text transform="matrix(1 0 0 1 0 129.333)"><tspan x="0" y="0" style="font-family:Bitstream Vera Sans; font-size:7.650000;">Angeles</tspan></text>
		</g>
		<g>
			<text transform="matrix(1 0 0 1 98.6665 9)"><tspan x="0" y="0" style="font-family:Bitstream Vera Sans; font-size:7.650000;">Las V</tspan></text>
			<text transform="matrix(1 0 0 1 121.1855 9)"><tspan x="0" y="0" style="font-family:Bitstream Vera Sans; font-size:7.650000;">egas</tspan></text>
		</g>
		<g>
			<line style="fill:none;stroke:#000000;" x1="12.667" y1="97.333" x2="99" y2="20.333"/>
			<path d="M101.707,17.922c-0.851,1.606-1.71,3.818-1.928,5.542l-1.129-2.816l-2.669-1.442
				C97.719,19.187,100.015,18.584,101.707,17.922z"/>
		</g>
		<g>
			<line style="fill:none;stroke:#000000;" x1="102.375" y1="97.954" x2="102.375" y2="21.955"/>
			<path d="M102.375,18.333c0.632,1.704,1.711,3.818,2.853,5.128l-2.853-1.032l-2.853,1.032
				C100.664,22.151,101.743,20.037,102.375,18.333z"/>
		</g>
		<g>
			<line style="fill:none;stroke:#000000;" x1="11.948" y1="98.377" x2="99.333" y2="98.377"/>
			<path d="M102.954,98.377c-1.704,0.632-3.818,1.711-5.128,2.853l1.032-2.853l-1.032-2.853
				C99.136,96.667,101.25,97.746,102.954,98.377z"/>
		</g>
		<g>
			<text transform="matrix(1 0 0 1 55.3442 106.9756)"><tspan x="0" y="0" style="font-family:'Symbol'; font-size:9;">&#x2206;</tspan></text>
			<text transform="matrix(1 0 0 1 60.8521 106.9756)"><tspan x="0" y="0" style="font-family:Bitstream Vera Sans; font-size:7.650000;">x</tspan></text>
		</g>
		<g>
			<text transform="matrix(1 0 0 1 103.6748 60.3677)"><tspan x="0" y="0" style="font-family:'Symbol'; font-size:9;">&#x2206;</tspan></text>
			<text transform="matrix(1 0 0 1 109.1831 60.3677)"><tspan x="0" y="0" style="font-family:Bitstream Vera Sans; font-size:7.650000;">y</tspan></text>
		</g>
		<g>
			<text transform="matrix(1 0 0 1 47.1777 53.1421)"><tspan x="0" y="0" style="font-family:Bitstream Vera Sans; font-size:7.650000;">|</tspan></text>
			<text transform="matrix(1 0 0 1 49.5156 53.1421)"><tspan x="0" y="0" style="font-family:'Symbol'; font-size:9;">&#x2206;</tspan></text>
			<text transform="matrix(1 0 0 1 55.0239 53.1421)"><tspan x="0" y="0" style="font-family:Bitstream Vera Sans-Bold'; font-size:7.650000;">r</tspan></text>
			<text transform="matrix(1 0 0 1 58.5259 53.1421)"><tspan x="0" y="0" style="font-family:Bitstream Vera Sans; font-size:7.650000;">|</tspan></text>
		</g>
		<g>
			<text transform="matrix(1 0 0 1 32.9692 92.3086)"><tspan x="0" y="0" style="font-family:'Symbol'; font-size:9;">&#x3B8;</tspan></text>
		</g>
		<path style="fill:none;stroke:#000000;stroke-width:0.5;" d="M30.333,99c0-6-2.333-9.333-5-12.333"/>
	</g>
</svg>
