<?xml version="1.0" encoding="iso-8859-1"?>
<!-- Generator: Adobe Illustrator 11 Build 196, SVG Export Plug-In . SVG Version: 6.0.0 Build 78)  -->
<!DOCTYPE svg PUBLIC "-//W3C//DTD SVG 1.0//EN"    "http://www.w3.org/TR/2001/REC-SVG-20010904/DTD/svg10.dtd" [
	<!ENTITY ns_flows "http://ns.adobe.com/Flows/1.0/">
	<!ENTITY ns_svg "http://www.w3.org/2000/svg">
	<!ENTITY ns_xlink "http://www.w3.org/1999/xlink">
]>
<svg  
	 width="119.775" height="72.684" viewBox="0 0 119.775 72.684" style="overflow:visible;enable-background:new 0 0 119.775 72.684"
	 xml:space="preserve">
	<style type="text/css">
	
	</style>
	<g id="Layer_1">
		<g>
			<line style="fill:none;stroke:#000000;" x1="0" y1="1.847" x2="15" y2="1.847"/>
			<path style="fill:none;stroke:#000000;" d="M14.93,1.847c10.935,0,19.799,8.865,19.799,19.799"/>
			<g>
				<line style="fill:none;stroke:#000000;" x1="34.854" y1="21.667" x2="34.854" y2="69.667"/>
				<path d="M34.854,72.684c-0.527-1.42-1.426-3.182-2.377-4.273l2.377,0.86l2.377-0.86C36.28,69.503,35.381,71.264,34.854,72.684z"
					/>
			</g>
			<line style="fill:none;stroke:#000000;stroke-width:0.5;" x1="15.5" y1="0" x2="15.5" y2="3.667"/>
			<line style="fill:none;stroke:#000000;stroke-width:0.5;" x1="33.042" y1="21.833" x2="36.708" y2="21.833"/>
		</g>
		<line style="fill:none;stroke:#000000;" x1="61.875" y1="1.847" x2="76.875" y2="1.847"/>
		<path style="fill:none;stroke:#000000;" d="M76.805,1.847c7.572,0,14.152,4.251,17.482,10.498"/>
		<g>
			<line style="fill:none;stroke:#000000;" x1="94.267" y1="12.334" x2="118.266" y2="53.903"/>
			<path d="M119.775,56.517c-1.166-0.966-2.825-2.042-4.195-2.512l2.489-0.444l1.629-1.933
				C119.419,53.049,119.521,55.024,119.775,56.517z"/>
		</g>
		<line style="fill:none;stroke:#000000;stroke-width:0.5;" x1="77.375" y1="0" x2="77.375" y2="3.667"/>
		<line style="fill:none;stroke:#000000;stroke-width:0.5;" x1="92.574" y1="13.28" x2="95.75" y2="11.446"/>
		<g>
			<text transform="matrix(1 0 0 1 11.7292 63.842)"><tspan x="0" y="0" style="font-family:Bitstream Vera Sans; font-size:7.650000;">(1)</tspan></text>
		</g>
		<g>
			<text transform="matrix(1 0 0 1 80.7292 63.842)"><tspan x="0" y="0" style="font-family:Bitstream Vera Sans; font-size:7.650000;">(2)</tspan></text>
		</g>
	</g>
</svg>
