<?xml version="1.0" encoding="UTF-8" standalone="no"?>
<!-- Generator: Adobe Illustrator 11 Build 196, SVG Export Plug-In . SVG Version: 6.0.0 Build 78)  -->
<svg
   xmlns:a="http://ns.adobe.com/AdobeSVGViewerExtensions/3.0/"
   xmlns:dc="http://purl.org/dc/elements/1.1/"
   xmlns:cc="http://web.resource.org/cc/"
   xmlns:rdf="http://www.w3.org/1999/02/22-rdf-syntax-ns#"
   xmlns:svg="http://www.w3.org/2000/svg"
   xmlns="http://www.w3.org/2000/svg"
   xmlns:sodipodi="http://inkscape.sourceforge.net/DTD/sodipodi-0.dtd"
   xmlns:inkscape="http://www.inkscape.org/namespaces/inkscape"
   width="215.852"
   height="147.461"
   viewBox="0 0 215.852 147.461"
   style="overflow:visible;enable-background:new 0 0 215.852 147.461"
   xml:space="preserve"
   id="svg2"
   sodipodi:version="0.32"
   inkscape:version="0.42.2"
   sodipodi:docname="triple-slit-numerical.svg"
   sodipodi:docbase="/home/bcrowell/Documents/writing/lm/trunk/5op/ch05/figs"><metadata
   id="metadata140"><rdf:RDF><cc:Work
       rdf:about=""><dc:format>image/svg+xml</dc:format><dc:type
         rdf:resource="http://purl.org/dc/dcmitype/StillImage" /></cc:Work></rdf:RDF></metadata><defs
   id="defs138">
		
			<linearGradient
   gradientTransform="matrix(1.1415 0 0 1.1415 -28.1206 -362.6918)"
   y2="416.9883"
   x2="82.0166"
   y1="433.4883"
   x1="82.0166"
   gradientUnits="userSpaceOnUse"
   id="XMLID_5_">
			<stop
   id="stop8"
   style="stop-color:#FFFFFF"
   offset="0" />
			<stop
   id="stop10"
   style="stop-color:#F6F6F6"
   offset="0.0436" />
			<stop
   id="stop12"
   style="stop-color:#CECECE"
   offset="0.2516" />
			<stop
   id="stop14"
   style="stop-color:#A5A5A5"
   offset="0.4476" />
			<stop
   id="stop16"
   style="stop-color:#7C7C7C"
   offset="0.6259" />
			<stop
   id="stop18"
   style="stop-color:#545454"
   offset="0.7831" />
			<stop
   id="stop20"
   style="stop-color:#2A2A2A"
   offset="0.9131" />
			<stop
   id="stop22"
   style="stop-color:#000000"
   offset="1" />
			<midPointStop
   style="stop-color:#FFFFFF"
   offset="0" />
			<midPointStop
   style="stop-color:#FFFFFF"
   offset="0.38" />
			<midPointStop
   style="stop-color:#000000"
   offset="1" />
		</linearGradient>
		 
		
			<linearGradient
   gradientTransform="matrix(1.1415 0 0 1.1415 -29.3208 -362.6918)"
   y2="416.9883"
   x2="157.7671"
   y1="433.4883"
   x1="157.7671"
   gradientUnits="userSpaceOnUse"
   id="XMLID_6_">
			<stop
   id="stop27"
   style="stop-color:#FFFFFF"
   offset="0" />
			<stop
   id="stop29"
   style="stop-color:#F6F6F6"
   offset="0.0436" />
			<stop
   id="stop31"
   style="stop-color:#CECECE"
   offset="0.2516" />
			<stop
   id="stop33"
   style="stop-color:#A5A5A5"
   offset="0.4476" />
			<stop
   id="stop35"
   style="stop-color:#7C7C7C"
   offset="0.6259" />
			<stop
   id="stop37"
   style="stop-color:#545454"
   offset="0.7831" />
			<stop
   id="stop39"
   style="stop-color:#2A2A2A"
   offset="0.9131" />
			<stop
   id="stop41"
   style="stop-color:#000000"
   offset="1" />
			<midPointStop
   style="stop-color:#FFFFFF"
   offset="0" />
			<midPointStop
   style="stop-color:#FFFFFF"
   offset="0.38" />
			<midPointStop
   style="stop-color:#000000"
   offset="1" />
		</linearGradient>
		 
		
		
		
		
		
		
		
			<linearGradient
   gradientTransform="matrix(1.1415 0 0 1.1415 -28.7207 -362.6918)"
   y2="416.9883"
   x2="208.2046"
   y1="433.4883"
   x1="208.2046"
   gradientUnits="userSpaceOnUse"
   id="XMLID_7_">
			<stop
   id="stop82"
   style="stop-color:#FFFFFF"
   offset="0" />
			<stop
   id="stop84"
   style="stop-color:#F6F6F6"
   offset="0.0436" />
			<stop
   id="stop86"
   style="stop-color:#CECECE"
   offset="0.2516" />
			<stop
   id="stop88"
   style="stop-color:#A5A5A5"
   offset="0.4476" />
			<stop
   id="stop90"
   style="stop-color:#7C7C7C"
   offset="0.6259" />
			<stop
   id="stop92"
   style="stop-color:#545454"
   offset="0.7831" />
			<stop
   id="stop94"
   style="stop-color:#2A2A2A"
   offset="0.9131" />
			<stop
   id="stop96"
   style="stop-color:#000000"
   offset="1" />
			<midPointStop
   style="stop-color:#FFFFFF"
   offset="0" />
			<midPointStop
   style="stop-color:#FFFFFF"
   offset="0.38" />
			<midPointStop
   style="stop-color:#000000"
   offset="1" />
		</linearGradient>
		 
		
			<linearGradient
   gradientTransform="matrix(1.1415 0 0 1.1415 -230.7597 -362.54)"
   y2="416.9883"
   x2="208.2046"
   y1="433.4883"
   x1="208.2046"
   gradientUnits="userSpaceOnUse"
   id="XMLID_8_">
			<stop
   id="stop101"
   style="stop-color:#FFFFFF"
   offset="0" />
			<stop
   id="stop103"
   style="stop-color:#F6F6F6"
   offset="0.0436" />
			<stop
   id="stop105"
   style="stop-color:#CECECE"
   offset="0.2516" />
			<stop
   id="stop107"
   style="stop-color:#A5A5A5"
   offset="0.4476" />
			<stop
   id="stop109"
   style="stop-color:#7C7C7C"
   offset="0.6259" />
			<stop
   id="stop111"
   style="stop-color:#545454"
   offset="0.7831" />
			<stop
   id="stop113"
   style="stop-color:#2A2A2A"
   offset="0.9131" />
			<stop
   id="stop115"
   style="stop-color:#000000"
   offset="1" />
			<midPointStop
   style="stop-color:#FFFFFF"
   offset="0" />
			<midPointStop
   style="stop-color:#FFFFFF"
   offset="0.38" />
			<midPointStop
   style="stop-color:#000000"
   offset="1" />
		</linearGradient>
		 
		
		
		
	
		
			<linearGradient
   gradientTransform="matrix(1.141500,0.000000,0.000000,1.141500,50.55500,-235.4404)"
   y2="305.75049"
   x2="13.079600"
   y1="322.25049"
   x1="13.079600"
   gradientUnits="userSpaceOnUse"
   id="linearGradient1580">
			<stop
   id="stop148"
   style="stop-color:#FFFFFF"
   offset="0" />
			<stop
   id="stop150"
   style="stop-color:#F6F6F6"
   offset="0.0436" />
			<stop
   id="stop152"
   style="stop-color:#CECECE"
   offset="0.2516" />
			<stop
   id="stop154"
   style="stop-color:#A5A5A5"
   offset="0.4476" />
			<stop
   id="stop156"
   style="stop-color:#7C7C7C"
   offset="0.6259" />
			<stop
   id="stop158"
   style="stop-color:#545454"
   offset="0.7831" />
			<stop
   id="stop160"
   style="stop-color:#2A2A2A"
   offset="0.9131" />
			<stop
   id="stop162"
   style="stop-color:#000000"
   offset="1" />
			<midPointStop
   style="stop-color:#FFFFFF"
   offset="0" />
			<midPointStop
   style="stop-color:#FFFFFF"
   offset="0.38" />
			<midPointStop
   style="stop-color:#000000"
   offset="1" />
		</linearGradient>
		 
		
			<linearGradient
   gradientTransform="matrix(1.141500,0.000000,0.000000,1.141500,49.35480,-235.4404)"
   y2="305.75049"
   x2="88.830101"
   y1="322.25049"
   x1="88.830101"
   gradientUnits="userSpaceOnUse"
   id="linearGradient1591">
			<stop
   id="stop167"
   style="stop-color:#FFFFFF"
   offset="0" />
			<stop
   id="stop169"
   style="stop-color:#F6F6F6"
   offset="0.0436" />
			<stop
   id="stop171"
   style="stop-color:#CECECE"
   offset="0.2516" />
			<stop
   id="stop173"
   style="stop-color:#A5A5A5"
   offset="0.4476" />
			<stop
   id="stop175"
   style="stop-color:#7C7C7C"
   offset="0.6259" />
			<stop
   id="stop177"
   style="stop-color:#545454"
   offset="0.7831" />
			<stop
   id="stop179"
   style="stop-color:#2A2A2A"
   offset="0.9131" />
			<stop
   id="stop181"
   style="stop-color:#000000"
   offset="1" />
			<midPointStop
   style="stop-color:#FFFFFF"
   offset="0" />
			<midPointStop
   style="stop-color:#FFFFFF"
   offset="0.38" />
			<midPointStop
   style="stop-color:#000000"
   offset="1" />
		</linearGradient>
		 
		
		
		
		
		
		
		
			<linearGradient
   gradientTransform="matrix(1.141500,0.000000,0.000000,1.141500,49.98560,-235.5459)"
   y2="305.75049"
   x2="139.26759"
   y1="322.25049"
   x1="139.26759"
   gradientUnits="userSpaceOnUse"
   id="linearGradient1620">
			<stop
   id="stop222"
   style="stop-color:#FFFFFF"
   offset="0" />
			<stop
   id="stop224"
   style="stop-color:#F6F6F6"
   offset="0.0436" />
			<stop
   id="stop226"
   style="stop-color:#CECECE"
   offset="0.2516" />
			<stop
   id="stop228"
   style="stop-color:#A5A5A5"
   offset="0.4476" />
			<stop
   id="stop230"
   style="stop-color:#7C7C7C"
   offset="0.6259" />
			<stop
   id="stop232"
   style="stop-color:#545454"
   offset="0.7831" />
			<stop
   id="stop234"
   style="stop-color:#2A2A2A"
   offset="0.9131" />
			<stop
   id="stop236"
   style="stop-color:#000000"
   offset="1" />
			<midPointStop
   style="stop-color:#FFFFFF"
   offset="0" />
			<midPointStop
   style="stop-color:#FFFFFF"
   offset="0.38" />
			<midPointStop
   style="stop-color:#000000"
   offset="1" />
		</linearGradient>
		 
		
			<linearGradient
   gradientTransform="matrix(1.141500,0.000000,0.000000,1.141500,-152.0676,-235.2974)"
   y2="305.75049"
   x2="139.26711"
   y1="322.25049"
   x1="139.26711"
   gradientUnits="userSpaceOnUse"
   id="linearGradient1631">
			<stop
   id="stop241"
   style="stop-color:#FFFFFF"
   offset="0" />
			<stop
   id="stop243"
   style="stop-color:#F6F6F6"
   offset="0.0436" />
			<stop
   id="stop245"
   style="stop-color:#CECECE"
   offset="0.2516" />
			<stop
   id="stop247"
   style="stop-color:#A5A5A5"
   offset="0.4476" />
			<stop
   id="stop249"
   style="stop-color:#7C7C7C"
   offset="0.6259" />
			<stop
   id="stop251"
   style="stop-color:#545454"
   offset="0.7831" />
			<stop
   id="stop253"
   style="stop-color:#2A2A2A"
   offset="0.9131" />
			<stop
   id="stop255"
   style="stop-color:#000000"
   offset="1" />
			<midPointStop
   style="stop-color:#FFFFFF"
   offset="0" />
			<midPointStop
   style="stop-color:#FFFFFF"
   offset="0.38" />
			<midPointStop
   style="stop-color:#000000"
   offset="1" />
		</linearGradient>
		 
		
		
		
	</defs><sodipodi:namedview
   inkscape:cy="52.951706"
   inkscape:cx="272.83466"
   inkscape:zoom="1.6391122"
   inkscape:window-height="996"
   inkscape:window-width="1278"
   inkscape:pageshadow="2"
   inkscape:pageopacity="0.0"
   borderopacity="1.0"
   bordercolor="#666666"
   pagecolor="#ffffff"
   id="base"
   inkscape:window-x="0"
   inkscape:window-y="0"
   inkscape:current-layer="svg2" />
	<style
   type="text/css"
   id="style4">
	
	</style>
	<rect
   style="fill:#dedede;fill-opacity:1.0000000;fill-rule:evenodd;stroke:none;stroke-width:1.0000000pt;stroke-linecap:butt;stroke-linejoin:miter;stroke-opacity:1.0000000;overflow:visible"
   id="rect2545"
   width="277.30722"
   height="182.72256"
   x="277.42902"
   y="-14.236052" /><rect
   style="fill:#dedede;fill-opacity:1.0000000;fill-rule:evenodd;stroke:none;stroke-width:1.0000000pt;stroke-linecap:butt;stroke-linejoin:miter;stroke-opacity:1.0000000"
   id="rect2543"
   width="277.30722"
   height="182.72256"
   x="-29.894236"
   y="-14.236052" /><rect
   id="rect24"
   height="12.117390"
   width="86.543259"
   style="fill:#000000;fill-opacity:1.0000000"
   y="136.32732"
   x="10.982771" /><rect
   id="rect43"
   height="12.117390"
   width="86.543259"
   style="fill:#000000;fill-opacity:1.0000000"
   y="136.32732"
   x="120.52552" /><line
   id="line45"
   y2="-9.1738033"
   x2="108.61147"
   y1="136.49010"
   x1="108.61147"
   style="fill:none;stroke:#000000" /><line
   id="line47"
   y2="136.43484"
   x2="-0.45210230"
   y1="-9.1738033"
   x1="108.61147"
   style="fill:none;stroke:#000000" /><line
   id="line49"
   y2="136.59543"
   x2="217.80995"
   y1="-9.0132198"
   x1="108.74636"
   style="fill:none;stroke:#000000" /><g
   id="g51"
   transform="translate(-1.220173,-4.047659)"
   style="font-size:10.000000px;font-style:normal;font-variant:normal;font-weight:normal;font-stretch:normal;text-align:start;line-height:125.00000%;writing-mode:lr-tb;text-anchor:start;font-family:Bitstream Vera Sans">
			<text
   id="text53"
   transform="translate(46.22560,56.69090)"
   style="font-size:10.000000px;font-style:normal;font-variant:normal;font-weight:normal;font-stretch:normal;text-align:start;line-height:125.00000%;writing-mode:lr-tb;text-anchor:start;font-family:Bitstream Vera Sans"
   sodipodi:linespacing="125.00000%"><tspan
     id="tspan55"
     style="font-size:10.000000px;font-style:normal;font-variant:normal;font-weight:normal;font-stretch:normal;text-align:start;line-height:125.00000%;writing-mode:lr-tb;text-anchor:start;font-family:Bitstream Vera Sans"
     y="0"
     x="0">5</tspan></text>


			<text
   id="text57"
   transform="translate(51.75100,56.69090)"
   style="font-size:10.000000px;font-style:normal;font-variant:normal;font-weight:normal;font-stretch:normal;text-align:start;line-height:125.00000%;writing-mode:lr-tb;text-anchor:start;font-family:Bitstream Vera Sans"
   sodipodi:linespacing="125.00000%"><tspan
     id="tspan59"
     style="font-size:10.000000px;font-style:normal;font-variant:normal;font-weight:normal;font-stretch:normal;text-align:start;line-height:125.00000%;writing-mode:lr-tb;text-anchor:start;font-family:Bitstream Vera Sans"
     y="0"
     x="0">λ</tspan></text>


		</g><g
   id="g61"
   transform="translate(-1.220173,-4.047659)"
   style="font-size:10.000000px;font-style:normal;font-variant:normal;font-weight:normal;font-stretch:normal;text-align:start;line-height:125.00000%;writing-mode:lr-tb;text-anchor:start;font-family:Bitstream Vera Sans">
			<text
   id="text63"
   transform="translate(159.3872,56.69090)"
   style="font-size:10.000000px;font-style:normal;font-variant:normal;font-weight:normal;font-stretch:normal;text-align:start;line-height:125.00000%;writing-mode:lr-tb;text-anchor:start;font-family:Bitstream Vera Sans"
   sodipodi:linespacing="125.00000%"><tspan
     id="tspan65"
     style="font-size:10.000000px;font-style:normal;font-variant:normal;font-weight:normal;font-stretch:normal;text-align:start;line-height:125.00000%;writing-mode:lr-tb;text-anchor:start;font-family:Bitstream Vera Sans"
     y="0"
     x="0">5</tspan></text>


			<text
   id="text67"
   transform="translate(164.9126,56.69090)"
   style="font-size:10.000000px;font-style:normal;font-variant:normal;font-weight:normal;font-stretch:normal;text-align:start;line-height:125.00000%;writing-mode:lr-tb;text-anchor:start;font-family:Bitstream Vera Sans"
   sodipodi:linespacing="125.00000%"><tspan
     id="tspan69"
     style="font-size:10.000000px;font-style:normal;font-variant:normal;font-weight:normal;font-stretch:normal;text-align:start;line-height:125.00000%;writing-mode:lr-tb;text-anchor:start;font-family:Bitstream Vera Sans"
     y="0"
     x="0">λ</tspan></text>


		</g><g
   id="g71"
   transform="translate(-1.220173,-4.047659)"
   style="font-size:10.000000px;font-style:normal;font-variant:normal;font-weight:normal;font-stretch:normal;text-align:start;line-height:125.00000%;writing-mode:lr-tb;text-anchor:start;font-family:Bitstream Vera Sans">
			<text
   id="text73"
   transform="translate(113.1372,63.08200)"
   style="font-size:10.000000px;font-style:normal;font-variant:normal;font-weight:normal;font-stretch:normal;text-align:start;line-height:125.00000%;writing-mode:lr-tb;text-anchor:start;font-family:Bitstream Vera Sans"
   sodipodi:linespacing="125.00000%"><tspan
     id="tspan75"
     style="font-size:10.000000px;font-style:normal;font-variant:normal;font-weight:normal;font-stretch:normal;text-align:start;line-height:125.00000%;writing-mode:lr-tb;text-anchor:start;font-family:Bitstream Vera Sans"
     y="0"
     x="0">4</tspan></text>


			<text
   id="text77"
   transform="translate(118.6626,63.08200)"
   style="font-size:10.000000px;font-style:normal;font-variant:normal;font-weight:normal;font-stretch:normal;text-align:start;line-height:125.00000%;writing-mode:lr-tb;text-anchor:start;font-family:Bitstream Vera Sans"
   sodipodi:linespacing="125.00000%"><tspan
     id="tspan79"
     style="font-size:10.000000px;font-style:normal;font-variant:normal;font-weight:normal;font-stretch:normal;text-align:start;line-height:125.00000%;writing-mode:lr-tb;text-anchor:start;font-family:Bitstream Vera Sans"
     y="0"
     x="0">λ</tspan></text>


		</g><rect
   id="rect98"
   height="12.117390"
   width="17.745184"
   style="fill:#000000;fill-opacity:1.0000000"
   y="136.32732"
   x="229.65976" /><rect
   x="-29.894230"
   id="rect117"
   height="12.117390"
   width="17.745184"
   style="fill:#000000;fill-opacity:1.0000000"
   y="136.42329" /><g
   id="g119"
   transform="translate(-23.83026,16.85361)">
			<text
   id="text121"
   transform="translate(20.13230,143.0273)"><tspan
     id="tspan123"
     style="font-size:7.6500001px;font-family:Bitstream Vera Sans"
     y="0"
     x="0">A</tspan></text>


		</g><g
   id="g125"
   transform="translate(0.951016,16.85361)">
			<text
   id="text127"
   transform="translate(105.7100,143.0273)"><tspan
     id="tspan129"
     style="font-size:7.6500001px;font-family:Bitstream Vera Sans"
     y="0"
     x="0">B</tspan></text>


		</g><g
   id="g131"
   transform="translate(26.16973,16.85361)">
			<text
   id="text133"
   transform="translate(191.0146,143.0273)"><tspan
     id="tspan135"
     style="font-size:7.6500001px;font-family:Bitstream Vera Sans"
     y="0"
     x="0">C</tspan></text>


		</g>
<rect
   id="rect164"
   height="12.117390"
   width="86.543259"
   style="fill:#000000;fill-opacity:1.0000000"
   y="136.26851"
   x="318.29074" /><rect
   id="rect183"
   height="12.117390"
   width="86.541977"
   style="fill:#000000;fill-opacity:1.0000000"
   y="136.26851"
   x="427.83350" /><line
   id="line185"
   y2="136.36922"
   x2="415.91943"
   y1="-8.8810215"
   x1="433.14307"
   style="fill:none;stroke:#000000" /><line
   id="line187"
   y2="136.31396"
   x2="306.85587"
   y1="-9.6107159"
   x1="432.82962"
   style="fill:none;stroke:#000000" /><line
   id="line189"
   y2="136.47583"
   x2="525.11792"
   y1="-9.6107159"
   x1="432.82962"
   style="fill:none;stroke:#000000" /><g
   id="g191"
   transform="translate(298.4055,11.44750)"
   style="font-size:10.000000px;font-style:normal;font-variant:normal;font-weight:normal;font-stretch:normal;text-align:start;line-height:125.00000%;writing-mode:lr-tb;text-anchor:start;font-family:Bitstream Vera Sans">
			<text
   id="text193"
   transform="translate(41.31540,48.70560)"
   style="font-size:10.000000px;font-style:normal;font-variant:normal;font-weight:normal;font-stretch:normal;text-align:start;line-height:125.00000%;writing-mode:lr-tb;text-anchor:start;font-family:Bitstream Vera Sans"
   sodipodi:linespacing="125.00000%"><tspan
     id="tspan195"
     style="font-size:10.000000px;font-style:normal;font-variant:normal;font-weight:normal;font-stretch:normal;text-align:start;line-height:125.00000%;writing-mode:lr-tb;text-anchor:start;font-family:Bitstream Vera Sans"
     y="0"
     x="0">5.25 </tspan></text>


			<text
   id="text197"
   transform="translate(63.41210,48.70560)"
   style="font-size:10.000000px;font-style:normal;font-variant:normal;font-weight:normal;font-stretch:normal;text-align:start;line-height:125.00000%;writing-mode:lr-tb;text-anchor:start;font-family:Bitstream Vera Sans"
   sodipodi:linespacing="125.00000%"><tspan
     id="tspan199"
     style="font-size:10.000000px;font-style:normal;font-variant:normal;font-weight:normal;font-stretch:normal;text-align:start;line-height:125.00000%;writing-mode:lr-tb;text-anchor:start;font-family:Bitstream Vera Sans"
     y="0"
     x="0">λ</tspan></text>


		</g><g
   id="g201"
   transform="translate(324.6392,10.22733)"
   style="font-size:10.000000px;font-style:normal;font-variant:normal;font-weight:normal;font-stretch:normal;text-align:start;line-height:125.00000%;writing-mode:lr-tb;text-anchor:start;font-family:Bitstream Vera Sans">
			<text
   id="text203"
   transform="translate(153.8677,45.92770)"
   style="font-size:10.000000px;font-style:normal;font-variant:normal;font-weight:normal;font-stretch:normal;text-align:start;line-height:125.00000%;writing-mode:lr-tb;text-anchor:start;font-family:Bitstream Vera Sans"
   sodipodi:linespacing="125.00000%"><tspan
     id="tspan205"
     style="font-size:10.000000px;font-style:normal;font-variant:normal;font-weight:normal;font-stretch:normal;text-align:start;line-height:125.00000%;writing-mode:lr-tb;text-anchor:start;font-family:Bitstream Vera Sans"
     y="0"
     x="0">4.75 </tspan></text>


			<text
   id="text207"
   transform="translate(175.9644,45.92770)"
   style="font-size:10.000000px;font-style:normal;font-variant:normal;font-weight:normal;font-stretch:normal;text-align:start;line-height:125.00000%;writing-mode:lr-tb;text-anchor:start;font-family:Bitstream Vera Sans"
   sodipodi:linespacing="125.00000%"><tspan
     id="tspan209"
     style="font-size:10.000000px;font-style:normal;font-variant:normal;font-weight:normal;font-stretch:normal;text-align:start;line-height:125.00000%;writing-mode:lr-tb;text-anchor:start;font-family:Bitstream Vera Sans"
     y="0"
     x="0">λ</tspan></text>


		</g><g
   id="g211"
   transform="translate(309.3871,5.346636)"
   style="font-size:10.000000px;font-style:normal;font-variant:normal;font-weight:normal;font-stretch:normal;text-align:start;line-height:125.00000%;writing-mode:lr-tb;text-anchor:start;font-family:Bitstream Vera Sans">
			<text
   id="text213"
   transform="translate(118.3760,68.88280)"
   style="font-size:10.000000px;font-style:normal;font-variant:normal;font-weight:normal;font-stretch:normal;text-align:start;line-height:125.00000%;writing-mode:lr-tb;text-anchor:start;font-family:Bitstream Vera Sans"
   sodipodi:linespacing="125.00000%"><tspan
     id="tspan215"
     style="font-size:10.000000px;font-style:normal;font-variant:normal;font-weight:normal;font-stretch:normal;text-align:start;line-height:125.00000%;writing-mode:lr-tb;text-anchor:start;font-family:Bitstream Vera Sans"
     y="0"
     x="0">4.02 </tspan></text>


			<text
   id="text217"
   transform="translate(140.4727,68.88280)"
   style="font-size:10.000000px;font-style:normal;font-variant:normal;font-weight:normal;font-stretch:normal;text-align:start;line-height:125.00000%;writing-mode:lr-tb;text-anchor:start;font-family:Bitstream Vera Sans"
   sodipodi:linespacing="125.00000%"><tspan
     id="tspan219"
     style="font-size:10.000000px;font-style:normal;font-variant:normal;font-weight:normal;font-stretch:normal;text-align:start;line-height:125.00000%;writing-mode:lr-tb;text-anchor:start;font-family:Bitstream Vera Sans"
     y="0"
     x="0">λ</tspan></text>


		</g><rect
   id="rect238"
   height="12.117390"
   width="17.745184"
   style="fill:#000000;fill-opacity:1.0000000"
   y="136.20221"
   x="537.00629" /><rect
   x="277.43430"
   id="rect257"
   height="12.117390"
   width="17.745184"
   style="fill:#000000;fill-opacity:1.0000000"
   y="136.35883" /><g
   id="g259"
   transform="translate(285.3968,16.48651)">
			<text
   id="text261"
   transform="translate(20.08590,144.3853)"><tspan
     id="tspan263"
     style="font-size:7.6500001px;font-family:Bitstream Vera Sans"
     y="0"
     x="0">A</tspan></text>


		</g><g
   id="g265"
   transform="translate(308.1784,16.48651)">
			<text
   id="text267"
   transform="translate(105.6631,144.3853)"><tspan
     id="tspan269"
     style="font-size:7.6500001px;font-family:Bitstream Vera Sans"
     y="0"
     x="0">B</tspan></text>


		</g><g
   id="g271"
   transform="translate(331.3968,16.48651)">
			<text
   id="text273"
   transform="translate(190.9678,144.3853)"><tspan
     id="tspan275"
     style="font-size:7.6500001px;font-family:Bitstream Vera Sans"
     y="0"
     x="0">C</tspan></text>


		</g><text
   xml:space="preserve"
   style="font-size:10.000000px;font-style:normal;font-variant:normal;font-weight:normal;font-stretch:normal;text-align:start;line-height:125.00000%;writing-mode:lr-tb;text-anchor:start;fill:#000000;fill-opacity:1.0000000;stroke:none;stroke-width:1.0000000pt;stroke-linecap:butt;stroke-linejoin:miter;stroke-opacity:1.0000000;font-family:Bitstream Vera Sans"
   x="-15.701518"
   y="4.6524706"
   id="text1447"
   sodipodi:linespacing="125.00000%"><tspan
     sodipodi:role="line"
     id="tspan1449"
     x="-15.701518"
     y="4.6524706">1</tspan></text>
<text
   xml:space="preserve"
   style="font-size:10.000000px;font-style:normal;font-variant:normal;font-weight:normal;font-stretch:normal;text-align:start;line-height:125.00000%;writing-mode:lr-tb;text-anchor:start;fill:#000000;fill-opacity:1.0000000;stroke:none;stroke-width:1.0000000pt;stroke-linecap:butt;stroke-linejoin:miter;stroke-opacity:1.0000000;font-family:Bitstream Vera Sans"
   x="291.11096"
   y="4.6524706"
   id="text1451"
   sodipodi:linespacing="125.00000%"><tspan
     sodipodi:role="line"
     id="tspan1453"
     x="291.11096"
     y="4.6524706">2</tspan></text>
</svg>