<?xml version="1.0" encoding="iso-8859-1"?>
<!-- Generator: Adobe Illustrator 11 Build 196, SVG Export Plug-In . SVG Version: 6.0.0 Build 78)  -->
<!DOCTYPE svg PUBLIC "-//W3C//DTD SVG 1.0//EN"    "http://www.w3.org/TR/2001/REC-SVG-20010904/DTD/svg10.dtd" [
	<!ENTITY ns_flows "http://ns.adobe.com/Flows/1.0/">
	<!ENTITY ns_svg "http://www.w3.org/2000/svg">
	<!ENTITY ns_xlink "http://www.w3.org/1999/xlink">
]>
<svg  
	 width="149.067" height="115.895" viewBox="0 0 149.067 115.895"
	 style="overflow:visible;enable-background:new 0 0 149.067 115.895" xml:space="preserve">
	<style type="text/css">
	
	</style>
	<g id="Layer_1">
		<line style="fill:none;stroke:#000000;" x1="91.466" y1="39.496" x2="6.888" y2="39.496"/>
		<line style="fill:none;stroke:#000000;" x1="45.129" y1="109.56" x2="7.446" y2="109.56"/>
		<g>
			<line style="fill:none;stroke:#000000;" x1="15.82" y1="41.837" x2="15.82" y2="107.498"/>
			<path d="M15.82,109.644c-0.375-1.01-1.014-2.263-1.691-3.04l1.691,0.611l1.691-0.611
				C16.834,107.381,16.194,108.634,15.82,109.644z"/>
			<path d="M15.82,39.69c0.375,1.01,1.014,2.263,1.691,3.04l-1.691-0.611l-1.691,0.611C14.806,41.954,15.445,40.7,15.82,39.69z"/>
		</g>
		<g>
			<g>
				<text transform="matrix(0 -1 1 0 10 96.3516)"><tspan x="0" y="0" style="font-family:Bitstream Vera Sans; font-size:8.500000;">maximum</tspan></text>
			</g>
		</g>
		<line style="fill:none;stroke:#000000;" x1="21.403" y1="74.109" x2="74.718" y2="74.109"/>
		<g>
			<line style="fill:none;stroke:#000000;" x1="24.752" y1="76.421" x2="24.752" y2="107.248"/>
			<path d="M24.752,109.246c-0.349-0.94-0.944-2.107-1.575-2.831l1.575,0.57l1.575-0.57
				C25.697,107.139,25.101,108.306,24.752,109.246z"/>
			<path d="M24.752,74.422c0.349,0.94,0.944,2.107,1.575,2.831l-1.575-0.57l-1.575,0.57C23.808,76.53,24.404,75.363,24.752,74.422z"
				/>
		</g>
		<g>
			<g>
				<text transform="matrix(1 0 0 1 27.5439 88.624)"><tspan x="0" y="0" style="font-family:Bitstream Vera Sans; font-size:8.500000;">half</tspan></text>
			</g>
			<g>
				<text transform="matrix(1 0 0 1 27.5439 100.624)"><tspan x="0" y="0" style="font-family:Bitstream Vera Sans; font-size:8.500000;">max.</tspan></text>
			</g>
		</g>
		<line style="fill:none;stroke:#000000;" x1="76.672" y1="71.876" x2="76.672" y2="26.097"/>
		<line style="fill:none;stroke:#000000;" x1="119.101" y1="71.876" x2="119.101" y2="26.097"/>
		<g>
			<line style="fill:none;stroke:#000000;" x1="80.021" y1="31.401" x2="116.032" y2="31.401"/>
			<path d="M118.156,31.401c-1,0.371-2.24,1.004-3.008,1.674l0.605-1.674l-0.605-1.674C115.917,30.397,117.157,31.03,118.156,31.401
				z"/>
			<path d="M77.896,31.401c1-0.371,2.24-1.004,3.008-1.674l-0.605,1.674l0.605,1.673C80.136,32.404,78.896,31.771,77.896,31.401z"/>
		</g>
		<g>
			<g>
				<text transform="matrix(1 0 0 1 60.668 10)"><tspan x="0" y="0" style="font-family:Bitstream Vera Sans; font-size:8.500000;">full width at half</tspan></text>
			</g>
			<g>
				<text transform="matrix(1 0 0 1 60.668 22)"><tspan x="0" y="0" style="font-family:Bitstream Vera Sans; font-size:8.500000;">maximum (FWHM)</tspan></text>
			</g>
		</g>
		<path style="fill:#EDEDED;stroke:#000000;stroke-width:2;stroke-linecap:square;stroke-miterlimit:1;" d="M49.528,109.709
			c32.262,0,26.199-72.456,42.429-59.177c3.07,2.512,6.02-5.338,11.444-7.257c18.144-6.42,8.375,66.435,39.638,66.435
			C174.303,109.709,49.528,109.709,49.528,109.709z"/>
		<rect x="0.596" y="113.061" style="fill:none;" width="147.401" height="2.834"/> 
	</g>
</svg>
