<?xml version="1.0" encoding="UTF-8" standalone="no"?>
<!DOCTYPE svg PUBLIC "-//W3C//DTD SVG 20010904//EN"
"http://www.w3.org/TR/2001/REC-SVG-20010904/DTD/svg10.dtd">
<!-- Generator: Adobe Illustrator 11 Build 196, SVG Export Plug-In . SVG Version: 6.0.0 Build 78)  -->
<svg:svg
   width="363.618"
   height="148.333"
   viewBox="0 0 363.618 148.333"
   style="overflow:visible;enable-background:new 0 0 363.618 148.333"
   xml:space="preserve"
   id="svg1"
   sodipodi:version="0.32"
   inkscape:version="0.40+cvs"
   sodipodi:docname="bullets.svg"
   sodipodi:docbase="/home/bcrowell/Documents/writing/lm/trunk/1np/ch06/figs"
   xmlns:cc="http://web.resource.org/cc/"
   xmlns:inkscape="http://www.inkscape.org/namespaces/inkscape"
   xmlns:sodipodi="http://sodipodi.sourceforge.net/DTD/sodipodi-0.dtd"
   xmlns:rdf="http://www.w3.org/1999/02/22-rdf-syntax-ns#"
   xmlns:xml="http://www.w3.org/XML/1998/namespace"
   xmlns:svg="http://www.w3.org/2000/svg"
   xmlns:a="http://ns.adobe.com/AdobeSVGViewerExtensions/3.0/"
   xmlns:dc="http://purl.org/dc/elements/1.1/"
   xmlns:xlink="http://www.w3.org/1999/xlink"><svg:metadata
   id="metadata110" />
<svg:metadata
   id="metadata113" />

<svg:metadata
   id="metadata106" />


<svg:defs
   id="defs165">
		
		
		
		
		
		
		
		
		
		
			
		
		
		
		
		
		
		
	
			
			
				<svg:linearGradient
   id="XMLID_4_"
   gradientUnits="userSpaceOnUse"
   x1="108.1313"
   y1="71.6667"
   x2="108.1313"
   y2="85.1667"
   gradientTransform="matrix(0.325 0 0 0.325 35.132 -12.2677)">
				<svg:stop
   offset="0"
   style="stop-color:#B4B4B4"
   id="stop91" />




				<svg:stop
   offset="0.36"
   style="stop-color:#E4E4E4"
   id="stop93" />




				<svg:stop
   offset="0.4464"
   style="stop-color:#D0D0D0"
   id="stop95" />




				<svg:stop
   offset="0.5554"
   style="stop-color:#B9B9B9"
   id="stop97" />




				<svg:stop
   offset="0.6657"
   style="stop-color:#A5A5A5"
   id="stop99" />




				<svg:stop
   offset="0.7762"
   style="stop-color:#949494"
   id="stop101" />




				<svg:stop
   offset="0.8874"
   style="stop-color:#8A8A8A"
   id="stop103" />




				<svg:stop
   offset="1"
   style="stop-color:#868686"
   id="stop105" />




				<midPointStop
   offset="0"
   style="stop-color:#B4B4B4"
   id="midPointStop107" />




				<midPointStop
   offset="0.5"
   style="stop-color:#B4B4B4"
   id="midPointStop109" />




				<midPointStop
   offset="0.36"
   style="stop-color:#E4E4E4"
   id="midPointStop111" />




				<midPointStop
   offset="0.29"
   style="stop-color:#E4E4E4"
   id="midPointStop113" />




				<midPointStop
   offset="1"
   style="stop-color:#868686"
   id="midPointStop115" />




			</svg:linearGradient>




			
			
		
			
			
			
			
			
			
			
			
			
			
				
			
		
				


				

 
				


			
					


					


					


				</svg:defs>



<svg:metadata
   id="metadata164">
  <rdf:RDF
   id="RDF166">
    <cc:Work
   rdf:about=""
   id="Work167">
      <dc:format
   id="format168">image/svg+xml</dc:format>



      <dc:type
   id="type170"
   rdf:resource="http://purl.org/dc/dcmitype/StillImage" />



    </cc:Work>



  </rdf:RDF>



</svg:metadata>



<sodipodi:namedview
   id="base"
   pagecolor="#ffffff"
   bordercolor="#666666"
   borderopacity="1.0"
   inkscape:pageopacity="0.0"
   inkscape:pageshadow="2"
   inkscape:zoom="0.98312137"
   inkscape:cx="175.76177"
   inkscape:cy="-2.9959409"
   inkscape:window-width="798"
   inkscape:window-height="576"
   inkscape:window-x="0"
   inkscape:window-y="0"
   inkscape:current-layer="svg1" />




	<svg:style
   type="text/css"
   id="style3">
	
	</svg:style>




	<svg:rect
   style="fill:#ebebeb;fill-opacity:1.0000000;stroke:none;stroke-width:2.1250000;stroke-linecap:butt;stroke-linejoin:miter;stroke-miterlimit:4.0000000;stroke-dashoffset:0.0000000;stroke-opacity:1.0000000;"
   id="rect187"
   width="363.58878"
   height="71.492607"
   x="-1.4864084e-05"
   y="76.700691" />


<svg:path
   style="fill:none;stroke:#000000;stroke-width:0.50000000;stroke-dasharray:2.0000000 "
   d="M 124.63300,91.292000 C 175.26500,94.260000 276.00800,94.667000 363.50800,137.16700"
   id="path9" />



<svg:path
   d="M 126.99400,90.294000 C 126.97700,90.294000 126.96400,90.300000 126.94700,90.300000 L 126.94700,90.230000 L 120.94700,90.230000 L 120.94700,92.480000 L 126.94700,92.480000 L 126.94700,92.410000 C 126.96400,92.410000 126.97700,92.416000 126.99400,92.416000 C 127.91000,92.416000 128.65100,91.941000 128.65100,91.355000 C 128.65100,90.769000 127.91000,90.294000 126.99400,90.294000 z "
   id="path48" />



<svg:path
   d="M 126.99400,94.813000 C 126.97700,94.813000 126.96400,94.819000 126.94700,94.819000 L 126.94700,94.749000 L 120.94700,94.749000 L 120.94700,96.999000 L 126.94700,96.999000 L 126.94700,96.929000 C 126.96400,96.929000 126.97700,96.935000 126.99400,96.935000 C 127.91000,96.935000 128.65100,96.460000 128.65100,95.874000 C 128.65100,95.288000 127.91000,94.813000 126.99400,94.813000 z "
   id="path50" />



<svg:path
   d="M 200.61900,94.813000 C 200.60200,94.813000 200.58900,94.819000 200.57200,94.819000 L 200.57200,94.749000 L 194.57200,94.749000 L 194.57200,96.999000 L 200.57200,96.999000 L 200.57200,96.929000 C 200.58900,96.929000 200.60200,96.935000 200.61900,96.935000 C 201.53500,96.935000 202.27600,96.460000 202.27600,95.874000 C 202.27600,95.288000 201.53500,94.813000 200.61900,94.813000 z "
   id="path52" />



<svg:path
   d="M 126.99400,103.85600 C 126.97700,103.85600 126.96400,103.86200 126.94700,103.86200 L 126.94700,103.79200 L 120.94700,103.79200 L 120.94700,106.04200 L 126.94700,106.04200 L 126.94700,105.97200 C 126.96400,105.97200 126.97700,105.97800 126.99400,105.97800 C 127.91000,105.97800 128.65100,105.50300 128.65100,104.91700 C 128.65100,104.33100 127.91000,103.85600 126.99400,103.85600 z "
   id="path54" />



<svg:path
   d="M 266.74400,103.85600 C 266.72700,103.85600 266.71400,103.86200 266.69700,103.86200 L 266.69700,103.79200 L 260.69700,103.79200 L 260.69700,106.04200 L 266.69700,106.04200 L 266.69700,105.97200 C 266.71400,105.97200 266.72700,105.97800 266.74400,105.97800 C 267.66000,105.97800 268.40100,105.50300 268.40100,104.91700 C 268.40100,104.33100 267.66000,103.85600 266.74400,103.85600 z "
   id="path56" />



<svg:path
   d="M 126.99400,124.81300 C 126.97700,124.81300 126.96400,124.81900 126.94700,124.81900 L 126.94700,124.74900 L 120.94700,124.74900 L 120.94700,126.99900 L 126.94700,126.99900 L 126.94700,126.92900 C 126.96400,126.92900 126.97700,126.93500 126.99400,126.93500 C 127.91000,126.93500 128.65100,126.46000 128.65100,125.87400 C 128.65100,125.28800 127.91000,124.81300 126.99400,124.81300 z "
   id="path58" />



<svg:path
   d="M 339.61900,124.81300 C 339.60200,124.81300 339.58900,124.81900 339.57200,124.81900 L 339.57200,124.74900 L 333.57200,124.74900 L 333.57200,126.99900 L 339.57200,126.99900 L 339.57200,126.92900 C 339.58900,126.92900 339.60200,126.93500 339.61900,126.93500 C 340.53500,126.93500 341.27600,126.46000 341.27600,125.87400 C 341.27600,125.28800 340.53500,124.81300 339.61900,124.81300 z "
   id="path60" />



<svg:line
   style="fill:none;stroke:#000000;stroke-width:0.50000000;stroke-dasharray:2.0000000 "
   x1="124.37200"
   y1="91.667000"
   x2="124.37200"
   y2="133.66701"
   id="line62" />



<svg:path
   d="M 289.82800,141.00000 C 288.69200,141.42100 287.28300,142.14100 286.41000,142.90200 L 287.09800,141.00000 L 286.41000,139.09800 C 287.28300,139.86000 288.69200,140.57900 289.82800,141.00000 z "
   id="path70" />

<svg:path
   d="M 151.00000,141.00000 C 152.13600,140.57900 153.54500,139.85900 154.41900,139.09800 L 153.73000,141.00000 L 154.41800,142.90200 C 153.54500,142.14100 152.13500,141.42200 151.00000,141.00000 z "
   id="path72" />

<svg:g
   id="g77">
					<svg:text
   transform="matrix(1 0 0 1 171.3721 143.6667)"
   id="text79"><svg:tspan
     x="0"
     y="0"
     style="font-family:Bitstream Vera Sans; font-size:7.650000;"
     id="tspan80">(horizontal scale reduced)</svg:tspan></svg:text>




				</svg:g>



<svg:rect
   style="fill:#ebebeb;fill-opacity:1.0000000;stroke:none;stroke-width:2.1250000;stroke-linecap:butt;stroke-linejoin:miter;stroke-miterlimit:4.0000000;stroke-dashoffset:0.0000000;stroke-opacity:1.0000000;"
   id="rect113"
   width="363.58878"
   height="71.492607"
   x="-1.4864084e-05"
   y="-0.0075530815" />


<svg:path
   d="M 126.99400,13.454000 C 126.97700,13.454000 126.96400,13.460000 126.94700,13.460000 L 126.94700,13.390000 L 120.94700,13.390000 L 120.94700,15.640000 L 126.94700,15.640000 L 126.94700,15.569000 C 126.96400,15.569000 126.97700,15.575000 126.99400,15.575000 C 127.91000,15.575000 128.65100,15.100000 128.65100,14.514000 C 128.65100,13.928000 127.91000,13.454000 126.99400,13.454000 z "
   id="path123" />



<svg:path
   d="M 126.99400,17.927000 C 126.97700,17.927000 126.96400,17.933000 126.94700,17.933000 L 126.94700,17.862000 L 120.94700,17.862000 L 120.94700,20.112000 L 126.94700,20.112000 L 126.94700,20.042000 C 126.96400,20.042000 126.97700,20.048000 126.99400,20.048000 C 127.91000,20.048000 128.65100,19.573000 128.65100,18.987000 C 128.65100,18.401000 127.91000,17.927000 126.99400,17.927000 z "
   id="path125" />



<svg:path
   d="M 199.13600,13.454000 C 199.11900,13.454000 199.10600,13.460000 199.08900,13.460000 L 199.08900,13.390000 L 193.08900,13.390000 L 193.08900,15.640000 L 199.08900,15.640000 L 199.08900,15.569000 C 199.10600,15.569000 199.11900,15.575000 199.13600,15.575000 C 200.05200,15.575000 200.79300,15.100000 200.79300,14.514000 C 200.79300,13.928000 200.05100,13.454000 199.13600,13.454000 z "
   id="path127" />



<svg:path
   d="M 126.99400,26.970000 C 126.97700,26.970000 126.96400,26.976000 126.94700,26.976000 L 126.94700,26.906000 L 120.94700,26.906000 L 120.94700,29.156000 L 126.94700,29.156000 L 126.94700,29.086000 C 126.96400,29.086000 126.97700,29.092000 126.99400,29.092000 C 127.91000,29.092000 128.65100,28.617000 128.65100,28.031000 C 128.65100,27.445000 127.91000,26.970000 126.99400,26.970000 z "
   id="path129" />



<svg:path
   d="M 244.27700,13.454000 C 244.26000,13.454000 244.24700,13.460000 244.23000,13.460000 L 244.23000,13.390000 L 238.23000,13.390000 L 238.23000,15.640000 L 244.23000,15.640000 L 244.23000,15.569000 C 244.24700,15.569000 244.26000,15.575000 244.27700,15.575000 C 245.19200,15.575000 245.93400,15.100000 245.93400,14.514000 C 245.93500,13.928000 245.19200,13.454000 244.27700,13.454000 z "
   id="path131" />



<svg:path
   d="M 126.99400,47.927000 C 126.97700,47.927000 126.96400,47.932000 126.94700,47.933000 L 126.94700,47.863000 L 120.94700,47.863000 L 120.94700,50.113000 L 126.94700,50.113000 L 126.94700,50.043000 C 126.96400,50.043000 126.97700,50.049000 126.99400,50.049000 C 127.91000,50.049000 128.65100,49.574000 128.65100,48.988000 C 128.65100,48.402000 127.91000,47.927000 126.99400,47.927000 z "
   id="path133" />



<svg:path
   d="M 268.79400,13.454000 C 268.77700,13.454000 268.76400,13.460000 268.74700,13.460000 L 268.74700,13.390000 L 262.74700,13.390000 L 262.74700,15.640000 L 268.74700,15.640000 L 268.74700,15.569000 C 268.76400,15.569000 268.77700,15.575000 268.79400,15.575000 C 269.70900,15.575000 270.45100,15.100000 270.45100,14.514000 C 270.45100,13.928000 269.70900,13.454000 268.79400,13.454000 z "
   id="path135" />



<svg:line
   style="fill:none;stroke:#000000;stroke-width:0.50000000;stroke-dasharray:2.0000000 "
   x1="124.37200"
   y1="14.781000"
   x2="124.37200"
   y2="56.780998"
   id="line137" />



<svg:path
   style="fill:none;stroke:#000000;stroke-width:0.50000000;stroke-dasharray:2.0000000 "
   d="M 124.03900,14.114000 C 124.03900,14.114000 254.45600,14.114000 273.78900,14.114000 C 293.12200,14.114000 299.78900,23.447000 299.78900,33.447000 C 299.78900,43.447000 299.78900,57.447000 299.78900,57.447000"
   id="path139" />



<svg:path
   d="M 295.78900,18.114000 C 295.77200,18.114000 295.75900,18.120000 295.74200,18.120000 L 295.74200,18.050000 L 289.74200,18.050000 L 289.74200,20.300000 L 295.74200,20.300000 L 295.74200,20.229000 C 295.75900,20.229000 295.77200,20.235000 295.78900,20.235000 C 296.70500,20.235000 297.44600,19.760000 297.44600,19.174000 C 297.44600,18.588000 296.70400,18.114000 295.78900,18.114000 z "
   id="path141" />



<svg:path
   d="M 301.16900,27.448000 C 301.15200,27.448000 301.13900,27.454000 301.12200,27.454000 L 301.12200,27.384000 L 295.12200,27.384000 L 295.12200,29.634000 L 301.12200,29.634000 L 301.12200,29.564000 C 301.13900,29.564000 301.15200,29.570000 301.16900,29.570000 C 302.08400,29.570000 302.82600,29.095000 302.82600,28.509000 C 302.82600,27.922000 302.08400,27.448000 301.16900,27.448000 z "
   id="path143" />



<svg:path
   d="M 302.45600,49.518000 C 302.43900,49.518000 302.42500,49.524000 302.40900,49.524000 L 302.40900,49.454000 L 296.40900,49.454000 L 296.40900,51.704000 L 302.40900,51.704000 L 302.40900,51.634000 C 302.42600,51.634000 302.43900,51.640000 302.45600,51.640000 C 303.37100,51.640000 304.11300,51.165000 304.11300,50.579000 C 304.11300,49.993000 303.37100,49.518000 302.45600,49.518000 z "
   id="path145" />



<svg:path
   d="M 282.60800,13.481000 C 282.59100,13.481000 282.57800,13.487000 282.56100,13.487000 L 282.56100,13.417000 L 276.56100,13.417000 L 276.56100,15.667000 L 282.56100,15.667000 L 282.56100,15.597000 C 282.57800,15.597000 282.59100,15.603000 282.60800,15.603000 C 283.52400,15.603000 284.26500,15.128000 284.26500,14.542000 C 284.26600,13.956000 283.52400,13.481000 282.60800,13.481000 z "
   id="path147" />



<svg:g
   id="g149"
   transform="translate(162.9921,2.293035)">
			<svg:text
   transform="translate(163.5400,8.999800)"
   id="text151"><svg:tspan
     x="0"
     y="0"
     style="font-size:7.6500001;font-family:Bitstream Vera Sans"
     id="tspan152">Aristotle</svg:tspan></svg:text>




		</svg:g>



<svg:g
   id="g156"
   transform="translate(165.0239,-7.827072e-15)">
			<svg:text
   transform="translate(164.5376,88.33330)"
   id="text158"><svg:tspan
     x="0"
     y="0"
     style="font-size:7.6500001;font-family:Bitstream Vera Sans"
     id="tspan159">Newton</svg:tspan></svg:text>




		</svg:g>




<svg:g
   id="g338">
  <svg:path
   style="stroke:#000000;stroke-width:0.50000000"
   d="M 39.118000,15.360000 C 38.820000,16.558000 38.820000,17.811000 39.476000,18.908000 C 39.693000,19.301000 39.551000,19.795000 39.165000,20.012000 C 38.772000,20.235000 38.278000,20.093000 38.055000,19.700000 C 37.357000,18.373000 37.019000,16.809000 37.493000,15.360000 C 37.493000,14.913000 37.858000,14.548000 38.305000,14.548000 C 38.752000,14.548000 39.118000,14.913000 39.118000,15.360000 L 39.118000,15.360000 z "
   id="path88" />



  <svg:path
   style="fill:#868686;stroke:#000000;stroke-width:0.50000000;fill-opacity:1.0000000;"
   d="M 114.55600,11.189000 L 114.55600,9.7270000 L 113.19100,9.7270000 L 113.19100,11.189000 L 39.318000,11.189000 L 36.880000,11.189000 L 31.355000,11.189000 L 31.355000,9.4020000 L 29.990000,9.4020000 L 29.990000,11.189000 L 28.105000,11.189000 C 25.951000,11.189000 24.205000,12.935000 24.205000,15.089000 L 24.205000,17.039000 C 24.205000,19.193000 25.951000,20.939000 28.105000,20.939000 L 39.317000,20.939000 C 41.471000,20.939000 43.217000,19.193000 43.217000,17.039000 L 43.217000,15.576000 L 116.34200,15.576000 L 116.34200,11.189000 L 114.55600,11.189000 z M 39.941000,18.881000 L 36.041000,18.881000 C 35.368000,18.881000 34.822000,18.336000 34.822000,17.662000 C 34.822000,16.989000 35.367000,16.443000 36.041000,16.443000 L 39.941000,16.443000 C 40.614000,16.443000 41.160000,16.989000 41.160000,17.662000 C 41.160000,18.336000 40.615000,18.881000 39.941000,18.881000 z "
   id="path118" />



  <svg:g
   id="g260"
   transform="translate(46.11034,18.93944)">
    <svg:rect
   style="fill:#dcdcdc;fill-opacity:1.0000000;stroke:none;stroke-width:2.1250000;stroke-linecap:butt;stroke-linejoin:miter;stroke-miterlimit:4.0000000;stroke-dashoffset:0.0000000;stroke-opacity:1.0000000"
   id="rect177"
   width="87.906700"
   height="0.38725418"
   x="-17.955956"
   y="-6.1814151" />



    <svg:rect
   style="fill:#868686;fill-opacity:1.0000000;stroke:none;stroke-width:2.1250000;stroke-linecap:butt;stroke-linejoin:miter;stroke-miterlimit:4.0000000;stroke-dashoffset:0.0000000;stroke-opacity:1.0000000"
   id="rect251"
   width="87.906700"
   height="0.38725418"
   x="-17.955956"
   y="-4.4161129" />



    <svg:rect
   style="fill:#949494;fill-opacity:1.0000000;stroke:none;stroke-width:2.1250000;stroke-linecap:butt;stroke-linejoin:miter;stroke-miterlimit:4.0000000;stroke-dashoffset:0.0000000;stroke-opacity:1.0000000"
   id="rect252"
   width="87.906700"
   height="0.38725418"
   x="-17.955956"
   y="-4.7475533" />



    <svg:rect
   style="fill:#a6a6a6;fill-opacity:1.0000000;stroke:none;stroke-width:2.1250000;stroke-linecap:butt;stroke-linejoin:miter;stroke-miterlimit:4.0000000;stroke-dashoffset:0.0000000;stroke-opacity:1.0000000"
   id="rect253"
   width="87.906700"
   height="0.38725418"
   x="-17.955956"
   y="-5.1059241" />



    <svg:rect
   style="fill:#b8b8b8;fill-opacity:1.0000000;stroke:none;stroke-width:2.1250000;stroke-linecap:butt;stroke-linejoin:miter;stroke-miterlimit:4.0000000;stroke-dashoffset:0.0000000;stroke-opacity:1.0000000"
   id="rect254"
   width="87.906700"
   height="0.38725418"
   x="-17.955956"
   y="-5.4535036" />



    <svg:rect
   style="fill:#cacaca;fill-opacity:1.0000000;stroke:none;stroke-width:2.1250000;stroke-linecap:butt;stroke-linejoin:miter;stroke-miterlimit:4.0000000;stroke-dashoffset:0.0000000;stroke-opacity:1.0000000"
   id="rect255"
   width="87.906700"
   height="0.38725418"
   x="-17.955956"
   y="-5.7963319" />



    <svg:rect
   style="fill:#c5c5c5;fill-opacity:1.0000000;stroke:none;stroke-width:2.1250000;stroke-linecap:butt;stroke-linejoin:miter;stroke-miterlimit:4.0000000;stroke-dashoffset:0.0000000;stroke-opacity:1.0000000"
   id="rect256"
   width="87.906700"
   height="0.38725418"
   x="-17.955956"
   y="-6.5333676" />



    <svg:rect
   style="fill:#b4b4b4;fill-opacity:1.0000000;stroke:none;stroke-width:2.1250000;stroke-linecap:butt;stroke-linejoin:miter;stroke-miterlimit:4.0000000;stroke-dashoffset:0.0000000;stroke-opacity:1.0000000"
   id="rect257"
   width="87.906700"
   height="0.38725418"
   x="-17.955956"
   y="-6.8917384" />



    <svg:rect
   style="fill:#a2a2a2;fill-opacity:1.0000000;stroke:none;stroke-width:2.1250000;stroke-linecap:butt;stroke-linejoin:miter;stroke-miterlimit:4.0000000;stroke-dashoffset:0.0000000;stroke-opacity:1.0000000"
   id="rect258"
   width="87.906700"
   height="0.38725418"
   x="-17.955956"
   y="-7.2142715" />



    <svg:rect
   style="fill:#868686;fill-opacity:1.0000000;stroke:none;stroke-width:2.1250000;stroke-linecap:butt;stroke-linejoin:miter;stroke-miterlimit:4.0000000;stroke-dashoffset:0.0000000;stroke-opacity:1.0000000"
   id="rect259"
   width="87.906700"
   height="0.38725418"
   x="-17.955956"
   y="-7.5368056" />



  </svg:g>



  <svg:polygon
   style="fill:#7f7f7f;stroke:#000000;stroke-width:0.50000000;"
   points="28.106,11.189 0.318,13.627 4.218,28.252 30.056,18.99      "
   id="polygon120" />



</svg:g>



<svg:g
   id="g340"
   transform="translate(4.656112e-2,77.14763)">
  <svg:path
   style="stroke:#000000;stroke-width:0.50000000"
   d="M 39.118000,15.360000 C 38.820000,16.558000 38.820000,17.811000 39.476000,18.908000 C 39.693000,19.301000 39.551000,19.795000 39.165000,20.012000 C 38.772000,20.235000 38.278000,20.093000 38.055000,19.700000 C 37.357000,18.373000 37.019000,16.809000 37.493000,15.360000 C 37.493000,14.913000 37.858000,14.548000 38.305000,14.548000 C 38.752000,14.548000 39.118000,14.913000 39.118000,15.360000 L 39.118000,15.360000 z "
   id="path341" />



  <svg:path
   style="fill:#868686;fill-opacity:1.0000000;stroke:#000000;stroke-width:0.50000000"
   d="M 114.55600,11.189000 L 114.55600,9.7270000 L 113.19100,9.7270000 L 113.19100,11.189000 L 39.318000,11.189000 L 36.880000,11.189000 L 31.355000,11.189000 L 31.355000,9.4020000 L 29.990000,9.4020000 L 29.990000,11.189000 L 28.105000,11.189000 C 25.951000,11.189000 24.205000,12.935000 24.205000,15.089000 L 24.205000,17.039000 C 24.205000,19.193000 25.951000,20.939000 28.105000,20.939000 L 39.317000,20.939000 C 41.471000,20.939000 43.217000,19.193000 43.217000,17.039000 L 43.217000,15.576000 L 116.34200,15.576000 L 116.34200,11.189000 L 114.55600,11.189000 z M 39.941000,18.881000 L 36.041000,18.881000 C 35.368000,18.881000 34.822000,18.336000 34.822000,17.662000 C 34.822000,16.989000 35.367000,16.443000 36.041000,16.443000 L 39.941000,16.443000 C 40.614000,16.443000 41.160000,16.989000 41.160000,17.662000 C 41.160000,18.336000 40.615000,18.881000 39.941000,18.881000 z "
   id="path342" />



  <svg:g
   id="g343"
   transform="translate(46.11034,18.93944)">
    <svg:rect
   style="fill:#dcdcdc;fill-opacity:1.0000000;stroke:none;stroke-width:2.1250000;stroke-linecap:butt;stroke-linejoin:miter;stroke-miterlimit:4.0000000;stroke-dashoffset:0.0000000;stroke-opacity:1.0000000"
   id="rect344"
   width="87.906700"
   height="0.38725418"
   x="-17.955956"
   y="-6.1814151" />



    <svg:rect
   style="fill:#868686;fill-opacity:1.0000000;stroke:none;stroke-width:2.1250000;stroke-linecap:butt;stroke-linejoin:miter;stroke-miterlimit:4.0000000;stroke-dashoffset:0.0000000;stroke-opacity:1.0000000"
   id="rect345"
   width="87.906700"
   height="0.38725418"
   x="-17.955956"
   y="-4.4161129" />



    <svg:rect
   style="fill:#949494;fill-opacity:1.0000000;stroke:none;stroke-width:2.1250000;stroke-linecap:butt;stroke-linejoin:miter;stroke-miterlimit:4.0000000;stroke-dashoffset:0.0000000;stroke-opacity:1.0000000"
   id="rect346"
   width="87.906700"
   height="0.38725418"
   x="-17.955956"
   y="-4.7475533" />



    <svg:rect
   style="fill:#a6a6a6;fill-opacity:1.0000000;stroke:none;stroke-width:2.1250000;stroke-linecap:butt;stroke-linejoin:miter;stroke-miterlimit:4.0000000;stroke-dashoffset:0.0000000;stroke-opacity:1.0000000"
   id="rect347"
   width="87.906700"
   height="0.38725418"
   x="-17.955956"
   y="-5.1059241" />



    <svg:rect
   style="fill:#b8b8b8;fill-opacity:1.0000000;stroke:none;stroke-width:2.1250000;stroke-linecap:butt;stroke-linejoin:miter;stroke-miterlimit:4.0000000;stroke-dashoffset:0.0000000;stroke-opacity:1.0000000"
   id="rect348"
   width="87.906700"
   height="0.38725418"
   x="-17.955956"
   y="-5.4535036" />



    <svg:rect
   style="fill:#cacaca;fill-opacity:1.0000000;stroke:none;stroke-width:2.1250000;stroke-linecap:butt;stroke-linejoin:miter;stroke-miterlimit:4.0000000;stroke-dashoffset:0.0000000;stroke-opacity:1.0000000"
   id="rect349"
   width="87.906700"
   height="0.38725418"
   x="-17.955956"
   y="-5.7963319" />



    <svg:rect
   style="fill:#c5c5c5;fill-opacity:1.0000000;stroke:none;stroke-width:2.1250000;stroke-linecap:butt;stroke-linejoin:miter;stroke-miterlimit:4.0000000;stroke-dashoffset:0.0000000;stroke-opacity:1.0000000"
   id="rect350"
   width="87.906700"
   height="0.38725418"
   x="-17.955956"
   y="-6.5333676" />



    <svg:rect
   style="fill:#b4b4b4;fill-opacity:1.0000000;stroke:none;stroke-width:2.1250000;stroke-linecap:butt;stroke-linejoin:miter;stroke-miterlimit:4.0000000;stroke-dashoffset:0.0000000;stroke-opacity:1.0000000"
   id="rect351"
   width="87.906700"
   height="0.38725418"
   x="-17.955956"
   y="-6.8917384" />



    <svg:rect
   style="fill:#a2a2a2;fill-opacity:1.0000000;stroke:none;stroke-width:2.1250000;stroke-linecap:butt;stroke-linejoin:miter;stroke-miterlimit:4.0000000;stroke-dashoffset:0.0000000;stroke-opacity:1.0000000"
   id="rect352"
   width="87.906700"
   height="0.38725418"
   x="-17.955956"
   y="-7.2142715" />



    <svg:rect
   style="fill:#868686;fill-opacity:1.0000000;stroke:none;stroke-width:2.1250000;stroke-linecap:butt;stroke-linejoin:miter;stroke-miterlimit:4.0000000;stroke-dashoffset:0.0000000;stroke-opacity:1.0000000"
   id="rect353"
   width="87.906700"
   height="0.38725418"
   x="-17.955956"
   y="-7.5368056" />



  </svg:g>



  <svg:polygon
   style="fill:#7f7f7f;stroke:#000000;stroke-width:0.50000000"
   points="28.106000,11.189000 0.31800000,13.627000 4.2180000,28.252000 30.056000,18.990000 28.106000,11.189000 "
   id="polygon354" />



</svg:g>



<svg:text
   xml:space="preserve"
   style="font-size:8.0000000;font-style:normal;font-variant:normal;font-weight:normal;font-stretch:normal;fill:#000000;fill-opacity:1.0000000;stroke:none;stroke-width:1.0000000pt;stroke-linecap:butt;stroke-linejoin:miter;stroke-opacity:1.0000000;font-family:Bitstream Vera Sans;text-anchor:start;writing-mode:lr-tb"
   x="7.9675031"
   y="65.008446"
   id="text188"
   sodipodi:linespacing="100%"><svg:tspan
     sodipodi:role="line"
     id="tspan189"
     x="7.9675031"
     y="65.008446">1</svg:tspan></svg:text>


<svg:text
   xml:space="preserve"
   style="font-size:8.0000000;font-style:normal;font-variant:normal;font-weight:normal;font-stretch:normal;fill:#000000;fill-opacity:1.0000000;stroke:none;stroke-width:1.0000000pt;stroke-linecap:butt;stroke-linejoin:miter;stroke-opacity:1.0000000;font-family:Bitstream Vera Sans;text-anchor:start;writing-mode:lr-tb"
   x="8.145237"
   y="142.40353"
   id="text191"
   sodipodi:linespacing="100%"><svg:tspan
     sodipodi:role="line"
     id="tspan192"
     x="8.1452370"
     y="142.40353">2</svg:tspan></svg:text>


<svg:path
   style="fill:none;fill-opacity:0.75000000;fill-rule:evenodd;stroke:#000000;stroke-width:0.50000006;stroke-linecap:butt;stroke-linejoin:miter;stroke-miterlimit:4.0000000;stroke-opacity:1.0000000"
   d="M 153.51421,141.00000 L 169.02297,141.00000"
   id="path194" />

<svg:path
   style="fill:none;fill-opacity:0.75000000;fill-rule:evenodd;stroke:#000000;stroke-width:0.50000006;stroke-linecap:butt;stroke-linejoin:miter;stroke-miterlimit:4.0000000;stroke-opacity:1.0000000"
   d="M 272.75183,141.00000 L 288.26059,141.00000"
   id="path268" />

</svg:svg>
