<?xml version="1.0" encoding="iso-8859-1"?>
<!-- Generator: Adobe Illustrator 11 Build 196, SVG Export Plug-In . SVG Version: 6.0.0 Build 78)  -->
<!DOCTYPE svg PUBLIC "-//W3C//DTD SVG 1.0//EN"    "http://www.w3.org/TR/2001/REC-SVG-20010904/DTD/svg10.dtd" [
	<!ENTITY ns_flows "http://ns.adobe.com/Flows/1.0/">
	<!ENTITY ns_svg "http://www.w3.org/2000/svg">
	<!ENTITY ns_xlink "http://www.w3.org/1999/xlink">
]>
<svg  
	 width="137.1" height="74.913" viewBox="0 0 137.1 74.913" style="overflow:visible;enable-background:new 0 0 137.1 74.913"
	 xml:space="preserve">
	<style type="text/css">
	
	</style>
	<g id="Layer_1">
		
			<radialGradient id="XMLID_4_" cx="105.1982" cy="63.4502" r="10.6301" fx="105.1982" fy="63.4502" gradientTransform="matrix(1 0 0 1 26 -40.5)" gradientUnits="userSpaceOnUse">
			<stop  offset="0" style="stop-color:#EDEDED"/>
			<stop  offset="0.0072" style="stop-color:#EBEBEB"/>
			<stop  offset="0.0758" style="stop-color:#D4D4D4"/>
			<stop  offset="0.1509" style="stop-color:#BEBEBE"/>
			<stop  offset="0.2321" style="stop-color:#A8A8A8"/>
			<stop  offset="0.3212" style="stop-color:#959595"/>
			<stop  offset="0.4215" style="stop-color:#848484"/>
			<stop  offset="0.5394" style="stop-color:#777777"/>
			<stop  offset="0.6914" style="stop-color:#6E6E6E"/>
			<stop  offset="1" style="stop-color:#6C6C6C"/>
			<midPointStop  offset="0" style="stop-color:#EDEDED"/>
			<midPointStop  offset="0.17" style="stop-color:#EDEDED"/>
			<midPointStop  offset="1" style="stop-color:#6C6C6C"/>
		</radialGradient>
		<circle style="fill:url(#XMLID_4_);" cx="127.698" cy="25.95" r="8.485"/> 
		
			<radialGradient id="XMLID_5_" cx="105.1982" cy="63.4502" r="10.6301" fx="105.1982" fy="63.4502" gradientTransform="matrix(1 0 0 1 -92.75 -40.5)" gradientUnits="userSpaceOnUse">
			<stop  offset="0" style="stop-color:#EDEDED"/>
			<stop  offset="0.0072" style="stop-color:#EBEBEB"/>
			<stop  offset="0.0758" style="stop-color:#D4D4D4"/>
			<stop  offset="0.1509" style="stop-color:#BEBEBE"/>
			<stop  offset="0.2321" style="stop-color:#A8A8A8"/>
			<stop  offset="0.3212" style="stop-color:#959595"/>
			<stop  offset="0.4215" style="stop-color:#848484"/>
			<stop  offset="0.5394" style="stop-color:#777777"/>
			<stop  offset="0.6914" style="stop-color:#6E6E6E"/>
			<stop  offset="1" style="stop-color:#6C6C6C"/>
			<midPointStop  offset="0" style="stop-color:#EDEDED"/>
			<midPointStop  offset="0.17" style="stop-color:#EDEDED"/>
			<midPointStop  offset="1" style="stop-color:#6C6C6C"/>
		</radialGradient>
		<circle style="fill:url(#XMLID_5_);" cx="8.948" cy="25.95" r="8.485"/> 
		<line style="fill:none;stroke:#000000;stroke-width:0.5;" x1="8.948" y1="52.562" x2="8.948" y2="64.562"/>
		<line style="fill:none;stroke:#000000;stroke-width:0.5;" x1="127.698" y1="52.562" x2="127.698" y2="64.562"/>
		<g>
			<text transform="matrix(1 0 0 1 64.6982 70.4502)"><tspan x="0" y="0" style="font-family:Bitstream Vera Sans; font-size:8.500000;">1 m</tspan></text>
		</g>
		<g>
			<line style="stroke:#000000;stroke-width:0.5;" x1="12.76" y1="58.562" x2="124.136" y2="58.562"/>
			<path d="M127.124,58.562c-1.406,0.521-3.15,1.412-4.23,2.354l0.851-2.354l-0.851-2.354
				C123.974,57.15,125.718,58.04,127.124,58.562z"/>
			<path d="M9.773,58.562c1.406-0.521,3.15-1.412,4.231-2.354l-0.851,2.354l0.851,2.354C12.923,59.973,11.179,59.083,9.773,58.562z"
				/>
		</g>
		<g>
			<text transform="matrix(1 0 0 1 118.1982 10)"><tspan x="0" y="0" style="font-family:Bitstream Vera Sans; font-size:8.500000;">1 kg</tspan></text>
		</g>
		<g>
			<text transform="matrix(1 0 0 1 0 10)"><tspan x="0" y="0" style="font-family:Bitstream Vera Sans; font-size:8.500000;">1 kg</tspan></text>
		</g>
		
			<linearGradient id="XMLID_6_" gradientUnits="userSpaceOnUse" x1="18.0798" y1="28.3486" x2="118.5669" y2="28.3486" gradientTransform="matrix(1 0 0 1 0 -2.5)">
			<stop  offset="0" style="stop-color:#868686"/>
			<stop  offset="0.0191" style="stop-color:#919191"/>
			<stop  offset="0.0981" style="stop-color:#B1B1B1"/>
			<stop  offset="0.1789" style="stop-color:#C9C9C9"/>
			<stop  offset="0.2607" style="stop-color:#D9D9D9"/>
			<stop  offset="0.3438" style="stop-color:#E4E4E4"/>
			<stop  offset="0.4291" style="stop-color:#EAEAEA"/>
			<stop  offset="0.52" style="stop-color:#ECECEC"/>
			<stop  offset="0.6081" style="stop-color:#EAEAEA"/>
			<stop  offset="0.6867" style="stop-color:#E4E4E4"/>
			<stop  offset="0.7617" style="stop-color:#DADADA"/>
			<stop  offset="0.8345" style="stop-color:#CACACA"/>
			<stop  offset="0.9057" style="stop-color:#B4B4B4"/>
			<stop  offset="0.9748" style="stop-color:#959595"/>
			<stop  offset="1" style="stop-color:#868686"/>
			<midPointStop  offset="0" style="stop-color:#868686"/>
			<midPointStop  offset="0.28" style="stop-color:#868686"/>
			<midPointStop  offset="0.52" style="stop-color:#ECECEC"/>
			<midPointStop  offset="0.73" style="stop-color:#ECECEC"/>
			<midPointStop  offset="1" style="stop-color:#868686"/>
		</linearGradient>
		<polygon style="fill:url(#XMLID_6_);" points="118.567,25.849 102.83,1.411 102.83,13.599 33.817,13.599 33.817,1.411 
			18.08,25.849 33.817,50.286 33.817,38.099 102.83,38.099 102.83,50.286 "/>
		<g>
			<text transform="matrix(1 0 0 1 34.1982 30.4502)"><tspan x="0" y="0" style="font-family:Bitstream Vera Sans; font-size:10.200000;">6.67x10</tspan></text>
			<text transform="matrix(1 0 0 1 76.9014 27.4502)"><tspan x="0" y="0" style="font-family:Bitstream Vera Sans; font-size:8.500000;">-1</tspan></text>
			<text transform="matrix(1 0 0 1 85.0527 27.4502)"><tspan x="0" y="0" style="font-family:Bitstream Vera Sans; font-size:8.500000;">1</tspan></text>
			<text transform="matrix(1 0 0 1 90.6143 30.4502)"><tspan x="0" y="0" style="font-family:Bitstream Vera Sans; font-size:10.200000;"> N</tspan></text>
		</g>
	</g>
</svg>
