<?xml version="1.0" encoding="iso-8859-1"?>
<!-- Generator: Adobe Illustrator 11 Build 196, SVG Export Plug-In . SVG Version: 6.0.0 Build 78)  -->
<!DOCTYPE svg PUBLIC "-//W3C//DTD SVG 1.0//EN"    "http://www.w3.org/TR/2001/REC-SVG-20010904/DTD/svg10.dtd" [
	<!ENTITY ns_flows "http://ns.adobe.com/Flows/1.0/">
	<!ENTITY ns_svg "http://www.w3.org/2000/svg">
	<!ENTITY ns_xlink "http://www.w3.org/1999/xlink">
]>
<svg  
	 width="128.227" height="214.299" viewBox="0 0 128.227 214.299"
	 style="overflow:visible;enable-background:new 0 0 128.227 214.299" xml:space="preserve">
	<style type="text/css">
	
	</style>
	<g id="Layer_1">
		<g>
			<g>
				<rect x="0.5" y="0.5" style="fill:none;stroke:#000000;" width="41.813" height="20.16"/> 
				<g>
					<text transform="matrix(1 0 0 1 13.917 13.1702)"><tspan x="0" y="0" style="font-family:Bitstream Vera Sans; font-size:8.500000;">C.E.</tspan></text>
				</g>
			</g>
			<g>
				<rect x="79.273" y="19.832" style="fill:none;stroke:#000000;" width="41.813" height="20.16"/> 
				<g>
					<text transform="matrix(1 0 0 1 92.6899 32.5017)"><tspan x="0" y="0" style="font-family:Bitstream Vera Sans; font-size:8.500000;">N.D.</tspan></text>
				</g>
			</g>
			<circle cx="38.557" cy="16.641" r="1.22"/> 
			<circle cx="38.557" cy="5.44" r="1.219"/> 
			<circle cx="86.157" cy="36.801" r="1.22"/> 
			<circle cx="96.237" cy="36.801" r="1.22"/> 
			<rect x="35.427" y="62.438" style="fill:none;stroke:#000000;" width="37.6" height="21.6"/> 
			<g>
				<text transform="matrix(1 0 0 1 48.2266 75.238)"><tspan x="0" y="0" style="font-family:Bitstream Vera Sans; font-size:8.500000;">P</tspan></text>
				<text transform="matrix(1 0 0 1 53.6064 75.238)"><tspan x="0" y="0" style="font-family:Bitstream Vera Sans; font-size:8.500000;">.S.</tspan></text>
			</g>
			<circle cx="41.027" cy="81.218" r="1.219"/> 
			<circle cx="68.227" cy="81.218" r="1.219"/> 
			<path style="fill:none;stroke:#000000;" d="M41.027,81.219c-5.333,10.286-34.134,9.486-20-16.647
				c14.133-26.133,22.4-32.533,24.533-34.133s-3.606-11.861-7.003-13.797"/>
			<path style="fill:none;stroke:#000000;" d="M68.227,81.219c15.733,6.553,18.133-4.647,15.466-12.647
				c-2.667-8-29.333-16.267-33.6-22.667c-4.267-6.4-23.733-38.933-11.2-41.066"/>
			<path style="fill:none;stroke:#000000;" d="M39.693,16.838c7.2,0.8,32.8,28.533,46.134,20"/>
			<path style="fill:none;stroke:#000000;" d="M67.094,80.854c10.933,5.6,13.333-35.733,15.466-37.066
				c2.133-1.333,14.124-5.296,13.867-7.2"/>
			<g>
				<circle style="fill:#FFFFFF;stroke:#000000;" cx="18.244" cy="71.604" r="7.501"/> 
				<g>
					<text transform="matrix(1 0 0 1 15.0425 74.6042)"><tspan x="0" y="0" style="font-family:Bitstream Vera Sans; font-size:8.500000;">A</tspan></text>
				</g>
			</g>
			<g>
				<circle style="fill:#FFFFFF;stroke:#000000;" cx="26.894" cy="53.603" r="7.501"/> 
				<g>
					<text transform="matrix(1 0 0 1 24.5601 57.4036)"><tspan x="0" y="0" style="font-family:Bitstream Vera Sans; font-size:8.500000;">V</tspan></text>
				</g>
			</g>
		</g>
		<g>
			<g>
				<rect x="0.5" y="122.452" style="fill:none;stroke:#000000;" width="41.813" height="20.16"/> 
				<g>
					<text transform="matrix(1 0 0 1 13.917 135.1228)"><tspan x="0" y="0" style="font-family:Bitstream Vera Sans; font-size:8.500000;">C.E.</tspan></text>
				</g>
			</g>
			<g>
				<rect x="79.273" y="141.784" style="fill:none;stroke:#000000;" width="41.813" height="20.16"/> 
				<g>
					<text transform="matrix(1 0 0 1 92.6899 154.4543)"><tspan x="0" y="0" style="font-family:Bitstream Vera Sans; font-size:8.500000;">N.D.</tspan></text>
				</g>
			</g>
			<circle cx="38.557" cy="138.593" r="1.22"/> 
			<circle cx="38.557" cy="127.393" r="1.219"/> 
			<circle cx="86.157" cy="158.753" r="1.219"/> 
			<circle cx="96.237" cy="158.753" r="1.219"/> 
			<rect x="35.427" y="184.39" style="fill:none;stroke:#000000;" width="37.6" height="21.6"/> 
			<g>
				<text transform="matrix(1 0 0 1 48.2266 197.1902)"><tspan x="0" y="0" style="font-family:Bitstream Vera Sans; font-size:8.500000;">P</tspan></text>
				<text transform="matrix(1 0 0 1 53.6064 197.1902)"><tspan x="0" y="0" style="font-family:Bitstream Vera Sans; font-size:8.500000;">.S.</tspan></text>
			</g>
			<circle cx="41.027" cy="203.171" r="1.22"/> 
			<circle cx="68.227" cy="203.171" r="1.22"/> 
			<path style="fill:none;stroke:#000000;" d="M39.693,138.79c7.2,0.8,32.8,28.533,46.134,20"/>
			<path style="fill:none;stroke:#000000;" d="M67.094,202.807c10.933,5.6,13.333-35.733,15.466-37.066
				c2.133-1.333,14.124-5.296,13.867-7.2"/>
			<g>
				<circle style="fill:#FFFFFF;stroke:#000000;" cx="63.694" cy="154.307" r="7.501"/> 
				<g>
					<text transform="matrix(1 0 0 1 60.4927 157.3069)"><tspan x="0" y="0" style="font-family:Bitstream Vera Sans; font-size:8.500000;">A</tspan></text>
				</g>
			</g>
			<path style="fill:none;stroke:#000000;" d="M41.027,203.171c-12.133-15.732,22.667-67.333-2.133-76.533"/>
			<path style="fill:none;stroke:#000000;" d="M38.557,127.393c25.737-3.755,43.737-4.955,47.737,30.646"/>
			<g>
				<g>
					<circle style="fill:#FFFFFF;stroke:#000000;" cx="70.693" cy="128.489" r="7.501"/> 
				</g>
				<g>
					<text transform="matrix(1 0 0 1 67.5601 132.2888)"><tspan x="0" y="0" style="font-family:Bitstream Vera Sans; font-size:8.500000;">V</tspan></text>
				</g>
			</g>
		</g>
		<line style="fill:none;" x1="128.227" y1="41.637" x2="128.227" y2="112.038"/>
		<g>
			<text transform="matrix(1 0 0 1 105.439 88.2361)"><tspan x="0" y="0" style="font-family:Bitstream Vera Sans; font-size:8.500000;">(a)</tspan></text>
		</g>
		<g>
			<text transform="matrix(1 0 0 1 105.439 209.8362)"><tspan x="0" y="0" style="font-family:Bitstream Vera Sans; font-size:8.500000;">(b)</tspan></text>
		</g>
	</g>
</svg>
