<?xml version="1.0" encoding="iso-8859-1"?>
<!-- Generator: Adobe Illustrator 11 Build 196, SVG Export Plug-In . SVG Version: 6.0.0 Build 78)  -->
<!DOCTYPE svg PUBLIC "-//W3C//DTD SVG 1.0//EN"    "http://www.w3.org/TR/2001/REC-SVG-20010904/DTD/svg10.dtd" [
	<!ENTITY ns_flows "http://ns.adobe.com/Flows/1.0/">
	<!ENTITY ns_svg "http://www.w3.org/2000/svg">
	<!ENTITY ns_xlink "http://www.w3.org/1999/xlink">
]>
<svg  
	 width="94.786" height="72.33" viewBox="0 0 94.786 72.33" style="overflow:visible;enable-background:new 0 0 94.786 72.33"
	 xml:space="preserve">
	<style type="text/css">
	
	</style>
	<g id="Layer_1">
		<g>
			<g>
				<path style="fill:#B4B4B4;stroke:#000000;" d="M94.286,35.833l-0.051,0C93.036,18.954,64.271,3.728,39.057,3.193
					c-1.677-0.259-3.396-0.396-5.146-0.396c-7.356,0-14.153,2.383-19.672,6.412c-4.123,2.697-7.49,6.374-9.757,11.175
					C1.943,25.094,0.5,30.482,0.5,36.208c0,4.915,1.07,9.577,2.976,13.78c2.9,7.858,8.48,13.056,15.511,16.112
					c4.493,2.248,9.559,3.52,14.924,3.52c0.671,0,1.336-0.026,1.998-0.065c25.904,0.75,57.077-15.045,58.327-32.632l0.051,0
					c0-0.182-0.019-0.363-0.025-0.545C94.267,36.197,94.286,36.015,94.286,35.833z"/>
				<g>
					<text transform="matrix(1 0 0 1 30.3691 9)"><tspan x="0" y="0" style="font-family:Bitstream Vera Sans; font-size:7.650000;">+</tspan></text>
				</g>
				<g>
					<text transform="matrix(1 0 0 1 32.3218 68.313)"><tspan x="0" y="0" style="font-family:Bitstream Vera Sans; font-size:7.650000;">+</tspan></text>
				</g>
				<g>
					<text transform="matrix(1 0 0 1 2.1553 38.2295)"><tspan x="0" y="0" style="font-family:Bitstream Vera Sans; font-size:7.650000;">+</tspan></text>
				</g>
				<g>
					<text transform="matrix(1 0 0 1 86.2769 38.7593)"><tspan x="0" y="0" style="font-family:Bitstream Vera Sans; font-size:7.650000;">+</tspan></text>
				</g>
				<g>
					<text transform="matrix(1 0 0 1 11.9438 19.4258)"><tspan x="0" y="0" style="font-family:Bitstream Vera Sans; font-size:7.650000;">+</tspan></text>
				</g>
				<g>
					<text transform="matrix(1 0 0 1 11.2769 56.4258)"><tspan x="0" y="0" style="font-family:Bitstream Vera Sans; font-size:7.650000;">+</tspan></text>
				</g>
				<g>
					<text transform="matrix(1 0 0 1 49.9438 14.9258)"><tspan x="0" y="0" style="font-family:Bitstream Vera Sans; font-size:7.650000;">+</tspan></text>
				</g>
				<g>
					<text transform="matrix(1 0 0 1 66.4438 21.2593)"><tspan x="0" y="0" style="font-family:Bitstream Vera Sans; font-size:7.650000;">+</tspan></text>
				</g>
				<g>
					<text transform="matrix(1 0 0 1 76.1104 26.9258)"><tspan x="0" y="0" style="font-family:Bitstream Vera Sans; font-size:7.650000;">+</tspan></text>
				</g>
				<g>
					<text transform="matrix(1 0 0 1 83.4438 32.0928)"><tspan x="0" y="0" style="font-family:Bitstream Vera Sans; font-size:7.650000;">+</tspan></text>
				</g>
				<g>
					<text transform="matrix(1 0 0 1 83.9438 45.4258)"><tspan x="0" y="0" style="font-family:Bitstream Vera Sans; font-size:7.650000;">+</tspan></text>
				</g>
				<g>
					<text transform="matrix(1 0 0 1 75.6104 52.0928)"><tspan x="0" y="0" style="font-family:Bitstream Vera Sans; font-size:7.650000;">+</tspan></text>
				</g>
				<g>
					<text transform="matrix(1 0 0 1 63.9438 57.2593)"><tspan x="0" y="0" style="font-family:Bitstream Vera Sans; font-size:7.650000;">+</tspan></text>
				</g>
				<g>
					<text transform="matrix(1 0 0 1 49.6104 62.9258)"><tspan x="0" y="0" style="font-family:Bitstream Vera Sans; font-size:7.650000;">+</tspan></text>
				</g>
			</g>
			<circle style="fill:#FFFFFF;stroke:#000000;stroke-width:0.5;" cx="36.155" cy="35.959" r="2.392"/> 
		</g>
	</g>
</svg>
