<?xml version="1.0" encoding="UTF-8" standalone="no"?>
<!-- Generator: Adobe Illustrator 11 Build 196, SVG Export Plug-In . SVG Version: 6.0.0 Build 78)  -->
<svg
   xmlns:a="http://ns.adobe.com/AdobeSVGViewerExtensions/3.0/"
   xmlns:dc="http://purl.org/dc/elements/1.1/"
   xmlns:cc="http://web.resource.org/cc/"
   xmlns:rdf="http://www.w3.org/1999/02/22-rdf-syntax-ns#"
   xmlns:svg="http://www.w3.org/2000/svg"
   xmlns="http://www.w3.org/2000/svg"
   xmlns:sodipodi="http://inkscape.sourceforge.net/DTD/sodipodi-0.dtd"
   xmlns:inkscape="http://www.inkscape.org/namespaces/inkscape"
   width="247.571"
   height="74"
   viewBox="0 0 247.571 74"
   style="overflow:visible;enable-background:new 0 0 247.571 74"
   xml:space="preserve"
   id="svg2"
   sodipodi:version="0.32"
   inkscape:version="0.42.2"
   sodipodi:docname="vibrations.svg"
   sodipodi:docbase="/home/bcrowell/Documents/writing/lm/trunk/3vw/ch99/figs"><metadata
   id="metadata189"><rdf:RDF><cc:Work
       rdf:about=""><dc:format>image/svg+xml</dc:format><dc:type
         rdf:resource="http://purl.org/dc/dcmitype/StillImage" /></cc:Work></rdf:RDF></metadata><defs
   id="defs187" /><sodipodi:namedview
   inkscape:cy="417.84947"
   inkscape:cx="305.25953"
   inkscape:zoom="0.43415836"
   inkscape:window-height="510"
   inkscape:window-width="712"
   inkscape:pageshadow="2"
   inkscape:pageopacity="0.0"
   borderopacity="1.0"
   bordercolor="#666666"
   pagecolor="#ffffff"
   id="base"
   inkscape:window-x="179"
   inkscape:window-y="179"
   inkscape:current-layer="svg2" />
	<style
   type="text/css"
   id="style4">
	
	</style>
	<g
   id="Layer_1">
		<polyline
   style="fill:none;stroke:#000000;stroke-miterlimit:1;"
   points="238.595,44.5 242.595,44.5 242.595,65.5 238.595,65.5     238.595,44.5 "
   id="polyline7" />
		<rect
   x="222.595"
   y="52"
   style="fill:#FFFFFF;"
   width="4"
   height="21"
   id="rect9" /> 
		<polyline
   style="fill:none;stroke:#000000;stroke-miterlimit:1;"
   points="223.095,52.5 227.095,52.5 227.095,73.5 223.095,73.5     223.095,52.5 "
   id="polyline11" />
		<rect
   x="12.595"
   y="52"
   style="fill:#FFFFFF;"
   width="4"
   height="21"
   id="rect13" /> 
		<polyline
   style="fill:none;stroke:#000000;stroke-miterlimit:1;"
   points="13.095,52.5 17.095,52.5 17.095,73.5 13.095,73.5     13.095,52.5 "
   id="polyline15" />
		<g
   id="g17">
			
				<linearGradient
   id="XMLID_35_"
   gradientUnits="userSpaceOnUse"
   x1="-74.7461"
   y1="-231.8608"
   x2="182.4352"
   y2="-231.8608"
   gradientTransform="matrix(0.9447 -3.000000e-04 3.000000e-04 0.9447 69.5326 261.9447)">
				<stop
   offset="0"
   style="stop-color:#D8D8D8"
   id="stop20" />
				<stop
   offset="0.1061"
   style="stop-color:#DCDCDC"
   id="stop22" />
				<stop
   offset="0.2513"
   style="stop-color:#E5E5E5"
   id="stop24" />
				<stop
   offset="0.4183"
   style="stop-color:#F5F5F5"
   id="stop26" />
				<stop
   offset="0.51"
   style="stop-color:#FFFFFF"
   id="stop28" />
				<stop
   offset="0.5174"
   style="stop-color:#FDFDFD"
   id="stop30" />
				<stop
   offset="0.6445"
   style="stop-color:#EEEEEE"
   id="stop32" />
				<stop
   offset="0.7692"
   style="stop-color:#E2E2E2"
   id="stop34" />
				<stop
   offset="0.8894"
   style="stop-color:#DADADA"
   id="stop36" />
				<stop
   offset="1"
   style="stop-color:#D8D8D8"
   id="stop38" />
				<midPointStop
   offset="0"
   style="stop-color:#D8D8D8" />
				<midPointStop
   offset="0.64"
   style="stop-color:#D8D8D8" />
				<midPointStop
   offset="0.51"
   style="stop-color:#FFFFFF" />
				<midPointStop
   offset="0.31"
   style="stop-color:#FFFFFF" />
				<midPointStop
   offset="1"
   style="stop-color:#D8D8D8" />
			</linearGradient>
			<polygon
   style="fill:url(#XMLID_35_);stroke:#000000;"
   points="231.774,56.315 242.36,29.38 11.32,29.463 0.734,56.398 "
   id="polygon40" />
			<polygon
   style="fill:#DCDCDC;stroke:#000000;"
   points="231.774,56.315 246.989,42.608 242.36,29.38 "
   id="polygon42" />
		</g>
		<g
   id="g44">
			<text
   transform="matrix(1 0 0 1 164.5947 69)"
   id="text46"><tspan
     x="0"
     y="0"
     style="font-family:Bitstream Vera Sans; font-size:7.650000;"
     id="tspan48">air track</tspan></text>

		</g>
		<polygon
   style="fill:#EEEEEE;"
   points="99.595,25 94.595,39 129.595,39 133.595,25 "
   id="polygon50" />
		<polyline
   style="fill:none;stroke:#000000;stroke-miterlimit:1;"
   points="100.095,25.5 95.095,39.5 130.095,39.5 134.095,25.5     100.095,25.5 "
   id="polyline52" />
		<rect
   x="99.595"
   y="17"
   style="fill:#EEEEEE;"
   width="35"
   height="8"
   id="rect54" /> 
		<polyline
   style="fill:none;stroke:#000000;stroke-miterlimit:1;"
   points="100.095,17.5 135.095,17.5 135.095,25.5 100.095,25.5     100.095,17.5 "
   id="polyline56" />
		<path
   style="fill:none;stroke:#000000;stroke-miterlimit:1;"
   d="M141.595,13.5c3.25,0,6.5,3,6.5,6s-3.25,6-6.5,6s-6.5-3-6.5-6    S138.345,13.5,141.595,13.5z"
   id="path58" />
		<path
   style="fill:none;stroke:#000000;stroke-miterlimit:1;"
   d="M145.095,13.5c3,0,6,3,6,6s-3,6-6,6s-6-3-6-6    S142.095,13.5,145.095,13.5z"
   id="path60" />
		<path
   style="fill:none;stroke:#000000;stroke-miterlimit:1;"
   d="M148.595,13.5c3.25,0,6.5,3,6.5,6s-3.25,6-6.5,6s-6.5-3-6.5-6    S145.345,13.5,148.595,13.5z"
   id="path62" />
		<path
   style="fill:none;stroke:#000000;stroke-miterlimit:1;"
   d="M151.595,13.5c3.25,0,6.5,3,6.5,6s-3.25,6-6.5,6s-6.5-3-6.5-6    S148.345,13.5,151.595,13.5z"
   id="path64" />
		<path
   style="fill:none;stroke:#000000;stroke-miterlimit:1;"
   d="M154.595,13.5c3.25,0,6.5,3,6.5,6s-3.25,6-6.5,6s-6.5-3-6.5-6    S151.345,13.5,154.595,13.5z"
   id="path66" />
		<path
   style="fill:none;stroke:#000000;stroke-miterlimit:1;"
   d="M157.595,13.5c3.25,0,6.5,3,6.5,6s-3.25,6-6.5,6s-6.5-3-6.5-6    S154.345,13.5,157.595,13.5z"
   id="path68" />
		<path
   style="fill:none;stroke:#000000;stroke-miterlimit:1;"
   d="M161.095,13.5c3,0,6,3,6,6s-3,6-6,6s-6-3-6-6    S158.095,13.5,161.095,13.5z"
   id="path70" />
		<path
   style="fill:none;stroke:#000000;stroke-miterlimit:1;"
   d="M165.095,13.5c3,0,6,3,6,6s-3,6-6,6s-6-3-6-6    S162.095,13.5,165.095,13.5z"
   id="path72" />
		<path
   style="fill:none;stroke:#000000;stroke-miterlimit:1;"
   d="M168.095,13.5c3,0,6,3,6,6s-3,6-6,6s-6-3-6-6    S165.095,13.5,168.095,13.5z"
   id="path74" />
		<path
   style="fill:none;stroke:#000000;stroke-miterlimit:1;"
   d="M171.095,13.5c3,0,6,3,6,6s-3,6-6,6s-6-3-6-6    S168.095,13.5,171.095,13.5z"
   id="path76" />
		<path
   style="fill:none;stroke:#000000;stroke-miterlimit:1;"
   d="M173.095,13.5c3,0,6,3,6,6s-3,6-6,6s-6-3-6-6    S170.095,13.5,173.095,13.5z"
   id="path78" />
		<path
   style="fill:none;stroke:#000000;stroke-miterlimit:1;"
   d="M177.095,13.5c3,0,6,3,6,6s-3,6-6,6s-6-3-6-6    S174.095,13.5,177.095,13.5z"
   id="path80" />
		<path
   style="fill:none;stroke:#000000;stroke-miterlimit:1;"
   d="M180.095,13.5c3,0,6,3,6,6s-3,6-6,6s-6-3-6-6    S177.095,13.5,180.095,13.5z"
   id="path82" />
		<path
   style="fill:none;stroke:#000000;stroke-miterlimit:1;"
   d="M183.595,13.5c3.25,0,6.5,3,6.5,6s-3.25,6-6.5,6s-6.5-3-6.5-6    S180.345,13.5,183.595,13.5z"
   id="path84" />
		<path
   style="fill:none;stroke:#000000;stroke-miterlimit:1;"
   d="M186.095,13.5c3,0,6,3,6,6s-3,6-6,6s-6-3-6-6    S183.095,13.5,186.095,13.5z"
   id="path86" />
		<path
   style="fill:none;stroke:#000000;stroke-miterlimit:1;"
   d="M189.095,13.5c3,0,6,3,6,6s-3,6-6,6s-6-3-6-6    S186.095,13.5,189.095,13.5z"
   id="path88" />
		<path
   style="fill:none;stroke:#000000;stroke-miterlimit:1;"
   d="M193.095,13.5c3,0,6,3,6,6s-3,6-6,6s-6-3-6-6    S190.095,13.5,193.095,13.5z"
   id="path90" />
		<path
   style="fill:none;stroke:#000000;stroke-miterlimit:1;"
   d="M196.595,13.5c3.25,0,6.5,3,6.5,6s-3.25,6-6.5,6s-6.5-3-6.5-6    S193.345,13.5,196.595,13.5z"
   id="path92" />
		<path
   style="fill:none;stroke:#000000;stroke-miterlimit:1;"
   d="M199.595,13.5c3.25,0,6.5,3,6.5,6s-3.25,6-6.5,6s-6.5-3-6.5-6    S196.345,13.5,199.595,13.5z"
   id="path94" />
		<path
   style="fill:none;stroke:#000000;stroke-miterlimit:1;"
   d="M202.595,13.5c3.25,0,6.5,3,6.5,6s-3.25,6-6.5,6s-6.5-3-6.5-6    S199.345,13.5,202.595,13.5z"
   id="path96" />
		<path
   style="fill:none;stroke:#000000;stroke-miterlimit:1;"
   d="M205.095,13.5c3,0,6,3,6,6s-3,6-6,6s-6-3-6-6    S202.095,13.5,205.095,13.5z"
   id="path98" />
		<path
   style="fill:none;stroke:#000000;stroke-miterlimit:1;"
   d="M209.095,13.5c3,0,6,3,6,6s-3,6-6,6s-6-3-6-6    S206.095,13.5,209.095,13.5z"
   id="path100" />
		<path
   style="fill:none;stroke:#000000;stroke-miterlimit:1;"
   d="M212.095,13.5c3,0,6,3,6,6s-3,6-6,6s-6-3-6-6    S209.095,13.5,212.095,13.5z"
   id="path102" />
		<path
   style="fill:none;stroke:#000000;stroke-miterlimit:1;"
   d="M215.595,13.5c3.25,0,6.5,3,6.5,6s-3.25,6-6.5,6s-6.5-3-6.5-6    S212.345,13.5,215.595,13.5z"
   id="path104" />
		<path
   style="fill:none;stroke:#000000;stroke-miterlimit:1;"
   d="M218.095,13.5c3,0,6,3,6,6s-3,6-6,6s-6-3-6-6    S215.095,13.5,218.095,13.5z"
   id="path106" />
		<path
   style="fill:none;stroke:#000000;stroke-miterlimit:1;"
   d="M221.095,13.5c3,0,6,3,6,6s-3,6-6,6s-6-3-6-6    S218.095,13.5,221.095,13.5z"
   id="path108" />
		<path
   style="fill:none;stroke:#000000;stroke-miterlimit:1;"
   d="M225.095,13.5c3,0,6,3,6,6s-3,6-6,6s-6-3-6-6    S222.095,13.5,225.095,13.5z"
   id="path110" />
		<path
   style="fill:none;stroke:#000000;stroke-miterlimit:1;"
   d="M228.595,13.5c3.25,0,6.5,3,6.5,6s-3.25,6-6.5,6s-6.5-3-6.5-6    S225.345,13.5,228.595,13.5z"
   id="path112" />
		<path
   style="fill:none;stroke:#000000;stroke-miterlimit:1;"
   d="M231.595,13.5c3.25,0,6.5,3,6.5,6s-3.25,6-6.5,6s-6.5-3-6.5-6    S228.345,13.5,231.595,13.5z"
   id="path114" />
		<path
   style="fill:none;stroke:#000000;stroke-miterlimit:1;"
   d="M234.595,13.5c3.25,0,6.5,3,6.5,6s-3.25,6-6.5,6s-6.5-3-6.5-6    S231.345,13.5,234.595,13.5z"
   id="path116" />
		<path
   style="fill:none;stroke:#000000;stroke-miterlimit:1;"
   d="M8.095,13.5c3,0,6,3,6,6s-3,6-6,6s-6-3-6-6S5.095,13.5,8.095,13.5    z"
   id="path118" />
		<path
   style="fill:none;stroke:#000000;stroke-miterlimit:1;"
   d="M11.095,13.5c3,0,6,3,6,6s-3,6-6,6s-6-3-6-6    S8.095,13.5,11.095,13.5z"
   id="path120" />
		<path
   style="fill:none;stroke:#000000;stroke-miterlimit:1;"
   d="M14.095,13.5c3,0,6,3,6,6s-3,6-6,6s-6-3-6-6    S11.095,13.5,14.095,13.5z"
   id="path122" />
		<path
   style="fill:none;stroke:#000000;stroke-miterlimit:1;"
   d="M17.595,13.5c3.25,0,6.5,3,6.5,6s-3.25,6-6.5,6s-6.5-3-6.5-6    S14.345,13.5,17.595,13.5z"
   id="path124" />
		<path
   style="fill:none;stroke:#000000;stroke-miterlimit:1;"
   d="M21.095,13.5c3,0,6,3,6,6s-3,6-6,6s-6-3-6-6    S18.095,13.5,21.095,13.5z"
   id="path126" />
		<path
   style="fill:none;stroke:#000000;stroke-miterlimit:1;"
   d="M24.095,13.5c3,0,6,3,6,6s-3,6-6,6s-6-3-6-6    S21.095,13.5,24.095,13.5z"
   id="path128" />
		<path
   style="fill:none;stroke:#000000;stroke-miterlimit:1;"
   d="M27.095,13.5c3,0,6,3,6,6s-3,6-6,6s-6-3-6-6    S24.095,13.5,27.095,13.5z"
   id="path130" />
		<path
   style="fill:none;stroke:#000000;stroke-miterlimit:1;"
   d="M29.095,13.5c3,0,6,3,6,6s-3,6-6,6s-6-3-6-6    S26.095,13.5,29.095,13.5z"
   id="path132" />
		<path
   style="fill:none;stroke:#000000;stroke-miterlimit:1;"
   d="M33.095,13.5c3,0,6,3,6,6s-3,6-6,6s-6-3-6-6    S30.095,13.5,33.095,13.5z"
   id="path134" />
		<path
   style="fill:none;stroke:#000000;stroke-miterlimit:1;"
   d="M36.595,13.5c3.25,0,6.5,3,6.5,6s-3.25,6-6.5,6s-6.5-3-6.5-6    S33.345,13.5,36.595,13.5z"
   id="path136" />
		<path
   style="fill:none;stroke:#000000;stroke-miterlimit:1;"
   d="M39.595,13.5c3.25,0,6.5,3,6.5,6s-3.25,6-6.5,6s-6.5-3-6.5-6    S36.345,13.5,39.595,13.5z"
   id="path138" />
		<path
   style="fill:none;stroke:#000000;stroke-miterlimit:1;"
   d="M42.595,13.5c3.25,0,6.5,3,6.5,6s-3.25,6-6.5,6s-6.5-3-6.5-6    S39.345,13.5,42.595,13.5z"
   id="path140" />
		<path
   style="fill:none;stroke:#000000;stroke-miterlimit:1;"
   d="M45.595,13.5c3.25,0,6.5,3,6.5,6s-3.25,6-6.5,6s-6.5-3-6.5-6    S42.345,13.5,45.595,13.5z"
   id="path142" />
		<path
   style="fill:none;stroke:#000000;stroke-miterlimit:1;"
   d="M49.095,13.5c3,0,6,3,6,6s-3,6-6,6s-6-3-6-6    S46.095,13.5,49.095,13.5z"
   id="path144" />
		<path
   style="fill:none;stroke:#000000;stroke-miterlimit:1;"
   d="M52.595,13.5c3.25,0,6.5,3,6.5,6s-3.25,6-6.5,6s-6.5-3-6.5-6    S49.345,13.5,52.595,13.5z"
   id="path146" />
		<path
   style="fill:none;stroke:#000000;stroke-miterlimit:1;"
   d="M56.095,13.5c3,0,6,3,6,6s-3,6-6,6s-6-3-6-6    S53.095,13.5,56.095,13.5z"
   id="path148" />
		<path
   style="fill:none;stroke:#000000;stroke-miterlimit:1;"
   d="M59.095,13.5c3,0,6,3,6,6s-3,6-6,6s-6-3-6-6    S56.095,13.5,59.095,13.5z"
   id="path150" />
		<path
   style="fill:none;stroke:#000000;stroke-miterlimit:1;"
   d="M61.095,13.5c3,0,6,3,6,6s-3,6-6,6s-6-3-6-6    S58.095,13.5,61.095,13.5z"
   id="path152" />
		<path
   style="fill:none;stroke:#000000;stroke-miterlimit:1;"
   d="M65.095,13.5c3,0,6,3,6,6s-3,6-6,6s-6-3-6-6    S62.095,13.5,65.095,13.5z"
   id="path154" />
		<path
   style="fill:none;stroke:#000000;stroke-miterlimit:1;"
   d="M68.595,13.5c3.25,0,6.5,3,6.5,6s-3.25,6-6.5,6s-6.5-3-6.5-6    S65.345,13.5,68.595,13.5z"
   id="path156" />
		<path
   style="fill:none;stroke:#000000;stroke-miterlimit:1;"
   d="M71.595,13.5c3.25,0,6.5,3,6.5,6s-3.25,6-6.5,6s-6.5-3-6.5-6    S68.345,13.5,71.595,13.5z"
   id="path158" />
		<path
   style="fill:none;stroke:#000000;stroke-miterlimit:1;"
   d="M74.595,13.5c3.25,0,6.5,3,6.5,6s-3.25,6-6.5,6s-6.5-3-6.5-6    S71.345,13.5,74.595,13.5z"
   id="path160" />
		<path
   style="fill:none;stroke:#000000;stroke-miterlimit:1;"
   d="M77.595,13.5c3.25,0,6.5,3,6.5,6s-3.25,6-6.5,6s-6.5-3-6.5-6    S74.345,13.5,77.595,13.5z"
   id="path162" />
		<path
   style="fill:none;stroke:#000000;stroke-miterlimit:1;"
   d="M81.095,13.5c3,0,6,3,6,6s-3,6-6,6s-6-3-6-6    S78.095,13.5,81.095,13.5z"
   id="path164" />
		<path
   style="fill:none;stroke:#000000;stroke-miterlimit:1;"
   d="M84.595,13.5c3.25,0,6.5,3,6.5,6s-3.25,6-6.5,6s-6.5-3-6.5-6    S81.345,13.5,84.595,13.5z"
   id="path166" />
		<path
   style="fill:none;stroke:#000000;stroke-miterlimit:1;"
   d="M88.095,13.5c3,0,6,3,6,6s-3,6-6,6s-6-3-6-6    S85.095,13.5,88.095,13.5z"
   id="path168" />
		<path
   style="fill:none;stroke:#000000;stroke-miterlimit:1;"
   d="M91.095,13.5c3,0,6,3,6,6s-3,6-6,6s-6-3-6-6    S88.095,13.5,91.095,13.5z"
   id="path170" />
		<path
   style="fill:none;stroke:#000000;stroke-miterlimit:1;"
   d="M93.095,13.5c3,0,6,3,6,6s-3,6-6,6s-6-3-6-6    S90.095,13.5,93.095,13.5z"
   id="path172" />
		<g
   id="g174">
			<text
   transform="matrix(1 0 0 1 177.5947 9)"
   id="text176"><tspan
     x="0"
     y="0"
     style="font-family:Bitstream Vera Sans; font-size:7.650000;"
     id="tspan178">spring</tspan></text>

		</g>
		<g
   id="g180">
			<text
   transform="matrix(1 0 0 1 108.5947 35)"
   id="text182"><tspan
     x="0"
     y="0"
     style="font-family:Bitstream Vera Sans; font-size:7.650000;"
     id="tspan184">cart</tspan></text>

		</g>
	</g>
<rect
   style="fill:none;fill-opacity:0.75000000;fill-rule:evenodd;stroke:none;stroke-width:0.88320074pt;stroke-linecap:butt;stroke-linejoin:miter;stroke-opacity:1.0000000"
   id="rect1487"
   width="565.95410"
   height="6.9099212"
   x="5.5592203"
   y="26.531342" /></svg>