<?xml version="1.0" encoding="UTF-8" standalone="no"?>
<!-- Generator: Adobe Illustrator 11 Build 196, SVG Export Plug-In . SVG Version: 6.0.0 Build 78)  -->
<svg
   xmlns:dc="http://purl.org/dc/elements/1.1/"
   xmlns:cc="http://web.resource.org/cc/"
   xmlns:rdf="http://www.w3.org/1999/02/22-rdf-syntax-ns#"
   xmlns:svg="http://www.w3.org/2000/svg"
   xmlns="http://www.w3.org/2000/svg"
   xmlns:sodipodi="http://inkscape.sourceforge.net/DTD/sodipodi-0.dtd"
   xmlns:inkscape="http://www.inkscape.org/namespaces/inkscape"
   width="112.939"
   height="66.925"
   viewBox="0 0 112.939 66.925"
   style="overflow:visible;enable-background:new 0 0 112.939 66.925"
   xml:space="preserve"
   id="svg89"
   sodipodi:version="0.32"
   inkscape:version="0.42.2"
   sodipodi:docname="barnn.svg"
   sodipodi:docbase="/home/bcrowell/Documents/writing/lm/trunk/9share/em-fields"><metadata
   id="metadata141"><rdf:RDF><cc:Work
       rdf:about=""><dc:format>image/svg+xml</dc:format><dc:type
         rdf:resource="http://purl.org/dc/dcmitype/StillImage" /></cc:Work></rdf:RDF></metadata><defs
   id="defs139" /><sodipodi:namedview
   inkscape:cy="35.523799"
   inkscape:cx="116.26539"
   inkscape:zoom="2.1644996"
   inkscape:window-height="510"
   inkscape:window-width="712"
   inkscape:pageshadow="2"
   inkscape:pageopacity="0.0"
   borderopacity="1.0"
   bordercolor="#666666"
   pagecolor="#ffffff"
   id="base"
   inkscape:window-x="284"
   inkscape:window-y="284"
   inkscape:current-layer="svg89" />
	<style
   type="text/css"
   id="style91">
	
	</style>
	<g
   id="Layer_1">
		<g
   id="g94">
			<rect
   x="0.25"
   y="4.992"
   style="fill:#B4B4B4;stroke:#000000;stroke-width:0.5;"
   width="24"
   height="61.5"
   id="rect96" /> 
			<polygon
   style="fill:#B4B4B4;stroke:#000000;stroke-width:0.5;stroke-linejoin:round;"
   points="24.169,4.912 31.889,0.455      8.129,0.455 0.409,4.912 "
   id="polygon98" />
			<polygon
   style="fill:#B4B4B4;stroke:#000000;stroke-width:0.5;"
   points="32.048,61.933 32.048,0.433 24.15,4.992 24.15,66.492      "
   id="polygon100" />
			<g
   id="g102">
				<text
   transform="matrix(1 0 0 1 7.8359 18.7954)"
   id="text104"><tspan
     x="0"
     y="0"
     style="font-family:Bitstream Vera Sans; font-size:10.200000;"
     id="tspan106">N</tspan></text>

			</g>
			<g
   id="g108">
				<text
   transform="matrix(1 0 0 1 8.1655 60.7822)"
   id="text110"><tspan
     x="0"
     y="0"
     style="font-family:Bitstream Vera Sans; font-size:10.200000;"
     id="tspan112">S</tspan></text>

			</g>
		</g>
		<g
   id="g114">
			<g
   id="g116">
				<rect
   x="78.75"
   y="4.992"
   style="fill:#B4B4B4;stroke:#000000;stroke-width:0.5;"
   width="24"
   height="61.5"
   id="rect118" /> 
				<polygon
   style="fill:#B4B4B4;stroke:#000000;stroke-width:0.5;stroke-linejoin:round;"
   points="102.669,4.912 110.389,0.455       86.629,0.455 78.909,4.912 "
   id="polygon120" />
				<polygon
   style="fill:#B4B4B4;stroke:#000000;stroke-width:0.5;"
   points="110.548,61.933 110.548,0.433 102.65,4.992       102.65,66.492 "
   id="polygon122" />
				<g
   id="g124">
					<text
   transform="matrix(1 0 0 1 86.3359 18.7954)"
   id="text126"><tspan
     x="0"
     y="0"
     style="font-family:Bitstream Vera Sans; font-size:10.200000;"
     id="tspan128">N</tspan></text>

				</g>
				<g
   id="g130">
					<text
   transform="matrix(1 0 0 1 86.6655 60.7822)"
   id="text132"><tspan
     x="0"
     y="0"
     style="font-family:Bitstream Vera Sans; font-size:10.200000;"
     id="tspan134">S</tspan></text>

				</g>
			</g>
			<line
   style="fill:none;"
   x1="112.939"
   y1="24.92"
   x2="112.939"
   y2="42.92"
   id="line136" />
		</g>
	</g>
<rect
   style="fill:none;fill-opacity:0.75000000;fill-rule:evenodd;stroke:none;stroke-width:1.0000000pt;stroke-linecap:butt;stroke-linejoin:miter;stroke-opacity:1.0000000;overflow:visible"
   id="rect1360"
   width="169.11758"
   height="8.9270277"
   x="-29.644306"
   y="29.063536" /></svg>