<?xml version="1.0" encoding="UTF-8" standalone="no"?>
<!-- Created with Inkscape (http://www.inkscape.org/) -->
<svg
   xmlns:dc="http://purl.org/dc/elements/1.1/"
   xmlns:cc="http://web.resource.org/cc/"
   xmlns:rdf="http://www.w3.org/1999/02/22-rdf-syntax-ns#"
   xmlns:svg="http://www.w3.org/2000/svg"
   xmlns="http://www.w3.org/2000/svg"
   xmlns:sodipodi="http://inkscape.sourceforge.net/DTD/sodipodi-0.dtd"
   xmlns:inkscape="http://www.inkscape.org/namespaces/inkscape"
   width="744.09448819"
   height="1052.3622047"
   id="svg2"
   sodipodi:version="0.32"
   inkscape:version="0.42.2"
   sodipodi:docbase="/home/bcrowell/Documents/writing/lm/trunk/0sn/ch11/figs"
   sodipodi:docname="dq-ampere-off-center.svg">
  <defs
     id="defs4">
    <marker
       inkscape:stockid="Arrow2Send"
       orient="auto"
       refY="0.0"
       refX="0.0"
       id="Arrow2Send"
       style="overflow:visible;">
      <path
         sodipodi:nodetypes="cccc"
         id="path2188"
         style="font-size:12.0;fill-rule:evenodd;stroke-width:0.62500000;stroke-linejoin:round;"
         d="M 8.7185878,4.0337352 L -2.2072895,0.016013256 L 8.7185884,-4.0017078 C 6.9730900,-1.6296469 6.9831476,1.6157441 8.7185878,4.0337352 z "
         transform="scale(0.3) rotate(180) translate(-5,0)" />
    </marker>
  </defs>
  <sodipodi:namedview
     id="base"
     pagecolor="#ffffff"
     bordercolor="#666666"
     borderopacity="1.0"
     inkscape:pageopacity="0.0"
     inkscape:pageshadow="2"
     inkscape:zoom="2.6468652"
     inkscape:cx="143.28959"
     inkscape:cy="654.16292"
     inkscape:document-units="px"
     inkscape:current-layer="layer1"
     inkscape:window-width="712"
     inkscape:window-height="510"
     inkscape:window-x="65"
     inkscape:window-y="328" />
  <metadata
     id="metadata7">
    <rdf:RDF>
      <cc:Work
         rdf:about="">
        <dc:format>image/svg+xml</dc:format>
        <dc:type
           rdf:resource="http://purl.org/dc/dcmitype/StillImage" />
      </cc:Work>
    </rdf:RDF>
  </metadata>
  <g
     inkscape:label="Layer 1"
     inkscape:groupmode="layer"
     id="layer1">
    <rect
       style="font-size:10.000000px;font-style:normal;font-variant:normal;font-weight:normal;font-stretch:normal;text-align:start;line-height:125.00000%;writing-mode:lr-tb;text-anchor:start;fill:#d1d1d1;fill-opacity:0.75000000;fill-rule:evenodd;stroke:none;stroke-width:1.0000000pt;stroke-linecap:butt;stroke-linejoin:miter;stroke-opacity:1.0000000;font-family:Bitstream Vera Sans"
       id="rect2272"
       width="87.966942"
       height="92.492424"
       x="133.03238"
       y="346.33963" />
    <rect
       style="font-size:10.000000px;font-style:normal;font-variant:normal;font-weight:normal;font-stretch:normal;text-align:start;line-height:125.00000%;writing-mode:lr-tb;text-anchor:start;fill:#d1d1d1;fill-opacity:0.75000000;fill-rule:evenodd;stroke:none;stroke-width:1.0000000pt;stroke-linecap:butt;stroke-linejoin:miter;stroke-opacity:1.0000000;font-family:Bitstream Vera Sans"
       id="rect2270"
       width="90.089577"
       height="92.492424"
       x="36.747353"
       y="346.53897" />
    <path
       style="font-size:16.175838px;font-style:normal;font-variant:normal;font-weight:normal;font-stretch:normal;text-align:start;line-height:202.19798%;writing-mode:lr-tb;text-anchor:start;fill:#ffffff;fill-opacity:1.0000000;fill-rule:evenodd;stroke:#000000;stroke-width:0.54093027;stroke-linecap:butt;stroke-linejoin:miter;stroke-miterlimit:4.0000000;stroke-dasharray:none;stroke-opacity:1.0000000;font-family:Bitstream Vera Sans"
       d="M 72.777674,395.27029 L 72.777674,428.18011 L 72.811483,428.18011 C 72.810779,428.19017 72.801827,428.19896 72.801827,428.20908 C 72.801827,428.90271 74.457612,429.46481 76.501401,429.46481 C 78.545190,429.46481 80.205808,428.90270 80.205808,428.20908 C 80.205808,428.19900 80.196844,428.19012 80.196146,428.18011 L 80.225127,428.18011 L 80.225127,395.27029 L 72.777674,395.27029 z "
       id="path2071" />
    <path
       sodipodi:type="arc"
       style="font-size:16.175838px;font-style:normal;font-variant:normal;font-weight:normal;font-stretch:normal;text-align:start;line-height:202.19798%;writing-mode:lr-tb;text-anchor:start;fill:#7f7f7f;fill-opacity:0.66853935;fill-rule:evenodd;stroke:#000000;stroke-width:1.4153858;stroke-linecap:butt;stroke-linejoin:miter;stroke-opacity:1.0000000;font-family:Bitstream Vera Sans;stroke-miterlimit:4.0000000;stroke-dasharray:none"
       id="path1324"
       sodipodi:cx="161.42857"
       sodipodi:cy="368.07648"
       sodipodi:rx="47.142857"
       sodipodi:ry="15.714286"
       d="M 208.57143 368.07648 A 47.142857 15.714286 0 1 1  114.28572,368.07648 A 47.142857 15.714286 0 1 1  208.57143 368.07648 z"
       transform="matrix(0.618206,0.000000,0.000000,0.618206,-23.29471,167.6292)" />
    <g
       style="font-size:16.175838px;font-style:normal;font-variant:normal;font-weight:normal;font-stretch:normal;text-align:start;line-height:202.19798%;writing-mode:lr-tb;text-anchor:start;font-family:Bitstream Vera Sans"
       id="g2073"
       transform="matrix(0.618206,0.000000,0.000000,0.618206,-20.14831,171.6384)">
      <path
         id="rect2055"
         d="M 150.32028,307.61871 L 150.32028,360.85309 L 150.37497,360.85309 C 150.37383,360.86937 150.35935,360.88359 150.35935,360.89996 C 150.35935,362.02196 153.03772,362.93121 156.34372,362.93121 C 159.64972,362.93121 162.33591,362.02195 162.33591,360.89996 C 162.33591,360.88366 162.32141,360.86929 162.32028,360.85309 L 162.36716,360.85309 L 162.36716,307.61871 L 150.32028,307.61871 z "
         style="font-size:16.175838px;font-style:normal;font-variant:normal;font-weight:normal;font-stretch:normal;text-align:start;line-height:202.19798%;writing-mode:lr-tb;text-anchor:start;fill:#ffffff;fill-opacity:1.0000000;fill-rule:evenodd;stroke:#000000;stroke-width:0.87500000;stroke-linecap:butt;stroke-linejoin:miter;stroke-miterlimit:4.0000000;stroke-dasharray:none;stroke-opacity:1.0000000;font-family:Bitstream Vera Sans" />
      <path
         transform="matrix(0.129347,0.000000,0.000000,0.129347,135.4587,260.0953)"
         d="M 208.57143 368.07648 A 47.142857 15.714286 0 1 1  114.28572,368.07648 A 47.142857 15.714286 0 1 1  208.57143 368.07648 z"
         sodipodi:ry="15.714286"
         sodipodi:rx="47.142857"
         sodipodi:cy="368.07648"
         sodipodi:cx="161.42857"
         id="path2059"
         style="font-size:125.05770px;font-style:normal;font-variant:normal;font-weight:normal;font-stretch:normal;text-align:start;line-height:1563.2212%;writing-mode:lr-tb;text-anchor:start;fill:#ffffff;fill-opacity:1.0000000;fill-rule:evenodd;stroke:#000000;stroke-width:6.7647491;stroke-linecap:butt;stroke-linejoin:miter;stroke-miterlimit:4.0000000;stroke-dasharray:none;stroke-opacity:1.0000000;font-family:Bitstream Vera Sans"
         sodipodi:type="arc" />
    </g>
    <path
       style="font-size:16.175838px;font-style:normal;font-variant:normal;font-weight:normal;font-stretch:normal;text-align:start;line-height:202.19798%;writing-mode:lr-tb;text-anchor:start;fill:none;fill-opacity:0.75000000;fill-rule:evenodd;stroke:#000000;stroke-width:1.5455149;stroke-linecap:butt;stroke-linejoin:miter;marker-end:url(#Arrow2Send);stroke-miterlimit:4.0000000;stroke-dasharray:none;stroke-opacity:1.0000000;font-family:Bitstream Vera Sans"
       d="M 76.501401,389.22366 L 76.501401,370.27117"
       id="path2220" />
    <path
       style="font-size:10.000000px;font-style:normal;font-variant:normal;font-weight:normal;font-stretch:normal;text-align:start;line-height:125.00000%;writing-mode:lr-tb;text-anchor:start;fill:#ffffff;fill-opacity:1.0000000;fill-rule:evenodd;stroke:#000000;stroke-width:0.54093033;stroke-linecap:butt;stroke-linejoin:miter;stroke-miterlimit:4.0000000;stroke-dasharray:none;stroke-opacity:1.0000000;font-family:Bitstream Vera Sans"
       d="M 164.33642,395.27033 L 164.33642,428.18015 L 164.37023,428.18015 C 164.36953,428.19021 164.36057,428.19900 164.36057,428.20912 C 164.36057,428.90275 166.01636,429.46485 168.06015,429.46485 C 170.10394,429.46485 171.76456,428.90274 171.76456,428.20912 C 171.76456,428.19905 171.75559,428.19016 171.75489,428.18015 L 171.78387,428.18015 L 171.78387,395.27033 L 164.33642,395.27033 z "
       id="path2236" />
    <path
       sodipodi:type="arc"
       style="font-size:16.175838px;font-style:normal;font-variant:normal;font-weight:normal;font-stretch:normal;text-align:start;line-height:202.19798%;writing-mode:lr-tb;text-anchor:start;fill:#7f7f7f;fill-opacity:0.66853935;fill-rule:evenodd;stroke:#000000;stroke-width:1.4153858;stroke-linecap:butt;stroke-linejoin:miter;stroke-miterlimit:4.0000000;stroke-dasharray:none;stroke-opacity:1.0000000;font-family:Bitstream Vera Sans"
       id="path2238"
       sodipodi:cx="161.42857"
       sodipodi:cy="368.07648"
       sodipodi:rx="47.142857"
       sodipodi:ry="15.714286"
       d="M 208.57143 368.07648 A 47.142857 15.714286 0 1 1  114.28572,368.07648 A 47.142857 15.714286 0 1 1  208.57143 368.07648 z"
       transform="matrix(0.618206,0.000000,0.000000,0.618206,82.26402,167.6292)" />
    <g
       id="g2240"
       transform="matrix(0.618206,0.000000,0.000000,0.618206,71.41042,171.6384)"
       style="font-size:16.175838px;font-style:normal;font-variant:normal;font-weight:normal;font-stretch:normal;text-align:start;line-height:202.19798%;writing-mode:lr-tb;text-anchor:start;font-family:Bitstream Vera Sans">
      <path
         id="path2242"
         d="M 150.32028,307.61871 L 150.32028,360.85309 L 150.37497,360.85309 C 150.37383,360.86937 150.35935,360.88359 150.35935,360.89996 C 150.35935,362.02196 153.03772,362.93121 156.34372,362.93121 C 159.64972,362.93121 162.33591,362.02195 162.33591,360.89996 C 162.33591,360.88366 162.32141,360.86929 162.32028,360.85309 L 162.36716,360.85309 L 162.36716,307.61871 L 150.32028,307.61871 z "
         style="font-size:16.175838px;font-style:normal;font-variant:normal;font-weight:normal;font-stretch:normal;text-align:start;line-height:202.19798%;writing-mode:lr-tb;text-anchor:start;fill:#ffffff;fill-opacity:1.0000000;fill-rule:evenodd;stroke:#000000;stroke-width:0.87500000;stroke-linecap:butt;stroke-linejoin:miter;stroke-miterlimit:4.0000000;stroke-dasharray:none;stroke-opacity:1.0000000;font-family:Bitstream Vera Sans" />
      <path
         transform="matrix(0.129347,0.000000,0.000000,0.129347,135.4587,260.0953)"
         d="M 208.57143 368.07648 A 47.142857 15.714286 0 1 1  114.28572,368.07648 A 47.142857 15.714286 0 1 1  208.57143 368.07648 z"
         sodipodi:ry="15.714286"
         sodipodi:rx="47.142857"
         sodipodi:cy="368.07648"
         sodipodi:cx="161.42857"
         id="path2244"
         style="font-size:125.05770px;font-style:normal;font-variant:normal;font-weight:normal;font-stretch:normal;text-align:start;line-height:1563.2212%;writing-mode:lr-tb;text-anchor:start;fill:#ffffff;fill-opacity:1.0000000;fill-rule:evenodd;stroke:#000000;stroke-width:6.7647491;stroke-linecap:butt;stroke-linejoin:miter;stroke-miterlimit:4.0000000;stroke-dasharray:none;stroke-opacity:1.0000000;font-family:Bitstream Vera Sans"
         sodipodi:type="arc" />
    </g>
    <path
       style="font-size:10.000000px;font-style:normal;font-variant:normal;font-weight:normal;font-stretch:normal;text-align:start;line-height:125.00000%;writing-mode:lr-tb;text-anchor:start;fill:none;fill-opacity:0.75000000;fill-rule:evenodd;stroke:#000000;stroke-width:1.5455153;stroke-linecap:butt;stroke-linejoin:miter;marker-end:url(#Arrow2Send);stroke-miterlimit:4.0000000;stroke-dasharray:none;stroke-opacity:1.0000000;font-family:Bitstream Vera Sans"
       d="M 168.06015,389.22369 L 168.06015,370.27121"
       id="path2246" />
    <text
       xml:space="preserve"
       style="font-size:10.000000px;font-style:normal;font-variant:normal;font-weight:normal;font-stretch:normal;text-align:start;line-height:125.00000%;writing-mode:lr-tb;text-anchor:start;fill:#000000;fill-opacity:1.0000000;stroke:none;stroke-width:1.0000000pt;stroke-linecap:butt;stroke-linejoin:miter;stroke-opacity:1.0000000;font-family:Bitstream Vera Sans"
       x="41.227867"
       y="359.46619"
       id="text2274"
       sodipodi:linespacing="125.00000%"><tspan
         sodipodi:role="line"
         id="tspan2276"
         x="41.227867"
         y="359.46619">1</tspan></text>
    <text
       xml:space="preserve"
       style="font-size:10.000000px;font-style:normal;font-variant:normal;font-weight:normal;font-stretch:normal;text-align:start;line-height:125.00000%;writing-mode:lr-tb;text-anchor:start;fill:#000000;fill-opacity:1.0000000;stroke:none;stroke-width:1.0000000pt;stroke-linecap:butt;stroke-linejoin:miter;stroke-opacity:1.0000000;font-family:Bitstream Vera Sans"
       x="137.55672"
       y="359.50693"
       id="text2278"
       sodipodi:linespacing="125.00000%"><tspan
         sodipodi:role="line"
         id="tspan2280"
         x="137.55672"
         y="359.50693">2</tspan></text>
  </g>
</svg>
