<?xml version="1.0" encoding="UTF-8" standalone="no"?>
<!-- Created with Inkscape (http://www.inkscape.org/) -->
<svg
   xmlns:dc="http://purl.org/dc/elements/1.1/"
   xmlns:cc="http://web.resource.org/cc/"
   xmlns:rdf="http://www.w3.org/1999/02/22-rdf-syntax-ns#"
   xmlns:svg="http://www.w3.org/2000/svg"
   xmlns="http://www.w3.org/2000/svg"
   xmlns:sodipodi="http://inkscape.sourceforge.net/DTD/sodipodi-0.dtd"
   xmlns:inkscape="http://www.inkscape.org/namespaces/inkscape"
   width="744.09448819"
   height="1052.3622047"
   id="svg2"
   sodipodi:version="0.32"
   inkscape:version="0.42.2"
   sodipodi:docbase="/home/bcrowell/Documents/writing/lm/trunk/0sn/ch11/figs"
   sodipodi:docname="dq-ampere-blobs.svg">
  <defs
     id="defs4">
    <marker
       inkscape:stockid="Arrow2Send"
       orient="auto"
       refY="0.0"
       refX="0.0"
       id="Arrow2Send"
       style="overflow:visible;">
      <path
         sodipodi:nodetypes="cccc"
         id="path2188"
         style="font-size:12.0;fill-rule:evenodd;stroke-width:0.62500000;stroke-linejoin:round;"
         d="M 8.7185878,4.0337352 L -2.2072895,0.016013256 L 8.7185884,-4.0017078 C 6.9730900,-1.6296469 6.9831476,1.6157441 8.7185878,4.0337352 z "
         transform="scale(0.3) rotate(180) translate(-5,0)" />
    </marker>
  </defs>
  <sodipodi:namedview
     id="base"
     pagecolor="#ffffff"
     bordercolor="#666666"
     borderopacity="1.0"
     inkscape:pageopacity="0.0"
     inkscape:pageshadow="2"
     inkscape:zoom="2.6468652"
     inkscape:cx="143.28959"
     inkscape:cy="654.16292"
     inkscape:document-units="px"
     inkscape:current-layer="layer1"
     inkscape:window-width="712"
     inkscape:window-height="510"
     inkscape:window-x="65"
     inkscape:window-y="328" />
  <metadata
     id="metadata7">
    <rdf:RDF>
      <cc:Work
         rdf:about="">
        <dc:format>image/svg+xml</dc:format>
        <dc:type
           rdf:resource="http://purl.org/dc/dcmitype/StillImage" />
      </cc:Work>
    </rdf:RDF>
  </metadata>
  <g
     inkscape:label="Layer 1"
     inkscape:groupmode="layer"
     id="layer1">
    <rect
       style="font-size:10.000000px;font-style:normal;font-variant:normal;font-weight:normal;font-stretch:normal;text-align:start;line-height:125.00000%;writing-mode:lr-tb;text-anchor:start;fill:#d1d1d1;fill-opacity:0.75000000;fill-rule:evenodd;stroke:none;stroke-width:1.0000000pt;stroke-linecap:butt;stroke-linejoin:miter;stroke-opacity:1.0000000;font-family:Bitstream Vera Sans"
       id="rect2272"
       width="87.966942"
       height="92.492424"
       x="133.03238"
       y="346.33963" />
    <rect
       style="font-size:10.000000px;font-style:normal;font-variant:normal;font-weight:normal;font-stretch:normal;text-align:start;line-height:125.00000%;writing-mode:lr-tb;text-anchor:start;fill:#d1d1d1;fill-opacity:0.75000000;fill-rule:evenodd;stroke:none;stroke-width:1.0000000pt;stroke-linecap:butt;stroke-linejoin:miter;stroke-opacity:1.0000000;font-family:Bitstream Vera Sans"
       id="rect2270"
       width="75.732971"
       height="92.492424"
       x="36.747353"
       y="346.53897" />
    <path
       style="font-size:16.175838px;font-style:normal;font-variant:normal;font-weight:normal;font-stretch:normal;text-align:start;line-height:202.19798%;writing-mode:lr-tb;text-anchor:start;fill:#ffffff;fill-opacity:1.0000000;fill-rule:evenodd;stroke:#000000;stroke-width:0.54093027;stroke-linecap:butt;stroke-linejoin:miter;stroke-miterlimit:4.0000000;stroke-dasharray:none;stroke-opacity:1.0000000;font-family:Bitstream Vera Sans"
       d="M 70.777674,395.27029 L 70.777674,428.18011 L 70.811483,428.18011 C 70.810779,428.19017 70.801827,428.19896 70.801827,428.20908 C 70.801827,428.90271 72.457612,429.46481 74.501401,429.46481 C 76.545190,429.46481 78.205808,428.90270 78.205808,428.20908 C 78.205808,428.19900 78.196844,428.19012 78.196146,428.18011 L 78.225127,428.18011 L 78.225127,395.27029 L 70.777674,395.27029 z "
       id="path2071" />
    <path
       sodipodi:type="arc"
       style="font-size:16.175838px;font-style:normal;font-variant:normal;font-weight:normal;font-stretch:normal;text-align:start;line-height:202.19798%;writing-mode:lr-tb;text-anchor:start;fill:#7f7f7f;fill-opacity:0.66853935;fill-rule:evenodd;stroke:#000000;stroke-width:1.4153858;stroke-linecap:butt;stroke-linejoin:miter;stroke-miterlimit:4.0000000;stroke-dasharray:none;stroke-opacity:1.0000000;font-family:Bitstream Vera Sans"
       id="path1324"
       sodipodi:cx="161.42857"
       sodipodi:cy="368.07648"
       sodipodi:rx="47.142857"
       sodipodi:ry="15.714286"
       d="M 208.57143 368.07648 A 47.142857 15.714286 0 1 1  114.28572,368.07648 A 47.142857 15.714286 0 1 1  208.57143 368.07648 z"
       transform="matrix(0.618206,0.000000,0.000000,0.618206,-25.29471,167.6292)" />
    <g
       style="font-size:16.175838px;font-style:normal;font-variant:normal;font-weight:normal;font-stretch:normal;text-align:start;line-height:202.19798%;writing-mode:lr-tb;text-anchor:start;font-family:Bitstream Vera Sans"
       id="g2073"
       transform="matrix(0.618206,0.000000,0.000000,0.618206,-22.14831,171.6384)">
      <path
         id="rect2055"
         d="M 150.32028,307.61871 L 150.32028,360.85309 L 150.37497,360.85309 C 150.37383,360.86937 150.35935,360.88359 150.35935,360.89996 C 150.35935,362.02196 153.03772,362.93121 156.34372,362.93121 C 159.64972,362.93121 162.33591,362.02195 162.33591,360.89996 C 162.33591,360.88366 162.32141,360.86929 162.32028,360.85309 L 162.36716,360.85309 L 162.36716,307.61871 L 150.32028,307.61871 z "
         style="font-size:16.175838px;font-style:normal;font-variant:normal;font-weight:normal;font-stretch:normal;text-align:start;line-height:202.19798%;writing-mode:lr-tb;text-anchor:start;fill:#ffffff;fill-opacity:1.0000000;fill-rule:evenodd;stroke:#000000;stroke-width:0.87500000;stroke-linecap:butt;stroke-linejoin:miter;stroke-miterlimit:4.0000000;stroke-dasharray:none;stroke-opacity:1.0000000;font-family:Bitstream Vera Sans" />
      <path
         transform="matrix(0.129347,0.000000,0.000000,0.129347,135.4587,260.0953)"
         d="M 208.57143 368.07648 A 47.142857 15.714286 0 1 1  114.28572,368.07648 A 47.142857 15.714286 0 1 1  208.57143 368.07648 z"
         sodipodi:ry="15.714286"
         sodipodi:rx="47.142857"
         sodipodi:cy="368.07648"
         sodipodi:cx="161.42857"
         id="path2059"
         style="font-size:125.05770px;font-style:normal;font-variant:normal;font-weight:normal;font-stretch:normal;text-align:start;line-height:1563.2212%;writing-mode:lr-tb;text-anchor:start;fill:#ffffff;fill-opacity:1.0000000;fill-rule:evenodd;stroke:#000000;stroke-width:6.7647491;stroke-linecap:butt;stroke-linejoin:miter;stroke-miterlimit:4.0000000;stroke-dasharray:none;stroke-opacity:1.0000000;font-family:Bitstream Vera Sans"
         sodipodi:type="arc" />
    </g>
    <path
       style="font-size:16.175838px;font-style:normal;font-variant:normal;font-weight:normal;font-stretch:normal;text-align:start;line-height:202.19798%;writing-mode:lr-tb;text-anchor:start;fill:none;fill-opacity:0.75000000;fill-rule:evenodd;stroke:#000000;stroke-width:1.5455149;stroke-linecap:butt;stroke-linejoin:miter;marker-end:url(#Arrow2Send);stroke-miterlimit:4.0000000;stroke-dasharray:none;stroke-opacity:1.0000000;font-family:Bitstream Vera Sans"
       d="M 74.501401,389.22366 L 74.501401,370.27117"
       id="path2220" />
    <text
       xml:space="preserve"
       style="font-size:10.000000px;font-style:normal;font-variant:normal;font-weight:normal;font-stretch:normal;text-align:start;line-height:125.00000%;writing-mode:lr-tb;text-anchor:start;fill:#000000;fill-opacity:1.0000000;stroke:none;stroke-width:1.0000000pt;stroke-linecap:butt;stroke-linejoin:miter;stroke-opacity:1.0000000;font-family:Bitstream Vera Sans"
       x="41.227867"
       y="359.46619"
       id="text2274"
       sodipodi:linespacing="125.00000%"><tspan
         sodipodi:role="line"
         id="tspan2276"
         x="41.227867"
         y="359.46619">1</tspan></text>
    <text
       xml:space="preserve"
       style="font-size:10.000000px;font-style:normal;font-variant:normal;font-weight:normal;font-stretch:normal;text-align:start;line-height:125.00000%;writing-mode:lr-tb;text-anchor:start;fill:#000000;fill-opacity:1.0000000;stroke:none;stroke-width:1.0000000pt;stroke-linecap:butt;stroke-linejoin:miter;stroke-opacity:1.0000000;font-family:Bitstream Vera Sans"
       x="137.55672"
       y="359.50693"
       id="text2278"
       sodipodi:linespacing="125.00000%"><tspan
         sodipodi:role="line"
         id="tspan2280"
         x="137.55672"
         y="359.50693">2</tspan></text>
    <path
       style="font-size:16.175838px;font-style:normal;font-variant:normal;font-weight:normal;font-stretch:normal;text-align:start;line-height:202.19798%;writing-mode:lr-tb;text-anchor:start;fill:#ffffff;fill-opacity:1.0000000;fill-rule:evenodd;stroke:#000000;stroke-width:0.54093027;stroke-linecap:butt;stroke-linejoin:miter;stroke-miterlimit:4.0000000;stroke-dasharray:none;stroke-opacity:1.0000000;font-family:Bitstream Vera Sans"
       d="M 163.26627,395.21523 L 163.26627,428.12505 L 163.30008,428.12505 C 163.29937,428.13511 163.29042,428.14390 163.29042,428.15402 C 163.29042,428.84765 164.94621,429.40975 166.99000,429.40975 C 169.03378,429.40975 170.69440,428.84764 170.69440,428.15402 C 170.69440,428.14394 170.68544,428.13506 170.68474,428.12505 L 170.71372,428.12505 L 170.71372,395.21523 L 163.26627,395.21523 z "
       id="path1323" />
    <path
       style="font-size:16.175838px;font-style:normal;font-variant:normal;font-weight:normal;font-stretch:normal;text-align:start;line-height:202.19798%;writing-mode:lr-tb;text-anchor:start;fill:#7f7f7f;fill-opacity:0.66853935;fill-rule:evenodd;stroke:#000000;stroke-width:0.87000000;stroke-linecap:butt;stroke-linejoin:miter;stroke-miterlimit:4.0000000;stroke-dasharray:none;stroke-opacity:1.0000000;font-family:Bitstream Vera Sans"
       d="M 167.00000 385.40625 C 150.91251 385.40625 137.84374 389.76251 137.84375 395.12500 C 137.84375 400.22525 149.78524 404.29025 164.78125 404.68750 C 160.06429 406.41381 157.12500 408.70154 157.12500 411.21875 C 157.12500 416.58125 170.16252 420.93751 186.25000 420.93750 C 202.33749 420.93750 215.40626 416.58125 215.40625 411.21875 C 215.40625 406.11850 203.46475 402.05350 188.46875 401.65625 C 193.18571 399.92994 196.12500 397.64222 196.12500 395.12500 C 196.12500 389.76250 183.08748 385.40625 167.00000 385.40625 z "
       id="path1325" />
    <g
       style="font-size:16.175838px;font-style:normal;font-variant:normal;font-weight:normal;font-stretch:normal;text-align:start;line-height:202.19798%;writing-mode:lr-tb;text-anchor:start;font-family:Bitstream Vera Sans"
       id="g1327"
       transform="matrix(0.618206,0.000000,0.000000,0.618206,70.34027,171.5833)">
      <path
         id="path1329"
         d="M 150.32028,307.61871 L 150.32028,360.85309 L 150.37497,360.85309 C 150.37383,360.86937 150.35935,360.88359 150.35935,360.89996 C 150.35935,362.02196 153.03772,362.93121 156.34372,362.93121 C 159.64972,362.93121 162.33591,362.02195 162.33591,360.89996 C 162.33591,360.88366 162.32141,360.86929 162.32028,360.85309 L 162.36716,360.85309 L 162.36716,307.61871 L 150.32028,307.61871 z "
         style="font-size:16.175838px;font-style:normal;font-variant:normal;font-weight:normal;font-stretch:normal;text-align:start;line-height:202.19798%;writing-mode:lr-tb;text-anchor:start;fill:#ffffff;fill-opacity:1.0000000;fill-rule:evenodd;stroke:#000000;stroke-width:0.87500000;stroke-linecap:butt;stroke-linejoin:miter;stroke-miterlimit:4.0000000;stroke-dasharray:none;stroke-opacity:1.0000000;font-family:Bitstream Vera Sans" />
      <path
         transform="matrix(0.129347,0.000000,0.000000,0.129347,135.4587,260.0953)"
         d="M 208.57143 368.07648 A 47.142857 15.714286 0 1 1  114.28572,368.07648 A 47.142857 15.714286 0 1 1  208.57143 368.07648 z"
         sodipodi:ry="15.714286"
         sodipodi:rx="47.142857"
         sodipodi:cy="368.07648"
         sodipodi:cx="161.42857"
         id="path1331"
         style="font-size:125.05770px;font-style:normal;font-variant:normal;font-weight:normal;font-stretch:normal;text-align:start;line-height:1563.2212%;writing-mode:lr-tb;text-anchor:start;fill:#ffffff;fill-opacity:1.0000000;fill-rule:evenodd;stroke:#000000;stroke-width:6.7647491;stroke-linecap:butt;stroke-linejoin:miter;stroke-miterlimit:4.0000000;stroke-dasharray:none;stroke-opacity:1.0000000;font-family:Bitstream Vera Sans"
         sodipodi:type="arc" />
    </g>
    <path
       style="font-size:16.175838px;font-style:normal;font-variant:normal;font-weight:normal;font-stretch:normal;text-align:start;line-height:202.19798%;writing-mode:lr-tb;text-anchor:start;fill:none;fill-opacity:0.75000000;fill-rule:evenodd;stroke:#000000;stroke-width:1.5455149;stroke-linecap:butt;stroke-linejoin:miter;marker-end:url(#Arrow2Send);stroke-miterlimit:4.0000000;stroke-dasharray:none;stroke-opacity:1.0000000;font-family:Bitstream Vera Sans"
       d="M 166.99000,389.16860 L 166.99000,370.21611"
       id="path1333" />
  </g>
</svg>
