<?xml version="1.0" encoding="iso-8859-1"?>
<!-- Generator: Adobe Illustrator 11 Build 196, SVG Export Plug-In . SVG Version: 6.0.0 Build 78)  -->
<!DOCTYPE svg PUBLIC "-//W3C//DTD SVG 1.0//EN"    "http://www.w3.org/TR/2001/REC-SVG-20010904/DTD/svg10.dtd" [
	<!ENTITY ns_flows "http://ns.adobe.com/Flows/1.0/">
	<!ENTITY ns_svg "http://www.w3.org/2000/svg">
	<!ENTITY ns_xlink "http://www.w3.org/1999/xlink">
]>
<svg
	 width="145.333" height="200.607" viewBox="0 0 145.333 200.607"
	 style="overflow:visible;enable-background:new 0 0 145.333 200.607" xml:space="preserve">
	<style type="text/css">
	
	</style>
	<g id="Layer_1">
		<rect y="93.992" style="fill:#DCDCDC;" width="145.333" height="106.615"/> 
		<rect style="fill:#7F7F7F;" width="145.333" height="93.6"/> 
		<g>
			<text transform="matrix(1 0 0 1 81.1465 103.9458)"><tspan x="0" y="0" style="font-family:Bitstream Vera Sans-Bold'; font-size:10.200000;">medium 1</tspan></text>
		</g>
		<g>
			<text transform="matrix(1 0 0 1 81.1465 89.4458)"><tspan x="0" y="0" style="fill:#FFFFFF; font-family:Bitstream Vera Sans-Bold'; font-size:10.200000;">medium 2</tspan></text>
		</g>
		<g>
			<rect x="21.925" y="98.17" transform="matrix(0.4226 0.9063 -0.9063 0.4226 109.2257 31.4573)" width="15.999" height="6.562"/> 
			<rect x="58.12" y="81.294" transform="matrix(0.4226 0.9063 -0.9063 0.4226 114.8298 -11.092)" width="15.999" height="6.562"/> 
		</g>
		<g>
			<rect x="38.616" y="133.969" transform="matrix(0.4226 0.9063 -0.9063 0.4226 151.3102 37.0012)" width="16" height="6.562"/> 
			<rect x="74.812" y="117.093" transform="matrix(0.4226 0.9063 -0.9063 0.4226 156.9145 -5.5482)" width="16" height="6.562"/> 
		</g>
		<path style="fill:#FFFFFF;stroke:#000000;stroke-width:0.5;" d="M83.582,138.22c3.378-1.575,4.415-6.504,2.314-11.009
			l-22.08-47.354c-2.101-4.505-6.542-6.88-9.921-5.304l-23.79,11.092c-3.379,1.575-4.415,6.504-2.314,11.009l22.079,47.354
			c2.101,4.504,6.542,6.879,9.921,5.304L83.582,138.22z"/>
		<g>
			
				<ellipse transform="matrix(0.4226 0.9063 -0.9063 0.4226 99.0441 21.9542)" style="fill:#FFFFFF;" cx="32.292" cy="88.711" rx="1.591" ry="2.784"/> 
			
				<ellipse transform="matrix(0.4226 0.9063 -0.9063 0.4226 102.5346 -4.5513)" style="fill:#FFFFFF;" cx="54.839" cy="78.198" rx="1.591" ry="2.784"/> 
		</g>
		<path style="fill:#B4B4B4;" d="M59.215,88.622c1.22-0.569,1.594-2.349,0.835-3.976l0,0c-0.758-1.627-2.362-2.484-3.583-1.916
			L34.717,92.873c-1.22,0.569-1.594,2.349-0.836,3.976l0,0c0.759,1.627,2.363,2.484,3.583,1.916L59.215,88.622z"/>
		
			<ellipse transform="matrix(0.4226 0.9063 -0.9063 0.4226 107.544 18.8795)" style="fill:none;stroke:#000000;stroke-width:2;" cx="38.955" cy="93.845" rx="1.591" ry="4.508"/> 
		<line style="fill:none;stroke:#000000;stroke-width:2;" x1="38.955" y1="93.845" x2="37.826" y2="91.423"/>
		<g>
			<text transform="matrix(1 0 0 1 74.6279 188.7041)"><tspan x="0" y="0" style="font-family:'Symbol'; font-size:14;">&#x3B8;</tspan></text>
			<text transform="matrix(1 0 0 1 81.9219 191.7041)"><tspan x="0" y="0" style="font-family:Bitstream Vera Sans; font-size:10.200000;">1</tspan></text>
		</g>
		<line style="fill:none;stroke:#000000;stroke-width:2;stroke-dasharray:4;" x1="69.593" y1="195.207" x2="69.593" y2="149.207"/>
		<g>
			<text transform="matrix(1 0 0 1 26.6279 17.7041)"><tspan x="0" y="0" style="fill:#FFFFFF; font-family:'Symbol'; font-size:14;">&#x3B8;</tspan></text>
			<text transform="matrix(1 0 0 1 33.9219 20.7041)"><tspan x="0" y="0" style="fill:#FFFFFF; font-family:Bitstream Vera Sans; font-size:10.200000;">2</tspan></text>
		</g>
		<g>
			<line style="fill:none;stroke:#FFFFFF;stroke-width:2;" x1="41.134" y1="75.937" x2="31.339" y2="25.548"/>
			<path style="fill:#FFFFFF;" d="M30.188,19.624c1.576,2.586,4.014,5.702,6.298,7.482l-4.996-0.781l-4.339,2.595
				C28.603,26.414,29.695,22.612,30.188,19.624z"/>
		</g>
		<line style="fill:none;stroke:#FFFFFF;stroke-width:2;stroke-dasharray:4;" x1="41.555" y1="72.635" x2="41.555" y2="3.968"/>
		<g>
			<line style="stroke:#000000;stroke-width:2;" x1="97.491" y1="198.468" x2="73.491" y2="143.468"/>
			<path d="M71.077,137.936c2.101,2.181,5.159,4.691,7.776,5.932l-5.046,0.326l-3.67,3.478
				C71.008,144.909,71.247,140.96,71.077,137.936z"/>
		</g>
	</g>
</svg>
