<?xml version="1.0" encoding="UTF-8" standalone="no"?>
<!DOCTYPE svg PUBLIC "-//W3C//DTD SVG 20010904//EN"
"http://www.w3.org/TR/2001/REC-SVG-20010904/DTD/svg10.dtd">
<!-- Created with Inkscape (http://www.inkscape.org/) -->
<svg:svg
   width="52.000000mm"
   height="71.180000mm"
   xmlns:cc="http://web.resource.org/cc/"
   xmlns:inkscape="http://www.inkscape.org/namespaces/inkscape"
   xmlns:sodipodi="http://sodipodi.sourceforge.net/DTD/sodipodi-0.dtd"
   xmlns:rdf="http://www.w3.org/1999/02/22-rdf-syntax-ns#"
   xmlns:svg="http://www.w3.org/2000/svg"
   xmlns:dc="http://purl.org/dc/elements/1.1/"
   xmlns:xlink="http://www.w3.org/1999/xlink"
   id="svg1"
   sodipodi:version="0.32"
   inkscape:version="0.40+cvs"
   sodipodi:docbase="/home/bcrowell/Documents/writing/lm/trunk/1np/ch09/figs"
   sodipodi:docname="v2-r-derivation.svg">
  <svg:metadata
     id="metadata3" />
  <svg:defs
     id="defs3" />
  <sodipodi:namedview
     id="base"
     pagecolor="#ffffff"
     bordercolor="#666666"
     borderopacity="1.0"
     inkscape:pageopacity="0.0"
     inkscape:pageshadow="2"
     inkscape:zoom="256.00000"
     inkscape:cx="0.060199380"
     inkscape:cy="201.76814"
     inkscape:current-layer="layer1"
     inkscape:window-width="640"
     inkscape:window-height="536"
     inkscape:window-x="151"
     inkscape:window-y="20" />
  <svg:metadata
     id="metadata4">
    <rdf:RDF
       id="RDF5">
      <cc:Work
         rdf:about=""
         id="Work6">
        <dc:format
           id="format7">image/svg+xml</dc:format>
        <dc:type
           id="type9"
           rdf:resource="http://purl.org/dc/dcmitype/StillImage" />
      </cc:Work>
    </rdf:RDF>
  </svg:metadata>
  <svg:g
     inkscape:label="Layer 1"
     inkscape:groupmode="layer"
     id="layer1">
    <svg:rect
       style="fill:#e1e1e1;fill-opacity:1.0000000;fill-rule:evenodd;stroke:none;stroke-width:1.0000000pt;stroke-linecap:butt;stroke-linejoin:miter;stroke-opacity:1.0000000"
       id="rect238"
       width="184.25197"
       height="114.13161"
       x="0.00049790740"
       y="0.0026026219" />
    <svg:g
       id="g314"
       transform="translate(-54.83377,-150.7281)">
      <svg:rect
         style="fill:#e1e1e1;fill-opacity:1.0000000;fill-rule:evenodd;stroke:none;stroke-width:1.0000000pt;stroke-linecap:butt;stroke-linejoin:miter;stroke-opacity:1.0000000"
         id="rect312"
         width="88.184357"
         height="114.13161"
         x="54.849258"
         y="278.07367" />
      <svg:rect
         style="fill:#e1e1e1;fill-opacity:1.0000000;fill-rule:evenodd;stroke:none;stroke-width:1.0000000pt;stroke-linecap:butt;stroke-linejoin:miter;stroke-opacity:1.0000000"
         id="rect313"
         width="88.184357"
         height="114.13161"
         x="150.90236"
         y="278.07367" />
    </svg:g>
    <svg:g
       id="g316"
       transform="translate(-65.50877,-176.1821)">
      <svg:g
         id="g94"
         transform="translate(93.66982,305.6833)">
        <svg:line
           style="fill:none;stroke:#000000"
           x1="26.000000"
           y1="108.37400"
           x2="26.000000"
           y2="18.372999"
           id="line96" />
        <svg:path
           d="M 26.000000,15.355000 C 26.526000,16.775000 27.426000,18.537000 28.377000,19.628000 L 26.000000,18.769000 L 23.623000,19.629000 C 24.574000,18.537000 25.474000,16.775000 26.000000,15.355000 z "
           id="path98" />
      </svg:g>
      <svg:g
         id="g101"
         transform="translate(93.66982,305.6833)">
        <svg:line
           style="fill:none;stroke:#000000"
           x1="21.139000"
           y1="91.603996"
           x2="5.5110002"
           y2="2.9719999"
           id="line103" />
        <svg:path
           d="M 4.9850000,0.0000000 C 5.7520000,1.3070000 6.9420000,2.8850000 8.0690000,3.7950000 L 5.5790000,3.3610000 L 3.3870000,4.6210000 C 4.1350000,3.3810000 4.7140000,1.4890000 4.9850000,0.0000000 z "
           id="path105" />
      </svg:g>
      <svg:text
         id="text108"
         x="122.6698"
         y="367.05679"><svg:tspan
           x="122.6698"
           y="367.05679"
           style="font-size:7.6500001;font-family:Bitstream Vera Sans-Bold'"
           id="tspan109">v</svg:tspan></svg:text>
      <svg:text
         id="text112"
         x="127.6747"
         y="370.05679"><svg:tspan
           x="127.6747"
           y="370.05679"
           style="font-size:5.9499998;font-family:Bitstream Vera Sans"
           id="tspan113">i</svg:tspan></svg:text>
      <svg:text
         id="text116"
         x="93.669823"
         y="354.55679"><svg:tspan
           x="93.669823"
           y="354.55679"
           style="font-size:7.6500001;font-family:Bitstream Vera Sans-Bold'"
           id="tspan117">v</svg:tspan></svg:text>
      <svg:text
         id="text120"
         x="98.674721"
         y="357.55679"><svg:tspan
           x="98.674721"
           y="357.55679"
           style="font-size:5.9499998;font-family:Bitstream Vera Sans"
           id="tspan121">f</svg:tspan></svg:text>
    </svg:g>
    <svg:g
       id="g315"
       transform="translate(-44.98077,-177.8241)">
      <svg:g
         id="g124"
         transform="translate(93.66982,305.6833)">
        <svg:line
           style="fill:none;stroke:#000000"
           x1="73.035004"
           y1="5.5419998"
           x2="73.035004"
           y2="95.542000"
           id="line126" />
        <svg:path
           d="M 73.035000,98.560000 C 72.508000,97.140000 71.607000,95.377000 70.656000,94.288000 L 73.035000,95.147000 L 75.411000,94.288000 C 74.460000,95.377000 73.561000,97.140000 73.035000,98.560000 z "
           id="path128" />
      </svg:g>
      <svg:g
         id="g131"
         transform="translate(93.66982,305.6833)">
        <svg:line
           style="fill:none;stroke:#000000"
           x1="88.672997"
           y1="96.292000"
           x2="73.043999"
           y2="7.6580000"
           id="line133" />
        <svg:path
           d="M 72.521000,4.6870000 C 73.288000,5.9940000 74.478000,7.5730000 75.604000,8.4820000 L 73.114000,8.0480000 L 70.924000,9.3080000 C 71.669000,8.0670000 72.248000,6.1760000 72.521000,4.6870000 z "
           id="path135" />
      </svg:g>
      <svg:text
         id="text138"
         x="152.20399"
         y="361.74341"><svg:tspan
           x="152.20399"
           y="361.74341"
           style="font-size:9.0000000;font-family:'AmericanTypewriter'"
           id="tspan139">-</svg:tspan></svg:text>
      <svg:text
         id="text142"
         x="154.9852"
         y="361.74341"><svg:tspan
           x="154.9852"
           y="361.74341"
           style="font-size:7.6500001;font-family:Bitstream Vera Sans-Bold'"
           id="tspan143">v</svg:tspan></svg:text>
      <svg:text
         id="text146"
         x="159.9901"
         y="364.74341"><svg:tspan
           x="159.9901"
           y="364.74341"
           style="font-size:5.9499998;font-family:Bitstream Vera Sans"
           id="tspan147">i</svg:tspan></svg:text>
      <svg:text
         id="text150"
         x="176.20399"
         y="358.74341"><svg:tspan
           x="176.20399"
           y="358.74341"
           style="font-size:7.6500001;font-family:Bitstream Vera Sans-Bold'"
           id="tspan151">v</svg:tspan></svg:text>
      <svg:text
         id="text154"
         x="181.20889"
         y="361.74341"><svg:tspan
           x="181.20889"
           y="361.74341"
           style="font-size:5.9499998;font-family:Bitstream Vera Sans"
           id="tspan155">f</svg:tspan></svg:text>
      <svg:g
         id="g158"
         transform="translate(93.66982,305.6833)">
        <svg:line
           style="fill:none;stroke:#000000"
           x1="89.031998"
           y1="97.112999"
           x2="76.081001"
           y2="98.247002"
           id="line160" />
        <svg:path
           d="M 73.076000,98.508000 C 74.442000,97.860000 76.121000,96.810000 77.125000,95.767000 L 76.477000,98.209000 L 77.540000,100.50200 C 76.369000,99.651000 74.535000,98.909000 73.076000,98.508000 z "
           id="path162" />
      </svg:g>
      <svg:text
         id="text165"
         x="176.6776"
         y="414.05679"><svg:tspan
           x="176.6776"
           y="414.05679"
           style="font-size:7.6500001;font-family:Bitstream Vera Sans-Bold'"
           id="tspan166">v</svg:tspan></svg:text>
      <svg:text
         id="text169"
         x="181.6844"
         y="414.05679"><svg:tspan
           x="181.6844"
           y="414.05679"
           style="font-size:9.0000000;font-family:'AmericanTypewriter'"
           id="tspan170">= </svg:tspan></svg:text>
      <svg:text
         id="text173"
         x="190.6844"
         y="414.05679"><svg:tspan
           x="190.6844"
           y="414.05679"
           style="font-size:7.6500001;font-family:Bitstream Vera Sans-Bold'"
           id="tspan174">v</svg:tspan></svg:text>
      <svg:text
         id="text177"
         x="195.6884"
         y="417.05679"><svg:tspan
           x="195.6884"
           y="417.05679"
           style="font-size:5.9499998;font-family:Bitstream Vera Sans"
           id="tspan178">f</svg:tspan></svg:text>
      <svg:text
         id="text181"
         x="197.6337"
         y="414.05679"><svg:tspan
           x="197.6337"
           y="414.05679"
           style="font-size:9.0000000;font-family:'AmericanTypewriter'"
           id="tspan182">+ (-</svg:tspan></svg:text>
      <svg:text
         id="text185"
         x="213.5096"
         y="414.05679"><svg:tspan
           x="213.5096"
           y="414.05679"
           style="font-size:7.6500001;font-family:Bitstream Vera Sans-Bold'"
           id="tspan186">v</svg:tspan></svg:text>
      <svg:text
         id="text189"
         x="218.5145"
         y="417.05679"><svg:tspan
           x="218.5145"
           y="417.05679"
           style="font-size:5.9499998;font-family:Bitstream Vera Sans"
           id="tspan190">i</svg:tspan></svg:text>
      <svg:text
         id="text193"
         x="220.0692"
         y="414.05679"><svg:tspan
           x="220.0692"
           y="414.05679"
           style="font-size:9.0000000;font-family:'AmericanTypewriter'"
           id="tspan194">)</svg:tspan></svg:text>
      <svg:path
         style="fill:none;stroke:#000000;stroke-width:0.50000000"
         d="M 166.66982,345.55630 C 169.16982,345.55630 170.41982,345.43130 172.16982,344.93130"
         id="path197" />
      <svg:path
         style="fill:none;stroke:#000000;stroke-width:0.50000000"
         d="M 166.79482,398.30730 C 170.66982,398.30730 172.54482,400.18230 172.91982,403.43230"
         id="path199" />
      <svg:path
         style="fill:none;stroke:#000000;stroke-width:0.50000000"
         d="M 176.00382,403.28130 C 176.34082,399.42230 178.37182,397.71730 181.64282,397.62630"
         id="path201" />
      <svg:polygon
         style="fill:none;stroke:#000000"
         points="82.839000,108.38600 80.720000,102.83400 78.199000,108.38600 82.839000,108.38600 "
         id="polygon203"
         transform="translate(93.66982,305.6833)" />
      <svg:g
         id="g205"
         transform="translate(93.66982,305.6833)">
        <svg:path
           style="fill:none;stroke:#000000"
           d="M 73.878000,87.017000 C 74.321000,86.378000 75.569000,84.187000 75.681000,90.817000"
           id="path207" />
        <svg:path
           style="fill:none;stroke:#000000"
           d="M 75.432000,87.127000 C 78.039000,84.242000 78.287000,84.825000 78.787000,93.202000"
           id="path209" />
      </svg:g>
      <svg:g
         id="g212"
         transform="translate(93.66982,305.6833)">
        <svg:path
           style="fill:none;stroke:#000000"
           d="M 80.378000,86.267000 C 80.821000,85.628000 82.069000,83.437000 82.181000,90.067000"
           id="path214" />
        <svg:path
           style="fill:none;stroke:#000000"
           d="M 81.932000,86.377000 C 84.539000,83.492000 84.787000,84.075000 85.287000,92.452000"
           id="path216" />
      </svg:g>
      <svg:g
         id="g219"
         transform="translate(93.66982,305.6833)">
        <svg:ellipse
           style="fill:none;stroke:#000000"
           cx="75.977997"
           cy="43.841999"
           rx="1.4780000"
           ry="2.6659999"
           id="ellipse221"
           sodipodi:cx="75.977997"
           sodipodi:cy="43.841999"
           sodipodi:rx="1.4780000"
           sodipodi:ry="2.6659999" />
        <svg:line
           style="fill:none;stroke:#000000"
           x1="74.500000"
           y1="43.841999"
           x2="77.455002"
           y2="43.841999"
           id="line223" />
      </svg:g>
    </svg:g>
    <svg:g
       id="g237"
       transform="translate(36.49119,11.68897)">
      <svg:line
         style="fill:none;stroke:#000000"
         x1="0.0000000"
         y1="54.271999"
         x2="101.00000"
         y2="54.271999"
         id="line7" />
      <svg:line
         style="fill:none;stroke:#000000"
         x1="0.086999997"
         y1="54.279999"
         x2="99.552002"
         y2="36.742001"
         id="line9" />
      <svg:path
         style="fill:none;stroke:#000000"
         d="M 101.37500,54.719000 C 101.37500,46.551000 100.87500,41.719000 99.375000,36.719000"
         id="path11" />
      <svg:path
         style="fill:none;stroke:#000000;stroke-width:0.50000000;stroke-dasharray:2.0000000 "
         d="M 101.37500,15.511000 C 101.37500,16.011000 101.37500,75.553000 101.37500,75.553000"
         id="path13" />
      <svg:path
         style="fill:none;stroke:#000000;stroke-width:0.50000000;stroke-dasharray:2.0000000 "
         d="M 95.986000,14.306000 C 96.073000,14.798000 104.63900,63.382000 104.63900,63.382000"
         id="path15" />
      <svg:g
         id="g17">
        <svg:text
           transform="translate(45.00000,53.51070)"
           id="text19"><svg:tspan
             x="0"
             y="0"
             style="font-size:9.0000000;font-family:'Symbol'"
             id="tspan20">θ</svg:tspan></svg:text>
      </svg:g>
      <svg:g
         id="g24">
        <svg:text
           transform="translate(96.00000,14.01070)"
           id="text26"><svg:tspan
             x="0"
             y="0"
             style="font-size:9.0000000;font-family:'Symbol'"
             id="tspan27">θ</svg:tspan></svg:text>
      </svg:g>
      <svg:g
         id="g31">
        <svg:path
           style="fill:none;stroke:#000000;stroke-width:0.50000000"
           d="M 93.997000,91.509000 C 98.568000,79.988000 101.08000,67.427000 101.08000,54.280000 C 101.08000,35.390000 95.893000,17.711000 86.867000,2.5900000"
           id="path33" />
        <svg:path
           d="M 85.315000,0.0000000 C 86.495000,0.94900000 88.170000,2.0010000 89.547000,2.4510000 L 87.065000,2.9310000 L 85.464000,4.8880000 C 85.722000,3.4630000 85.590000,1.4890000 85.315000,0.0000000 z "
           id="path35" />
      </svg:g>
    </svg:g>
    <svg:text
       xml:space="preserve"
       style="font-size:9.0000000;font-style:normal;font-variant:normal;font-weight:normal;font-stretch:normal;fill:#000000;fill-opacity:1.0000000;stroke:none;stroke-width:1.0000000pt;stroke-linecap:butt;stroke-linejoin:miter;stroke-opacity:1.0000000;font-family:Bitstream Vera Sans;text-anchor:start;writing-mode:lr-tb"
       x="5.3408298"
       y="124.02409"
       id="text317"
       sodipodi:linespacing="100%"><svg:tspan
         sodipodi:role="line"
         id="tspan318"
         x="5.3408298"
         y="124.02409">1</svg:tspan></svg:text>
    <svg:text
       xml:space="preserve"
       style="font-size:9.0000000;font-style:normal;font-variant:normal;font-weight:normal;font-stretch:normal;fill:#000000;fill-opacity:1.0000000;stroke:none;stroke-width:1.0000000pt;stroke-linecap:butt;stroke-linejoin:miter;stroke-opacity:1.0000000;font-family:Bitstream Vera Sans;text-anchor:start;writing-mode:lr-tb"
       x="5.4111423"
       y="252.20108"
       id="text320"
       sodipodi:linespacing="100%"><svg:tspan
         sodipodi:role="line"
         id="tspan321"
         x="5.4111423"
         y="252.20108">2</svg:tspan></svg:text>
    <svg:text
       xml:space="preserve"
       style="font-size:9.0000000;font-style:normal;font-variant:normal;font-weight:normal;font-stretch:normal;fill:#000000;fill-opacity:1.0000000;stroke:none;stroke-width:1.0000000pt;stroke-linecap:butt;stroke-linejoin:miter;stroke-opacity:1.0000000;font-family:Bitstream Vera Sans;text-anchor:start;writing-mode:lr-tb"
       x="102.37293"
       y="252.07364"
       id="text323"
       sodipodi:linespacing="100%"><svg:tspan
         sodipodi:role="line"
         id="tspan324"
         x="102.37293"
         y="252.07364">3</svg:tspan></svg:text>
  </svg:g>
</svg:svg>
