<?xml version="1.0" encoding="UTF-8" standalone="no"?>
<!-- Created with Inkscape (http://www.inkscape.org/) -->
<svg
   xmlns:dc="http://purl.org/dc/elements/1.1/"
   xmlns:cc="http://web.resource.org/cc/"
   xmlns:rdf="http://www.w3.org/1999/02/22-rdf-syntax-ns#"
   xmlns:svg="http://www.w3.org/2000/svg"
   xmlns="http://www.w3.org/2000/svg"
   xmlns:sodipodi="http://sodipodi.sourceforge.net/DTD/sodipodi-0.dtd"
   xmlns:inkscape="http://www.inkscape.org/namespaces/inkscape"
   width="744.09448819"
   height="1052.3622047"
   id="svg2"
   sodipodi:version="0.32"
   inkscape:version="0.45.1"
   sodipodi:docbase="/home/bcrowell/Documents/writing/books/physics/0sn/ch11/figs"
   sodipodi:docname="permeability-boundary.svg"
   inkscape:output_extension="org.inkscape.output.svg.inkscape">
  <defs
     id="defs4">
    <marker
       inkscape:stockid="Arrow2Mend"
       orient="auto"
       refY="0.0"
       refX="0.0"
       id="Arrow2Mend"
       style="overflow:visible;">
      <path
         id="path3214"
         style="font-size:12.0;fill-rule:evenodd;stroke-width:0.62500000;stroke-linejoin:round;"
         d="M 8.7185878,4.0337352 L -2.2072895,0.016013256 L 8.7185884,-4.0017078 C 6.9730900,-1.6296469 6.9831476,1.6157441 8.7185878,4.0337352 z "
         transform="scale(0.6) rotate(180) translate(0,0)" />
    </marker>
  </defs>
  <sodipodi:namedview
     id="base"
     pagecolor="#ffffff"
     bordercolor="#666666"
     borderopacity="1.0"
     gridtolerance="10000"
     guidetolerance="10"
     objecttolerance="10"
     inkscape:pageopacity="0.0"
     inkscape:pageshadow="2"
     inkscape:zoom="1.3679358"
     inkscape:cx="346.66667"
     inkscape:cy="597.72487"
     inkscape:document-units="px"
     inkscape:current-layer="layer1"
     inkscape:window-width="746"
     inkscape:window-height="582"
     inkscape:window-x="54"
     inkscape:window-y="54" />
  <metadata
     id="metadata7">
    <rdf:RDF>
      <cc:Work
         rdf:about="">
        <dc:format>image/svg+xml</dc:format>
        <dc:type
           rdf:resource="http://purl.org/dc/dcmitype/StillImage" />
      </cc:Work>
    </rdf:RDF>
  </metadata>
  <g
     inkscape:label="Layer 1"
     inkscape:groupmode="layer"
     id="layer1">
    <rect
       style="fill:#7a7a7a;fill-opacity:1;fill-rule:evenodd;stroke:none;stroke-width:0.74606729pt;stroke-linecap:butt;stroke-linejoin:miter;stroke-opacity:1"
       id="rect2160"
       width="183.31938"
       height="93.791313"
       x="194.0379"
       y="453.01529" />
    <rect
       style="fill:#dedede;fill-opacity:1;fill-rule:evenodd;stroke:none;stroke-width:0.74606729pt;stroke-linecap:butt;stroke-linejoin:miter;stroke-opacity:1"
       id="rect3134"
       width="183.31938"
       height="93.791313"
       x="194.0379"
       y="360.96918" />
    <rect
       style="fill:none;fill-opacity:0.75;fill-rule:evenodd;stroke:#000000;stroke-width:0.68730497;stroke-linecap:butt;stroke-linejoin:miter;stroke-miterlimit:4;stroke-dasharray:4.12383004, 0.687305;stroke-dashoffset:0;stroke-opacity:1"
       id="rect3136"
       width="39.769043"
       height="19.134123"
       x="206.75568"
       y="445.41412" />
    <text
       xml:space="preserve"
       style="font-size:10px;font-style:normal;font-variant:normal;font-weight:normal;font-stretch:normal;text-align:start;line-height:100%;writing-mode:lr-tb;text-anchor:start;fill:#000000;fill-opacity:1;stroke:none;stroke-width:1pt;stroke-linecap:butt;stroke-linejoin:miter;stroke-opacity:1;font-family:Bitstream Vera Sans"
       x="196.71957"
       y="476.46799"
       id="text3138"
       sodipodi:linespacing="100%"><tspan
         sodipodi:role="line"
         id="tspan3140"
         x="196.71957"
         y="476.46799">A</tspan></text>
    <text
       xml:space="preserve"
       style="font-size:10px;font-style:normal;font-variant:normal;font-weight:normal;font-stretch:normal;text-align:start;line-height:100%;writing-mode:lr-tb;text-anchor:start;fill:#000000;fill-opacity:1;stroke:none;stroke-width:1pt;stroke-linecap:butt;stroke-linejoin:miter;stroke-opacity:1;font-family:Bitstream Vera Sans"
       x="252.3949"
       y="476.46799"
       id="text3142"
       sodipodi:linespacing="100%"><tspan
         sodipodi:role="line"
         id="tspan3144"
         x="252.3949"
         y="476.46799">B</tspan></text>
    <text
       xml:space="preserve"
       style="font-size:10px;font-style:normal;font-variant:normal;font-weight:normal;font-stretch:normal;text-align:start;line-height:100%;writing-mode:lr-tb;text-anchor:start;fill:#000000;fill-opacity:1;stroke:none;stroke-width:1pt;stroke-linecap:butt;stroke-linejoin:miter;stroke-opacity:1;font-family:Bitstream Vera Sans"
       x="252.81482"
       y="439.81192"
       id="text3146"
       sodipodi:linespacing="100%"><tspan
         sodipodi:role="line"
         id="tspan3148"
         x="252.81482"
         y="439.81192">C</tspan></text>
    <text
       xml:space="preserve"
       style="font-size:10px;font-style:normal;font-variant:normal;font-weight:normal;font-stretch:normal;text-align:start;line-height:100%;writing-mode:lr-tb;text-anchor:start;fill:#000000;fill-opacity:1;stroke:none;stroke-width:1pt;stroke-linecap:butt;stroke-linejoin:miter;stroke-opacity:1;font-family:Bitstream Vera Sans"
       x="195.81625"
       y="439.95352"
       id="text3150"
       sodipodi:linespacing="100%"><tspan
         sodipodi:role="line"
         id="tspan3152"
         x="195.81625"
         y="439.95352">D</tspan></text>
    <g
       id="g3177"
       transform="translate(-3.7830672,-144.44444)">
      <path
         id="path3160"
         d="M 275.76093,534.54083 C 278.15318,526.53985 278.79111,515.05127 278.79111,515.05127 C 278.79111,515.05127 278.63163,523.66771 281.8213,523.66771 C 285.01097,523.66771 285.17045,515.46157 285.17045,515.46157 L 285.32993,522.43678"
         style="fill:none;fill-opacity:0.75;fill-rule:evenodd;stroke:#000000;stroke-width:1.25;stroke-linecap:butt;stroke-linejoin:miter;stroke-miterlimit:4;stroke-dasharray:none;stroke-opacity:1" />
      <text
         sodipodi:linespacing="100%"
         id="text3162"
         y="528.23523"
         x="288.3241"
         style="font-size:10px;font-style:normal;font-variant:normal;font-weight:normal;font-stretch:normal;text-align:start;line-height:100%;writing-mode:lr-tb;text-anchor:start;fill:#000000;fill-opacity:1;stroke:none;stroke-width:1pt;stroke-linecap:butt;stroke-linejoin:miter;stroke-opacity:1;font-family:Bitstream Vera Sans"
         xml:space="preserve"><tspan
           y="528.23523"
           x="288.3241"
           id="tspan3164"
           sodipodi:role="line">1</tspan></text>
    </g>
    <g
       id="g3172"
       transform="translate(-0.3048558,145.13227)">
      <path
         id="path3166"
         d="M 272.32178,394.9112 C 274.71403,386.91022 275.35196,375.42164 275.35196,375.42164 C 275.35196,375.42164 275.19247,384.03808 278.38214,384.03808 C 281.57181,384.03808 281.73129,375.83194 281.73129,375.83194 L 281.89077,382.80715"
         style="fill:none;fill-opacity:0.75;fill-rule:evenodd;stroke:#000000;stroke-width:1.25;stroke-linecap:butt;stroke-linejoin:miter;stroke-miterlimit:4;stroke-dasharray:none;stroke-opacity:1" />
      <text
         sodipodi:linespacing="100%"
         id="text3168"
         y="388.60559"
         x="284.88495"
         style="font-size:10px;font-style:normal;font-variant:normal;font-weight:normal;font-stretch:normal;text-align:start;line-height:100%;writing-mode:lr-tb;text-anchor:start;fill:#000000;fill-opacity:1;stroke:none;stroke-width:1pt;stroke-linecap:butt;stroke-linejoin:miter;stroke-opacity:1;font-family:Bitstream Vera Sans"
         xml:space="preserve"><tspan
           y="388.60559"
           x="284.88495"
           id="tspan3170"
           sodipodi:role="line">2</tspan></text>
    </g>
    <path
       style="fill:none;fill-opacity:0.75;fill-rule:evenodd;stroke:#000000;stroke-width:1.25;stroke-linecap:butt;stroke-linejoin:miter;marker-end:url(#Arrow2Mend);stroke-miterlimit:4;stroke-dasharray:none;stroke-opacity:1"
       d="M 285.44973,447.07718 L 306.77249,447.07718"
       id="path3384" />
    <path
       style="fill:none;fill-opacity:0.75;fill-rule:evenodd;stroke:#000000;stroke-width:1.25;stroke-linecap:butt;stroke-linejoin:miter;marker-end:url(#Arrow2Mend);stroke-miterlimit:4;stroke-dasharray:none;stroke-opacity:1"
       d="M 286.09323,464.02499 L 307.41599,464.02499"
       id="path3386" />
    <path
       style="fill:none;fill-opacity:0.75;fill-rule:evenodd;stroke:#000000;stroke-width:1.25;stroke-linecap:butt;stroke-linejoin:miter;marker-end:url(#Arrow2Mend);stroke-miterlimit:4;stroke-dasharray:none;stroke-opacity:1"
       d="M 328.90356,447.07718 L 357.20467,447.07718"
       id="path3388"
       sodipodi:nodetypes="cc" />
    <path
       style="fill:none;fill-opacity:0.75;fill-rule:evenodd;stroke:#000000;stroke-width:1.25;stroke-linecap:butt;stroke-linejoin:miter;marker-end:url(#Arrow2Mend);stroke-miterlimit:4;stroke-dasharray:none;stroke-opacity:1"
       d="M 319.08978,464.02499 L 371.582,464.02499"
       id="path3390"
       sodipodi:nodetypes="cc" />
    <g
       id="g3436"
       transform="translate(-113.77069,2.2112355)">
      <text
         sodipodi:linespacing="100%"
         id="text3392"
         y="427.81189"
         x="403.06879"
         style="font-size:12px;font-style:normal;font-variant:normal;font-weight:normal;font-stretch:normal;text-align:start;line-height:100%;writing-mode:lr-tb;text-anchor:start;fill:#000000;fill-opacity:1;stroke:none;stroke-width:1pt;stroke-linecap:butt;stroke-linejoin:miter;stroke-opacity:1;font-family:Bitstream Vera Sans"
         xml:space="preserve"><tspan
           y="427.81189"
           x="403.06879"
           id="tspan3394"
           sodipodi:role="line">H</tspan></text>
      <text
         sodipodi:linespacing="100%"
         id="text3396"
         y="431.25107"
         x="412.69839"
         style="font-size:10px;font-style:normal;font-variant:normal;font-weight:normal;font-stretch:normal;text-align:start;line-height:100%;writing-mode:lr-tb;text-anchor:start;fill:#000000;fill-opacity:1;stroke:none;stroke-width:1pt;stroke-linecap:butt;stroke-linejoin:miter;stroke-opacity:1;font-family:Bitstream Vera Sans"
         xml:space="preserve"><tspan
           y="431.25107"
           x="412.69839"
           id="tspan3398"
           sodipodi:role="line">1</tspan></text>
    </g>
    <g
       id="g3442"
       transform="translate(-111.79871,23.533987)">
      <text
         sodipodi:linespacing="100%"
         id="text3400"
         y="462.7944"
         x="401.13586"
         style="font-size:12px;font-style:normal;font-variant:normal;font-weight:normal;font-stretch:normal;text-align:start;line-height:100%;writing-mode:lr-tb;text-anchor:start;fill:#000000;fill-opacity:1;stroke:none;stroke-width:1pt;stroke-linecap:butt;stroke-linejoin:miter;stroke-opacity:1;font-family:Bitstream Vera Sans"
         xml:space="preserve"><tspan
           y="462.7944"
           x="401.13586"
           id="tspan3402"
           sodipodi:role="line">H</tspan></text>
      <text
         sodipodi:linespacing="100%"
         id="text3404"
         y="466.23358"
         x="410.76547"
         style="font-size:10px;font-style:normal;font-variant:normal;font-weight:normal;font-stretch:normal;text-align:start;line-height:100%;writing-mode:lr-tb;text-anchor:start;fill:#000000;fill-opacity:1;stroke:none;stroke-width:1pt;stroke-linecap:butt;stroke-linejoin:miter;stroke-opacity:1;font-family:Bitstream Vera Sans"
         xml:space="preserve"><tspan
           y="466.23358"
           x="410.76547"
           id="tspan3406"
           sodipodi:role="line">2</tspan></text>
    </g>
    <g
       id="g3424"
       transform="translate(-110.3706,3.9792408)">
      <text
         sodipodi:linespacing="100%"
         id="text3408"
         y="426.04388"
         x="448.87482"
         style="font-size:12px;font-style:normal;font-variant:normal;font-weight:normal;font-stretch:normal;text-align:start;line-height:100%;writing-mode:lr-tb;text-anchor:start;fill:#000000;fill-opacity:1;stroke:none;stroke-width:1pt;stroke-linecap:butt;stroke-linejoin:miter;stroke-opacity:1;font-family:Bitstream Vera Sans"
         xml:space="preserve"><tspan
           y="426.04388"
           x="448.87482"
           id="tspan3410"
           sodipodi:role="line">B</tspan></text>
      <text
         sodipodi:linespacing="100%"
         id="text3412"
         y="429.48306"
         x="458.50443"
         style="font-size:10px;font-style:normal;font-variant:normal;font-weight:normal;font-stretch:normal;text-align:start;line-height:100%;writing-mode:lr-tb;text-anchor:start;fill:#000000;fill-opacity:1;stroke:none;stroke-width:1pt;stroke-linecap:butt;stroke-linejoin:miter;stroke-opacity:1;font-family:Bitstream Vera Sans"
         xml:space="preserve"><tspan
           y="429.48306"
           x="458.50443"
           id="tspan3414"
           sodipodi:role="line">1</tspan></text>
    </g>
    <g
       id="g3430"
       transform="translate(-108.39862,25.301992)">
      <text
         sodipodi:linespacing="100%"
         id="text3416"
         y="461.0264"
         x="446.94189"
         style="font-size:12px;font-style:normal;font-variant:normal;font-weight:normal;font-stretch:normal;text-align:start;line-height:100%;writing-mode:lr-tb;text-anchor:start;fill:#000000;fill-opacity:1;stroke:none;stroke-width:1pt;stroke-linecap:butt;stroke-linejoin:miter;stroke-opacity:1;font-family:Bitstream Vera Sans"
         xml:space="preserve"><tspan
           y="461.0264"
           x="446.94189"
           id="tspan3418"
           sodipodi:role="line">B</tspan></text>
      <text
         sodipodi:linespacing="100%"
         id="text3420"
         y="464.46558"
         x="456.5715"
         style="font-size:10px;font-style:normal;font-variant:normal;font-weight:normal;font-stretch:normal;text-align:start;line-height:100%;writing-mode:lr-tb;text-anchor:start;fill:#000000;fill-opacity:1;stroke:none;stroke-width:1pt;stroke-linecap:butt;stroke-linejoin:miter;stroke-opacity:1;font-family:Bitstream Vera Sans"
         xml:space="preserve"><tspan
           y="464.46558"
           x="456.5715"
           id="tspan3422"
           sodipodi:role="line">2</tspan></text>
    </g>
  </g>
</svg>
