<?xml version="1.0" encoding="UTF-8" standalone="no"?>
<!-- Created with Inkscape (http://www.inkscape.org/) -->
<svg
   xmlns:dc="http://purl.org/dc/elements/1.1/"
   xmlns:cc="http://web.resource.org/cc/"
   xmlns:rdf="http://www.w3.org/1999/02/22-rdf-syntax-ns#"
   xmlns:svg="http://www.w3.org/2000/svg"
   xmlns="http://www.w3.org/2000/svg"
   xmlns:xlink="http://www.w3.org/1999/xlink"
   xmlns:sodipodi="http://inkscape.sourceforge.net/DTD/sodipodi-0.dtd"
   xmlns:inkscape="http://www.inkscape.org/namespaces/inkscape"
   width="1269.0000pt"
   height="810.00000pt"
   id="svg2"
   sodipodi:version="0.32"
   inkscape:version="0.42"
   sodipodi:docbase="/home/bcrowell/Documents/writing/books/physics/7cp/ch00/figs"
   sodipodi:docname="lulu-cover.svg">
  <defs
     id="defs4">
    <radialGradient
       cx="-264.67310"
       cy="-194.56200"
       r="5.9628000"
       fx="-264.67310"
       fy="-194.56200"
       id="XMLID_16_"
       gradientUnits="userSpaceOnUse"
       gradientTransform="translate(271.1895,203.2734)">
      <stop
         style="stop-color:#ffffff;stop-opacity:1.0000000"
         offset="0.0000000"
         id="stop1752" />
      <stop
         style="stop-color:#fefefe;stop-opacity:1.0000000"
         offset="0.0041999999"
         id="stop1754" />
      <stop
         style="stop-color:#ededed;stop-opacity:1.0000000"
         offset="0.11530000"
         id="stop1756" />
      <stop
         style="stop-color:#dfdfdf;stop-opacity:1.0000000"
         offset="0.23500000"
         id="stop1758" />
      <stop
         style="stop-color:#d3d3d3;stop-opacity:1.0000000"
         offset="0.36730000"
         id="stop1760" />
      <stop
         style="stop-color:#cacaca;stop-opacity:1.0000000"
         offset="0.51690000"
         id="stop1762" />
      <stop
         style="stop-color:#c5c5c5;stop-opacity:1.0000000"
         offset="0.69830000"
         id="stop1764" />
      <stop
         style="stop-color:#c3c3c3;stop-opacity:1.0000000"
         offset="1.0000000"
         id="stop1766" />
      <midPointStop
         id="midPointStop1768"
         style="stop-color:#FFFFFF"
         offset="0" />
      <midPointStop
         id="midPointStop1770"
         style="stop-color:#FFFFFF"
         offset="0.2" />
      <midPointStop
         id="midPointStop1772"
         style="stop-color:#C3C3C3"
         offset="1" />
    </radialGradient>
    <radialGradient
       cx="-264.67310"
       cy="-194.56200"
       r="5.9628000"
       fx="-264.67310"
       fy="-194.56200"
       id="radialGradient2376"
       xlink:href="#XMLID_16_"
       gradientUnits="userSpaceOnUse"
       gradientTransform="translate(271.1895,203.2734)" />
    <radialGradient
       cx="-264.13129"
       cy="-195.72850"
       r="0.56059998"
       fx="-264.13129"
       fy="-195.72850"
       id="XMLID_15_"
       gradientUnits="userSpaceOnUse"
       gradientTransform="translate(272.6895,206.0234)">
      <stop
         style="stop-color:#c5c5c5;stop-opacity:1.0000000"
         offset="0.0000000"
         id="stop1733" />
      <stop
         style="stop-color:#c7c7c7;stop-opacity:1.0000000"
         offset="0.37799999"
         id="stop1735" />
      <stop
         style="stop-color:#cdcdcd;stop-opacity:1.0000000"
         offset="0.64969999"
         id="stop1737" />
      <stop
         style="stop-color:#d6d6d6;stop-opacity:1.0000000"
         offset="0.88749999"
         id="stop1739" />
      <stop
         style="stop-color:#dcdcdc;stop-opacity:1.0000000"
         offset="1.0000000"
         id="stop1741" />
      <midPointStop
         id="midPointStop1743"
         style="stop-color:#C5C5C5"
         offset="0" />
      <midPointStop
         id="midPointStop1745"
         style="stop-color:#C5C5C5"
         offset="0.77" />
      <midPointStop
         id="midPointStop1747"
         style="stop-color:#DCDCDC"
         offset="1" />
    </radialGradient>
    <radialGradient
       cx="-264.13129"
       cy="-195.72850"
       r="0.56059998"
       fx="-264.13129"
       fy="-195.72850"
       id="radialGradient2374"
       xlink:href="#XMLID_15_"
       gradientUnits="userSpaceOnUse"
       gradientTransform="translate(272.6895,206.0234)" />
    <radialGradient
       cx="-263.46481"
       cy="-196.77000"
       r="0.70950001"
       fx="-263.46481"
       fy="-196.77000"
       id="XMLID_14_"
       gradientUnits="userSpaceOnUse"
       gradientTransform="matrix(1.400000,0.000000,0.000000,1.400000,378.1003,284.7563)">
      <stop
         style="stop-color:#c5c5c5;stop-opacity:1.0000000"
         offset="0.0000000"
         id="stop1714" />
      <stop
         style="stop-color:#c7c7c7;stop-opacity:1.0000000"
         offset="0.37799999"
         id="stop1716" />
      <stop
         style="stop-color:#cdcdcd;stop-opacity:1.0000000"
         offset="0.64969999"
         id="stop1718" />
      <stop
         style="stop-color:#d6d6d6;stop-opacity:1.0000000"
         offset="0.88749999"
         id="stop1720" />
      <stop
         style="stop-color:#dcdcdc;stop-opacity:1.0000000"
         offset="1.0000000"
         id="stop1722" />
      <midPointStop
         id="midPointStop1724"
         style="stop-color:#C5C5C5"
         offset="0" />
      <midPointStop
         id="midPointStop1726"
         style="stop-color:#C5C5C5"
         offset="0.77" />
      <midPointStop
         id="midPointStop1728"
         style="stop-color:#DCDCDC"
         offset="1" />
    </radialGradient>
    <radialGradient
       cx="-263.46481"
       cy="-196.77000"
       r="0.70950001"
       fx="-263.46481"
       fy="-196.77000"
       id="radialGradient2372"
       xlink:href="#XMLID_14_"
       gradientUnits="userSpaceOnUse"
       gradientTransform="matrix(1.400000,0.000000,0.000000,1.400000,378.1003,284.7563)" />
    <radialGradient
       cx="-260.38159"
       cy="-194.81200"
       r="0.32539999"
       fx="-260.38159"
       fy="-194.81200"
       id="XMLID_13_"
       gradientUnits="userSpaceOnUse"
       gradientTransform="matrix(1.300000,0.000000,0.000000,1.300000,350.7916,264.4546)">
      <stop
         style="stop-color:#c5c5c5;stop-opacity:1.0000000"
         offset="0.0000000"
         id="stop1695" />
      <stop
         style="stop-color:#c7c7c7;stop-opacity:1.0000000"
         offset="0.37799999"
         id="stop1697" />
      <stop
         style="stop-color:#cdcdcd;stop-opacity:1.0000000"
         offset="0.64969999"
         id="stop1699" />
      <stop
         style="stop-color:#d6d6d6;stop-opacity:1.0000000"
         offset="0.88749999"
         id="stop1701" />
      <stop
         style="stop-color:#dcdcdc;stop-opacity:1.0000000"
         offset="1.0000000"
         id="stop1703" />
      <midPointStop
         id="midPointStop1705"
         style="stop-color:#C5C5C5"
         offset="0" />
      <midPointStop
         id="midPointStop1707"
         style="stop-color:#C5C5C5"
         offset="0.77" />
      <midPointStop
         id="midPointStop1709"
         style="stop-color:#DCDCDC"
         offset="1" />
    </radialGradient>
    <radialGradient
       cx="-260.38159"
       cy="-194.81200"
       r="0.32539999"
       fx="-260.38159"
       fy="-194.81200"
       id="radialGradient2370"
       xlink:href="#XMLID_13_"
       gradientUnits="userSpaceOnUse"
       gradientTransform="matrix(1.300000,0.000000,0.000000,1.300000,350.7916,264.4546)" />
    <radialGradient
       cx="-240.50661"
       cy="-198.31200"
       r="0.67180002"
       fx="-240.50661"
       fy="-198.31200"
       id="XMLID_12_"
       gradientUnits="userSpaceOnUse"
       gradientTransform="matrix(0.410400,1.127600,-1.127600,0.410400,-110.7035,360.6915)">
      <stop
         style="stop-color:#c5c5c5;stop-opacity:1.0000000"
         offset="0.0000000"
         id="stop1676" />
      <stop
         style="stop-color:#c7c7c7;stop-opacity:1.0000000"
         offset="0.37799999"
         id="stop1678" />
      <stop
         style="stop-color:#cdcdcd;stop-opacity:1.0000000"
         offset="0.64969999"
         id="stop1680" />
      <stop
         style="stop-color:#d6d6d6;stop-opacity:1.0000000"
         offset="0.88749999"
         id="stop1682" />
      <stop
         style="stop-color:#dcdcdc;stop-opacity:1.0000000"
         offset="1.0000000"
         id="stop1684" />
      <midPointStop
         id="midPointStop1686"
         style="stop-color:#C5C5C5"
         offset="0" />
      <midPointStop
         id="midPointStop1688"
         style="stop-color:#C5C5C5"
         offset="0.77" />
      <midPointStop
         id="midPointStop1690"
         style="stop-color:#DCDCDC"
         offset="1" />
    </radialGradient>
    <radialGradient
       cx="-240.50661"
       cy="-198.31200"
       r="0.67180002"
       fx="-240.50661"
       fy="-198.31200"
       id="radialGradient2368"
       xlink:href="#XMLID_12_"
       gradientUnits="userSpaceOnUse"
       gradientTransform="matrix(0.410400,1.127600,-1.127600,0.410400,-110.7035,360.6915)" />
    <radialGradient
       cx="-240.88161"
       cy="-195.47850"
       r="0.85490000"
       fx="-240.88161"
       fy="-195.47850"
       id="XMLID_11_"
       gradientUnits="userSpaceOnUse"
       gradientTransform="matrix(1.200000,0.000000,0.000000,1.200000,303.2118,245.1738)">
      <stop
         style="stop-color:#c5c5c5;stop-opacity:1.0000000"
         offset="0.0000000"
         id="stop1657" />
      <stop
         style="stop-color:#c7c7c7;stop-opacity:1.0000000"
         offset="0.37799999"
         id="stop1659" />
      <stop
         style="stop-color:#cdcdcd;stop-opacity:1.0000000"
         offset="0.64969999"
         id="stop1661" />
      <stop
         style="stop-color:#d6d6d6;stop-opacity:1.0000000"
         offset="0.88749999"
         id="stop1663" />
      <stop
         style="stop-color:#dcdcdc;stop-opacity:1.0000000"
         offset="1.0000000"
         id="stop1665" />
      <midPointStop
         id="midPointStop1667"
         style="stop-color:#C5C5C5"
         offset="0" />
      <midPointStop
         id="midPointStop1669"
         style="stop-color:#C5C5C5"
         offset="0.77" />
      <midPointStop
         id="midPointStop1671"
         style="stop-color:#DCDCDC"
         offset="1" />
    </radialGradient>
    <radialGradient
       cx="-240.88161"
       cy="-195.47850"
       r="0.85490000"
       fx="-240.88161"
       fy="-195.47850"
       id="radialGradient2366"
       xlink:href="#XMLID_11_"
       gradientUnits="userSpaceOnUse"
       gradientTransform="matrix(1.200000,0.000000,0.000000,1.200000,303.2118,245.1738)" />
    <radialGradient
       cx="-243.08980"
       cy="-197.35350"
       r="1.3850000"
       fx="-243.08980"
       fy="-197.35350"
       id="XMLID_10_"
       gradientUnits="userSpaceOnUse"
       gradientTransform="matrix(1.170000,0.000000,0.000000,1.170000,296.7023,240.0114)">
      <stop
         style="stop-color:#c5c5c5;stop-opacity:1.0000000"
         offset="0.0000000"
         id="stop1638" />
      <stop
         style="stop-color:#c7c7c7;stop-opacity:1.0000000"
         offset="0.37799999"
         id="stop1640" />
      <stop
         style="stop-color:#cdcdcd;stop-opacity:1.0000000"
         offset="0.64969999"
         id="stop1642" />
      <stop
         style="stop-color:#d6d6d6;stop-opacity:1.0000000"
         offset="0.88749999"
         id="stop1644" />
      <stop
         style="stop-color:#dcdcdc;stop-opacity:1.0000000"
         offset="1.0000000"
         id="stop1646" />
      <midPointStop
         id="midPointStop1648"
         style="stop-color:#C5C5C5"
         offset="0" />
      <midPointStop
         id="midPointStop1650"
         style="stop-color:#C5C5C5"
         offset="0.77" />
      <midPointStop
         id="midPointStop1652"
         style="stop-color:#DCDCDC"
         offset="1" />
    </radialGradient>
    <radialGradient
       cx="-243.08980"
       cy="-197.35350"
       r="1.3850000"
       fx="-243.08980"
       fy="-197.35350"
       id="radialGradient2364"
       xlink:href="#XMLID_10_"
       gradientUnits="userSpaceOnUse"
       gradientTransform="matrix(1.170000,0.000000,0.000000,1.170000,296.7023,240.0114)" />
    <radialGradient
       cx="-244.63161"
       cy="-199.52000"
       r="1.0623000"
       fx="-244.63161"
       fy="-199.52000"
       id="XMLID_9_"
       gradientUnits="userSpaceOnUse"
       gradientTransform="matrix(1.170000,0.000000,0.000000,1.170000,296.5480,241.3381)">
      <stop
         style="stop-color:#c5c5c5;stop-opacity:1.0000000"
         offset="0.0000000"
         id="stop1619" />
      <stop
         style="stop-color:#c7c7c7;stop-opacity:1.0000000"
         offset="0.37799999"
         id="stop1621" />
      <stop
         style="stop-color:#cdcdcd;stop-opacity:1.0000000"
         offset="0.64969999"
         id="stop1623" />
      <stop
         style="stop-color:#d6d6d6;stop-opacity:1.0000000"
         offset="0.88749999"
         id="stop1625" />
      <stop
         style="stop-color:#dcdcdc;stop-opacity:1.0000000"
         offset="1.0000000"
         id="stop1627" />
      <midPointStop
         id="midPointStop1629"
         style="stop-color:#C5C5C5"
         offset="0" />
      <midPointStop
         id="midPointStop1631"
         style="stop-color:#C5C5C5"
         offset="0.77" />
      <midPointStop
         id="midPointStop1633"
         style="stop-color:#DCDCDC"
         offset="1" />
    </radialGradient>
    <radialGradient
       cx="-244.63161"
       cy="-199.52000"
       r="1.0623000"
       fx="-244.63161"
       fy="-199.52000"
       id="radialGradient2362"
       xlink:href="#XMLID_9_"
       gradientUnits="userSpaceOnUse"
       gradientTransform="matrix(1.170000,0.000000,0.000000,1.170000,296.5480,241.3381)" />
    <radialGradient
       inkscape:collect="always"
       xlink:href="#XMLID_9_"
       id="radialGradient3028"
       gradientUnits="userSpaceOnUse"
       gradientTransform="matrix(1.170000,0.000000,0.000000,1.170000,296.5480,241.3381)"
       cx="-244.63161"
       cy="-199.52000"
       fx="-244.63161"
       fy="-199.52000"
       r="1.0623000" />
    <radialGradient
       inkscape:collect="always"
       xlink:href="#XMLID_10_"
       id="radialGradient3030"
       gradientUnits="userSpaceOnUse"
       gradientTransform="matrix(1.170000,0.000000,0.000000,1.170000,296.7023,240.0114)"
       cx="-243.08980"
       cy="-197.35350"
       fx="-243.08980"
       fy="-197.35350"
       r="1.3850000" />
    <radialGradient
       inkscape:collect="always"
       xlink:href="#XMLID_11_"
       id="radialGradient3032"
       gradientUnits="userSpaceOnUse"
       gradientTransform="matrix(1.200000,0.000000,0.000000,1.200000,303.2118,245.1738)"
       cx="-240.88161"
       cy="-195.47850"
       fx="-240.88161"
       fy="-195.47850"
       r="0.85490000" />
    <radialGradient
       inkscape:collect="always"
       xlink:href="#XMLID_12_"
       id="radialGradient3034"
       gradientUnits="userSpaceOnUse"
       gradientTransform="matrix(0.410400,1.127600,-1.127600,0.410400,-110.7035,360.6915)"
       cx="-240.50661"
       cy="-198.31200"
       fx="-240.50661"
       fy="-198.31200"
       r="0.67180002" />
    <radialGradient
       inkscape:collect="always"
       xlink:href="#XMLID_13_"
       id="radialGradient3036"
       gradientUnits="userSpaceOnUse"
       gradientTransform="matrix(1.300000,0.000000,0.000000,1.300000,350.7916,264.4546)"
       cx="-260.38159"
       cy="-194.81200"
       fx="-260.38159"
       fy="-194.81200"
       r="0.32539999" />
    <radialGradient
       inkscape:collect="always"
       xlink:href="#XMLID_14_"
       id="radialGradient3038"
       gradientUnits="userSpaceOnUse"
       gradientTransform="matrix(1.400000,0.000000,0.000000,1.400000,378.1003,284.7563)"
       cx="-263.46481"
       cy="-196.77000"
       fx="-263.46481"
       fy="-196.77000"
       r="0.70950001" />
    <radialGradient
       inkscape:collect="always"
       xlink:href="#XMLID_15_"
       id="radialGradient3040"
       gradientUnits="userSpaceOnUse"
       gradientTransform="translate(272.6895,206.0234)"
       cx="-264.13129"
       cy="-195.72850"
       fx="-264.13129"
       fy="-195.72850"
       r="0.56059998" />
    <radialGradient
       inkscape:collect="always"
       xlink:href="#XMLID_16_"
       id="radialGradient3042"
       gradientUnits="userSpaceOnUse"
       gradientTransform="translate(271.1895,203.2734)"
       cx="-264.67310"
       cy="-194.56200"
       fx="-264.67310"
       fy="-194.56200"
       r="5.9628000" />
  </defs>
  <sodipodi:namedview
     id="base"
     pagecolor="#ffffff"
     bordercolor="#666666"
     borderopacity="1.0"
     inkscape:pageopacity="0.0"
     inkscape:pageshadow="2"
     inkscape:zoom="2.9729823"
     inkscape:cx="455.57764"
     inkscape:cy="570.22631"
     inkscape:document-units="px"
     inkscape:current-layer="layer1"
     inkscape:window-width="1278"
     inkscape:window-height="996"
     inkscape:window-x="0"
     inkscape:window-y="30" />
  <metadata
     id="metadata7">
    <rdf:RDF>
      <cc:Work
         rdf:about="">
        <dc:format>image/svg+xml</dc:format>
        <dc:type
           rdf:resource="http://purl.org/dc/dcmitype/StillImage" />
      </cc:Work>
    </rdf:RDF>
  </metadata>
  <g
     inkscape:label="Layer 1"
     inkscape:groupmode="layer"
     id="layer1">
    <rect
       style="fill:#c69b71;fill-opacity:1.0000000;fill-rule:evenodd;stroke:none;stroke-width:1.0000000pt;stroke-linecap:butt;stroke-linejoin:miter;stroke-opacity:1.0000000"
       id="rect1371"
       width="299.36783"
       height="1012.5000"
       x="0.0000000"
       y="0.0000000" />
    <g
       id="g2100"
       transform="translate(-9.616728,0.000000)">
      <g
         id="g1332">
        <image
           id="image1399"
           height="1012.4998"
           width="782.38617"
           sodipodi:absref="/home/bcrowell/Documents/writing/books/physics/7je/ch00/figs/wave2.jpg"
           xlink:href="wave2.jpg"
           x="813.48218"
           y="0.00018019897" />
        <text
           xml:space="preserve"
           style="font-size:80.000000px;font-style:normal;font-variant:normal;font-weight:bold;font-stretch:normal;text-align:end;line-height:125.00000%;writing-mode:lr-tb;text-anchor:end;fill:#000000;fill-opacity:1.0000000;stroke:none;stroke-width:1.0000000pt;stroke-linecap:butt;stroke-linejoin:miter;stroke-opacity:1.0000000;font-family:Bitstream Vera Sans"
           x="1501.4246"
           y="149.73695"
           id="text1402"
           sodipodi:linespacing="125.00000%"><tspan
             sodipodi:role="line"
             id="tspan1404"
             x="1501.4246"
             y="149.73695">Conceptual</tspan><tspan
             sodipodi:role="line"
             x="1501.4246"
             y="249.73695"
             id="tspan1406">Physics</tspan></text>
        <text
           xml:space="preserve"
           style="font-size:40.000000px;font-style:normal;font-variant:normal;font-weight:normal;font-stretch:normal;text-align:start;line-height:125.00000%;writing-mode:lr-tb;text-anchor:start;fill:#000000;fill-opacity:1.0000000;stroke:none;stroke-width:1.0000000pt;stroke-linecap:butt;stroke-linejoin:miter;stroke-opacity:1.0000000;font-family:Bitstream Vera Sans"
           x="1353.7488"
           y="332.7464"
           id="text1408"
           sodipodi:linespacing="125.00000%"><tspan
             sodipodi:role="line"
             id="tspan1410"
             x="1353.7488"
             y="332.74640">Crowell</tspan></text>
      </g>
      <image
         y="-0.0019252226"
         x="74.466728"
         xlink:href="wave1.jpg"
         sodipodi:absref="/home/bcrowell/Documents/writing/books/physics/7cp/ch00/figs/wave1.jpg"
         width="739.43182"
         height="1012.5000"
         id="image1368" />
    </g>
    <g
       id="g2058"
       transform="matrix(0.000000,1.000000,-1.000000,0.000000,284.6443,-429.6490)">
      <text
         sodipodi:linespacing="125.00000%"
         id="text2048"
         y="-503.01538"
         x="674.20715"
         style="font-size:20.000000px;font-style:normal;font-variant:normal;font-weight:bold;font-stretch:normal;text-align:start;line-height:125.00000%;writing-mode:lr-tb;text-anchor:start;fill:#000000;fill-opacity:1.0000000;stroke:none;stroke-width:1.0000000pt;stroke-linecap:butt;stroke-linejoin:miter;stroke-opacity:1.0000000;font-family:Bitstream Vera Sans"
         xml:space="preserve"><tspan
           y="-503.01538"
           x="674.20715"
           id="tspan2050"
           sodipodi:role="line">Conceptual Physics</tspan></text>
      <text
         sodipodi:linespacing="125.00000%"
         id="text2054"
         y="-503.01538"
         x="552.49762"
         style="font-size:20.000000px;font-style:normal;font-variant:normal;font-weight:normal;font-stretch:normal;text-align:start;line-height:125.00000%;writing-mode:lr-tb;text-anchor:start;fill:#000000;fill-opacity:1.0000000;stroke:none;stroke-width:1.0000000pt;stroke-linecap:butt;stroke-linejoin:miter;stroke-opacity:1.0000000;font-family:Bitstream Vera Sans"
         xml:space="preserve"><tspan
           y="-503.01538"
           x="552.49762"
           id="tspan2056"
           sodipodi:role="line">Crowell</tspan></text>
    </g>
    <g
       id="g2264"
       transform="matrix(0.000000,0.883862,-0.883862,0.000000,1402.584,351.5336)">
      <g
         id="g1614"
         transform="translate(561.7217,679.3318)">
        <path
           id="path1616"
           style="fill:#dcdcdc"
           d="M 8.3920000,4.4000000 L 8.1620000,4.5150000 L 8.1620000,18.852000 L 8.3920000,18.896000 C 12.395000,18.896000 15.640000,15.651000 15.640000,11.648000 C 15.640000,7.6450000 12.395000,4.4000000 8.3920000,4.4000000 z " />
        <radialGradient
           gradientTransform="matrix(1.170000,0.000000,0.000000,1.170000,296.5480,241.3381)"
           gradientUnits="userSpaceOnUse"
           id="radialGradient1875"
           fy="-199.52000"
           fx="-244.63161"
           r="1.0623000"
           cy="-199.52000"
           cx="-244.63161">
          <stop
             id="stop1877"
             offset="0.0000000"
             style="stop-color:#c5c5c5;stop-opacity:1.0000000" />
          <stop
             id="stop1879"
             offset="0.37799999"
             style="stop-color:#c7c7c7;stop-opacity:1.0000000" />
          <stop
             id="stop1881"
             offset="0.64969999"
             style="stop-color:#cdcdcd;stop-opacity:1.0000000" />
          <stop
             id="stop1883"
             offset="0.88749999"
             style="stop-color:#d6d6d6;stop-opacity:1.0000000" />
          <stop
             id="stop1885"
             offset="1.0000000"
             style="stop-color:#dcdcdc;stop-opacity:1.0000000" />
          <midPointStop
             offset="0"
             style="stop-color:#C5C5C5"
             id="midPointStop1887" />
          <midPointStop
             offset="0.77"
             style="stop-color:#C5C5C5"
             id="midPointStop1889" />
          <midPointStop
             offset="1"
             style="stop-color:#DCDCDC"
             id="midPointStop1891" />
        </radialGradient>
        <ellipse
           sodipodi:ry="1.3099999"
           sodipodi:rx="1.1720001"
           sodipodi:cy="7.8779998"
           sodipodi:cx="10.308000"
           id="ellipse1635"
           style="fill:url(#radialGradient3028)"
           ry="1.3099999"
           rx="1.1720001"
           cy="7.8779998"
           cx="10.308000" />
        <radialGradient
           gradientTransform="matrix(1.170000,0.000000,0.000000,1.170000,296.7023,240.0114)"
           gradientUnits="userSpaceOnUse"
           id="radialGradient1894"
           fy="-197.35350"
           fx="-243.08980"
           r="1.3850000"
           cy="-197.35350"
           cx="-243.08980">
          <stop
             id="stop1896"
             offset="0.0000000"
             style="stop-color:#c5c5c5;stop-opacity:1.0000000" />
          <stop
             id="stop1898"
             offset="0.37799999"
             style="stop-color:#c7c7c7;stop-opacity:1.0000000" />
          <stop
             id="stop1900"
             offset="0.64969999"
             style="stop-color:#cdcdcd;stop-opacity:1.0000000" />
          <stop
             id="stop1902"
             offset="0.88749999"
             style="stop-color:#d6d6d6;stop-opacity:1.0000000" />
          <stop
             id="stop1904"
             offset="1.0000000"
             style="stop-color:#dcdcdc;stop-opacity:1.0000000" />
          <midPointStop
             offset="0"
             style="stop-color:#C5C5C5"
             id="midPointStop1906" />
          <midPointStop
             offset="0.77"
             style="stop-color:#C5C5C5"
             id="midPointStop1908" />
          <midPointStop
             offset="1"
             style="stop-color:#DCDCDC"
             id="midPointStop1910" />
        </radialGradient>
        <ellipse
           sodipodi:ry="1.5860000"
           sodipodi:rx="1.6540000"
           sodipodi:cy="9.0869999"
           sodipodi:cx="12.267000"
           id="ellipse1654"
           style="fill:url(#radialGradient3030)"
           ry="1.5860000"
           rx="1.6540000"
           cy="9.0869999"
           cx="12.267000" />
        <radialGradient
           gradientTransform="matrix(1.200000,0.000000,0.000000,1.200000,303.2118,245.1738)"
           gradientUnits="userSpaceOnUse"
           id="radialGradient1913"
           fy="-195.47850"
           fx="-240.88161"
           r="0.85490000"
           cy="-195.47850"
           cx="-240.88161">
          <stop
             id="stop1915"
             offset="0.0000000"
             style="stop-color:#c5c5c5;stop-opacity:1.0000000" />
          <stop
             id="stop1917"
             offset="0.37799999"
             style="stop-color:#c7c7c7;stop-opacity:1.0000000" />
          <stop
             id="stop1919"
             offset="0.64969999"
             style="stop-color:#cdcdcd;stop-opacity:1.0000000" />
          <stop
             id="stop1921"
             offset="0.88749999"
             style="stop-color:#d6d6d6;stop-opacity:1.0000000" />
          <stop
             id="stop1923"
             offset="1.0000000"
             style="stop-color:#dcdcdc;stop-opacity:1.0000000" />
          <midPointStop
             offset="0"
             style="stop-color:#C5C5C5"
             id="midPointStop1925" />
          <midPointStop
             offset="0.77"
             style="stop-color:#C5C5C5"
             id="midPointStop1927" />
          <midPointStop
             offset="1"
             style="stop-color:#DCDCDC"
             id="midPointStop1929" />
        </radialGradient>
        <ellipse
           sodipodi:ry="0.99000001"
           sodipodi:rx="1.0610000"
           sodipodi:cy="10.587000"
           sodipodi:cx="14.142000"
           id="ellipse1673"
           style="fill:url(#radialGradient3032)"
           ry="0.99000001"
           rx="1.0610000"
           cy="10.587000"
           cx="14.142000" />
        <radialGradient
           gradientTransform="matrix(0.410400,1.127600,-1.127600,0.410400,-110.7035,360.6915)"
           gradientUnits="userSpaceOnUse"
           id="radialGradient1932"
           fy="-198.31200"
           fx="-240.50661"
           r="0.67180002"
           cy="-198.31200"
           cx="-240.50661">
          <stop
             id="stop1934"
             offset="0.0000000"
             style="stop-color:#c5c5c5;stop-opacity:1.0000000" />
          <stop
             id="stop1936"
             offset="0.37799999"
             style="stop-color:#c7c7c7;stop-opacity:1.0000000" />
          <stop
             id="stop1938"
             offset="0.64969999"
             style="stop-color:#cdcdcd;stop-opacity:1.0000000" />
          <stop
             id="stop1940"
             offset="0.88749999"
             style="stop-color:#d6d6d6;stop-opacity:1.0000000" />
          <stop
             id="stop1942"
             offset="1.0000000"
             style="stop-color:#dcdcdc;stop-opacity:1.0000000" />
          <midPointStop
             offset="0"
             style="stop-color:#C5C5C5"
             id="midPointStop1944" />
          <midPointStop
             offset="0.77"
             style="stop-color:#C5C5C5"
             id="midPointStop1946" />
          <midPointStop
             offset="1"
             style="stop-color:#DCDCDC"
             id="midPointStop1948" />
        </radialGradient>
        <path
           id="path1692"
           style="fill:url(#radialGradient3034)"
           d="M 13.735000,8.4880000 C 13.922000,9.0020000 14.312000,9.3320000 14.605000,9.2250000 C 14.898000,9.1180000 14.985000,8.6150000 14.798000,8.1010000 C 14.611000,7.5870000 14.221000,7.2570000 13.928000,7.3640000 C 13.635000,7.4710000 13.548000,7.9750000 13.735000,8.4880000 z " />
        <radialGradient
           gradientTransform="matrix(1.300000,0.000000,0.000000,1.300000,350.7916,264.4546)"
           gradientUnits="userSpaceOnUse"
           id="radialGradient1951"
           fy="-194.81200"
           fx="-260.38159"
           r="0.32539999"
           cy="-194.81200"
           cx="-260.38159">
          <stop
             id="stop1953"
             offset="0.0000000"
             style="stop-color:#c5c5c5;stop-opacity:1.0000000" />
          <stop
             id="stop1955"
             offset="0.37799999"
             style="stop-color:#c7c7c7;stop-opacity:1.0000000" />
          <stop
             id="stop1957"
             offset="0.64969999"
             style="stop-color:#cdcdcd;stop-opacity:1.0000000" />
          <stop
             id="stop1959"
             offset="0.88749999"
             style="stop-color:#d6d6d6;stop-opacity:1.0000000" />
          <stop
             id="stop1961"
             offset="1.0000000"
             style="stop-color:#dcdcdc;stop-opacity:1.0000000" />
          <midPointStop
             offset="0"
             style="stop-color:#C5C5C5"
             id="midPointStop1963" />
          <midPointStop
             offset="0.77"
             style="stop-color:#C5C5C5"
             id="midPointStop1965" />
          <midPointStop
             offset="1"
             style="stop-color:#DCDCDC"
             id="midPointStop1967" />
        </radialGradient>
        <ellipse
           sodipodi:ry="0.46000001"
           sodipodi:rx="0.38299999"
           sodipodi:cy="11.212000"
           sodipodi:cx="12.308000"
           id="ellipse1711"
           style="fill:url(#radialGradient3036)"
           ry="0.46000001"
           rx="0.38299999"
           cy="11.212000"
           cx="12.308000" />
        <radialGradient
           gradientTransform="matrix(1.400000,0.000000,0.000000,1.400000,378.1003,284.7563)"
           gradientUnits="userSpaceOnUse"
           id="radialGradient1970"
           fy="-196.77000"
           fx="-263.46481"
           r="0.70950001"
           cy="-196.77000"
           cx="-263.46481">
          <stop
             id="stop1972"
             offset="0.0000000"
             style="stop-color:#c5c5c5;stop-opacity:1.0000000" />
          <stop
             id="stop1974"
             offset="0.37799999"
             style="stop-color:#c7c7c7;stop-opacity:1.0000000" />
          <stop
             id="stop1976"
             offset="0.64969999"
             style="stop-color:#cdcdcd;stop-opacity:1.0000000" />
          <stop
             id="stop1978"
             offset="0.88749999"
             style="stop-color:#d6d6d6;stop-opacity:1.0000000" />
          <stop
             id="stop1980"
             offset="1.0000000"
             style="stop-color:#dcdcdc;stop-opacity:1.0000000" />
          <midPointStop
             offset="0"
             style="stop-color:#C5C5C5"
             id="midPointStop1982" />
          <midPointStop
             offset="0.77"
             style="stop-color:#C5C5C5"
             id="midPointStop1984" />
          <midPointStop
             offset="1"
             style="stop-color:#DCDCDC"
             id="midPointStop1986" />
        </radialGradient>
        <ellipse
           sodipodi:ry="0.90700001"
           sodipodi:rx="1.0720000"
           sodipodi:cy="9.2530003"
           sodipodi:cx="9.2250004"
           id="ellipse1730"
           style="fill:url(#radialGradient3038)"
           ry="0.90700001"
           rx="1.0720000"
           cy="9.2530003"
           cx="9.2250004" />
        <radialGradient
           gradientTransform="translate(272.6895,206.0234)"
           gradientUnits="userSpaceOnUse"
           id="radialGradient1989"
           fy="-195.72850"
           fx="-264.13129"
           r="0.56059998"
           cy="-195.72850"
           cx="-264.13129">
          <stop
             id="stop1991"
             offset="0.0000000"
             style="stop-color:#c5c5c5;stop-opacity:1.0000000" />
          <stop
             id="stop1993"
             offset="0.37799999"
             style="stop-color:#c7c7c7;stop-opacity:1.0000000" />
          <stop
             id="stop1995"
             offset="0.64969999"
             style="stop-color:#cdcdcd;stop-opacity:1.0000000" />
          <stop
             id="stop1997"
             offset="0.88749999"
             style="stop-color:#d6d6d6;stop-opacity:1.0000000" />
          <stop
             id="stop1999"
             offset="1.0000000"
             style="stop-color:#dcdcdc;stop-opacity:1.0000000" />
          <midPointStop
             offset="0"
             style="stop-color:#C5C5C5"
             id="midPointStop2001" />
          <midPointStop
             offset="0.77"
             style="stop-color:#C5C5C5"
             id="midPointStop2003" />
          <midPointStop
             offset="1"
             style="stop-color:#DCDCDC"
             id="midPointStop2005" />
        </radialGradient>
        <ellipse
           sodipodi:ry="0.58899999"
           sodipodi:rx="0.52999997"
           sodipodi:cy="10.295000"
           sodipodi:cx="8.5579996"
           id="ellipse1749"
           style="fill:url(#radialGradient3040)"
           ry="0.58899999"
           rx="0.52999997"
           cy="10.295000"
           cx="8.5579996" />
        <radialGradient
           gradientTransform="translate(271.1895,203.2734)"
           gradientUnits="userSpaceOnUse"
           id="radialGradient2008"
           fy="-194.56200"
           fx="-264.67310"
           r="5.9628000"
           cy="-194.56200"
           cx="-264.67310">
          <stop
             id="stop2010"
             offset="0.0000000"
             style="stop-color:#ffffff;stop-opacity:1.0000000" />
          <stop
             id="stop2012"
             offset="0.0041999999"
             style="stop-color:#fefefe;stop-opacity:1.0000000" />
          <stop
             id="stop2014"
             offset="0.11530000"
             style="stop-color:#ededed;stop-opacity:1.0000000" />
          <stop
             id="stop2016"
             offset="0.23500000"
             style="stop-color:#dfdfdf;stop-opacity:1.0000000" />
          <stop
             id="stop2018"
             offset="0.36730000"
             style="stop-color:#d3d3d3;stop-opacity:1.0000000" />
          <stop
             id="stop2020"
             offset="0.51690000"
             style="stop-color:#cacaca;stop-opacity:1.0000000" />
          <stop
             id="stop2022"
             offset="0.69830000"
             style="stop-color:#c5c5c5;stop-opacity:1.0000000" />
          <stop
             id="stop2024"
             offset="1.0000000"
             style="stop-color:#c3c3c3;stop-opacity:1.0000000" />
          <midPointStop
             offset="0"
             style="stop-color:#FFFFFF"
             id="midPointStop2026" />
          <midPointStop
             offset="0.2"
             style="stop-color:#FFFFFF"
             id="midPointStop2028" />
          <midPointStop
             offset="1"
             style="stop-color:#C3C3C3"
             id="midPointStop2030" />
        </radialGradient>
        <path
           id="path1774"
           style="fill:url(#radialGradient3042)"
           d="M 8.1730000,4.3690000 L 7.3790000,4.7650000 C 7.3410000,4.7290000 7.2990000,4.6960000 7.2430000,4.6890000 C 6.5050000,4.6620000 5.9030000,4.2200000 5.1730000,4.0760000 C 3.9890000,3.8420000 2.7510000,4.1620000 1.8720000,4.9750000 C 1.2000000,5.5960000 1.0480000,6.5210000 0.66500000,7.3300000 C 0.32900000,8.0330000 -0.0070000000,8.7600000 0.013000000,9.5330000 C 0.036000000,10.576000 0.21200000,11.631000 0.69300000,12.588000 C 0.93100000,13.072000 1.2670000,13.490000 1.5450000,13.947000 C 1.7830000,15.111000 2.2360000,16.193000 2.6620000,17.306000 C 2.8850000,17.888000 3.3810000,18.322000 3.9430000,18.556000 C 4.3410000,18.720000 4.7590000,18.482000 5.1730000,18.400000 C 5.9270000,18.255000 6.5710000,18.627000 7.2750000,18.830000 C 7.4510000,18.881000 7.6270000,18.877000 7.8020000,18.877000 C 7.9190000,18.877000 8.0040000,18.788000 8.0310000,18.679000 L 8.1740000,18.706000 L 8.1740000,4.3690000 L 8.1730000,4.3690000 z " />
        <path
           id="path1776"
           d="M 7.2670000,3.8990000 C 6.7820000,3.9340000 6.1840000,3.9070000 5.8330000,4.2900000 C 5.7430000,4.3950000 5.7500000,4.5510000 5.8560000,4.6450000 C 5.9580000,4.7350000 6.1140000,4.7280000 6.2080000,4.6220000 C 6.4930000,4.4120000 6.9070000,4.4040000 7.2670000,4.3990000 C 7.4030000,4.3990000 7.5170000,4.2860000 7.5170000,4.1490000 C 7.5170000,4.0120000 7.4030000,3.8990000 7.2670000,3.8990000 L 7.2670000,3.8990000 z " />
        <path
           id="path1778"
           d="M 7.2310000,4.7740000 C 6.4930000,4.7470000 5.8920000,4.3050000 5.1610000,4.1610000 C 3.9770000,3.9260000 2.7390000,4.2470000 1.8600000,5.0590000 C 1.1880000,5.6800000 1.0360000,6.6060000 0.65300000,7.4150000 C 0.31700000,8.1180000 -0.019000000,8.8440000 0.0000000,9.6180000 C 0.024000000,10.661000 0.19900000,11.716000 0.68000000,12.673000 C 0.91800000,13.157000 1.2540000,13.575000 1.5320000,14.032000 C 1.7710000,15.196000 2.2230000,16.278000 2.6500000,17.391000 C 2.8720000,17.974000 3.3680000,18.407000 3.9310000,18.641000 C 4.3300000,18.805000 4.7470000,18.567000 5.1610000,18.485000 C 5.9150000,18.340000 6.5590000,18.711000 7.2630000,18.915000 C 7.4390000,18.966000 7.6150000,18.961000 7.7900000,18.961000 C 7.9270000,18.961000 8.0400000,18.848000 8.0400000,18.711000 C 8.0400000,18.574000 7.9270000,18.461000 7.7900000,18.461000 C 7.6850000,18.461000 7.5800000,18.477000 7.4810000,18.453000 C 6.6800000,18.250000 5.9650000,17.828000 5.1180000,17.988000 C 4.7780000,18.054000 4.4730000,18.250000 4.1530000,18.172000 C 3.7390000,18.074000 3.3960000,17.754000 3.2000000,17.371000 C 2.9150000,16.805000 2.7620000,16.207000 2.5120000,15.629000 C 2.2620000,15.055000 2.2190000,14.430000 1.9770000,13.860000 C 1.7500000,13.336000 1.3330000,12.919000 1.1100000,12.403000 C 0.66500000,11.367000 0.33300000,10.242000 0.57900000,9.0820000 C 0.82900000,7.9150000 1.4260000,6.9730000 1.8480000,5.8980000 C 1.9140000,5.7270000 2.0120000,5.5660000 2.1490000,5.4450000 C 2.9070000,4.7700000 3.9420000,4.5080000 4.9220000,4.6330000 C 5.7080000,4.7310000 6.3670000,5.2580000 7.1760000,5.2740000 C 7.3130000,5.2860000 7.4380000,5.1880000 7.4540000,5.0510000 C 7.4650000,4.9150000 7.3680000,4.7900000 7.2310000,4.7740000 L 7.2310000,4.7740000 z " />
        <path
           id="path1780"
           style="fill:none;stroke:#000000;stroke-width:0.60000002"
           d="M 8.3920000,18.834000 C 12.394000,18.834000 15.640000,15.589000 15.640000,11.586000 C 15.640000,7.5840000 12.395000,4.3380000 8.3920000,4.3380000" />
        <line
           id="line1782"
           y2="17.961000"
           x2="8.1420002"
           y1="5.2110000"
           x1="8.1420002"
           style="fill:none;stroke:#000000;stroke-width:0.60000002" />
        <path
           id="path1784"
           style="fill:none;stroke:#000000;stroke-width:0.50000000"
           d="M 7.8920000,4.6490000 C 8.0170000,3.8490000 8.3410000,3.0790000 8.6960000,2.3410000 C 8.8440000,2.0400000 8.9580000,1.7280000 9.0080000,1.3950000 L 9.0400000,1.2700000 C 9.0900000,1.1880000 9.0900000,1.0830000 9.0400000,1.0000000 L 9.0040000,0.95000000 C 8.9850000,0.91500000 8.9690000,0.88300000 8.9500000,0.84900000 L 8.8210000,0.66900000 L 8.7750000,1.0590000 L 8.7750000,1.0440000 C 8.8140000,1.0360000 8.8410000,0.96100000 8.8920000,1.0240000 C 9.0280000,1.0040000 9.1220000,0.87600000 9.1020000,0.73900000 C 9.0830000,0.60300000 8.9540000,0.50900000 8.8170000,0.52900000 C 8.7740000,0.53600000 8.7350000,0.54400000 8.6920000,0.55100000 L 8.5120000,0.63300000 C 8.4110000,0.69600000 8.3680000,0.82500000 8.4110000,0.93400000 L 8.5170000,1.0990000 L 8.5210000,1.1030000 L 8.6180000,1.2670000 L 8.5790000,1.1250000 L 8.5170000,1.3170000 C 8.5170000,1.3090000 8.5170000,1.3050000 8.5170000,1.2980000 C 8.4930000,1.4230000 8.4770000,1.5480000 8.4340000,1.6650000 C 8.0470000,2.6450000 7.4960000,3.5940000 7.3920000,4.6490000 C 7.3920000,4.7860000 7.5050000,4.8990000 7.6420000,4.8990000 C 7.7780000,4.8990000 7.8920000,4.7860000 7.8920000,4.6490000 L 7.8920000,4.6490000 z " />
      </g>
      <g
         id="g1786"
         transform="translate(455.0689,679.3318)">
        <text
           id="text1788"
           transform="translate(22.66020,15.27150)">
          <tspan
             id="tspan1790"
             style="font-size:9.3500004px;font-family:Bitstream Vera Sans"
             y="0"
             x="0">Light and Matter</tspan>
        </text>
      </g>
      <g
         id="g2258"
         transform="translate(589.4481,682.3867)">
        <text
           id="text2260"
           y="11.423969"
           x="-8.1200485">
          <tspan
             id="tspan2262"
             style="font-size:9.3500004px;font-family:Bitstream Vera Sans"
             y="11.423969"
             x="-8.1200485">www.lightandmatter.com</tspan>
        </text>
      </g>
    </g>
    <text
       xml:space="preserve"
       style="font-size:12.000000px;font-style:normal;font-variant:normal;font-weight:normal;font-stretch:normal;text-align:start;line-height:125.00000%;writing-mode:lr-tb;text-anchor:start;fill:#000000;fill-opacity:1.0000000;stroke:none;stroke-width:1.0000000pt;stroke-linecap:butt;stroke-linejoin:miter;stroke-opacity:1.0000000;font-family:Bitstream Vera Sans"
       x="343.94397"
       y="390.68759"
       id="text2058"
       sodipodi:linespacing="125.00000%"><tspan
         sodipodi:role="line"
         x="343.94397"
         y="390.68759"
         id="tspan2062">This book can be downloaded</tspan></text>
    <text
       xml:space="preserve"
       style="font-size:12.000000px;font-style:normal;font-variant:normal;font-weight:normal;font-stretch:normal;text-align:start;line-height:125.00000%;writing-mode:lr-tb;text-anchor:start;fill:#000000;fill-opacity:1.0000000;stroke:none;stroke-width:1.0000000pt;stroke-linecap:butt;stroke-linejoin:miter;stroke-opacity:1.0000000;font-family:Bitstream Vera Sans"
       x="343.94397"
       y="415.41354"
       id="text2064"
       sodipodi:linespacing="125.00000%"><tspan
         sodipodi:role="line"
         id="tspan2066"
         x="343.94397"
         y="415.41354">for free, or bought in print, at</tspan></text>
    <text
       xml:space="preserve"
       style="font-size:12.000000px;font-style:normal;font-variant:normal;font-weight:normal;font-stretch:normal;text-align:start;line-height:125.00000%;writing-mode:lr-tb;text-anchor:start;fill:#000000;fill-opacity:1.0000000;stroke:none;stroke-width:1.0000000pt;stroke-linecap:butt;stroke-linejoin:miter;stroke-opacity:1.0000000;font-family:Bitstream Vera Sans"
       x="343.98798"
       y="440.1395"
       id="text2068"
       sodipodi:linespacing="125.00000%"><tspan
         sodipodi:role="line"
         id="tspan2070"
         x="343.98798"
         y="440.13950">www.lightandmatter.com/cp.</tspan></text>
  </g>
</svg>
