<?xml version="1.0" encoding="UTF-8" standalone="no"?>
<!-- Created with Inkscape (http://www.inkscape.org/) -->
<svg
   xmlns:dc="http://purl.org/dc/elements/1.1/"
   xmlns:cc="http://web.resource.org/cc/"
   xmlns:rdf="http://www.w3.org/1999/02/22-rdf-syntax-ns#"
   xmlns:svg="http://www.w3.org/2000/svg"
   xmlns="http://www.w3.org/2000/svg"
   xmlns:xlink="http://www.w3.org/1999/xlink"
   xmlns:sodipodi="http://inkscape.sourceforge.net/DTD/sodipodi-0.dtd"
   xmlns:inkscape="http://www.inkscape.org/namespaces/inkscape"
   width="744.09448819"
   height="1052.3622047"
   id="svg1547"
   sodipodi:version="0.32"
   inkscape:version="0.42.2"
   sodipodi:docbase="/home/bcrowell/Documents/writing/lm/trunk/0sn/ch05/figs"
   sodipodi:docname="turbine.svg">
  <defs
     id="defs1549">
    <linearGradient
       id="XMLID_6_"
       gradientUnits="userSpaceOnUse"
       x1="73.3335"
       y1="73.25"
       x2="81.3335"
       y2="73.25"
       gradientTransform="translate(-3.505600,0.818800)">
			<stop
   offset="0"
   style="stop-color:#C5C5C5"
   id="stop152" />

			<stop
   offset="0.16"
   style="stop-color:#FFFFFF"
   id="stop154" />

			<stop
   offset="0.34"
   style="stop-color:#CECECE"
   id="stop156" />

			<stop
   offset="1"
   style="stop-color:#A7A7A7"
   id="stop158" />

			<midPointStop
   offset="0"
   style="stop-color:#C5C5C5"
   id="midPointStop160" />

			<midPointStop
   offset="0.5"
   style="stop-color:#C5C5C5"
   id="midPointStop162" />

			<midPointStop
   offset="0.16"
   style="stop-color:#FFFFFF"
   id="midPointStop164" />

			<midPointStop
   offset="0.5"
   style="stop-color:#FFFFFF"
   id="midPointStop166" />

			<midPointStop
   offset="0.34"
   style="stop-color:#CECECE"
   id="midPointStop168" />

			<midPointStop
   offset="0.5"
   style="stop-color:#CECECE"
   id="midPointStop170" />

			<midPointStop
   offset="1"
   style="stop-color:#A7A7A7"
   id="midPointStop172" />

		</linearGradient>
    <linearGradient
       id="XMLID_12_"
       gradientUnits="userSpaceOnUse"
       x1="115.5532"
       y1="211.6667"
       x2="129.1133"
       y2="211.6667"
       gradientTransform="translate(-47.95020,-145.6665)">
			<stop
   offset="0"
   style="stop-color:#C0C0C0"
   id="stop109" />

			<stop
   offset="0.32"
   style="stop-color:#F4F4F4"
   id="stop111" />

			<stop
   offset="1"
   style="stop-color:#A3A3A3"
   id="stop113" />

			<midPointStop
   offset="0"
   style="stop-color:#C0C0C0"
   id="midPointStop115" />

			<midPointStop
   offset="0.5"
   style="stop-color:#C0C0C0"
   id="midPointStop117" />

			<midPointStop
   offset="0.32"
   style="stop-color:#F4F4F4"
   id="midPointStop119" />

			<midPointStop
   offset="0.5"
   style="stop-color:#F4F4F4"
   id="midPointStop121" />

			<midPointStop
   offset="1"
   style="stop-color:#A3A3A3"
   id="midPointStop123" />

		</linearGradient>
    <linearGradient
       id="XMLID_11_"
       gradientUnits="userSpaceOnUse"
       x1="104.3408"
       y1="62.6667"
       x2="104.3408"
       y2="68"
       gradientTransform="matrix(1.100000,0.000000,0.000000,1.000000,-6.205400,0.000000)">
			<stop
   offset="0"
   style="stop-color:#C5C5C5"
   id="stop72" />

			<stop
   offset="0.16"
   style="stop-color:#FFFFFF"
   id="stop74" />

			<stop
   offset="0.34"
   style="stop-color:#CECECE"
   id="stop76" />

			<stop
   offset="1"
   style="stop-color:#A7A7A7"
   id="stop78" />

			<midPointStop
   offset="0"
   style="stop-color:#C5C5C5"
   id="midPointStop80" />

			<midPointStop
   offset="0.5"
   style="stop-color:#C5C5C5"
   id="midPointStop82" />

			<midPointStop
   offset="0.16"
   style="stop-color:#FFFFFF"
   id="midPointStop84" />

			<midPointStop
   offset="0.5"
   style="stop-color:#FFFFFF"
   id="midPointStop86" />

			<midPointStop
   offset="0.34"
   style="stop-color:#CECECE"
   id="midPointStop88" />

			<midPointStop
   offset="0.5"
   style="stop-color:#CECECE"
   id="midPointStop90" />

			<midPointStop
   offset="1"
   style="stop-color:#A7A7A7"
   id="midPointStop92" />

		</linearGradient>
    <linearGradient
       id="XMLID_10_"
       gradientUnits="userSpaceOnUse"
       x1="41.2129"
       y1="100.6667"
       x2="41.2129"
       y2="52.6667"
       gradientTransform="translate(0.000000,5.333500)">
			<stop
   offset="0"
   style="stop-color:#FFFFFF"
   id="stop59" />

			<stop
   offset="1"
   style="stop-color:#000000"
   id="stop61" />

			<midPointStop
   offset="0"
   style="stop-color:#FFFFFF"
   id="midPointStop63" />

			<midPointStop
   offset="0.5"
   style="stop-color:#FFFFFF"
   id="midPointStop65" />

			<midPointStop
   offset="1"
   style="stop-color:#000000"
   id="midPointStop67" />

		</linearGradient>
    <linearGradient
       id="XMLID_9_"
       gradientUnits="userSpaceOnUse"
       x1="106.0581"
       y1="52.6667"
       x2="106.0581"
       y2="101.3335"
       gradientTransform="translate(0.000000,5.333500)">
			<stop
   offset="0"
   style="stop-color:#FFFFFF"
   id="stop46" />

			<stop
   offset="1"
   style="stop-color:#000000"
   id="stop48" />

			<midPointStop
   offset="0"
   style="stop-color:#FFFFFF"
   id="midPointStop50" />

			<midPointStop
   offset="0.5"
   style="stop-color:#FFFFFF"
   id="midPointStop52" />

			<midPointStop
   offset="1"
   style="stop-color:#000000"
   id="midPointStop54" />

		</linearGradient>
    <linearGradient
       id="XMLID_8_"
       gradientUnits="userSpaceOnUse"
       x1="73.3335"
       y1="75.9167"
       x2="81.3335"
       y2="75.9167"
       gradientTransform="translate(-3.968800,-0.541500)">
			<stop
   offset="0"
   style="stop-color:#C5C5C5"
   id="stop21" />

			<stop
   offset="0.16"
   style="stop-color:#FFFFFF"
   id="stop23" />

			<stop
   offset="0.34"
   style="stop-color:#CECECE"
   id="stop25" />

			<stop
   offset="1"
   style="stop-color:#A7A7A7"
   id="stop27" />

			<midPointStop
   offset="0"
   style="stop-color:#C5C5C5"
   id="midPointStop29" />

			<midPointStop
   offset="0.5"
   style="stop-color:#C5C5C5"
   id="midPointStop31" />

			<midPointStop
   offset="0.16"
   style="stop-color:#FFFFFF"
   id="midPointStop33" />

			<midPointStop
   offset="0.5"
   style="stop-color:#FFFFFF"
   id="midPointStop35" />

			<midPointStop
   offset="0.34"
   style="stop-color:#CECECE"
   id="midPointStop37" />

			<midPointStop
   offset="0.5"
   style="stop-color:#CECECE"
   id="midPointStop39" />

			<midPointStop
   offset="1"
   style="stop-color:#A7A7A7"
   id="midPointStop41" />

		</linearGradient>
    <linearGradient
       id="XMLID_7_"
       gradientUnits="userSpaceOnUse"
       x1="73.7007"
       y1="160.6667"
       x2="73.7007"
       y2="0.6667">
			<stop
   offset="0"
   style="stop-color:#F2F2F2"
   id="stop8" />

			<stop
   offset="1"
   style="stop-color:#B4B4B4"
   id="stop10" />

			<midPointStop
   offset="0"
   style="stop-color:#F2F2F2"
   id="midPointStop12" />

			<midPointStop
   offset="0.5"
   style="stop-color:#F2F2F2"
   id="midPointStop14" />

			<midPointStop
   offset="1"
   style="stop-color:#B4B4B4"
   id="midPointStop16" />

		</linearGradient>
    <linearGradient
       inkscape:collect="always"
       xlink:href="#XMLID_7_"
       id="linearGradient1808"
       gradientUnits="userSpaceOnUse"
       x1="73.7007"
       y1="160.6667"
       x2="73.7007"
       y2="0.6667" />
    <linearGradient
       inkscape:collect="always"
       xlink:href="#XMLID_8_"
       id="linearGradient1810"
       gradientUnits="userSpaceOnUse"
       gradientTransform="translate(-3.968800,-0.541500)"
       x1="73.3335"
       y1="75.9167"
       x2="81.3335"
       y2="75.9167" />
    <linearGradient
       inkscape:collect="always"
       xlink:href="#XMLID_9_"
       id="linearGradient1812"
       gradientUnits="userSpaceOnUse"
       gradientTransform="translate(0.000000,5.333500)"
       x1="106.0581"
       y1="52.6667"
       x2="106.0581"
       y2="101.3335" />
    <linearGradient
       inkscape:collect="always"
       xlink:href="#XMLID_10_"
       id="linearGradient1814"
       gradientUnits="userSpaceOnUse"
       gradientTransform="translate(0.000000,5.333500)"
       x1="41.2129"
       y1="100.6667"
       x2="41.2129"
       y2="52.6667" />
    <linearGradient
       inkscape:collect="always"
       xlink:href="#XMLID_7_"
       id="linearGradient1816"
       gradientUnits="userSpaceOnUse"
       x1="73.7007"
       y1="160.6667"
       x2="73.7007"
       y2="0.6667" />
    <linearGradient
       inkscape:collect="always"
       xlink:href="#XMLID_8_"
       id="linearGradient1818"
       gradientUnits="userSpaceOnUse"
       gradientTransform="translate(-3.968800,-0.541500)"
       x1="73.3335"
       y1="75.9167"
       x2="81.3335"
       y2="75.9167" />
    <linearGradient
       inkscape:collect="always"
       xlink:href="#XMLID_9_"
       id="linearGradient1820"
       gradientUnits="userSpaceOnUse"
       gradientTransform="translate(0.000000,5.333500)"
       x1="106.0581"
       y1="52.6667"
       x2="106.0581"
       y2="101.3335" />
    <linearGradient
       inkscape:collect="always"
       xlink:href="#XMLID_10_"
       id="linearGradient1822"
       gradientUnits="userSpaceOnUse"
       gradientTransform="translate(0.000000,5.333500)"
       x1="41.2129"
       y1="100.6667"
       x2="41.2129"
       y2="52.6667" />
  </defs>
  <sodipodi:namedview
     id="base"
     pagecolor="#ffffff"
     bordercolor="#666666"
     borderopacity="1.0"
     inkscape:pageopacity="0.0"
     inkscape:pageshadow="2"
     inkscape:zoom="0.96133333"
     inkscape:cx="298.57143"
     inkscape:cy="607.14286"
     inkscape:document-units="px"
     inkscape:current-layer="layer1"
     inkscape:window-width="712"
     inkscape:window-height="510"
     inkscape:window-x="242"
     inkscape:window-y="242" />
  <metadata
     id="metadata1552">
    <rdf:RDF>
      <cc:Work
         rdf:about="">
        <dc:format>image/svg+xml</dc:format>
        <dc:type
           rdf:resource="http://purl.org/dc/dcmitype/StillImage" />
      </cc:Work>
    </rdf:RDF>
  </metadata>
  <g
     inkscape:label="Layer 1"
     inkscape:groupmode="layer"
     id="layer1">
    <g
       transform="translate(74.87089,337.2890)"
       style="overflow:visible"
       id="Layer_1">
		<linearGradient
   id="linearGradient1607"
   gradientUnits="userSpaceOnUse"
   x1="73.700699"
   y1="160.66670"
   x2="73.700699"
   y2="0.66670001">
			<stop
   offset="0"
   style="stop-color:#F2F2F2"
   id="stop1609" />

			<stop
   offset="1"
   style="stop-color:#B4B4B4"
   id="stop1611" />

			<midPointStop
   offset="0"
   style="stop-color:#F2F2F2"
   id="midPointStop1613" />

			<midPointStop
   offset="0.5"
   style="stop-color:#F2F2F2"
   id="midPointStop1615" />

			<midPointStop
   offset="1"
   style="stop-color:#B4B4B4"
   id="midPointStop1617" />

		</linearGradient>

		<rect
   style="fill:url(#linearGradient1816)"
   width="147.40100"
   height="161.57500"
   id="rect18"
   x="0.0000000"
   y="0.0000000" />
 
		
			<linearGradient
   id="linearGradient1620"
   gradientUnits="userSpaceOnUse"
   x1="73.333504"
   y1="75.916702"
   x2="81.333504"
   y2="75.916702"
   gradientTransform="translate(-3.968800,-0.541500)">
			<stop
   offset="0"
   style="stop-color:#C5C5C5"
   id="stop1622" />

			<stop
   offset="0.16"
   style="stop-color:#FFFFFF"
   id="stop1624" />

			<stop
   offset="0.34"
   style="stop-color:#CECECE"
   id="stop1626" />

			<stop
   offset="1"
   style="stop-color:#A7A7A7"
   id="stop1628" />

			<midPointStop
   offset="0"
   style="stop-color:#C5C5C5"
   id="midPointStop1630" />

			<midPointStop
   offset="0.5"
   style="stop-color:#C5C5C5"
   id="midPointStop1632" />

			<midPointStop
   offset="0.16"
   style="stop-color:#FFFFFF"
   id="midPointStop1634" />

			<midPointStop
   offset="0.5"
   style="stop-color:#FFFFFF"
   id="midPointStop1636" />

			<midPointStop
   offset="0.34"
   style="stop-color:#CECECE"
   id="midPointStop1638" />

			<midPointStop
   offset="0.5"
   style="stop-color:#CECECE"
   id="midPointStop1640" />

			<midPointStop
   offset="1"
   style="stop-color:#A7A7A7"
   id="midPointStop1642" />

		</linearGradient>

		<rect
   x="69.302002"
   y="62.792000"
   style="fill:url(#linearGradient1818);stroke:#000000;stroke-width:0.50000000"
   width="8.7290001"
   height="25.167000"
   id="rect43" />
 
		
			<linearGradient
   id="linearGradient1645"
   gradientUnits="userSpaceOnUse"
   x1="106.05810"
   y1="52.666698"
   x2="106.05810"
   y2="101.33350"
   gradientTransform="translate(0.000000,5.333500)">
			<stop
   offset="0"
   style="stop-color:#FFFFFF"
   id="stop1647" />

			<stop
   offset="1"
   style="stop-color:#000000"
   id="stop1649" />

			<midPointStop
   offset="0"
   style="stop-color:#FFFFFF"
   id="midPointStop1651" />

			<midPointStop
   offset="0.5"
   style="stop-color:#FFFFFF"
   id="midPointStop1653" />

			<midPointStop
   offset="1"
   style="stop-color:#000000"
   id="midPointStop1655" />

		</linearGradient>

		<path
   style="fill:url(#linearGradient1820);stroke:#000000;stroke-width:0.50000000"
   d="M 72.500000,99.000000 C 72.500000,99.000000 128.00000,111.00000 134.00000,106.50000 C 140.00000,102.00000 141.50000,82.500000 137.00000,79.500000 C 132.50000,76.500000 74.000000,88.500000 74.000000,88.500000 L 72.500000,99.000000 z "
   id="path56" />

		
			<linearGradient
   id="linearGradient1658"
   gradientUnits="userSpaceOnUse"
   x1="41.212898"
   y1="100.66670"
   x2="41.212898"
   y2="52.666698"
   gradientTransform="translate(0.000000,5.333500)">
			<stop
   offset="0"
   style="stop-color:#FFFFFF"
   id="stop1660" />

			<stop
   offset="1"
   style="stop-color:#000000"
   id="stop1662" />

			<midPointStop
   offset="0"
   style="stop-color:#FFFFFF"
   id="midPointStop1664" />

			<midPointStop
   offset="0.5"
   style="stop-color:#FFFFFF"
   id="midPointStop1666" />

			<midPointStop
   offset="1"
   style="stop-color:#000000"
   id="midPointStop1668" />

		</linearGradient>

		<path
   style="fill:url(#linearGradient1822);stroke:#000000;stroke-width:0.50000000"
   d="M 74.771000,99.000000 C 74.771000,99.000000 19.271000,111.00000 13.271000,106.50000 C 7.2710000,102.00000 5.7710000,82.500000 10.271000,79.500000 C 14.771000,76.500000 73.271000,88.500000 73.271000,88.500000 L 74.771000,99.000000 z "
   id="path69" />

		
			<linearGradient
   id="linearGradient1671"
   gradientUnits="userSpaceOnUse"
   x1="104.34080"
   y1="62.666698"
   x2="104.34080"
   y2="68.000000"
   gradientTransform="matrix(1.100000,0.000000,0.000000,1.000000,-6.205400,0.000000)">
			<stop
   offset="0"
   style="stop-color:#C5C5C5"
   id="stop1673" />

			<stop
   offset="0.16"
   style="stop-color:#FFFFFF"
   id="stop1675" />

			<stop
   offset="0.34"
   style="stop-color:#CECECE"
   id="stop1677" />

			<stop
   offset="1"
   style="stop-color:#A7A7A7"
   id="stop1679" />

			<midPointStop
   offset="0"
   style="stop-color:#C5C5C5"
   id="midPointStop1681" />

			<midPointStop
   offset="0.5"
   style="stop-color:#C5C5C5"
   id="midPointStop1683" />

			<midPointStop
   offset="0.16"
   style="stop-color:#FFFFFF"
   id="midPointStop1685" />

			<midPointStop
   offset="0.5"
   style="stop-color:#FFFFFF"
   id="midPointStop1687" />

			<midPointStop
   offset="0.34"
   style="stop-color:#CECECE"
   id="midPointStop1689" />

			<midPointStop
   offset="0.5"
   style="stop-color:#CECECE"
   id="midPointStop1691" />

			<midPointStop
   offset="1"
   style="stop-color:#A7A7A7"
   id="midPointStop1693" />

		</linearGradient>

		<rect
   x="70.052002"
   y="62.792000"
   style="fill:url(#XMLID_11_);stroke:#000000;stroke-width:0.50000000"
   width="77.035004"
   height="5.8750000"
   id="rect94" />
 
		<g
   id="g96">
			<text
   transform="translate(64.99800,141.1970)"
   id="text98">
  <tspan
     x="0"
     y="0"
     style="font-size:10.200000px;font-family:Bitstream Vera Sans"
     id="tspan100">hot</tspan>
</text>

		</g>

		<g
   id="g102">
			<text
   transform="translate(62.33300,34.65600)"
   id="text104">
  <tspan
     x="0"
     y="0"
     style="font-size:10.200000px;font-family:Bitstream Vera Sans"
     id="tspan106">cold</tspan>
</text>

		</g>

		
			<linearGradient
   id="linearGradient1702"
   gradientUnits="userSpaceOnUse"
   x1="115.55320"
   y1="211.66670"
   x2="129.11330"
   y2="211.66670"
   gradientTransform="translate(-47.95020,-145.6665)">
			<stop
   offset="0"
   style="stop-color:#C0C0C0"
   id="stop1704" />

			<stop
   offset="0.32"
   style="stop-color:#F4F4F4"
   id="stop1706" />

			<stop
   offset="1"
   style="stop-color:#A3A3A3"
   id="stop1708" />

			<midPointStop
   offset="0"
   style="stop-color:#C0C0C0"
   id="midPointStop1710" />

			<midPointStop
   offset="0.5"
   style="stop-color:#C0C0C0"
   id="midPointStop1712" />

			<midPointStop
   offset="0.32"
   style="stop-color:#F4F4F4"
   id="midPointStop1714" />

			<midPointStop
   offset="0.5"
   style="stop-color:#F4F4F4"
   id="midPointStop1716" />

			<midPointStop
   offset="1"
   style="stop-color:#A3A3A3"
   id="midPointStop1718" />

		</linearGradient>

		<rect
   x="67.602997"
   y="61.612000"
   style="fill:url(#XMLID_12_);stroke:#000000;stroke-width:0.50000000"
   width="13.560000"
   height="8.7760000"
   id="rect125" />
 
	</g>
    <g
       transform="translate(235.1153,337.2890)"
       style="overflow:visible"
       id="g1733">
		<rect
   style="fill:#dcdcdc"
   width="147.40100"
   height="161.57500"
   id="rect137"
   x="0.0000000"
   y="0.0000000" />
 
		<g
   id="g139">
			<text
   transform="translate(61.99800,145.3335)"
   id="text141">
  <tspan
     x="0"
     y="0"
     style="font-size:10.200000px;font-family:Bitstream Vera Sans"
     id="tspan143">warm</tspan>
</text>

		</g>

		<g
   id="g145">
			<text
   transform="translate(59.33300,18.66650)"
   id="text147">
  <tspan
     x="0"
     y="0"
     style="font-size:10.200000px;font-family:Bitstream Vera Sans"
     id="tspan149">warm</tspan>
</text>

		</g>

		
			<linearGradient
   id="linearGradient1742"
   gradientUnits="userSpaceOnUse"
   x1="73.333504"
   y1="73.250000"
   x2="81.333504"
   y2="73.250000"
   gradientTransform="translate(-3.505600,0.818800)">
			<stop
   offset="0"
   style="stop-color:#C5C5C5"
   id="stop1744" />

			<stop
   offset="0.16"
   style="stop-color:#FFFFFF"
   id="stop1746" />

			<stop
   offset="0.34"
   style="stop-color:#CECECE"
   id="stop1748" />

			<stop
   offset="1"
   style="stop-color:#A7A7A7"
   id="stop1750" />

			<midPointStop
   offset="0"
   style="stop-color:#C5C5C5"
   id="midPointStop1752" />

			<midPointStop
   offset="0.5"
   style="stop-color:#C5C5C5"
   id="midPointStop1754" />

			<midPointStop
   offset="0.16"
   style="stop-color:#FFFFFF"
   id="midPointStop1756" />

			<midPointStop
   offset="0.5"
   style="stop-color:#FFFFFF"
   id="midPointStop1758" />

			<midPointStop
   offset="0.34"
   style="stop-color:#CECECE"
   id="midPointStop1760" />

			<midPointStop
   offset="0.5"
   style="stop-color:#CECECE"
   id="midPointStop1762" />

			<midPointStop
   offset="1"
   style="stop-color:#A7A7A7"
   id="midPointStop1764" />

		</linearGradient>

		<rect
   x="69.764999"
   y="61.486000"
   style="fill:url(#XMLID_6_);stroke:#000000;stroke-width:0.50000000"
   width="8.7290001"
   height="25.167000"
   id="rect174" />
 
		
			<linearGradient
   id="linearGradient1767"
   gradientUnits="userSpaceOnUse"
   x1="104.34080"
   y1="60.000000"
   x2="104.34080"
   y2="65.333298"
   gradientTransform="matrix(1.100000,0.000000,0.000000,1.000000,-5.742500,1.360800)">
			<stop
   offset="0"
   style="stop-color:#C5C5C5"
   id="stop177" />

			<stop
   offset="0.16"
   style="stop-color:#FFFFFF"
   id="stop179" />

			<stop
   offset="0.34"
   style="stop-color:#CECECE"
   id="stop181" />

			<stop
   offset="1"
   style="stop-color:#A7A7A7"
   id="stop183" />

			<midPointStop
   offset="0"
   style="stop-color:#C5C5C5"
   id="midPointStop185" />

			<midPointStop
   offset="0.5"
   style="stop-color:#C5C5C5"
   id="midPointStop187" />

			<midPointStop
   offset="0.16"
   style="stop-color:#FFFFFF"
   id="midPointStop189" />

			<midPointStop
   offset="0.5"
   style="stop-color:#FFFFFF"
   id="midPointStop191" />

			<midPointStop
   offset="0.34"
   style="stop-color:#CECECE"
   id="midPointStop193" />

			<midPointStop
   offset="0.5"
   style="stop-color:#CECECE"
   id="midPointStop195" />

			<midPointStop
   offset="1"
   style="stop-color:#A7A7A7"
   id="midPointStop197" />

		</linearGradient>

		<rect
   x="70.514999"
   y="61.486000"
   style="fill:url(#linearGradient1808);stroke:#000000;stroke-width:0.50000000"
   width="77.035004"
   height="5.8750000"
   id="rect199" />
 
		
			<linearGradient
   id="linearGradient1781"
   gradientUnits="userSpaceOnUse"
   x1="115.55320"
   y1="209.00000"
   x2="129.11380"
   y2="209.00000"
   gradientTransform="translate(-47.48710,-144.3062)">
			<stop
   offset="0"
   style="stop-color:#C0C0C0"
   id="stop202" />

			<stop
   offset="0.32"
   style="stop-color:#F4F4F4"
   id="stop204" />

			<stop
   offset="1"
   style="stop-color:#A3A3A3"
   id="stop206" />

			<midPointStop
   offset="0"
   style="stop-color:#C0C0C0"
   id="midPointStop208" />

			<midPointStop
   offset="0.5"
   style="stop-color:#C0C0C0"
   id="midPointStop210" />

			<midPointStop
   offset="0.32"
   style="stop-color:#F4F4F4"
   id="midPointStop212" />

			<midPointStop
   offset="0.5"
   style="stop-color:#F4F4F4"
   id="midPointStop214" />

			<midPointStop
   offset="1"
   style="stop-color:#A3A3A3"
   id="midPointStop216" />

		</linearGradient>

		<rect
   x="68.066002"
   y="60.306000"
   style="fill:url(#linearGradient1810);stroke:#000000;stroke-width:0.50000000"
   width="13.561000"
   height="8.7760000"
   id="rect218" />
 
		
			<linearGradient
   id="linearGradient1792"
   gradientUnits="userSpaceOnUse"
   x1="106.05810"
   y1="50.000000"
   x2="106.05810"
   y2="98.666702"
   gradientTransform="translate(0.000000,5.333500)">
			<stop
   offset="0"
   style="stop-color:#FFFFFF"
   id="stop221" />

			<stop
   offset="1"
   style="stop-color:#000000"
   id="stop223" />

			<midPointStop
   offset="0"
   style="stop-color:#FFFFFF"
   id="midPointStop225" />

			<midPointStop
   offset="0.5"
   style="stop-color:#FFFFFF"
   id="midPointStop227" />

			<midPointStop
   offset="1"
   style="stop-color:#000000"
   id="midPointStop229" />

		</linearGradient>

		<path
   style="fill:url(#linearGradient1812);stroke:#000000;stroke-width:0.50000000"
   d="M 72.500000,96.333000 C 72.500000,96.333000 128.00000,108.33300 134.00000,103.83300 C 140.00000,99.333000 141.50000,79.833000 137.00000,76.833000 C 132.50000,73.833000 74.000000,85.833000 74.000000,85.833000 L 72.500000,96.333000 z "
   id="path231" />

		
			<linearGradient
   id="linearGradient1800"
   gradientUnits="userSpaceOnUse"
   x1="41.212898"
   y1="98.000000"
   x2="41.212898"
   y2="50.000000"
   gradientTransform="translate(0.000000,5.333500)">
			<stop
   offset="0"
   style="stop-color:#FFFFFF"
   id="stop234" />

			<stop
   offset="1"
   style="stop-color:#000000"
   id="stop236" />

			<midPointStop
   offset="0"
   style="stop-color:#FFFFFF"
   id="midPointStop238" />

			<midPointStop
   offset="0.5"
   style="stop-color:#FFFFFF"
   id="midPointStop240" />

			<midPointStop
   offset="1"
   style="stop-color:#000000"
   id="midPointStop242" />

		</linearGradient>

		<path
   style="fill:url(#linearGradient1814);stroke:#000000;stroke-width:0.50000000"
   d="M 74.771000,96.333000 C 74.771000,96.333000 19.271000,108.33300 13.271000,103.83300 C 7.2710000,99.333000 5.7710000,79.833000 10.271000,76.833000 C 14.771000,73.833000 73.271000,85.833000 73.271000,85.833000 L 74.771000,96.333000 z "
   id="path244" />

	</g>
    <text
       xml:space="preserve"
       style="font-size:11.000000px;font-style:normal;font-variant:normal;font-weight:normal;font-stretch:normal;text-align:start;line-height:125.00000%;writing-mode:lr-tb;text-anchor:start;fill:#000000;fill-opacity:1.0000000;stroke:none;stroke-width:1.0000000pt;stroke-linecap:butt;stroke-linejoin:miter;stroke-opacity:1.0000000;font-family:Bitstream Vera Sans"
       x="76.257973"
       y="350.29285"
       id="text1824"
       sodipodi:linespacing="125.00000%"><tspan
         sodipodi:role="line"
         id="tspan1826"
         x="76.257973"
         y="350.29285">1</tspan></text>
    <text
       xml:space="preserve"
       style="font-size:11.000000px;font-style:normal;font-variant:normal;font-weight:normal;font-stretch:normal;text-align:start;line-height:125.00000%;writing-mode:lr-tb;text-anchor:start;fill:#000000;fill-opacity:1.0000000;stroke:none;stroke-width:1.0000000pt;stroke-linecap:butt;stroke-linejoin:miter;stroke-opacity:1.0000000;font-family:Bitstream Vera Sans"
       x="242.69348"
       y="350.45786"
       id="text1828"
       sodipodi:linespacing="125.00000%"><tspan
         sodipodi:role="line"
         id="tspan1830"
         x="242.69348"
         y="350.45786">2</tspan></text>
  </g>
</svg>
