<?xml version="1.0" encoding="UTF-8" standalone="no"?>
<!DOCTYPE svg PUBLIC "-//W3C//DTD SVG 20010904//EN"
"http://www.w3.org/TR/2001/REC-SVG-20010904/DTD/svg10.dtd">
<!-- Created with Inkscape (http://www.inkscape.org/) -->
<svg
   width="113.00000mm"
   height="87.250000mm"
   id="svg452"
   sodipodi:version="0.32"
   inkscape:version="0.40+cvs"
   sodipodi:docbase="/home/bcrowell/Documents/writing/lm/trunk/1np/ch04/figs"
   sodipodi:docname="pickup-truck.svg"
   xmlns="http://www.w3.org/2000/svg"
   xmlns:cc="http://web.resource.org/cc/"
   xmlns:inkscape="http://www.inkscape.org/namespaces/inkscape"
   xmlns:sodipodi="http://sodipodi.sourceforge.net/DTD/sodipodi-0.dtd"
   xmlns:rdf="http://www.w3.org/1999/02/22-rdf-syntax-ns#"
   xmlns:xml="http://www.w3.org/XML/1998/namespace"
   xmlns:dc="http://purl.org/dc/elements/1.1/"
   xmlns:xlink="http://www.w3.org/1999/xlink">
  <defs
     id="defs3">
    <radialGradient
       id="XMLID_7_"
       cx="336.3003"
       cy="63.375"
       r="13.7823"
       fx="336.3003"
       fy="63.375"
       gradientTransform="matrix(0.8 0 0 0.8 -138.0782 4.1749)"
       gradientUnits="userSpaceOnUse">
      <stop
         offset="0"
         style="stop-color:#E4E4E4"
         id="stop33" />
      <stop
         offset="0.22"
         style="stop-color:#000000"
         id="stop35" />
      <midPointStop
         offset="0"
         style="stop-color:#E4E4E4"
         id="midPointStop37" />
      <midPointStop
         offset="0.5"
         style="stop-color:#E4E4E4"
         id="midPointStop39" />
      <midPointStop
         offset="0.22"
         style="stop-color:#000000"
         id="midPointStop41" />
    </radialGradient>
    <radialGradient
       inkscape:collect="always"
       xlink:href="#XMLID_7_"
       id="radialGradient451"
       gradientUnits="userSpaceOnUse"
       gradientTransform="matrix(0.800000,0.000000,0.000000,0.800000,-138.0782,4.174900)"
       cx="336.3003"
       cy="63.375"
       fx="336.3003"
       fy="63.375"
       r="13.7823" />
    <radialGradient
       id="XMLID_8_"
       cx="336.3003"
       cy="63.375"
       r="13.7823"
       fx="336.3003"
       fy="63.375"
       gradientTransform="matrix(0.8 0 0 0.8 -145.9837 109.2154)"
       gradientUnits="userSpaceOnUse">
      <stop
         offset="0"
         style="stop-color:#E4E4E4"
         id="stop80" />
      <stop
         offset="0.22"
         style="stop-color:#000000"
         id="stop82" />
      <midPointStop
         offset="0"
         style="stop-color:#E4E4E4"
         id="midPointStop84" />
      <midPointStop
         offset="0.5"
         style="stop-color:#E4E4E4"
         id="midPointStop86" />
      <midPointStop
         offset="0.22"
         style="stop-color:#000000"
         id="midPointStop88" />
    </radialGradient>
    <radialGradient
       inkscape:collect="always"
       xlink:href="#XMLID_8_"
       id="radialGradient450"
       gradientUnits="userSpaceOnUse"
       gradientTransform="matrix(0.800000,0.000000,0.000000,0.800000,-145.9837,109.2154)"
       cx="336.3003"
       cy="63.375"
       fx="336.3003"
       fy="63.375"
       r="13.7823" />
    <radialGradient
       id="XMLID_9_"
       cx="336.3003"
       cy="63.375"
       r="13.7823"
       fx="336.3003"
       fy="63.375"
       gradientTransform="matrix(0.8 0 0 0.8 -169.7657 217.1758)"
       gradientUnits="userSpaceOnUse">
      <stop
         offset="0"
         style="stop-color:#E4E4E4"
         id="stop124" />
      <stop
         offset="0.22"
         style="stop-color:#000000"
         id="stop126" />
      <midPointStop
         offset="0"
         style="stop-color:#E4E4E4"
         id="midPointStop128" />
      <midPointStop
         offset="0.5"
         style="stop-color:#E4E4E4"
         id="midPointStop130" />
      <midPointStop
         offset="0.22"
         style="stop-color:#000000"
         id="midPointStop132" />
    </radialGradient>
    <radialGradient
       inkscape:collect="always"
       xlink:href="#XMLID_9_"
       id="radialGradient449"
       gradientUnits="userSpaceOnUse"
       gradientTransform="matrix(0.800000,0.000000,0.000000,0.800000,-169.7657,217.1758)"
       cx="336.3003"
       cy="63.375"
       fx="336.3003"
       fy="63.375"
       r="13.7823" />
    <radialGradient
       id="XMLID_10_"
       cx="336.3003"
       cy="63.375"
       r="13.7823"
       fx="336.3003"
       fy="63.375"
       gradientTransform="matrix(0.8 0 0 0.8 147.1715 10.6998)"
       gradientUnits="userSpaceOnUse">
      <stop
         offset="0"
         style="stop-color:#E4E4E4"
         id="stop174" />
      <stop
         offset="0.22"
         style="stop-color:#000000"
         id="stop176" />
      <midPointStop
         offset="0"
         style="stop-color:#E4E4E4"
         id="midPointStop178" />
      <midPointStop
         offset="0.5"
         style="stop-color:#E4E4E4"
         id="midPointStop180" />
      <midPointStop
         offset="0.22"
         style="stop-color:#000000"
         id="midPointStop182" />
    </radialGradient>
    <radialGradient
       inkscape:collect="always"
       xlink:href="#XMLID_10_"
       id="radialGradient448"
       gradientUnits="userSpaceOnUse"
       gradientTransform="matrix(0.800000,0.000000,0.000000,0.800000,147.1715,10.69980)"
       cx="336.3003"
       cy="63.375"
       fx="336.3003"
       fy="63.375"
       r="13.7823" />
    <radialGradient
       id="XMLID_11_"
       cx="336.3003"
       cy="63.375"
       r="13.7823"
       fx="336.3003"
       fy="63.375"
       gradientTransform="matrix(0.8 0 0 0.8 89.234 117.023)"
       gradientUnits="userSpaceOnUse">
      <stop
         offset="0"
         style="stop-color:#E4E4E4"
         id="stop221" />
      <stop
         offset="0.22"
         style="stop-color:#000000"
         id="stop223" />
      <midPointStop
         offset="0"
         style="stop-color:#E4E4E4"
         id="midPointStop225" />
      <midPointStop
         offset="0.5"
         style="stop-color:#E4E4E4"
         id="midPointStop227" />
      <midPointStop
         offset="0.22"
         style="stop-color:#000000"
         id="midPointStop229" />
    </radialGradient>
    <radialGradient
       inkscape:collect="always"
       xlink:href="#XMLID_11_"
       id="radialGradient447"
       gradientUnits="userSpaceOnUse"
       gradientTransform="matrix(0.800000,0.000000,0.000000,0.800000,89.23400,117.0230)"
       cx="336.3003"
       cy="63.375"
       fx="336.3003"
       fy="63.375"
       r="13.7823" />
    <radialGradient
       id="XMLID_12_"
       cx="336.3003"
       cy="63.375"
       r="13.7823"
       fx="336.3003"
       fy="63.375"
       gradientTransform="matrix(0.8 0 0 0.8 39.0163 225.2527)"
       gradientUnits="userSpaceOnUse">
      <stop
         offset="0"
         style="stop-color:#E4E4E4"
         id="stop265" />
      <stop
         offset="0.22"
         style="stop-color:#000000"
         id="stop267" />
      <midPointStop
         offset="0"
         style="stop-color:#E4E4E4"
         id="midPointStop269" />
      <midPointStop
         offset="0.5"
         style="stop-color:#E4E4E4"
         id="midPointStop271" />
      <midPointStop
         offset="0.22"
         style="stop-color:#000000"
         id="midPointStop273" />
    </radialGradient>
    <radialGradient
       inkscape:collect="always"
       xlink:href="#XMLID_12_"
       id="radialGradient446"
       gradientUnits="userSpaceOnUse"
       gradientTransform="matrix(0.800000,0.000000,0.000000,0.800000,39.01630,225.2527)"
       cx="336.3003"
       cy="63.375"
       fx="336.3003"
       fy="63.375"
       r="13.7823" />
  </defs>
  <sodipodi:namedview
     id="base"
     pagecolor="#ffffff"
     bordercolor="#666666"
     borderopacity="1.0"
     inkscape:pageopacity="0.0"
     inkscape:pageshadow="2"
     inkscape:zoom="1.6804144"
     inkscape:cx="134.44303"
     inkscape:cy="165.89717"
     inkscape:current-layer="layer1"
     inkscape:window-width="798"
     inkscape:window-height="576"
     inkscape:window-x="1"
     inkscape:window-y="4" />
  <metadata
     id="metadata4">
    <rdf:RDF
       id="RDF5">
      <cc:Work
         rdf:about=""
         id="Work6">
        <dc:format
           id="format7">image/svg+xml</dc:format>
        <dc:type
           id="type9"
           rdf:resource="http://purl.org/dc/dcmitype/StillImage" />
      </cc:Work>
    </rdf:RDF>
  </metadata>
  <g
     inkscape:label="Layer 1"
     inkscape:groupmode="layer"
     id="layer1">
    <rect
       style="fill:#e0e0e0;fill-opacity:1.0000000;stroke:none;stroke-width:1.0960104;stroke-linecap:butt;stroke-linejoin:miter;stroke-miterlimit:4.0000000;stroke-dasharray:2.1920210 1.0960105 ;stroke-dashoffset:0.0000000;stroke-opacity:1.0000000"
       id="rect82"
       width="152.03670"
       height="310.43600"
       x="-2.3125261e-07"
       y="0.029561123" />
    <rect
       style="fill:#e0e0e0;fill-opacity:1.0000000;stroke:none;stroke-width:1.0960104;stroke-linecap:butt;stroke-linejoin:miter;stroke-miterlimit:4.0000000;stroke-dasharray:2.1920210 1.0960105 ;stroke-dashoffset:0.0000000;stroke-opacity:1.0000000"
       id="rect83"
       width="243.01743"
       height="310.43600"
       x="157.93210"
       y="0.029561123" />
    <g
       id="g7"
       transform="matrix(0.912400,0.000000,0.000000,0.912400,0.319615,-0.814644)">
      <g
         id="g9">
        <path
           d="M 27.600000,22.225000 C 30.251000,22.225000 32.400000,20.076000 32.400000,17.425000 L 32.400000,17.425000 C 32.400000,14.774000 30.251000,12.625000 27.600000,12.625000 L 13.200000,12.625000 C 10.549000,12.625000 8.4000000,14.774000 8.4000000,17.425000 L 8.4000000,17.425000 C 8.4000000,20.076000 10.549000,22.225000 13.200000,22.225000 L 27.600000,22.225000 z "
           id="path11" />
        <path
           d="M 134.40000,22.225000 C 137.05100,22.225000 139.20000,20.076000 139.20000,17.425000 L 139.20000,17.425000 C 139.20000,14.774000 137.05100,12.625000 134.40000,12.625000 L 120.00000,12.625000 C 117.34900,12.625000 115.20000,14.774000 115.20000,17.425000 L 115.20000,17.425000 C 115.20000,20.076000 117.34900,22.225000 120.00000,22.225000 L 134.40000,22.225000 z "
           id="path13" />
        <path
           d="M 27.600000,99.025000 C 30.251000,99.025000 32.400000,96.876000 32.400000,94.225000 L 32.400000,94.225000 C 32.400000,91.574000 30.251000,89.425000 27.600000,89.425000 L 13.200000,89.425000 C 10.549000,89.425000 8.4000000,91.574000 8.4000000,94.225000 L 8.4000000,94.225000 C 8.4000000,96.876000 10.549000,99.025000 13.200000,99.025000 L 27.600000,99.025000 z "
           id="path15" />
        <path
           d="M 134.40000,99.025000 C 137.05100,99.025000 139.20000,96.876000 139.20000,94.225000 L 139.20000,94.225000 C 139.20000,91.574000 137.05100,89.425000 134.40000,89.425000 L 120.00000,89.425000 C 117.34900,89.425000 115.20000,91.574000 115.20000,94.225000 L 115.20000,94.225000 C 115.20000,96.876000 117.34900,99.025000 120.00000,99.025000 L 134.40000,99.025000 z "
           id="path17" />
        <path
           style="fill:#7f7f7f"
           d="M 144.00000,93.025000 C 149.30200,93.025000 153.60000,88.727000 153.60000,83.425000 L 153.60000,28.225000 C 153.60000,22.923000 149.30200,18.625000 144.00000,18.625000 L 9.6000000,18.625000 C 4.2980000,18.625000 0.0000000,22.923000 0.0000000,28.225000 L 0.0000000,83.425000 C 0.0000000,88.727000 4.2980000,93.025000 9.6000000,93.025000 L 144.00000,93.025000 z "
           id="path19" />
        <path
           style="fill:#dcdcdc"
           d="M 140.60900,87.040000 C 144.88900,87.040000 148.35900,81.450000 148.35900,74.554000 L 148.35900,37.096000 C 148.35900,30.200000 144.88900,24.610000 140.60900,24.610000 L 85.392000,24.610000 C 81.112000,24.610000 77.642000,30.200000 77.642000,37.096000 L 77.642000,74.554000 C 77.642000,81.449000 81.112000,87.040000 85.392000,87.040000 L 140.60900,87.040000 z "
           id="path21" />
        <ellipse
           style="fill:#ffffff"
           cx="7.6880002"
           cy="35.625000"
           rx="3.1819999"
           ry="9.3339996"
           id="ellipse23"
           sodipodi:cx="7.6880002"
           sodipodi:cy="35.625000"
           sodipodi:rx="3.1819999"
           sodipodi:ry="9.3339996" />
        <ellipse
           style="fill:#ffffff"
           cx="7.6880002"
           cy="75.224998"
           rx="3.1819999"
           ry="9.3339996"
           id="ellipse25"
           sodipodi:cx="7.6880002"
           sodipodi:cy="75.224998"
           sodipodi:rx="3.1819999"
           sodipodi:ry="9.3339996" />
        <path
           style="fill:#7f7f7f;stroke:#ffffff"
           d="M 38.200000,84.825000 C 40.437000,84.825000 42.250000,82.408000 42.250000,79.425000 L 42.250000,33.825000 C 42.250000,30.843000 40.437000,28.425000 38.200000,28.425000 L 38.200000,28.425000 C 35.963000,28.425000 34.150000,30.842000 34.150000,33.825000 L 34.150000,79.426000 C 34.150000,82.408000 35.963000,84.825000 38.200000,84.825000 L 38.200000,84.825000 z "
           id="path27" />
      </g>
      <g
         id="g30">
        <radialGradient
           id="radialGradient374"
           cx="336.30029"
           cy="63.375000"
           r="13.782300"
           fx="336.30029"
           fy="63.375000"
           gradientTransform="matrix(0.800000,0.000000,0.000000,0.800000,-138.0782,4.174900)"
           gradientUnits="userSpaceOnUse">
          <stop
             offset="0"
             style="stop-color:#E4E4E4"
             id="stop376" />
          <stop
             offset="0.22"
             style="stop-color:#000000"
             id="stop378" />
          <midPointStop
             offset="0"
             style="stop-color:#E4E4E4"
             id="midPointStop380" />
          <midPointStop
             offset="0.5"
             style="stop-color:#E4E4E4"
             id="midPointStop382" />
          <midPointStop
             offset="0.22"
             style="stop-color:#000000"
             id="midPointStop384" />
        </radialGradient>
        <circle
           style="fill:url(#radialGradient451)"
           cx="128.52901"
           cy="57.539001"
           r="8.4849997"
           id="circle44"
           sodipodi:cx="128.52901"
           sodipodi:cy="57.539001"
           sodipodi:rx="8.4849997"
           sodipodi:ry="8.4849997" />
        <ellipse
           transform="matrix(0.934200,0.356800,-0.356800,0.934200,28.25480,-39.78510)"
           style="fill:none;stroke:#ffffff;stroke-width:0.40000001"
           cx="121.96600"
           cy="56.693001"
           rx="0.47099999"
           ry="0.80100000"
           id="ellipse46"
           sodipodi:cx="121.96600"
           sodipodi:cy="56.693001"
           sodipodi:rx="0.47099999"
           sodipodi:ry="0.80100000" />
        <ellipse
           transform="matrix(0.934200,0.356700,-0.356700,0.934200,27.31990,-40.34590)"
           style="fill:none;stroke:#ffffff;stroke-width:0.40000001"
           cx="123.03600"
           cy="53.889999"
           rx="0.47099999"
           ry="0.80100000"
           id="ellipse48"
           sodipodi:cx="123.03600"
           sodipodi:cy="53.889999"
           sodipodi:rx="0.47099999"
           sodipodi:ry="0.80100000" />
        <ellipse
           transform="matrix(0.934200,0.356800,-0.356800,0.934200,28.25540,-40.76220)"
           style="fill:none;stroke:#ffffff;stroke-width:0.40000001"
           cx="124.61400"
           cy="56.205002"
           rx="0.56599998"
           ry="0.80100000"
           id="ellipse50"
           sodipodi:cx="124.61400"
           sodipodi:cy="56.205002"
           sodipodi:rx="0.56599998"
           sodipodi:ry="0.80100000" />
      </g>
    </g>
    <g
       id="g54"
       transform="matrix(0.912400,0.000000,0.000000,0.912400,0.319615,-0.814644)">
      <path
         d="M 27.600000,129.62500 C 30.251000,129.62500 32.400000,127.47600 32.400000,124.82500 L 32.400000,124.82500 C 32.400000,122.17400 30.251000,120.02500 27.600000,120.02500 L 13.200000,120.02500 C 10.549000,120.02500 8.4000000,122.17400 8.4000000,124.82500 L 8.4000000,124.82500 C 8.4000000,127.47600 10.549000,129.62500 13.200000,129.62500 L 27.600000,129.62500 z "
         id="path56" />
      <path
         d="M 134.40000,129.62500 C 137.05100,129.62500 139.20000,127.47600 139.20000,124.82500 L 139.20000,124.82500 C 139.20000,122.17400 137.05100,120.02500 134.40000,120.02500 L 120.00000,120.02500 C 117.34900,120.02500 115.20000,122.17400 115.20000,124.82500 L 115.20000,124.82500 C 115.20000,127.47600 117.34900,129.62500 120.00000,129.62500 L 134.40000,129.62500 z "
         id="path58" />
      <path
         d="M 27.600000,206.42500 C 30.251000,206.42500 32.400000,204.27600 32.400000,201.62500 L 32.400000,201.62500 C 32.400000,198.97400 30.251000,196.82500 27.600000,196.82500 L 13.200000,196.82500 C 10.549000,196.82500 8.4000000,198.97400 8.4000000,201.62500 L 8.4000000,201.62500 C 8.4000000,204.27600 10.549000,206.42500 13.200000,206.42500 L 27.600000,206.42500 z "
         id="path60" />
      <path
         d="M 134.40000,206.42500 C 137.05100,206.42500 139.20000,204.27600 139.20000,201.62500 L 139.20000,201.62500 C 139.20000,198.97400 137.05100,196.82500 134.40000,196.82500 L 120.00000,196.82500 C 117.34900,196.82500 115.20000,198.97400 115.20000,201.62500 L 115.20000,201.62500 C 115.20000,204.27600 117.34900,206.42500 120.00000,206.42500 L 134.40000,206.42500 z "
         id="path62" />
      <path
         style="fill:#7f7f7f"
         d="M 144.00000,200.42500 C 149.30200,200.42500 153.60000,196.12700 153.60000,190.82400 L 153.60000,135.62400 C 153.60000,130.32200 149.30200,126.02400 144.00000,126.02400 L 9.6000000,126.02400 C 4.2980000,126.02400 0.0000000,130.32200 0.0000000,135.62400 L 0.0000000,190.82400 C 0.0000000,196.12600 4.2980000,200.42500 9.6000000,200.42500 L 144.00000,200.42500 z "
         id="path64" />
      <path
         style="fill:#dcdcdc"
         d="M 140.60900,194.43900 C 144.88900,194.43900 148.35900,188.84900 148.35900,181.95400 L 148.35900,144.49600 C 148.35900,137.60000 144.88900,132.01100 140.60900,132.01100 L 85.392000,132.01100 C 81.112000,132.01100 77.642000,137.60100 77.642000,144.49600 L 77.642000,181.95400 C 77.642000,188.84900 81.112000,194.43900 85.392000,194.43900 L 140.60900,194.43900 L 140.60900,194.43900 z "
         id="path66" />
      <ellipse
         style="fill:#ffffff"
         cx="7.6880002"
         cy="143.02499"
         rx="3.1819999"
         ry="9.3339996"
         id="ellipse68"
         sodipodi:cx="7.6880002"
         sodipodi:cy="143.02499"
         sodipodi:rx="3.1819999"
         sodipodi:ry="9.3339996" />
      <ellipse
         style="fill:#ffffff"
         cx="7.6880002"
         cy="182.62500"
         rx="3.1819999"
         ry="9.3339996"
         id="ellipse70"
         sodipodi:cx="7.6880002"
         sodipodi:cy="182.62500"
         sodipodi:rx="3.1819999"
         sodipodi:ry="9.3339996" />
      <path
         style="fill:#7f7f7f;stroke:#ffffff"
         d="M 38.200000,192.22500 C 40.437000,192.22500 42.250000,189.80800 42.250000,186.82500 L 42.250000,141.22400 C 42.250000,138.24200 40.437000,135.82400 38.200000,135.82400 L 38.200000,135.82400 C 35.963000,135.82400 34.150000,138.24100 34.150000,141.22400 L 34.150000,186.82500 C 34.150000,189.80800 35.963000,192.22500 38.200000,192.22500 L 38.200000,192.22500 z "
         id="path72" />
    </g>
    <circle
       style="fill:none;stroke:#000000;stroke-width:1.0960104;stroke-miterlimit:4.0000000;stroke-dasharray:2.1920210 1.0960105 ;stroke-dashoffset:0.0000000"
       cx="128.42500"
       cy="162.30000"
       r="8.4849997"
       id="circle75"
       transform="matrix(0.912400,0.000000,0.000000,0.912400,0.319615,-0.814644)"
       sodipodi:cx="128.42500"
       sodipodi:cy="162.30000"
       sodipodi:rx="8.4849997"
       sodipodi:ry="8.4849997" />
    <g
       id="g77"
       transform="matrix(0.912400,0.000000,0.000000,0.912400,0.319615,-0.814644)">
      <radialGradient
         id="radialGradient386"
         cx="336.30029"
         cy="63.375000"
         r="13.782300"
         fx="336.30029"
         fy="63.375000"
         gradientTransform="matrix(0.800000,0.000000,0.000000,0.800000,-145.9837,109.2154)"
         gradientUnits="userSpaceOnUse">
        <stop
           offset="0"
           style="stop-color:#E4E4E4"
           id="stop388" />
        <stop
           offset="0.22"
           style="stop-color:#000000"
           id="stop390" />
        <midPointStop
           offset="0"
           style="stop-color:#E4E4E4"
           id="midPointStop392" />
        <midPointStop
           offset="0.5"
           style="stop-color:#E4E4E4"
           id="midPointStop394" />
        <midPointStop
           offset="0.22"
           style="stop-color:#000000"
           id="midPointStop396" />
      </radialGradient>
      <circle
         style="fill:url(#radialGradient450)"
         cx="120.62300"
         cy="162.58000"
         r="8.4849997"
         id="circle91"
         sodipodi:cx="120.62300"
         sodipodi:cy="162.58000"
         sodipodi:rx="8.4849997"
         sodipodi:ry="8.4849997" />
      <ellipse
         transform="matrix(0.934100,0.357000,-0.357000,0.934100,65.24750,-30.06020)"
         style="fill:none;stroke:#ffffff;stroke-width:0.40000001"
         cx="114.06000"
         cy="161.73300"
         rx="0.47099999"
         ry="0.80199999"
         id="ellipse93"
         sodipodi:cx="114.06000"
         sodipodi:cy="161.73300"
         sodipodi:rx="0.47099999"
         sodipodi:ry="0.80199999" />
      <ellipse
         transform="matrix(0.934400,0.356300,-0.356300,0.934400,64.19090,-30.59280)"
         style="fill:none;stroke:#ffffff;stroke-width:0.40000001"
         cx="115.13000"
         cy="158.93100"
         rx="0.47099999"
         ry="0.80100000"
         id="ellipse95"
         sodipodi:cx="115.13000"
         sodipodi:cy="158.93100"
         sodipodi:rx="0.47099999"
         sodipodi:ry="0.80100000" />
      <ellipse
         transform="matrix(0.934200,0.356800,-0.356800,0.934200,65.22210,-31.03050)"
         style="fill:none;stroke:#ffffff;stroke-width:0.40000001"
         cx="116.70800"
         cy="161.24600"
         rx="0.56599998"
         ry="0.80199999"
         id="ellipse97"
         sodipodi:cx="116.70800"
         sodipodi:cy="161.24600"
         sodipodi:rx="0.56599998"
         sodipodi:ry="0.80199999" />
    </g>
    <g
       id="g100"
       transform="matrix(0.912400,0.000000,0.000000,0.912400,0.319615,-0.814644)">
      <path
         d="M 27.600000,237.02500 C 30.251000,237.02500 32.400000,234.87600 32.400000,232.22500 L 32.400000,232.22500 C 32.400000,229.57400 30.251000,227.42500 27.600000,227.42500 L 13.200000,227.42500 C 10.549000,227.42500 8.4000000,229.57400 8.4000000,232.22500 L 8.4000000,232.22500 C 8.4000000,234.87600 10.549000,237.02500 13.200000,237.02500 L 27.600000,237.02500 z "
         id="path102" />
      <path
         d="M 134.40000,237.02500 C 137.05100,237.02500 139.20000,234.87600 139.20000,232.22500 L 139.20000,232.22500 C 139.20000,229.57400 137.05100,227.42500 134.40000,227.42500 L 120.00000,227.42500 C 117.34900,227.42500 115.20000,229.57400 115.20000,232.22500 L 115.20000,232.22500 C 115.20000,234.87600 117.34900,237.02500 120.00000,237.02500 L 134.40000,237.02500 z "
         id="path104" />
      <path
         d="M 27.600000,313.82500 C 30.251000,313.82500 32.400000,311.67600 32.400000,309.02500 L 32.400000,309.02500 C 32.400000,306.37400 30.251000,304.22500 27.600000,304.22500 L 13.200000,304.22500 C 10.549000,304.22500 8.4000000,306.37400 8.4000000,309.02500 L 8.4000000,309.02500 C 8.4000000,311.67600 10.549000,313.82500 13.200000,313.82500 L 27.600000,313.82500 z "
         id="path106" />
      <path
         d="M 134.40000,313.82500 C 137.05100,313.82500 139.20000,311.67600 139.20000,309.02500 L 139.20000,309.02500 C 139.20000,306.37400 137.05100,304.22500 134.40000,304.22500 L 120.00000,304.22500 C 117.34900,304.22500 115.20000,306.37400 115.20000,309.02500 L 115.20000,309.02500 C 115.20000,311.67600 117.34900,313.82500 120.00000,313.82500 L 134.40000,313.82500 z "
         id="path108" />
      <path
         style="fill:#7f7f7f"
         d="M 144.00000,307.82500 C 149.30200,307.82500 153.60000,303.52700 153.60000,298.22400 L 153.60000,243.02500 C 153.60000,237.72300 149.30200,233.42400 144.00000,233.42400 L 9.6000000,233.42400 C 4.2980000,233.42400 0.0000000,237.72200 0.0000000,243.02500 L 0.0000000,298.22400 C 0.0000000,303.52700 4.2980000,307.82500 9.6000000,307.82500 L 144.00000,307.82500 z "
         id="path110" />
      <path
         style="fill:#dcdcdc"
         d="M 140.60900,301.83900 C 144.88900,301.83900 148.35900,296.24900 148.35900,289.35400 L 148.35900,251.89600 C 148.35900,245.00100 144.88900,239.41100 140.60900,239.41100 L 85.392000,239.41100 C 81.112000,239.41100 77.642000,245.00100 77.642000,251.89600 L 77.642000,289.35400 C 77.642000,296.24900 81.112000,301.83900 85.392000,301.83900 L 140.60900,301.83900 L 140.60900,301.83900 z "
         id="path112" />
      <ellipse
         style="fill:#ffffff"
         cx="7.6880002"
         cy="250.42500"
         rx="3.1819999"
         ry="9.3339996"
         id="ellipse114"
         sodipodi:cx="7.6880002"
         sodipodi:cy="250.42500"
         sodipodi:rx="3.1819999"
         sodipodi:ry="9.3339996" />
      <ellipse
         style="fill:#ffffff"
         cx="7.6880002"
         cy="290.02499"
         rx="3.1819999"
         ry="9.3339996"
         id="ellipse116"
         sodipodi:cx="7.6880002"
         sodipodi:cy="290.02499"
         sodipodi:rx="3.1819999"
         sodipodi:ry="9.3339996" />
      <path
         style="fill:#7f7f7f;stroke:#ffffff"
         d="M 38.200000,299.62500 C 40.437000,299.62500 42.250000,297.20800 42.250000,294.22500 L 42.250000,248.62400 C 42.250000,245.64200 40.437000,243.22500 38.200000,243.22500 L 38.200000,243.22500 C 35.963000,243.22500 34.150000,245.64200 34.150000,248.62400 L 34.150000,294.22500 C 34.150000,297.20800 35.963000,299.62500 38.200000,299.62500 L 38.200000,299.62500 z "
         id="path118" />
    </g>
    <g
       id="g121"
       transform="matrix(0.912400,0.000000,0.000000,0.912400,0.319615,-0.814644)">
      <radialGradient
         id="radialGradient398"
         cx="336.30029"
         cy="63.375000"
         r="13.782300"
         fx="336.30029"
         fy="63.375000"
         gradientTransform="matrix(0.800000,0.000000,0.000000,0.800000,-169.7657,217.1758)"
         gradientUnits="userSpaceOnUse">
        <stop
           offset="0"
           style="stop-color:#E4E4E4"
           id="stop400" />
        <stop
           offset="0.22"
           style="stop-color:#000000"
           id="stop402" />
        <midPointStop
           offset="0"
           style="stop-color:#E4E4E4"
           id="midPointStop404" />
        <midPointStop
           offset="0.5"
           style="stop-color:#E4E4E4"
           id="midPointStop406" />
        <midPointStop
           offset="0.22"
           style="stop-color:#000000"
           id="midPointStop408" />
      </radialGradient>
      <circle
         style="fill:url(#radialGradient449)"
         cx="96.841003"
         cy="270.54099"
         r="8.4849997"
         id="circle135"
         sodipodi:cx="96.841003"
         sodipodi:cy="270.54099"
         sodipodi:rx="8.4849997"
         sodipodi:ry="8.4849997" />
      <ellipse
         transform="matrix(0.934200,0.356800,-0.356800,0.934200,102.1663,-14.46040)"
         style="fill:none;stroke:#ffffff;stroke-width:0.40000001"
         cx="90.278000"
         cy="269.69400"
         rx="0.47099999"
         ry="0.80100000"
         id="ellipse137"
         sodipodi:cx="90.278000"
         sodipodi:cy="269.69400"
         sodipodi:rx="0.47099999"
         sodipodi:ry="0.80100000" />
      <ellipse
         transform="matrix(0.934100,0.357000,-0.357000,0.934100,101.2888,-15.02480)"
         style="fill:none;stroke:#ffffff;stroke-width:0.40000001"
         cx="91.348000"
         cy="266.89099"
         rx="0.47099999"
         ry="0.80199999"
         id="ellipse139"
         sodipodi:cx="91.348000"
         sodipodi:cy="266.89099"
         sodipodi:rx="0.47099999"
         sodipodi:ry="0.80199999" />
      <ellipse
         transform="matrix(0.934300,0.356600,-0.356600,0.934300,102.1098,-15.43910)"
         style="fill:none;stroke:#ffffff;stroke-width:0.40000001"
         cx="92.926003"
         cy="269.20599"
         rx="0.56500000"
         ry="0.80100000"
         id="ellipse141"
         sodipodi:cx="92.926003"
         sodipodi:cy="269.20599"
         sodipodi:rx="0.56500000"
         sodipodi:ry="0.80100000" />
    </g>
    <circle
       style="fill:none;stroke:#000000;stroke-width:1.0960104;stroke-miterlimit:4.0000000;stroke-dasharray:2.1920210 1.0960105 ;stroke-dashoffset:0.0000000"
       cx="128.72400"
       cy="270.26300"
       r="8.4849997"
       id="circle144"
       transform="matrix(0.912400,0.000000,0.000000,0.912400,0.319615,-0.814644)"
       sodipodi:cx="128.72400"
       sodipodi:cy="270.26300"
       sodipodi:rx="8.4849997"
       sodipodi:ry="8.4849997" />
    <circle
       style="fill:none;stroke:#000000;stroke-width:1.0960104;stroke-miterlimit:4.0000000;stroke-dasharray:2.1920210 1.0960105 ;stroke-dashoffset:0.0000000"
       cx="120.72400"
       cy="270.26300"
       r="8.4849997"
       id="circle146"
       transform="matrix(0.912400,0.000000,0.000000,0.912400,0.319615,-0.814644)"
       sodipodi:cx="120.72400"
       sodipodi:cy="270.26300"
       sodipodi:rx="8.4849997"
       sodipodi:ry="8.4849997" />
    <g
       id="g148"
       transform="matrix(0.912400,0.000000,0.000000,0.912400,0.319615,-0.814644)">
      <g
         id="g150">
        <path
           d="M 312.85000,28.750000 C 315.50100,28.750000 317.65000,26.601000 317.65000,23.950000 L 317.65000,23.950000 C 317.65000,21.299000 315.50100,19.150000 312.85000,19.150000 L 298.45000,19.150000 C 295.80000,19.150000 293.65000,21.299000 293.65000,23.950000 L 293.65000,23.950000 C 293.65000,26.601000 295.79900,28.750000 298.45000,28.750000 L 312.85000,28.750000 z "
           id="path152" />
        <path
           d="M 419.65000,28.750000 C 422.30100,28.750000 424.45000,26.601000 424.45000,23.950000 L 424.45000,23.950000 C 424.45000,21.299000 422.30100,19.150000 419.65000,19.150000 L 405.25000,19.150000 C 402.59900,19.150000 400.45000,21.299000 400.45000,23.950000 L 400.45000,23.950000 C 400.45000,26.601000 402.59900,28.750000 405.25000,28.750000 L 419.65000,28.750000 z "
           id="path154" />
        <path
           d="M 312.85000,105.55000 C 315.50100,105.55000 317.65000,103.40100 317.65000,100.75000 L 317.65000,100.75000 C 317.65000,98.099000 315.50100,95.950000 312.85000,95.950000 L 298.45000,95.950000 C 295.80000,95.950000 293.65000,98.099000 293.65000,100.75000 L 293.65000,100.75000 C 293.65000,103.40100 295.79900,105.55000 298.45000,105.55000 L 312.85000,105.55000 z "
           id="path156" />
        <path
           d="M 419.65000,105.55000 C 422.30100,105.55000 424.45000,103.40100 424.45000,100.75000 L 424.45000,100.75000 C 424.45000,98.099000 422.30100,95.950000 419.65000,95.950000 L 405.25000,95.950000 C 402.59900,95.950000 400.45000,98.099000 400.45000,100.75000 L 400.45000,100.75000 C 400.45000,103.40100 402.59900,105.55000 405.25000,105.55000 L 419.65000,105.55000 z "
           id="path158" />
        <path
           style="fill:#7f7f7f"
           d="M 429.25000,99.550000 C 434.55200,99.550000 438.85000,95.252000 438.85000,89.950000 L 438.85000,34.750000 C 438.85000,29.448000 434.55200,25.150000 429.25000,25.150000 L 294.85000,25.150000 C 289.54800,25.150000 285.25000,29.448000 285.25000,34.750000 L 285.25000,89.950000 C 285.25000,95.252000 289.54800,99.550000 294.85000,99.550000 L 429.25000,99.550000 z "
           id="path160" />
        <path
           style="fill:#dcdcdc"
           d="M 425.85900,93.564000 C 430.13900,93.564000 433.60900,87.974000 433.60900,81.078000 L 433.60900,43.621000 C 433.60900,36.726000 430.13900,31.135000 425.85900,31.135000 L 370.64100,31.135000 C 366.36100,31.135000 362.89100,36.725000 362.89100,43.621000 L 362.89100,81.079000 C 362.89100,87.974000 366.36100,93.565000 370.64100,93.565000 L 425.85900,93.565000 L 425.85900,93.564000 z "
           id="path162" />
        <ellipse
           style="fill:#ffffff"
           cx="292.93799"
           cy="42.150002"
           rx="3.1819999"
           ry="9.3339996"
           id="ellipse164"
           sodipodi:cx="292.93799"
           sodipodi:cy="42.150002"
           sodipodi:rx="3.1819999"
           sodipodi:ry="9.3339996" />
        <ellipse
           style="fill:#ffffff"
           cx="292.93799"
           cy="81.750000"
           rx="3.1819999"
           ry="9.3339996"
           id="ellipse166"
           sodipodi:cx="292.93799"
           sodipodi:cy="81.750000"
           sodipodi:rx="3.1819999"
           sodipodi:ry="9.3339996" />
        <path
           style="fill:#7f7f7f;stroke:#ffffff"
           d="M 323.45000,91.350000 C 325.68700,91.350000 327.50000,88.933000 327.50000,85.950000 L 327.50000,40.350000 C 327.50000,37.368000 325.68700,34.950000 323.45000,34.950000 L 323.45000,34.950000 C 321.21300,34.950000 319.40000,37.367000 319.40000,40.350000 L 319.40000,85.950000 C 319.40000,88.933000 321.21300,91.350000 323.45000,91.350000 L 323.45000,91.350000 z "
           id="path168" />
      </g>
      <g
         id="g171">
        <radialGradient
           id="radialGradient410"
           cx="336.30029"
           cy="63.375000"
           r="13.782300"
           fx="336.30029"
           fy="63.375000"
           gradientTransform="matrix(0.800000,0.000000,0.000000,0.800000,147.1715,10.69980)"
           gradientUnits="userSpaceOnUse">
          <stop
             offset="0"
             style="stop-color:#E4E4E4"
             id="stop412" />
          <stop
             offset="0.22"
             style="stop-color:#000000"
             id="stop414" />
          <midPointStop
             offset="0"
             style="stop-color:#E4E4E4"
             id="midPointStop416" />
          <midPointStop
             offset="0.5"
             style="stop-color:#E4E4E4"
             id="midPointStop418" />
          <midPointStop
             offset="0.22"
             style="stop-color:#000000"
             id="midPointStop420" />
        </radialGradient>
        <circle
           style="fill:url(#radialGradient448)"
           cx="413.77899"
           cy="64.064003"
           r="8.4849997"
           id="circle185"
           sodipodi:cx="413.77899"
           sodipodi:cy="64.064003"
           sodipodi:rx="8.4849997"
           sodipodi:ry="8.4849997" />
        <ellipse
           transform="matrix(0.934300,0.356600,-0.356600,0.934300,49.30750,-141.0440)"
           style="fill:none;stroke:#ffffff;stroke-width:0.40000001"
           cx="407.21600"
           cy="63.217999"
           rx="0.47099999"
           ry="0.80100000"
           id="ellipse187"
           sodipodi:cx="407.21600"
           sodipodi:cy="63.217999"
           sodipodi:rx="0.47099999"
           sodipodi:ry="0.80100000" />
        <ellipse
           transform="matrix(0.934200,0.356700,-0.356700,0.934200,48.41580,-141.6763)"
           style="fill:none;stroke:#ffffff;stroke-width:0.40000001"
           cx="408.28601"
           cy="60.415001"
           rx="0.47099999"
           ry="0.80100000"
           id="ellipse189"
           sodipodi:cx="408.28601"
           sodipodi:cy="60.415001"
           sodipodi:rx="0.47099999"
           sodipodi:ry="0.80100000" />
        <ellipse
           transform="matrix(0.934200,0.356800,-0.356800,0.934200,49.35770,-142.1082)"
           style="fill:none;stroke:#ffffff;stroke-width:0.40000001"
           cx="409.86401"
           cy="62.730000"
           rx="0.56599998"
           ry="0.80100000"
           id="ellipse191"
           sodipodi:cx="409.86401"
           sodipodi:cy="62.730000"
           sodipodi:rx="0.56599998"
           sodipodi:ry="0.80100000" />
      </g>
    </g>
    <g
       id="g195"
       transform="matrix(0.912400,0.000000,0.000000,0.912400,0.319615,-0.814644)">
      <path
         d="M 259.85000,136.15000 C 262.50100,136.15000 264.65000,134.00100 264.65000,131.35000 L 264.65000,131.35000 C 264.65000,128.69900 262.50100,126.55000 259.85000,126.55000 L 245.45000,126.55000 C 242.80000,126.55000 240.65000,128.69900 240.65000,131.35000 L 240.65000,131.35000 C 240.65000,134.00100 242.79900,136.15000 245.45000,136.15000 L 259.85000,136.15000 z "
         id="path197" />
      <path
         d="M 366.65000,136.15000 C 369.30100,136.15000 371.45000,134.00100 371.45000,131.35000 L 371.45000,131.35000 C 371.45000,128.69900 369.30100,126.55000 366.65000,126.55000 L 352.25000,126.55000 C 349.59900,126.55000 347.45000,128.69900 347.45000,131.35000 L 347.45000,131.35000 C 347.45000,134.00100 349.59900,136.15000 352.25000,136.15000 L 366.65000,136.15000 z "
         id="path199" />
      <path
         d="M 259.85000,212.95000 C 262.50100,212.95000 264.65000,210.80100 264.65000,208.15000 L 264.65000,208.15000 C 264.65000,205.49900 262.50100,203.35000 259.85000,203.35000 L 245.45000,203.35000 C 242.80000,203.35000 240.65000,205.49900 240.65000,208.15000 L 240.65000,208.15000 C 240.65000,210.80100 242.79900,212.95000 245.45000,212.95000 L 259.85000,212.95000 z "
         id="path201" />
      <path
         d="M 366.65000,212.95000 C 369.30100,212.95000 371.45000,210.80100 371.45000,208.15000 L 371.45000,208.15000 C 371.45000,205.49900 369.30100,203.35000 366.65000,203.35000 L 352.25000,203.35000 C 349.59900,203.35000 347.45000,205.49900 347.45000,208.15000 L 347.45000,208.15000 C 347.45000,210.80100 349.59900,212.95000 352.25000,212.95000 L 366.65000,212.95000 z "
         id="path203" />
      <path
         style="fill:#7f7f7f"
         d="M 376.25000,206.95000 C 381.55200,206.95000 385.85000,202.65200 385.85000,197.34900 L 385.85000,142.15000 C 385.85000,136.84800 381.55200,132.54900 376.25000,132.54900 L 241.85000,132.54900 C 236.54800,132.54900 232.25000,136.84700 232.25000,142.15000 L 232.25000,197.34900 C 232.25000,202.65200 236.54800,206.95000 241.85000,206.95000 L 376.25000,206.95000 z "
         id="path205" />
      <path
         style="fill:#dcdcdc"
         d="M 372.85900,200.96400 C 377.13900,200.96400 380.60900,195.37400 380.60900,188.47900 L 380.60900,151.02100 C 380.60900,144.12600 377.13900,138.53600 372.85900,138.53600 L 317.64100,138.53600 C 313.36100,138.53600 309.89100,144.12600 309.89100,151.02100 L 309.89100,188.47900 C 309.89100,195.37400 313.36100,200.96400 317.64100,200.96400 L 372.85900,200.96400 z "
         id="path207" />
      <ellipse
         style="fill:#ffffff"
         cx="239.93800"
         cy="149.55000"
         rx="3.1819999"
         ry="9.3339996"
         id="ellipse209"
         sodipodi:cx="239.93800"
         sodipodi:cy="149.55000"
         sodipodi:rx="3.1819999"
         sodipodi:ry="9.3339996" />
      <ellipse
         style="fill:#ffffff"
         cx="239.93800"
         cy="189.14999"
         rx="3.1819999"
         ry="9.3339996"
         id="ellipse211"
         sodipodi:cx="239.93800"
         sodipodi:cy="189.14999"
         sodipodi:rx="3.1819999"
         sodipodi:ry="9.3339996" />
      <path
         style="fill:#7f7f7f;stroke:#ffffff"
         d="M 270.45000,198.75000 C 272.68700,198.75000 274.50000,196.33300 274.50000,193.35100 L 274.50000,147.75000 C 274.50000,144.76800 272.68700,142.35100 270.45000,142.35100 L 270.45000,142.35100 C 268.21300,142.35100 266.40000,144.76800 266.40000,147.75000 L 266.40000,193.35100 C 266.40000,196.33300 268.21300,198.75000 270.45000,198.75000 L 270.45000,198.75000 z "
         id="path213" />
    </g>
    <circle
       style="fill:none;stroke:#000000;stroke-width:1.0960104;stroke-miterlimit:4.0000000;stroke-dasharray:2.1920210 1.0960105 ;stroke-dashoffset:0.0000000"
       cx="412.79001"
       cy="170.11301"
       r="8.4849997"
       id="circle216"
       transform="matrix(0.912400,0.000000,0.000000,0.912400,0.319615,-0.814644)"
       sodipodi:cx="412.79001"
       sodipodi:cy="170.11301"
       sodipodi:rx="8.4849997"
       sodipodi:ry="8.4849997" />
    <g
       id="g218"
       transform="matrix(0.912400,0.000000,0.000000,0.912400,0.319615,-0.814644)">
      <radialGradient
         id="radialGradient422"
         cx="336.30029"
         cy="63.375000"
         r="13.782300"
         fx="336.30029"
         fy="63.375000"
         gradientTransform="matrix(0.800000,0.000000,0.000000,0.800000,89.23400,117.0230)"
         gradientUnits="userSpaceOnUse">
        <stop
           offset="0"
           style="stop-color:#E4E4E4"
           id="stop424" />
        <stop
           offset="0.22"
           style="stop-color:#000000"
           id="stop426" />
        <midPointStop
           offset="0"
           style="stop-color:#E4E4E4"
           id="midPointStop428" />
        <midPointStop
           offset="0.5"
           style="stop-color:#E4E4E4"
           id="midPointStop430" />
        <midPointStop
           offset="0.22"
           style="stop-color:#000000"
           id="midPointStop432" />
      </radialGradient>
      <circle
         style="fill:url(#radialGradient447)"
         cx="355.84100"
         cy="170.38800"
         r="8.4849997"
         id="circle232"
         sodipodi:cx="355.84100"
         sodipodi:cy="170.38800"
         sodipodi:rx="8.4849997"
         sodipodi:ry="8.4849997" />
      <ellipse
         transform="matrix(0.934200,0.356800,-0.356800,0.934200,83.47890,-113.4610)"
         style="fill:none;stroke:#ffffff;stroke-width:0.40000001"
         cx="349.27802"
         cy="169.54100"
         rx="0.47099999"
         ry="0.80199999"
         id="ellipse234"
         sodipodi:cx="349.27802"
         sodipodi:cy="169.54100"
         sodipodi:rx="0.47099999"
         sodipodi:ry="0.80199999" />
      <ellipse
         transform="matrix(0.934200,0.356800,-0.356800,0.934200,82.54930,-114.0273)"
         style="fill:none;stroke:#ffffff;stroke-width:0.40000001"
         cx="350.34799"
         cy="166.73801"
         rx="0.47099999"
         ry="0.80100000"
         id="ellipse236"
         sodipodi:cx="350.34799"
         sodipodi:cy="166.73801"
         sodipodi:rx="0.47099999"
         sodipodi:ry="0.80100000" />
      <ellipse
         transform="matrix(0.934300,0.356500,-0.356500,0.934300,83.37910,-114.3431)"
         style="fill:none;stroke:#ffffff;stroke-width:0.40000001"
         cx="351.92599"
         cy="169.05299"
         rx="0.56599998"
         ry="0.80100000"
         id="ellipse238"
         sodipodi:cx="351.92599"
         sodipodi:cy="169.05299"
         sodipodi:rx="0.56599998"
         sodipodi:ry="0.80100000" />
    </g>
    <g
       id="g241"
       transform="matrix(0.912400,0.000000,0.000000,0.912400,0.319615,-0.814644)">
      <path
         d="M 236.85000,243.55000 C 239.50100,243.55000 241.65000,241.40100 241.65000,238.75000 L 241.65000,238.75000 C 241.65000,236.09900 239.50100,233.95000 236.85000,233.95000 L 222.45000,233.95000 C 219.80000,233.95000 217.65000,236.09900 217.65000,238.75000 L 217.65000,238.75000 C 217.65000,241.40100 219.79900,243.55000 222.45000,243.55000 L 236.85000,243.55000 z "
         id="path243" />
      <path
         d="M 343.65000,243.55000 C 346.30100,243.55000 348.45000,241.40100 348.45000,238.75000 L 348.45000,238.75000 C 348.45000,236.09900 346.30100,233.95000 343.65000,233.95000 L 329.25000,233.95000 C 326.59900,233.95000 324.45000,236.09900 324.45000,238.75000 L 324.45000,238.75000 C 324.45000,241.40100 326.59900,243.55000 329.25000,243.55000 L 343.65000,243.55000 z "
         id="path245" />
      <path
         d="M 236.85000,320.35000 C 239.50100,320.35000 241.65000,318.20100 241.65000,315.55000 L 241.65000,315.55000 C 241.65000,312.89900 239.50100,310.75000 236.85000,310.75000 L 222.45000,310.75000 C 219.80000,310.75000 217.65000,312.89900 217.65000,315.55000 L 217.65000,315.55000 C 217.65000,318.20100 219.79900,320.35000 222.45000,320.35000 L 236.85000,320.35000 z "
         id="path247" />
      <path
         d="M 343.65000,320.35000 C 346.30100,320.35000 348.45000,318.20100 348.45000,315.55000 L 348.45000,315.55000 C 348.45000,312.89900 346.30100,310.75000 343.65000,310.75000 L 329.25000,310.75000 C 326.59900,310.75000 324.45000,312.89900 324.45000,315.55000 L 324.45000,315.55000 C 324.45000,318.20100 326.59900,320.35000 329.25000,320.35000 L 343.65000,320.35000 z "
         id="path249" />
      <path
         style="fill:#7f7f7f"
         d="M 353.25000,314.35000 C 358.55200,314.35000 362.85000,310.05200 362.85000,304.75000 L 362.85000,249.55000 C 362.85000,244.24800 358.55200,239.94900 353.25000,239.94900 L 218.85000,239.94900 C 213.54800,239.94900 209.25000,244.24700 209.25000,249.55000 L 209.25000,304.75000 C 209.25000,310.05200 213.54800,314.35000 218.85000,314.35000 L 353.25000,314.35000 z "
         id="path251" />
      <path
         style="fill:#dcdcdc"
         d="M 349.85900,308.36400 C 354.13900,308.36400 357.60900,302.77400 357.60900,295.87900 L 357.60900,258.42100 C 357.60900,251.52600 354.13900,245.93600 349.85900,245.93600 L 294.64100,245.93600 C 290.36100,245.93600 286.89100,251.52600 286.89100,258.42100 L 286.89100,295.87900 C 286.89100,302.77500 290.36100,308.36400 294.64100,308.36400 L 349.85900,308.36400 L 349.85900,308.36400 z "
         id="path253" />
      <ellipse
         style="fill:#ffffff"
         cx="216.93800"
         cy="256.95001"
         rx="3.1819999"
         ry="9.3339996"
         id="ellipse255"
         sodipodi:cx="216.93800"
         sodipodi:cy="256.95001"
         sodipodi:rx="3.1819999"
         sodipodi:ry="9.3339996" />
      <ellipse
         style="fill:#ffffff"
         cx="216.93800"
         cy="296.54999"
         rx="3.1819999"
         ry="9.3339996"
         id="ellipse257"
         sodipodi:cx="216.93800"
         sodipodi:cy="296.54999"
         sodipodi:rx="3.1819999"
         sodipodi:ry="9.3339996" />
      <path
         style="fill:#7f7f7f;stroke:#ffffff"
         d="M 247.45000,306.15000 C 249.68700,306.15000 251.50000,303.73300 251.50000,300.75100 L 251.50000,255.15000 C 251.50000,252.16800 249.68700,249.75000 247.45000,249.75000 L 247.45000,249.75000 C 245.21300,249.75000 243.40000,252.16700 243.40000,255.15000 L 243.40000,300.75100 C 243.40000,303.73300 245.21300,306.15000 247.45000,306.15000 L 247.45000,306.15000 z "
         id="path259" />
    </g>
    <g
       id="g262"
       transform="matrix(0.912400,0.000000,0.000000,0.912400,0.319615,-0.814644)">
      <radialGradient
         id="radialGradient434"
         cx="336.30029"
         cy="63.375000"
         r="13.782300"
         fx="336.30029"
         fy="63.375000"
         gradientTransform="matrix(0.800000,0.000000,0.000000,0.800000,39.01630,225.2527)"
         gradientUnits="userSpaceOnUse">
        <stop
           offset="0"
           style="stop-color:#E4E4E4"
           id="stop436" />
        <stop
           offset="0.22"
           style="stop-color:#000000"
           id="stop438" />
        <midPointStop
           offset="0"
           style="stop-color:#E4E4E4"
           id="midPointStop440" />
        <midPointStop
           offset="0.5"
           style="stop-color:#E4E4E4"
           id="midPointStop442" />
        <midPointStop
           offset="0.22"
           style="stop-color:#000000"
           id="midPointStop444" />
      </radialGradient>
      <circle
         style="fill:url(#radialGradient446)"
         cx="305.62299"
         cy="278.61700"
         r="8.4849997"
         id="circle276"
         sodipodi:cx="305.62299"
         sodipodi:cy="278.61700"
         sodipodi:rx="8.4849997"
         sodipodi:ry="8.4849997" />
      <ellipse
         transform="matrix(0.934400,0.356300,-0.356300,0.934400,118.6121,-88.33320)"
         style="fill:none;stroke:#ffffff;stroke-width:0.40000001"
         cx="299.06000"
         cy="277.77100"
         rx="0.47099999"
         ry="0.80100000"
         id="ellipse278"
         sodipodi:cx="299.06000"
         sodipodi:cy="277.77100"
         sodipodi:rx="0.47099999"
         sodipodi:ry="0.80100000" />
      <ellipse
         transform="matrix(0.934200,0.356800,-0.356800,0.934200,117.8598,-88.98680)"
         style="fill:none;stroke:#ffffff;stroke-width:0.40000001"
         cx="300.13000"
         cy="274.96799"
         rx="0.47099999"
         ry="0.80100000"
         id="ellipse280"
         sodipodi:cx="300.13000"
         sodipodi:cy="274.96799"
         sodipodi:rx="0.47099999"
         sodipodi:ry="0.80100000" />
      <ellipse
         transform="matrix(0.934200,0.356800,-0.356800,0.934200,118.8079,-89.40650)"
         style="fill:none;stroke:#ffffff;stroke-width:0.40000001"
         cx="301.70801"
         cy="277.28299"
         rx="0.56599998"
         ry="0.80199999"
         id="ellipse282"
         sodipodi:cx="301.70801"
         sodipodi:cy="277.28299"
         sodipodi:rx="0.56599998"
         sodipodi:ry="0.80199999" />
    </g>
    <circle
       style="fill:none;stroke:#000000;stroke-width:1.0960104;stroke-miterlimit:4.0000000;stroke-dasharray:2.1920210 1.0960105 ;stroke-dashoffset:0.0000000"
       cx="412.62299"
       cy="278.34201"
       r="8.4849997"
       id="circle285"
       transform="matrix(0.912400,0.000000,0.000000,0.912400,0.319615,-0.814644)"
       sodipodi:cx="412.62299"
       sodipodi:cy="278.34201"
       sodipodi:rx="8.4849997"
       sodipodi:ry="8.4849997" />
    <circle
       style="fill:none;stroke:#000000;stroke-width:1.0960104;stroke-miterlimit:4.0000000;stroke-dasharray:2.1920210 1.0960105 ;stroke-dashoffset:0.0000000"
       cx="355.62100"
       cy="278.34201"
       r="8.4849997"
       id="circle287"
       transform="matrix(0.912400,0.000000,0.000000,0.912400,0.319615,-0.814644)"
       sodipodi:cx="355.62100"
       sodipodi:cy="278.34201"
       sodipodi:rx="8.4849997"
       sodipodi:ry="8.4849997" />
    <line
       style="fill:none;stroke:#000000;stroke-width:1.0000000;stroke-miterlimit:4.0000000;stroke-dasharray:2.0000000 1.0000000 ;stroke-dashoffset:0.0000000"
       x1="376.73032"
       y1="0.0022555664"
       x2="376.73032"
       y2="304.74384"
       id="line289" />
    <line
       style="fill:none;stroke:#000000;stroke-width:1.0000000;stroke-miterlimit:4.0000000;stroke-dasharray:2.0000000 1.0000000 ;stroke-dashoffset:0.0000000"
       x1="324.72348"
       y1="137.77159"
       x2="324.72348"
       y2="308.39038"
       id="line291" />
    <line
       style="fill:none;stroke:#000000;stroke-width:1.0000000;stroke-miterlimit:4.0000000;stroke-dasharray:2.0000000 1.0000000 ;stroke-dashoffset:0.0000000"
       x1="279.12268"
       y1="239.83092"
       x2="279.12268"
       y2="307.34851"
       id="line293" />
    <line
       style="fill:none;stroke:#000000;stroke-width:1.0000000;stroke-miterlimit:4.0000000;stroke-dasharray:2.0000000 1.0000000 ;stroke-dashoffset:0.0000000"
       x1="117.55210"
       y1="0.0022252873"
       x2="117.55210"
       y2="304.74384"
       id="line295" />
    <line
       style="fill:none;stroke:#000000;stroke-width:1.0000000;stroke-miterlimit:4.0000000;stroke-dasharray:2.0000000 1.0000000 ;stroke-dashoffset:0.0000000"
       x1="110.32133"
       y1="137.77156"
       x2="110.32133"
       y2="308.39038"
       id="line297" />
    <line
       style="fill:none;stroke:#000000;stroke-width:1.0000000;stroke-miterlimit:4.0000000;stroke-dasharray:2.0000000 1.0000000 ;stroke-dashoffset:0.0000000"
       x1="88.411873"
       y1="239.83090"
       x2="88.411873"
       y2="307.34851"
       id="line299" />
    <rect
       style="fill:#e0e0e0;fill-opacity:1.0000000;stroke:none;stroke-width:1.0960104;stroke-linecap:butt;stroke-linejoin:miter;stroke-miterlimit:4.0000000;stroke-dasharray:2.1920210 1.0960105 ;stroke-dashoffset:0.0000000;stroke-opacity:1.0000000"
       id="rect673"
       width="75.313141"
       height="2.6046715"
       x="271.10818"
       y="306.02792" />
    <rect
       style="fill:#e0e0e0;fill-opacity:1.0000000;stroke:none;stroke-width:1.0960104;stroke-linecap:butt;stroke-linejoin:miter;stroke-miterlimit:4.0000000;stroke-dasharray:2.1920210 1.0960105 ;stroke-dashoffset:0.0000000;stroke-opacity:1.0000000"
       id="rect84"
       width="75.313141"
       height="2.6046715"
       x="57.409008"
       y="305.99442" />
    <text
       xml:space="preserve"
       style="font-size:9.0000000;font-style:normal;font-variant:normal;font-weight:normal;font-stretch:normal;fill:#000000;fill-opacity:1.0000000;stroke:none;stroke-width:1.0000000pt;stroke-linecap:butt;stroke-linejoin:miter;stroke-opacity:1.0000000;font-family:Bitstream Vera Sans;text-anchor:start;writing-mode:lr-tb"
       x="3.7193277"
       y="9.3343487"
       id="text85"
       sodipodi:linespacing="100%"><tspan
         sodipodi:role="line"
         id="tspan86"
         x="3.7193277"
         y="9.3343487">1</tspan></text>
    <text
       xml:space="preserve"
       style="font-size:9.0000000;font-style:normal;font-variant:normal;font-weight:normal;font-stretch:normal;fill:#000000;fill-opacity:1.0000000;stroke:none;stroke-width:1.0000000pt;stroke-linecap:butt;stroke-linejoin:miter;stroke-opacity:1.0000000;font-family:Bitstream Vera Sans;text-anchor:start;writing-mode:lr-tb"
       x="162.46309"
       y="9.3343487"
       id="text88"
       sodipodi:linespacing="100%"><tspan
         sodipodi:role="line"
         id="tspan89"
         x="162.46309"
         y="9.3343487">2</tspan></text>
  </g>
</svg>
