<?xml version="1.0" encoding="UTF-8" standalone="no"?>
<!DOCTYPE svg PUBLIC "-//W3C//DTD SVG 20010904//EN"
"http://www.w3.org/TR/2001/REC-SVG-20010904/DTD/svg10.dtd">
<!-- Created with Inkscape (http://www.inkscape.org/) -->
<svg:svg
   width="52.000000mm"
   height="135.63000mm"
   xmlns:cc="http://web.resource.org/cc/"
   xmlns:inkscape="http://www.inkscape.org/namespaces/inkscape"
   xmlns:sodipodi="http://sodipodi.sourceforge.net/DTD/sodipodi-0.dtd"
   xmlns:rdf="http://www.w3.org/1999/02/22-rdf-syntax-ns#"
   xmlns:svg="http://www.w3.org/2000/svg"
   xmlns:dc="http://purl.org/dc/elements/1.1/"
   xmlns:xlink="http://www.w3.org/1999/xlink"
   id="svg35"
   sodipodi:version="0.32"
   inkscape:version="0.40+cvs"
   sodipodi:docbase="/home/bcrowell/Documents/writing/lm/trunk/1np/ch09/figs"
   sodipodi:docname="nonuniform.svg">
  <svg:metadata
     id="metadata37" />
  <svg:defs
     id="defs3" />
  <sodipodi:namedview
     id="base"
     pagecolor="#ffffff"
     bordercolor="#666666"
     borderopacity="1.0"
     inkscape:pageopacity="0.0"
     inkscape:pageshadow="2"
     inkscape:zoom="0.79991455"
     inkscape:cx="135.72111"
     inkscape:cy="151.84785"
     inkscape:current-layer="layer1"
     inkscape:window-width="640"
     inkscape:window-height="536"
     inkscape:window-x="100"
     inkscape:window-y="20" />
  <svg:metadata
     id="metadata4">
    <rdf:RDF
       id="RDF5">
      <cc:Work
         rdf:about=""
         id="Work6">
        <dc:format
           id="format7">image/svg+xml</dc:format>
        <dc:type
           id="type9"
           rdf:resource="http://purl.org/dc/dcmitype/StillImage" />
      </cc:Work>
    </rdf:RDF>
  </svg:metadata>
  <svg:g
     inkscape:label="Layer 1"
     inkscape:groupmode="layer"
     id="layer1">
    <svg:g
       id="g38"
       transform="translate(-394.4415,545.7139)">
      <svg:rect
         style="fill:#e1e1e1;fill-opacity:1.0000000;fill-rule:evenodd;stroke:none;stroke-width:1.0000000pt;stroke-linecap:butt;stroke-linejoin:miter;stroke-opacity:1.0000000"
         id="rect236"
         width="184.25197"
         height="169.28589"
         x="394.44763"
         y="-234.42477" />
      <svg:rect
         style="fill:#e1e1e1;fill-opacity:1.0000000;fill-rule:evenodd;stroke:none;stroke-width:1.0000000pt;stroke-linecap:butt;stroke-linejoin:miter;stroke-opacity:1.0000000"
         id="rect235"
         width="184.25197"
         height="147.81009"
         x="394.44763"
         y="-390.06772" />
      <svg:rect
         style="fill:#e1e1e1;fill-opacity:1.0000000;fill-rule:evenodd;stroke:none;stroke-width:1.0000000pt;stroke-linecap:butt;stroke-linejoin:miter;stroke-opacity:1.0000000"
         id="rect161"
         width="184.25197"
         height="147.81009"
         x="394.44763"
         y="-545.71069" />
      <svg:g
         id="Layer_1"
         transform="matrix(1.326050,0.000000,0.000000,1.326050,426.6729,-536.2186)">
        <svg:g
           id="g7">
          <svg:path
             style="fill:none;stroke:#000000;stroke-width:0.50000000"
             d="M 92.071000,96.900000 C 80.734000,51.913000 46.709000,15.945000 2.8740000,1.8800000"
             id="path9" />
          <svg:path
             d="M 0.0000000,0.95800000 C 1.5130000,0.89000000 3.4650000,0.57200000 4.7960000,0.0000000 L 3.2500000,2.0010000 L 3.3420000,4.5270000 C 2.5940000,3.2880000 1.1910000,1.8930000 0.0000000,0.95800000 z "
             id="path11" />
        </svg:g>
        <svg:g
           id="g14">
          <svg:line
             style="fill:none;stroke:#000000"
             x1="78.079002"
             y1="62.014999"
             x2="29.964001"
             y2="36.676998"
             id="line16" />
          <svg:path
             d="M 27.291000,35.275000 C 28.793000,35.470000 30.771000,35.496000 32.180000,35.162000 L 30.311000,36.865000 L 29.964000,39.369000 C 29.441000,38.020000 28.302000,36.403000 27.291000,35.275000 z "
             id="path18" />
        </svg:g>
        <svg:g
           id="g21">
          <svg:line
             style="fill:none;stroke:#000000"
             x1="78.579002"
             y1="62.880001"
             x2="54.580002"
             y2="21.311001"
             id="line23" />
          <svg:path
             d="M 53.071000,18.698000 C 54.237000,19.664000 55.896000,20.740000 57.266000,21.210000 L 54.777000,21.654000 L 53.148000,23.587000 C 53.427000,22.166000 53.324000,20.191000 53.071000,18.698000 z "
             id="path25" />
        </svg:g>
        <svg:g
           id="g28">
          <svg:line
             style="fill:none;stroke:#000000"
             x1="78.212997"
             y1="62.318001"
             x2="52.230999"
             y2="77.317001"
             id="line30" />
          <svg:path
             d="M 49.618000,78.826000 C 50.585000,77.660000 51.661000,76.001000 52.131000,74.631000 L 52.575000,77.120000 L 54.508000,78.749000 C 53.087000,78.470000 51.111000,78.573000 49.618000,78.826000 z "
             id="path32" />
        </svg:g>
        <svg:text
           transform="translate(62.41110,83.83110)"
           id="text35"><svg:tspan
             x="0"
             y="0"
             style="font-size:7.6500001;font-family:Bitstream Vera Sans-Bold'"
             id="tspan36">a</svg:tspan><svg:tspan
             x="5.006"
             y="3"
             style="font-size:5.9499998;font-family:Bitstream Vera Sans"
             id="tspan38">r</svg:tspan></svg:text>
        <svg:text
           transform="translate(71.41110,38.83110)"
           id="text41"><svg:tspan
             x="0"
             y="0"
             style="font-size:7.6500001;font-family:Bitstream Vera Sans-Bold'"
             id="tspan42">a</svg:tspan><svg:tspan
             x="5.006"
             y="3"
             style="font-size:5.9499998;font-family:Bitstream Vera Sans"
             id="tspan44">t</svg:tspan></svg:text>
        <svg:text
           transform="translate(26.41110,48.83110)"
           id="text47"><svg:tspan
             x="0"
             y="0"
             style="font-size:7.6500001;font-family:Bitstream Vera Sans-Bold'"
             id="tspan48">a</svg:tspan></svg:text>
      </svg:g>
      <svg:g
         id="g237"
         transform="translate(87.81335,-1018.473)">
        <svg:g
           id="g70"
           transform="matrix(1.326050,0.000000,0.000000,1.326050,338.8596,636.9340)">
          <svg:path
             style="fill:none;stroke:#000000;stroke-width:0.50000000"
             d="M 92.071000,96.900000 C 80.734000,51.913000 46.709000,15.945000 2.8740000,1.8800000"
             id="path72" />
          <svg:path
             d="M 0.0000000,0.95800000 C 1.5130000,0.89000000 3.4650000,0.57200000 4.7960000,0.0000000 L 3.2500000,2.0010000 L 3.3420000,4.5270000 C 2.5940000,3.2880000 1.1910000,1.8930000 0.0000000,0.95800000 z "
             id="path74" />
        </svg:g>
        <svg:g
           id="g91"
           transform="matrix(1.326050,0.000000,0.000000,1.326050,333.6939,630.0232)">
          <svg:line
             style="fill:none;stroke:#000000"
             x1="78.212997"
             y1="62.318001"
             x2="52.230999"
             y2="77.317001"
             id="line93" />
          <svg:path
             d="M 49.618000,78.826000 C 50.585000,77.660000 51.661000,76.001000 52.131000,74.631000 L 52.575000,77.120000 L 54.508000,78.749000 C 53.087000,78.470000 51.111000,78.573000 49.618000,78.826000 z "
             id="path95" />
        </svg:g>
        <svg:text
           id="text98"
           x="428.18927"
           y="741.18744"><svg:tspan
             x="428.18927"
             y="741.18744"
             style="font-size:10.144283;font-family:Bitstream Vera Sans-Bold'"
             id="tspan99">a</svg:tspan><svg:tspan
             x="434.82748"
             y="745.16559"
             style="font-size:7.8899980;font-family:Bitstream Vera Sans"
             id="tspan101">r</svg:tspan></svg:text>
      </svg:g>
      <svg:g
         id="g238"
         transform="translate(87.81335,-1020.646)">
        <svg:g
           id="g116"
           transform="matrix(1.326050,0.000000,0.000000,1.326050,338.8596,791.3152)">
          <svg:path
             style="fill:none;stroke:#000000;stroke-width:0.50000000"
             d="M 92.071000,96.900000 C 80.734000,51.913000 46.709000,15.945000 2.8740000,1.8800000"
             id="path118" />
          <svg:path
             d="M 0.0000000,0.95800000 C 1.5130000,0.89000000 3.4650000,0.57200000 4.7960000,0.0000000 L 3.2500000,2.0010000 L 3.3420000,4.5270000 C 2.5940000,3.2880000 1.1910000,1.8930000 0.0000000,0.95800000 z "
             id="path120" />
        </svg:g>
        <svg:g
           id="g123"
           transform="matrix(0.663025,-1.148392,-1.148392,-0.663025,462.3123,1005.142)">
          <svg:line
             style="fill:none;stroke:#000000"
             x1="78.079002"
             y1="62.014999"
             x2="29.964001"
             y2="36.676998"
             id="line125" />
          <svg:path
             d="M 27.291000,35.275000 C 28.793000,35.470000 30.771000,35.496000 32.180000,35.162000 L 30.311000,36.865000 L 29.964000,39.369000 C 29.441000,38.020000 28.302000,36.403000 27.291000,35.275000 z "
             id="path127" />
        </svg:g>
        <svg:g
           id="g130"
           transform="matrix(-1.326050,0.000000,0.000000,-1.326050,546.5397,956.7214)">
          <svg:line
             style="fill:none;stroke:#000000"
             x1="78.579002"
             y1="62.880001"
             x2="54.580002"
             y2="21.311001"
             id="line132" />
          <svg:path
             d="M 53.071000,18.698000 C 54.237000,19.664000 55.896000,20.740000 57.266000,21.210000 L 54.777000,21.654000 L 53.148000,23.587000 C 53.427000,22.166000 53.324000,20.191000 53.071000,18.698000 z "
             id="path134" />
        </svg:g>
        <svg:g
           id="g137"
           transform="matrix(0.663025,-1.148392,-1.148392,-0.663025,462.3123,1005.142)">
          <svg:line
             style="fill:none;stroke:#000000"
             x1="78.212997"
             y1="62.318001"
             x2="52.230999"
             y2="77.317001"
             id="line139" />
          <svg:path
             d="M 49.618000,78.826000 C 50.585000,77.660000 51.661000,76.001000 52.131000,74.631000 L 52.575000,77.120000 L 54.508000,78.749000 C 53.087000,78.470000 51.111000,78.573000 49.618000,78.826000 z "
             id="path141" />
        </svg:g>
        <svg:text
           id="text144"
           x="415.38062"
           y="877.52332"><svg:tspan
             x="415.38062"
             y="877.52332"
             style="font-size:10.144279;font-family:Bitstream Vera Sans-Bold'"
             id="tspan145">a</svg:tspan><svg:tspan
             x="422.0188"
             y="881.50146"
             style="font-size:7.8899946;font-family:Bitstream Vera Sans"
             id="tspan147">r</svg:tspan></svg:text>
        <svg:text
           id="text150"
           x="461.42145"
           y="897.7099"><svg:tspan
             x="461.42145"
             y="897.7099"
             style="font-size:10.144279;font-family:Bitstream Vera Sans-Bold'"
             id="tspan151">a</svg:tspan><svg:tspan
             x="468.05963"
             y="901.68805"
             style="font-size:7.8899946;font-family:Bitstream Vera Sans"
             id="tspan153">t</svg:tspan></svg:text>
        <svg:text
           id="text156"
           x="432.52811"
           y="916.3775"><svg:tspan
             x="432.52811"
             y="916.3775"
             style="font-size:10.144279;font-family:Bitstream Vera Sans-Bold'"
             id="tspan157">a</svg:tspan></svg:text>
      </svg:g>
      <svg:text
         xml:space="preserve"
         style="font-size:9.0000000;font-style:normal;font-variant:normal;font-weight:normal;font-stretch:normal;fill:#000000;fill-opacity:1.0000000;stroke:none;stroke-width:1.0000000pt;stroke-linecap:butt;stroke-linejoin:miter;stroke-opacity:1.0000000;font-family:Bitstream Vera Sans;text-anchor:start;writing-mode:lr-tb"
         x="406.36084"
         y="-253.52487"
         id="text239"
         sodipodi:linespacing="100%"><svg:tspan
           sodipodi:role="line"
           id="tspan240"
           x="406.36084"
           y="-253.52487">2</svg:tspan></svg:text>
      <svg:text
         xml:space="preserve"
         style="font-size:9.0000000;font-style:normal;font-variant:normal;font-weight:normal;font-stretch:normal;fill:#000000;fill-opacity:1.0000000;stroke:none;stroke-width:1.0000000pt;stroke-linecap:butt;stroke-linejoin:miter;stroke-opacity:1.0000000;font-family:Bitstream Vera Sans;text-anchor:start;writing-mode:lr-tb"
         x="406.03125"
         y="-409.69894"
         id="text242"
         sodipodi:linespacing="100%"><svg:tspan
           sodipodi:role="line"
           id="tspan243"
           x="406.03125"
           y="-409.69894">1</svg:tspan></svg:text>
      <svg:text
         xml:space="preserve"
         style="font-size:9.0000000;font-style:normal;font-variant:normal;font-weight:normal;font-stretch:normal;fill:#000000;fill-opacity:1.0000000;stroke:none;stroke-width:1.0000000pt;stroke-linecap:butt;stroke-linejoin:miter;stroke-opacity:1.0000000;font-family:Bitstream Vera Sans;text-anchor:start;writing-mode:lr-tb"
         x="406.33447"
         y="-77.095001"
         id="text245"
         sodipodi:linespacing="100%"><svg:tspan
           sodipodi:role="line"
           id="tspan246"
           x="406.33447"
           y="-77.095001">3</svg:tspan></svg:text>
    </svg:g>
  </svg:g>
</svg:svg>
