<?xml version="1.0" encoding="UTF-8" standalone="no"?>
<!-- Generator: Adobe Illustrator 11 Build 196, SVG Export Plug-In . SVG Version: 6.0.0 Build 78)  -->
<svg
   xmlns:dc="http://purl.org/dc/elements/1.1/"
   xmlns:cc="http://web.resource.org/cc/"
   xmlns:rdf="http://www.w3.org/1999/02/22-rdf-syntax-ns#"
   xmlns:svg="http://www.w3.org/2000/svg"
   xmlns="http://www.w3.org/2000/svg"
   xmlns:sodipodi="http://inkscape.sourceforge.net/DTD/sodipodi-0.dtd"
   xmlns:inkscape="http://www.inkscape.org/namespaces/inkscape"
   width="118.189"
   height="249.842"
   viewBox="0 0 118.189 249.842"
   style="overflow:visible;enable-background:new 0 0 118.189 249.842"
   xml:space="preserve"
   id="svg2"
   sodipodi:version="0.32"
   inkscape:version="0.42.2"
   sodipodi:docname="force-curve-2.svg"
   sodipodi:docbase="/home/bcrowell/Documents/writing/lm/trunk/3vw/ch01/figs"><metadata
   id="metadata152"><rdf:RDF><cc:Work
       rdf:about=""><dc:format>image/svg+xml</dc:format><dc:type
         rdf:resource="http://purl.org/dc/dcmitype/StillImage" /></cc:Work></rdf:RDF></metadata><defs
   id="defs150">
		
		
		
		
		
		
		
		
		
		
		
		 
		
		
		
	</defs><sodipodi:namedview
   inkscape:cy="136.44552"
   inkscape:cx="92.538919"
   inkscape:zoom="1.2279853"
   inkscape:window-height="996"
   inkscape:window-width="1278"
   inkscape:pageshadow="2"
   inkscape:pageopacity="0.0"
   borderopacity="1.0"
   bordercolor="#666666"
   pagecolor="#ffffff"
   id="base"
   inkscape:window-x="0"
   inkscape:window-y="0"
   inkscape:current-layer="svg2" />
	<style
   type="text/css"
   id="style4">
	
	</style>
	<rect
   style="fill:#dedede;fill-opacity:1.0000000;fill-rule:evenodd;stroke:none;stroke-width:1.0000000pt;stroke-linecap:butt;stroke-linejoin:miter;stroke-opacity:1.0000000"
   id="rect1450"
   width="184.25197"
   height="278.70016"
   x="-34.549610"
   y="-12.735005" /><g
   id="g7">
			<text
   id="text9"
   transform="translate(56.04740,135.7168)"><tspan
     id="tspan11"
     style="font-size:8.5000000px;font-family:Bitstream Vera Sans"
     y="0"
     x="0">F</tspan></text>

		</g><g
   id="g13">
			<text
   id="text15"
   transform="translate(113.0474,192.4668)"><tspan
     id="tspan17"
     style="font-size:8.5000000px;font-family:Bitstream Vera Sans"
     y="0"
     x="0">x</tspan></text>

		</g><g
   id="g19"
   transform="translate(-22.00000,-3.043260e-13)">
			<text
   id="text21"
   transform="translate(0.000000,13.31640)"><tspan
     id="tspan23"
     style="font-size:8.5000000px;font-family:Bitstream Vera Sans"
     y="0"
     x="0">1</tspan></text>

		</g><g
   id="g25"
   transform="translate(-22.00000,-3.043260e-13)">
			<text
   id="text27"
   transform="translate(2.000000,135.3164)"><tspan
     id="tspan29"
     style="font-size:8.5000000px;font-family:Bitstream Vera Sans"
     y="0"
     x="0">2</tspan></text>

		</g><line
   id="line31"
   y2="112.66700"
   x2="58.938999"
   y1="10.667000"
   x1="58.938999"
   style="fill:none;stroke:#000000;stroke-width:0.50000000" /><line
   id="line33"
   y2="61.667000"
   x2="109.93900"
   y1="61.667000"
   x1="7.9390001"
   style="fill:none;stroke:#000000;stroke-width:0.50000000" /><g
   id="g35">
			<text
   id="text37"
   transform="translate(113.1895,64.41650)"><tspan
     id="tspan39"
     style="font-size:8.5000000px;font-family:Bitstream Vera Sans"
     y="0"
     x="0">x</tspan></text>

		</g><g
   id="g41">
			<line
   id="line43"
   y2="63.679001"
   x2="13.541000"
   y1="59.778999"
   x1="13.541000"
   style="fill:none;stroke:#000000;stroke-width:0.50000000" />
			<line
   id="line45"
   y2="63.679001"
   x2="19.209000"
   y1="59.778999"
   x1="19.209000"
   style="fill:none;stroke:#000000;stroke-width:0.50000000" />
			<line
   id="line47"
   y2="63.679001"
   x2="24.879000"
   y1="59.778999"
   x1="24.879000"
   style="fill:none;stroke:#000000;stroke-width:0.50000000" />
			<line
   id="line49"
   y2="63.679001"
   x2="30.548000"
   y1="59.778999"
   x1="30.548000"
   style="fill:none;stroke:#000000;stroke-width:0.50000000" />
			<line
   id="line51"
   y2="63.679001"
   x2="36.217999"
   y1="59.778999"
   x1="36.217999"
   style="fill:none;stroke:#000000;stroke-width:0.50000000" />
			<line
   id="line53"
   y2="63.679001"
   x2="41.887001"
   y1="59.778999"
   x1="41.887001"
   style="fill:none;stroke:#000000;stroke-width:0.50000000" />
			<line
   id="line55"
   y2="63.679001"
   x2="47.556000"
   y1="59.778999"
   x1="47.556000"
   style="fill:none;stroke:#000000;stroke-width:0.50000000" />
			<line
   id="line57"
   y2="63.679001"
   x2="53.226002"
   y1="59.778999"
   x1="53.226002"
   style="fill:none;stroke:#000000;stroke-width:0.50000000" />
			<line
   id="line59"
   y2="63.679001"
   x2="58.895000"
   y1="59.778999"
   x1="58.895000"
   style="fill:none;stroke:#000000;stroke-width:0.50000000" />
			<line
   id="line61"
   y2="63.679001"
   x2="64.564003"
   y1="59.778999"
   x1="64.564003"
   style="fill:none;stroke:#000000;stroke-width:0.50000000" />
			<line
   id="line63"
   y2="63.679001"
   x2="70.233002"
   y1="59.778999"
   x1="70.233002"
   style="fill:none;stroke:#000000;stroke-width:0.50000000" />
			<line
   id="line65"
   y2="63.679001"
   x2="75.903000"
   y1="59.778999"
   x1="75.903000"
   style="fill:none;stroke:#000000;stroke-width:0.50000000" />
			<line
   id="line67"
   y2="63.679001"
   x2="81.571999"
   y1="59.778999"
   x1="81.571999"
   style="fill:none;stroke:#000000;stroke-width:0.50000000" />
			<line
   id="line69"
   y2="63.679001"
   x2="87.240997"
   y1="59.778999"
   x1="87.240997"
   style="fill:none;stroke:#000000;stroke-width:0.50000000" />
			<line
   id="line71"
   y2="63.679001"
   x2="92.911003"
   y1="59.778999"
   x1="92.911003"
   style="fill:none;stroke:#000000;stroke-width:0.50000000" />
			<line
   id="line73"
   y2="63.679001"
   x2="98.580002"
   y1="59.778999"
   x1="98.580002"
   style="fill:none;stroke:#000000;stroke-width:0.50000000" />
			<line
   id="line75"
   y2="63.679001"
   x2="104.24900"
   y1="59.778999"
   x1="104.24900"
   style="fill:none;stroke:#000000;stroke-width:0.50000000" />
		</g><g
   id="g77">
			<line
   id="line79"
   y2="107.02100"
   x2="60.907001"
   y1="107.02100"
   x1="57.007000"
   style="fill:none;stroke:#000000;stroke-width:0.50000000" />
			<line
   id="line81"
   y2="101.35200"
   x2="60.907001"
   y1="101.35200"
   x1="57.007000"
   style="fill:none;stroke:#000000;stroke-width:0.50000000" />
			<line
   id="line83"
   y2="95.682999"
   x2="60.907001"
   y1="95.682999"
   x1="57.007000"
   style="fill:none;stroke:#000000;stroke-width:0.50000000" />
			<line
   id="line85"
   y2="90.013000"
   x2="60.907001"
   y1="90.013000"
   x1="57.007000"
   style="fill:none;stroke:#000000;stroke-width:0.50000000" />
			<line
   id="line87"
   y2="84.344002"
   x2="60.907001"
   y1="84.344002"
   x1="57.007000"
   style="fill:none;stroke:#000000;stroke-width:0.50000000" />
			<line
   id="line89"
   y2="78.675003"
   x2="60.907001"
   y1="78.675003"
   x1="57.007000"
   style="fill:none;stroke:#000000;stroke-width:0.50000000" />
			<line
   id="line91"
   y2="73.004997"
   x2="60.907001"
   y1="73.004997"
   x1="57.007000"
   style="fill:none;stroke:#000000;stroke-width:0.50000000" />
			<line
   id="line93"
   y2="67.335999"
   x2="60.907001"
   y1="67.335999"
   x1="57.007000"
   style="fill:none;stroke:#000000;stroke-width:0.50000000" />
			<line
   id="line95"
   y2="61.667000"
   x2="60.907001"
   y1="61.667000"
   x1="57.007000"
   style="fill:none;stroke:#000000;stroke-width:0.50000000" />
			<line
   id="line97"
   y2="55.998001"
   x2="60.907001"
   y1="55.998001"
   x1="57.007000"
   style="fill:none;stroke:#000000;stroke-width:0.50000000" />
			<line
   id="line99"
   y2="50.327999"
   x2="60.907001"
   y1="50.327999"
   x1="57.007000"
   style="fill:none;stroke:#000000;stroke-width:0.50000000" />
			<line
   id="line101"
   y2="44.659000"
   x2="60.907001"
   y1="44.659000"
   x1="57.007000"
   style="fill:none;stroke:#000000;stroke-width:0.50000000" />
			<line
   id="line103"
   y2="38.990002"
   x2="60.907001"
   y1="38.990002"
   x1="57.007000"
   style="fill:none;stroke:#000000;stroke-width:0.50000000" />
			<line
   id="line105"
   y2="33.320000"
   x2="60.907001"
   y1="33.320000"
   x1="57.007000"
   style="fill:none;stroke:#000000;stroke-width:0.50000000" />
			<line
   id="line107"
   y2="27.650999"
   x2="60.907001"
   y1="27.650999"
   x1="57.007000"
   style="fill:none;stroke:#000000;stroke-width:0.50000000" />
			<line
   id="line109"
   y2="21.981001"
   x2="60.907001"
   y1="21.981001"
   x1="57.007000"
   style="fill:none;stroke:#000000;stroke-width:0.50000000" />
			<line
   id="line111"
   y2="16.312000"
   x2="60.907001"
   y1="16.312000"
   x1="57.007000"
   style="fill:none;stroke:#000000;stroke-width:0.50000000" />
		</g><path
   id="path113"
   d="M 10.132000,16.979000 C 15.132000,17.729000 25.632000,25.479000 36.632000,38.979000 C 47.632000,52.479000 70.882000,74.479000 92.882000,82.979000 C 114.88200,91.479000 113.13200,96.729000 114.63200,100.97900"
   style="fill:none;stroke:#000000;stroke-width:2.0000000" /><g
   id="g115">
			<text
   id="text117"
   transform="translate(55.60600,10.00000)"><tspan
     id="tspan119"
     style="font-size:8.5000000px;font-family:Bitstream Vera Sans"
     y="0"
     x="0">F</tspan></text>

		</g><circle
   sodipodi:ry="7.0710001"
   sodipodi:rx="7.0710001"
   sodipodi:cy="61.653999"
   sodipodi:cx="58.856998"
   id="circle121"
   r="7.0710001"
   cy="61.653999"
   cx="58.856998"
   style="fill:none;stroke:#000000;stroke-width:0.50000000" /><g
   id="g123">
			<line
   id="line125"
   y2="249.84200"
   x2="57.908001"
   y1="145.84200"
   x1="57.908001"
   style="fill:none;stroke:#000000;stroke-width:0.50000000" />
			<line
   id="line127"
   y2="198.87700"
   x2="110.29400"
   y1="198.87700"
   x1="7.2940001"
   style="fill:none;stroke:#000000;stroke-width:0.50000000" />
			<line
   id="line129"
   y2="210.95200"
   x2="23.624001"
   y1="187.55200"
   x1="23.624001"
   style="fill:none;stroke:#000000;stroke-width:0.50000000" />
			<line
   id="line131"
   y2="210.95200"
   x2="57.639999"
   y1="187.55200"
   x1="57.639999"
   style="fill:none;stroke:#000000;stroke-width:0.50000000" />
			<line
   id="line133"
   y2="210.95200"
   x2="91.654999"
   y1="187.55200"
   x1="91.654999"
   style="fill:none;stroke:#000000;stroke-width:0.50000000" />
			<line
   id="line135"
   y2="232.89301"
   x2="69.714996"
   y1="232.89301"
   x1="46.314999"
   style="fill:none;stroke:#000000;stroke-width:0.50000000" />
			<line
   id="line137"
   y2="198.87700"
   x2="69.714996"
   y1="198.87700"
   x1="46.314999"
   style="fill:none;stroke:#000000;stroke-width:0.50000000" />
			<line
   id="line139"
   y2="164.86099"
   x2="69.714996"
   y1="164.86099"
   x1="46.314999"
   style="fill:none;stroke:#000000;stroke-width:0.50000000" />
			<path
   id="path141"
   d="M 7.3140000,151.82200 C 38.091000,181.24300 72.978000,211.42200 109.91800,239.00900"
   style="fill:none;stroke:#000000;stroke-width:2.0000000" />
			<circle
   sodipodi:ry="42.425999"
   sodipodi:rx="42.425999"
   sodipodi:cy="198.80200"
   sodipodi:cx="57.414001"
   id="circle143"
   r="42.425999"
   cy="198.80200"
   cx="57.414001"
   style="fill:none;stroke:#000000;stroke-width:0.50000000" /> 
		</g><line
   id="line145"
   y2="187.59200"
   x2="16.482000"
   y1="59.466999"
   x1="52.106998"
   style="fill:none;stroke:#000000;stroke-width:0.50000000" /><line
   id="line147"
   y2="59.716999"
   x2="65.668999"
   y1="188.77901"
   x1="98.668999"
   style="fill:none;stroke:#000000;stroke-width:0.50000000" />
</svg>