<?xml version="1.0" encoding="iso-8859-1"?>
<!-- Generator: Adobe Illustrator 11 Build 196, SVG Export Plug-In . SVG Version: 6.0.0 Build 78)  -->
<!DOCTYPE svg PUBLIC "-//W3C//DTD SVG 1.0//EN"    "http://www.w3.org/TR/2001/REC-SVG-20010904/DTD/svg10.dtd" [
	<!ENTITY ns_flows "http://ns.adobe.com/Flows/1.0/">
	<!ENTITY ns_svg "http://www.w3.org/2000/svg">
	<!ENTITY ns_xlink "http://www.w3.org/1999/xlink">
]>
<svg  
	 width="147.8" height="161.575" viewBox="0 0 147.8 161.575" style="overflow:visible;enable-background:new 0 0 147.8 161.575"
	 xml:space="preserve">
	<style type="text/css">
	
	</style>
	<g id="Layer_1">
		<rect style="fill:#DCDCDC;" width="147.401" height="161.575"/> 
		<g>
			<text transform="matrix(1 0 0 1 61.998 145.3335)"><tspan x="0" y="0" style="font-family:Bitstream Vera Sans; font-size:10.200000;">warm</tspan></text>
		</g>
		<g>
			<text transform="matrix(1 0 0 1 59.333 18.6665)"><tspan x="0" y="0" style="font-family:Bitstream Vera Sans; font-size:10.200000;">warm</tspan></text>
		</g>
		
			<linearGradient id="XMLID_6_" gradientUnits="userSpaceOnUse" x1="73.3335" y1="73.25" x2="81.3335" y2="73.25" gradientTransform="matrix(1 0 0 1 -3.5056 0.8188)">
			<stop  offset="0" style="stop-color:#C5C5C5"/>
			<stop  offset="0.16" style="stop-color:#FFFFFF"/>
			<stop  offset="0.34" style="stop-color:#CECECE"/>
			<stop  offset="1" style="stop-color:#A7A7A7"/>
			<midPointStop  offset="0" style="stop-color:#C5C5C5"/>
			<midPointStop  offset="0.5" style="stop-color:#C5C5C5"/>
			<midPointStop  offset="0.16" style="stop-color:#FFFFFF"/>
			<midPointStop  offset="0.5" style="stop-color:#FFFFFF"/>
			<midPointStop  offset="0.34" style="stop-color:#CECECE"/>
			<midPointStop  offset="0.5" style="stop-color:#CECECE"/>
			<midPointStop  offset="1" style="stop-color:#A7A7A7"/>
		</linearGradient>
		<rect x="69.765" y="61.486" style="fill:url(#XMLID_6_);stroke:#000000;stroke-width:0.5;" width="8.729" height="25.167"/> 
		
			<linearGradient id="XMLID_7_" gradientUnits="userSpaceOnUse" x1="104.3408" y1="60" x2="104.3408" y2="65.3333" gradientTransform="matrix(1.1 0 0 1 -5.7425 1.3608)">
			<stop  offset="0" style="stop-color:#C5C5C5"/>
			<stop  offset="0.16" style="stop-color:#FFFFFF"/>
			<stop  offset="0.34" style="stop-color:#CECECE"/>
			<stop  offset="1" style="stop-color:#A7A7A7"/>
			<midPointStop  offset="0" style="stop-color:#C5C5C5"/>
			<midPointStop  offset="0.5" style="stop-color:#C5C5C5"/>
			<midPointStop  offset="0.16" style="stop-color:#FFFFFF"/>
			<midPointStop  offset="0.5" style="stop-color:#FFFFFF"/>
			<midPointStop  offset="0.34" style="stop-color:#CECECE"/>
			<midPointStop  offset="0.5" style="stop-color:#CECECE"/>
			<midPointStop  offset="1" style="stop-color:#A7A7A7"/>
		</linearGradient>
		<rect x="70.515" y="61.486" style="fill:url(#XMLID_7_);stroke:#000000;stroke-width:0.5;" width="77.035" height="5.875"/> 
		
			<linearGradient id="XMLID_8_" gradientUnits="userSpaceOnUse" x1="115.5532" y1="209" x2="129.1138" y2="209" gradientTransform="matrix(1 0 0 1 -47.4871 -144.3062)">
			<stop  offset="0" style="stop-color:#C0C0C0"/>
			<stop  offset="0.32" style="stop-color:#F4F4F4"/>
			<stop  offset="1" style="stop-color:#A3A3A3"/>
			<midPointStop  offset="0" style="stop-color:#C0C0C0"/>
			<midPointStop  offset="0.5" style="stop-color:#C0C0C0"/>
			<midPointStop  offset="0.32" style="stop-color:#F4F4F4"/>
			<midPointStop  offset="0.5" style="stop-color:#F4F4F4"/>
			<midPointStop  offset="1" style="stop-color:#A3A3A3"/>
		</linearGradient>
		<rect x="68.066" y="60.306" style="fill:url(#XMLID_8_);stroke:#000000;stroke-width:0.5;" width="13.561" height="8.776"/> 
		
			<linearGradient id="XMLID_9_" gradientUnits="userSpaceOnUse" x1="106.0581" y1="50" x2="106.0581" y2="98.6667" gradientTransform="matrix(1 0 0 1 0 5.3335)">
			<stop  offset="0" style="stop-color:#FFFFFF"/>
			<stop  offset="1" style="stop-color:#000000"/>
			<midPointStop  offset="0" style="stop-color:#FFFFFF"/>
			<midPointStop  offset="0.5" style="stop-color:#FFFFFF"/>
			<midPointStop  offset="1" style="stop-color:#000000"/>
		</linearGradient>
		<path style="fill:url(#XMLID_9_);stroke:#000000;stroke-width:0.5;" d="M72.5,96.333c0,0,55.5,12,61.5,7.5s7.5-24,3-27s-63,9-63,9
			L72.5,96.333z"/>
		
			<linearGradient id="XMLID_10_" gradientUnits="userSpaceOnUse" x1="41.2129" y1="98" x2="41.2129" y2="50" gradientTransform="matrix(1 0 0 1 0 5.3335)">
			<stop  offset="0" style="stop-color:#FFFFFF"/>
			<stop  offset="1" style="stop-color:#000000"/>
			<midPointStop  offset="0" style="stop-color:#FFFFFF"/>
			<midPointStop  offset="0.5" style="stop-color:#FFFFFF"/>
			<midPointStop  offset="1" style="stop-color:#000000"/>
		</linearGradient>
		<path style="fill:url(#XMLID_10_);stroke:#000000;stroke-width:0.5;" d="M74.771,96.333c0,0-55.5,12-61.5,7.5s-7.5-24-3-27
			s63,9,63,9L74.771,96.333z"/>
	</g>
</svg>
