<?xml version="1.0" encoding="iso-8859-1"?>
<!-- Generator: Adobe Illustrator 11 Build 196, SVG Export Plug-In . SVG Version: 6.0.0 Build 78)  -->
<!DOCTYPE svg PUBLIC "-//W3C//DTD SVG 1.0//EN"    "http://www.w3.org/TR/2001/REC-SVG-20010904/DTD/svg10.dtd" [
	<!ENTITY ns_flows "http://ns.adobe.com/Flows/1.0/">
	<!ENTITY ns_svg "http://www.w3.org/2000/svg">
	<!ENTITY ns_xlink "http://www.w3.org/1999/xlink">
]>
<svg  
	 width="128.55" height="227.153" viewBox="0 0 128.55 227.153" style="overflow:visible;enable-background:new 0 0 128.55 227.153"
	 xml:space="preserve">
	<style type="text/css">
	
	</style>
	<g id="Layer_1">
		
			<radialGradient id="XMLID_9_" cx="61.9246" cy="172.7471" r="42.759" fx="61.9246" fy="172.7471" gradientTransform="matrix(1.05 0 0 1.05 -3.1433 -5.6428)" gradientUnits="userSpaceOnUse">
			<stop  offset="0" style="stop-color:#C8C8C8"/>
			<stop  offset="0.47" style="stop-color:#B9B9B9"/>
			<stop  offset="0.5011" style="stop-color:#BDBDBD"/>
			<stop  offset="1" style="stop-color:#F4F4F4"/>
			<midPointStop  offset="0" style="stop-color:#C8C8C8"/>
			<midPointStop  offset="0.52" style="stop-color:#C8C8C8"/>
			<midPointStop  offset="0.47" style="stop-color:#B9B9B9"/>
			<midPointStop  offset="0.49" style="stop-color:#B9B9B9"/>
			<midPointStop  offset="1" style="stop-color:#F4F4F4"/>
		</radialGradient>
		<polygon style="fill:url(#XMLID_9_);stroke:#000000;" points="65.479,152.872 65.479,136.334 58.129,136.334 58.129,152.872 
			31.209,152.872 31.209,205.792 92.399,205.792 92.399,152.872 "/>
		<g>
			<line style="fill:#DCDCDC;stroke:#000000;" x1="30.566" y1="131.223" x2="57.761" y2="131.223"/>
			<line style="fill:#DCDCDC;stroke:#000000;" x1="65.846" y1="131.223" x2="93.042" y2="131.223"/>
		</g>
		<g>
			<line style="fill:#DCDCDC;stroke:#000000;" x1="30.566" y1="115.777" x2="57.761" y2="115.777"/>
			<line style="fill:#DCDCDC;stroke:#000000;" x1="65.846" y1="115.777" x2="93.042" y2="115.777"/>
		</g>
		<ellipse style="fill:none;stroke:#000000;stroke-dasharray:2;" cx="61.804" cy="70.328" rx="47.815" ry="36.901"/> 
		<g>
			<g>
				
					<linearGradient id="XMLID_10_" gradientUnits="userSpaceOnUse" x1="297.364" y1="112.7627" x2="297.614" y2="117.0752" gradientTransform="matrix(0 -0.6826 1.0233 0 -56.4809 285.2663)">
					<stop  offset="0" style="stop-color:#FFFFFF"/>
					<stop  offset="0.1582" style="stop-color:#E6E6E6"/>
					<stop  offset="0.49" style="stop-color:#9E9E9E"/>
					<stop  offset="0.4927" style="stop-color:#A0A0A0"/>
					<stop  offset="0.6208" style="stop-color:#C6C6C6"/>
					<stop  offset="0.74" style="stop-color:#E0E0E0"/>
					<stop  offset="0.8467" style="stop-color:#F1F1F1"/>
					<stop  offset="0.9369" style="stop-color:#FBFBFB"/>
					<stop  offset="1" style="stop-color:#FFFFFF"/>
					<midPointStop  offset="0" style="stop-color:#FFFFFF"/>
					<midPointStop  offset="0.52" style="stop-color:#FFFFFF"/>
					<midPointStop  offset="0.49" style="stop-color:#9E9E9E"/>
					<midPointStop  offset="0.37" style="stop-color:#9E9E9E"/>
					<midPointStop  offset="1" style="stop-color:#FFFFFF"/>
				</linearGradient>
				<path style="fill:url(#XMLID_10_);" d="M58.396,68.684l1.08,6.253c1.041,6.864,1.674,13.809,1.892,20.822h1.391
					c-0.218-6.992-0.848-13.917-1.883-20.761l0.155-0.012l-1.088-6.302H58.396z"/>
				
					<linearGradient id="XMLID_11_" gradientUnits="userSpaceOnUse" x1="366.4192" y1="105.3262" x2="366.8566" y2="109.2012" gradientTransform="matrix(0 -0.6826 1.0233 0 -56.4809 285.2663)">
					<stop  offset="0" style="stop-color:#FFFFFF"/>
					<stop  offset="0.1582" style="stop-color:#E6E6E6"/>
					<stop  offset="0.49" style="stop-color:#9E9E9E"/>
					<stop  offset="0.4927" style="stop-color:#A0A0A0"/>
					<stop  offset="0.6208" style="stop-color:#C6C6C6"/>
					<stop  offset="0.74" style="stop-color:#E0E0E0"/>
					<stop  offset="0.8467" style="stop-color:#F1F1F1"/>
					<stop  offset="0.9369" style="stop-color:#FBFBFB"/>
					<stop  offset="1" style="stop-color:#FFFFFF"/>
					<midPointStop  offset="0" style="stop-color:#FFFFFF"/>
					<midPointStop  offset="0.52" style="stop-color:#FFFFFF"/>
					<midPointStop  offset="0.49" style="stop-color:#9E9E9E"/>
					<midPointStop  offset="0.37" style="stop-color:#9E9E9E"/>
					<midPointStop  offset="1" style="stop-color:#FFFFFF"/>
				</linearGradient>
				<polygon style="fill:url(#XMLID_11_);" points="53.045,38.096 58.364,68.911 59.909,68.911 54.57,37.979 48.182,0.973 
					46.657,1.09 "/>
				
					<linearGradient id="XMLID_12_" gradientUnits="userSpaceOnUse" x1="246.4734" y1="113.3721" x2="246.4734" y2="118.0388" gradientTransform="matrix(0 -0.6826 1.0233 0 -56.4809 285.2663)">
					<stop  offset="0" style="stop-color:#FFFFFF"/>
					<stop  offset="0.1582" style="stop-color:#E6E6E6"/>
					<stop  offset="0.49" style="stop-color:#9E9E9E"/>
					<stop  offset="0.4927" style="stop-color:#A0A0A0"/>
					<stop  offset="0.6208" style="stop-color:#C6C6C6"/>
					<stop  offset="0.74" style="stop-color:#E0E0E0"/>
					<stop  offset="0.8467" style="stop-color:#F1F1F1"/>
					<stop  offset="0.9369" style="stop-color:#FBFBFB"/>
					<stop  offset="1" style="stop-color:#FFFFFF"/>
					<midPointStop  offset="0" style="stop-color:#FFFFFF"/>
					<midPointStop  offset="0.52" style="stop-color:#FFFFFF"/>
					<midPointStop  offset="0.49" style="stop-color:#9E9E9E"/>
					<midPointStop  offset="0.37" style="stop-color:#9E9E9E"/>
					<midPointStop  offset="1" style="stop-color:#FFFFFF"/>
				</linearGradient>
				<path style="fill:url(#XMLID_12_);" d="M61.232,95.758c0.055,1.756,0.09,3.515,0.091,5.279h-0.101v37.251h1.535v-37.251h-0.043
					c-0.002-1.765-0.037-3.523-0.092-5.279H61.232z"/>
			</g>
			<g>
				
					<linearGradient id="XMLID_13_" gradientUnits="userSpaceOnUse" x1="297.3503" y1="112.7637" x2="297.6003" y2="117.0761" gradientTransform="matrix(0 -0.6826 0.8186 0 -32.8114 285.2663)">
					<stop  offset="0" style="stop-color:#FFFFFF"/>
					<stop  offset="0.1582" style="stop-color:#E6E6E6"/>
					<stop  offset="0.49" style="stop-color:#9E9E9E"/>
					<stop  offset="0.4927" style="stop-color:#A0A0A0"/>
					<stop  offset="0.6208" style="stop-color:#C6C6C6"/>
					<stop  offset="0.74" style="stop-color:#E0E0E0"/>
					<stop  offset="0.8467" style="stop-color:#F1F1F1"/>
					<stop  offset="0.9369" style="stop-color:#FBFBFB"/>
					<stop  offset="1" style="stop-color:#FFFFFF"/>
					<midPointStop  offset="0" style="stop-color:#FFFFFF"/>
					<midPointStop  offset="0.52" style="stop-color:#FFFFFF"/>
					<midPointStop  offset="0.49" style="stop-color:#9E9E9E"/>
					<midPointStop  offset="0.37" style="stop-color:#9E9E9E"/>
					<midPointStop  offset="1" style="stop-color:#FFFFFF"/>
				</linearGradient>
				<path style="fill:url(#XMLID_13_);" d="M59.268,68.684l0.863,6.253c0.833,6.864,1.339,13.809,1.514,20.822h1.112
					c-0.174-6.992-0.678-13.917-1.507-20.761l0.124-0.012l-0.871-6.302H59.268z"/>
				
					<linearGradient id="XMLID_14_" gradientUnits="userSpaceOnUse" x1="366.3938" y1="105.3291" x2="366.8312" y2="109.2041" gradientTransform="matrix(0 -0.6826 0.8186 0 -32.8114 285.2663)">
					<stop  offset="0" style="stop-color:#FFFFFF"/>
					<stop  offset="0.1582" style="stop-color:#E6E6E6"/>
					<stop  offset="0.49" style="stop-color:#9E9E9E"/>
					<stop  offset="0.4927" style="stop-color:#A0A0A0"/>
					<stop  offset="0.6208" style="stop-color:#C6C6C6"/>
					<stop  offset="0.74" style="stop-color:#E0E0E0"/>
					<stop  offset="0.8467" style="stop-color:#F1F1F1"/>
					<stop  offset="0.9369" style="stop-color:#FBFBFB"/>
					<stop  offset="1" style="stop-color:#FFFFFF"/>
					<midPointStop  offset="0" style="stop-color:#FFFFFF"/>
					<midPointStop  offset="0.52" style="stop-color:#FFFFFF"/>
					<midPointStop  offset="0.49" style="stop-color:#9E9E9E"/>
					<midPointStop  offset="0.37" style="stop-color:#9E9E9E"/>
					<midPointStop  offset="1" style="stop-color:#FFFFFF"/>
				</linearGradient>
				<polygon style="fill:url(#XMLID_14_);" points="54.988,38.096 59.243,68.911 60.479,68.911 56.207,37.979 51.097,0.973 
					49.877,1.09 "/>
				
					<linearGradient id="XMLID_15_" gradientUnits="userSpaceOnUse" x1="246.4734" y1="113.3721" x2="246.4734" y2="118.0388" gradientTransform="matrix(0 -0.6826 0.8186 0 -32.8114 285.2663)">
					<stop  offset="0" style="stop-color:#FFFFFF"/>
					<stop  offset="0.1582" style="stop-color:#E6E6E6"/>
					<stop  offset="0.49" style="stop-color:#9E9E9E"/>
					<stop  offset="0.4927" style="stop-color:#A0A0A0"/>
					<stop  offset="0.6208" style="stop-color:#C6C6C6"/>
					<stop  offset="0.74" style="stop-color:#E0E0E0"/>
					<stop  offset="0.8467" style="stop-color:#F1F1F1"/>
					<stop  offset="0.9369" style="stop-color:#FBFBFB"/>
					<stop  offset="1" style="stop-color:#FFFFFF"/>
					<midPointStop  offset="0" style="stop-color:#FFFFFF"/>
					<midPointStop  offset="0.52" style="stop-color:#FFFFFF"/>
					<midPointStop  offset="0.49" style="stop-color:#9E9E9E"/>
					<midPointStop  offset="0.37" style="stop-color:#9E9E9E"/>
					<midPointStop  offset="1" style="stop-color:#FFFFFF"/>
				</linearGradient>
				<path style="fill:url(#XMLID_15_);" d="M61.537,95.758c0.043,1.756,0.072,3.515,0.073,5.279H61.53v37.251h1.228v-37.251h-0.035
					c-0.001-1.765-0.03-3.523-0.073-5.279H61.537z"/>
			</g>
		</g>
		<rect x="0.5" y="0.5" style="fill:none;stroke:#000000;" width="124.216" height="212.959"/> 
		<g>
			<text transform="matrix(1 0 0 1 22.8857 62.2031)"><tspan x="0" y="0" style="font-family:Bitstream Vera Sans; font-size:7.650000;">extra charged plates</tspan></text>
			<text transform="matrix(1 0 0 1 26.8923 73.2031)"><tspan x="0" y="0" style="font-family:Bitstream Vera Sans; font-size:7.650000;">or magnets for de-</tspan></text>
			<text transform="matrix(1 0 0 1 29.3875 84.2031)"><tspan x="0" y="0" style="font-family:Bitstream Vera Sans; font-size:7.650000;">flecting the beam</tspan></text>
		</g>
		<g>
			<g>
				<g>
					<text transform="matrix(1 0 0 1 31.3936 138.5859)"><tspan x="0" y="0" style="font-family:Bitstream Vera Sans; font-size:7.650000;">+</tspan></text>
				</g>
				<g>
					<text transform="matrix(1 0 0 1 40.3225 138.5859)"><tspan x="0" y="0" style="font-family:Bitstream Vera Sans; font-size:7.650000;">+</tspan></text>
				</g>
				<g>
					<text transform="matrix(1 0 0 1 49.2517 138.5859)"><tspan x="0" y="0" style="font-family:Bitstream Vera Sans; font-size:7.650000;">+</tspan></text>
				</g>
			</g>
			<g>
				<g>
					<text transform="matrix(1 0 0 1 68.1438 138.5859)"><tspan x="0" y="0" style="font-family:Bitstream Vera Sans; font-size:7.650000;">+</tspan></text>
				</g>
				<g>
					<text transform="matrix(1 0 0 1 77.073 138.5859)"><tspan x="0" y="0" style="font-family:Bitstream Vera Sans; font-size:7.650000;">+</tspan></text>
				</g>
				<g>
					<text transform="matrix(1 0 0 1 86.0022 138.5859)"><tspan x="0" y="0" style="font-family:Bitstream Vera Sans; font-size:7.650000;">+</tspan></text>
				</g>
			</g>
		</g>
		<g>
			<g>
				<g>
					<text transform="matrix(1 0 0 1 31.5198 113.7056)"><tspan x="0" y="0" style="font-family:Bitstream Vera Sans; font-size:7.650000;">&#x2013;</tspan></text>
				</g>
				<g>
					<text transform="matrix(1 0 0 1 40.449 113.7056)"><tspan x="0" y="0" style="font-family:Bitstream Vera Sans; font-size:7.650000;">&#x2013;</tspan></text>
				</g>
				<g>
					<text transform="matrix(1 0 0 1 49.3782 113.7056)"><tspan x="0" y="0" style="font-family:Bitstream Vera Sans; font-size:7.650000;">&#x2013;</tspan></text>
				</g>
			</g>
			<g>
				<g>
					<text transform="matrix(1 0 0 1 68.2703 113.7056)"><tspan x="0" y="0" style="font-family:Bitstream Vera Sans; font-size:7.650000;">&#x2013;</tspan></text>
				</g>
				<g>
					<text transform="matrix(1 0 0 1 77.1995 113.7056)"><tspan x="0" y="0" style="font-family:Bitstream Vera Sans; font-size:7.650000;">&#x2013;</tspan></text>
				</g>
				<g>
					<text transform="matrix(1 0 0 1 86.1287 113.7056)"><tspan x="0" y="0" style="font-family:Bitstream Vera Sans; font-size:7.650000;">&#x2013;</tspan></text>
				</g>
			</g>
		</g>
		
			<linearGradient id="XMLID_16_" gradientUnits="userSpaceOnUse" x1="128.0496" y1="188.5161" x2="140.2996" y2="188.5161" gradientTransform="matrix(5.4257 0 0 0.5034 -660.0376 50.2629)">
			<stop  offset="0" style="stop-color:#FFFFFF"/>
			<stop  offset="0.1582" style="stop-color:#E6E6E6"/>
			<stop  offset="0.49" style="stop-color:#9E9E9E"/>
			<stop  offset="0.4927" style="stop-color:#A0A0A0"/>
			<stop  offset="0.6208" style="stop-color:#C6C6C6"/>
			<stop  offset="0.74" style="stop-color:#E0E0E0"/>
			<stop  offset="0.8467" style="stop-color:#F1F1F1"/>
			<stop  offset="0.9369" style="stop-color:#FBFBFB"/>
			<stop  offset="1" style="stop-color:#FFFFFF"/>
			<midPointStop  offset="0" style="stop-color:#FFFFFF"/>
			<midPointStop  offset="0.52" style="stop-color:#FFFFFF"/>
			<midPointStop  offset="0.49" style="stop-color:#9E9E9E"/>
			<midPointStop  offset="0.37" style="stop-color:#9E9E9E"/>
			<midPointStop  offset="1" style="stop-color:#FFFFFF"/>
		</linearGradient>
		<rect x="58.594" y="136.924" style="fill:url(#XMLID_16_);" width="6.346" height="16.476"/> 
		<g>
			<text transform="matrix(1 0 0 1 96.8918 183.2363)"><tspan x="0" y="0" style="font-family:Bitstream Vera Sans; font-size:7.650000;">oven</tspan></text>
		</g>
		<g>
			<text transform="matrix(1 0 0 1 20.6929 223.1362)"><tspan x="0" y="0" style="font-family:Bitstream Vera Sans; font-size:7.650000;">vacuum chamber</tspan></text>
		</g>
		<line style="fill:none;" x1="128.55" y1="66.872" x2="128.55" y2="127.872"/>
	</g>
</svg>
