<?xml version="1.0" encoding="UTF-8" standalone="no"?>
<!-- Generator: Adobe Illustrator 11 Build 196, SVG Export Plug-In . SVG Version: 6.0.0 Build 78)  -->
<svg
   xmlns:a="http://ns.adobe.com/AdobeSVGViewerExtensions/3.0/"
   xmlns:dc="http://purl.org/dc/elements/1.1/"
   xmlns:cc="http://web.resource.org/cc/"
   xmlns:rdf="http://www.w3.org/1999/02/22-rdf-syntax-ns#"
   xmlns:svg="http://www.w3.org/2000/svg"
   xmlns="http://www.w3.org/2000/svg"
   xmlns:xlink="http://www.w3.org/1999/xlink"
   xmlns:sodipodi="http://inkscape.sourceforge.net/DTD/sodipodi-0.dtd"
   xmlns:inkscape="http://www.inkscape.org/namespaces/inkscape"
   width="351.25"
   height="254.302"
   viewBox="0 0 351.25 254.302"
   style="overflow:visible;enable-background:new 0 0 351.25 254.302"
   xml:space="preserve"
   id="svg2"
   sodipodi:version="0.32"
   inkscape:version="0.42.2"
   sodipodi:docname="three-models-of-light.svg"
   sodipodi:docbase="/home/bcrowell/Documents/writing/lm/trunk/5op/ch01/figs"><metadata
   id="metadata311"><rdf:RDF><cc:Work
       rdf:about=""><dc:format>image/svg+xml</dc:format><dc:type
         rdf:resource="http://purl.org/dc/dcmitype/StillImage" /></cc:Work></rdf:RDF></metadata><defs
   id="defs309">
		 
		
		
		
		
		
		
		
		
		
		
	
			
			
			
			
			
			
			
		<linearGradient
   inkscape:collect="always"
   xlink:href="#XMLID_10_"
   id="linearGradient3263"
   gradientUnits="userSpaceOnUse"
   gradientTransform="matrix(0.996200,8.710000e-2,-8.710000e-2,0.996200,-247.5046,-78.79650)"
   x1="378.67380"
   y1="159.38721"
   x2="387.17380"
   y2="159.38721" /><linearGradient
   inkscape:collect="always"
   xlink:href="#XMLID_10_"
   id="linearGradient3267"
   gradientUnits="userSpaceOnUse"
   gradientTransform="matrix(0.996200,8.710000e-2,-8.710000e-2,0.996200,-247.5046,-78.79650)"
   x1="378.67380"
   y1="159.38721"
   x2="387.17380"
   y2="159.38721" /><linearGradient
   inkscape:collect="always"
   xlink:href="#XMLID_10_"
   id="linearGradient3271"
   gradientUnits="userSpaceOnUse"
   gradientTransform="matrix(0.996200,8.710000e-2,-8.710000e-2,0.996200,-247.5046,-78.79650)"
   x1="378.67380"
   y1="159.38721"
   x2="387.17380"
   y2="159.38721" /><linearGradient
   inkscape:collect="always"
   xlink:href="#XMLID_10_"
   id="linearGradient3275"
   gradientUnits="userSpaceOnUse"
   gradientTransform="matrix(0.996200,8.710000e-2,-8.710000e-2,0.996200,-247.5046,-78.79650)"
   x1="378.67380"
   y1="159.38721"
   x2="387.17380"
   y2="159.38721" />
			
			
			
			
		
				
					<linearGradient
   gradientTransform="matrix(0.637600,5.580000e-2,-5.580000e-2,0.637600,-100.4884,25.74980)"
   y2="199.12450"
   x2="393.29199"
   y1="199.12450"
   x1="355.20609"
   gradientUnits="userSpaceOnUse"
   id="XMLID_15_">
					<stop
   id="stop111"
   style="stop-color:#dedede;stop-opacity:1.0000000;"
   offset="0.0000000" />
					<stop
   id="stop113"
   style="stop-color:#999999"
   offset="1" />
					<midPointStop
   style="stop-color:#FFFFFF"
   offset="0" />
					<midPointStop
   style="stop-color:#FFFFFF"
   offset="0.5" />
					<midPointStop
   style="stop-color:#999999"
   offset="1" />
				</linearGradient>
				
				 
			<linearGradient
   inkscape:collect="always"
   xlink:href="#XMLID_15_"
   id="linearGradient3316"
   gradientUnits="userSpaceOnUse"
   gradientTransform="matrix(0.637600,5.580000e-2,-5.580000e-2,0.637600,-100.4884,25.74980)"
   x1="355.20609"
   y1="199.12450"
   x2="393.29199"
   y2="199.12450" /><linearGradient
   inkscape:collect="always"
   xlink:href="#XMLID_15_"
   id="linearGradient3324"
   gradientUnits="userSpaceOnUse"
   gradientTransform="matrix(0.637600,5.580000e-2,-5.580000e-2,0.637600,-100.4884,25.74980)"
   x1="355.20609"
   y1="199.12450"
   x2="393.29199"
   y2="199.12450" /><linearGradient
   inkscape:collect="always"
   xlink:href="#XMLID_15_"
   id="linearGradient3332"
   gradientUnits="userSpaceOnUse"
   gradientTransform="matrix(0.637600,5.580000e-2,-5.580000e-2,0.637600,-100.4884,25.74980)"
   x1="355.20609"
   y1="199.12450"
   x2="393.29199"
   y2="199.12450" /><linearGradient
   inkscape:collect="always"
   xlink:href="#XMLID_15_"
   id="linearGradient3334"
   gradientUnits="userSpaceOnUse"
   gradientTransform="matrix(0.637600,5.580000e-2,-5.580000e-2,0.637600,-100.4884,25.74980)"
   x1="355.20609"
   y1="199.12450"
   x2="393.29199"
   y2="199.12450" /></defs><sodipodi:namedview
   inkscape:cy="45.423040"
   inkscape:cx="137.51359"
   inkscape:zoom="0.95826478"
   inkscape:window-height="996"
   inkscape:window-width="1278"
   inkscape:pageshadow="2"
   inkscape:pageopacity="0.0"
   borderopacity="1.0"
   bordercolor="#666666"
   pagecolor="#ffffff"
   id="base"
   showguides="true"
   inkscape:guide-bbox="true"
   inkscape:window-x="0"
   inkscape:window-y="0"
   inkscape:current-layer="svg2" />
	<style
   type="text/css"
   id="style4">
	
	</style>
	<rect
   id="rect7"
   height="253.80200"
   width="362.67014"
   style="fill:#dedede;stroke:none;stroke-width:0.51264459;fill-opacity:1.0000000"
   y="0.25000000"
   x="0.26280445" /><g
   id="g9">
			<text
   id="text11"
   transform="translate(14.25000,30.62550)"><tspan
     id="tspan13"
     style="font-size:10.200000px;font-family:Bitstream Vera Sans-Bold'"
     y="0"
     x="0">ray model</tspan></text>

		</g><g
   id="g15">
			<text
   id="text17"
   transform="translate(14.91650,110.5674)"><tspan
     id="tspan19"
     style="font-size:10.200000px;font-family:Bitstream Vera Sans-Bold'"
     y="0"
     x="0">wave model</tspan></text>

		</g><g
   id="g21"
   transform="translate(0.000000,8.000000)">
			<text
   id="text23"
   transform="translate(14.25000,192.9009)"><tspan
     id="tspan25"
     style="font-size:10.200000px;font-family:Bitstream Vera Sans-Bold'"
     y="0"
     x="0">particle model</tspan></text>

		</g><g
   id="g27">
			<g
   id="g29">
				<line
   id="line31"
   y2="14.736000"
   x2="158.50101"
   y1="11.018000"
   x1="115.99700"
   style="fill:none;stroke:#000000;stroke-width:0.50000000" />
				<path
   id="path33"
   d="M 161.50700,14.999000 C 160.04700,15.400000 158.21300,16.143000 157.04300,16.995000 L 158.10600,14.702000 L 157.45700,12.259000 C 158.46200,13.301000 160.13900,14.351000 161.50700,14.999000 z " />
			</g>
			<g
   id="g35">
				<line
   id="line37"
   y2="26.031000"
   x2="157.51300"
   y1="22.313000"
   x1="115.00900"
   style="fill:none;stroke:#000000;stroke-width:0.50000000" />
				<path
   id="path39"
   d="M 160.51900,26.294000 C 159.05900,26.695000 157.22600,27.438000 156.05500,28.290000 L 157.11900,25.997000 L 156.47000,23.554000 C 157.47400,24.597000 159.15000,25.646000 160.51900,26.294000 z " />
			</g>
			<g
   id="g41">
				<line
   id="line43"
   y2="37.327000"
   x2="156.52499"
   y1="33.608002"
   x1="114.02100"
   style="fill:none;stroke:#000000;stroke-width:0.50000000" />
				<path
   id="path45"
   d="M 159.53100,37.589000 C 158.07100,37.990000 156.23700,38.732000 155.06700,39.585000 L 156.13000,37.292000 L 155.48100,34.849000 C 156.48600,35.892000 158.16300,36.941000 159.53100,37.589000 z " />
			</g>
			<g
   id="g47">
				<line
   id="line49"
   y2="48.622002"
   x2="155.53700"
   y1="44.903999"
   x1="113.03300"
   style="fill:none;stroke:#000000;stroke-width:0.50000000" />
				<path
   id="path51"
   d="M 158.54300,48.885000 C 157.08300,49.286000 155.24900,50.028000 154.07900,50.881000 L 155.14300,48.588000 L 154.49400,46.145000 C 155.49800,47.187000 157.17400,48.236000 158.54300,48.885000 z " />
			</g>
			<g
   id="g53">
				<line
   id="line55"
   y2="59.917000"
   x2="154.54900"
   y1="56.199001"
   x1="112.04500"
   style="fill:none;stroke:#000000;stroke-width:0.50000000" />
				<path
   id="path57"
   d="M 157.55500,60.180000 C 156.09500,60.581000 154.26200,61.323000 153.09100,62.176000 L 154.15400,59.883000 L 153.50500,57.440000 C 154.51000,58.482000 156.18700,59.532000 157.55500,60.180000 z " />
			</g>
		</g><g
   id="g59">
			
				<linearGradient
   gradientTransform="matrix(0.996200,8.710000e-2,-8.710000e-2,0.996200,-247.5046,-78.79650)"
   y2="159.38721"
   x2="387.17380"
   y1="159.38721"
   x1="378.67380"
   gradientUnits="userSpaceOnUse"
   id="XMLID_10_">
				<stop
   id="stop62"
   style="stop-color:#dedede;stop-opacity:1.0000000;"
   offset="0.0000000" />
				<stop
   id="stop64"
   style="stop-color:#595959;stop-opacity:1.0000000;"
   offset="0.50000000" />
				<stop
   id="stop66"
   style="stop-color:#dedede;stop-opacity:1.0000000;"
   offset="1.0000000" />
				<midPointStop
   style="stop-color:#F2F2F2"
   offset="0" />
				<midPointStop
   style="stop-color:#F2F2F2"
   offset="0.5" />
				<midPointStop
   style="stop-color:#8D8D8D"
   offset="0.5" />
				<midPointStop
   style="stop-color:#8D8D8D"
   offset="0.5" />
				<midPointStop
   style="stop-color:#F2F2F2"
   offset="1" />
			</linearGradient>
			<polygon
   id="polygon68"
   points="121.46500,140.56100 126.17100,86.767000 118.20200,86.070000 113.49600,139.86400 121.46500,140.56100 "
   style="fill:url(#XMLID_10_)" />
			
				<linearGradient
   gradientTransform="matrix(0.996200,8.710000e-2,-8.710000e-2,0.996200,-239.0387,-78.05630)"
   y2="159.38721"
   x2="387.17429"
   y1="159.38721"
   x1="378.67429"
   gradientUnits="userSpaceOnUse"
   id="XMLID_11_">
				<stop
   id="stop71"
   style="stop-color:#F2F2F2"
   offset="0" />
				<stop
   id="stop73"
   style="stop-color:#8D8D8D"
   offset="0.5" />
				<stop
   id="stop75"
   style="stop-color:#F2F2F2"
   offset="1" />
				<midPointStop
   style="stop-color:#F2F2F2"
   offset="0" />
				<midPointStop
   style="stop-color:#F2F2F2"
   offset="0.5" />
				<midPointStop
   style="stop-color:#8D8D8D"
   offset="0.5" />
				<midPointStop
   style="stop-color:#8D8D8D"
   offset="0.5" />
				<midPointStop
   style="stop-color:#F2F2F2"
   offset="1" />
			</linearGradient>
			
			
				<linearGradient
   gradientTransform="matrix(0.996200,8.710000e-2,-8.710000e-2,0.996200,-230.5729,-77.31560)"
   y2="159.38770"
   x2="387.17429"
   y1="159.38770"
   x1="378.67429"
   gradientUnits="userSpaceOnUse"
   id="XMLID_12_">
				<stop
   id="stop80"
   style="stop-color:#F2F2F2"
   offset="0" />
				<stop
   id="stop82"
   style="stop-color:#8D8D8D"
   offset="0.5" />
				<stop
   id="stop84"
   style="stop-color:#F2F2F2"
   offset="1" />
				<midPointStop
   style="stop-color:#F2F2F2"
   offset="0" />
				<midPointStop
   style="stop-color:#F2F2F2"
   offset="0.5" />
				<midPointStop
   style="stop-color:#8D8D8D"
   offset="0.5" />
				<midPointStop
   style="stop-color:#8D8D8D"
   offset="0.5" />
				<midPointStop
   style="stop-color:#F2F2F2"
   offset="1" />
			</linearGradient>
			
			
				<linearGradient
   gradientTransform="matrix(0.996200,8.710000e-2,-8.710000e-2,0.996200,-222.1069,-76.57480)"
   y2="159.38721"
   x2="387.17380"
   y1="159.38721"
   x1="378.67380"
   gradientUnits="userSpaceOnUse"
   id="XMLID_13_">
				<stop
   id="stop89"
   style="stop-color:#F2F2F2"
   offset="0" />
				<stop
   id="stop91"
   style="stop-color:#8D8D8D"
   offset="0.5" />
				<stop
   id="stop93"
   style="stop-color:#F2F2F2"
   offset="1" />
				<midPointStop
   style="stop-color:#F2F2F2"
   offset="0" />
				<midPointStop
   style="stop-color:#F2F2F2"
   offset="0.5" />
				<midPointStop
   style="stop-color:#8D8D8D"
   offset="0.5" />
				<midPointStop
   style="stop-color:#8D8D8D"
   offset="0.5" />
				<midPointStop
   style="stop-color:#F2F2F2"
   offset="1" />
			</linearGradient>
			
			
				<linearGradient
   gradientTransform="matrix(0.996200,8.710000e-2,-8.710000e-2,0.996200,-213.6410,-75.83410)"
   y2="159.38721"
   x2="387.17429"
   y1="159.38721"
   x1="378.67429"
   gradientUnits="userSpaceOnUse"
   id="XMLID_14_">
				<stop
   id="stop98"
   style="stop-color:#F2F2F2"
   offset="0" />
				<stop
   id="stop100"
   style="stop-color:#8D8D8D"
   offset="0.5" />
				<stop
   id="stop102"
   style="stop-color:#F2F2F2"
   offset="1" />
				<midPointStop
   style="stop-color:#F2F2F2"
   offset="0" />
				<midPointStop
   style="stop-color:#F2F2F2"
   offset="0.5" />
				<midPointStop
   style="stop-color:#8D8D8D"
   offset="0.5" />
				<midPointStop
   style="stop-color:#8D8D8D"
   offset="0.5" />
				<midPointStop
   style="stop-color:#F2F2F2"
   offset="1" />
			</linearGradient>
			
		<polygon
   id="polygon3261"
   points="121.46500,140.56100 126.17100,86.767000 118.20200,86.070000 113.49600,139.86400 121.46500,140.56100 "
   style="fill:url(#linearGradient3263);overflow:visible"
   transform="translate(7.957689,0.595091)" /><polygon
   id="polygon3265"
   points="121.46500,140.56100 126.17100,86.767000 118.20200,86.070000 113.49600,139.86400 121.46500,140.56100 "
   style="fill:url(#linearGradient3267);overflow:visible"
   transform="translate(16.04673,1.372878)" /><polygon
   id="polygon3269"
   points="121.46500,140.56100 126.17100,86.767000 118.20200,86.070000 113.49600,139.86400 121.46500,140.56100 "
   style="fill:url(#linearGradient3271);overflow:visible"
   transform="translate(24.13576,2.228448)" /><polygon
   id="polygon3273"
   points="121.46500,140.56100 126.17100,86.767000 118.20200,86.070000 113.49600,139.86400 121.46500,140.56100 "
   style="fill:url(#linearGradient3275);overflow:visible"
   transform="translate(32.38035,3.006240)" /></g><g
   id="g3306"
   transform="translate(0.000000,8.000000)"><polygon
     style="fill:url(#linearGradient3334)"
     points="114.97100,170.72800 114.65600,174.32500 138.94000,176.45000 139.25400,172.85200 114.97100,170.72800 "
     id="polygon115" /><circle
     cx="139.09599"
     cy="174.64999"
     r="1.8099999"
     id="circle117"
     sodipodi:cx="139.09599"
     sodipodi:cy="174.64999"
     sodipodi:rx="1.8099999"
     sodipodi:ry="1.8099999" /></g><line
   id="line306"
   y2="122.90100"
   x2="351.25000"
   y1="72.901001"
   x1="351.25000"
   style="fill:none" />
<text
   xml:space="preserve"
   style="font-size:10.000000px;font-style:normal;font-variant:normal;font-weight:normal;font-stretch:normal;text-align:start;line-height:125.00000%;writing-mode:lr-tb;text-anchor:start;fill:#000000;fill-opacity:1.0000000;stroke:none;stroke-width:1.0000000pt;stroke-linecap:butt;stroke-linejoin:miter;stroke-opacity:1.0000000;font-family:Bitstream Vera Sans"
   x="179.9068"
   y="29.172739"
   id="text1778"
   sodipodi:linespacing="125.00000%"><tspan
     sodipodi:role="line"
     id="tspan1780"
     x="179.90680"
     y="29.172739">Advantage: Simplicity.</tspan></text>
<text
   xml:space="preserve"
   style="font-size:10.000000px;font-style:normal;font-variant:normal;font-weight:normal;font-stretch:normal;text-align:start;line-height:125.00000%;writing-mode:lr-tb;text-anchor:start;fill:#000000;fill-opacity:1.0000000;stroke:none;stroke-width:1.0000000pt;stroke-linecap:butt;stroke-linejoin:miter;stroke-opacity:1.0000000;font-family:Bitstream Vera Sans"
   x="179.9068"
   y="90.124763"
   id="text1782"
   sodipodi:linespacing="125.00000%"><tspan
     sodipodi:role="line"
     id="tspan1784"
     x="179.90680"
     y="90.124763">Advantage: Color is described</tspan><tspan
     sodipodi:role="line"
     x="179.90680"
     y="102.62476"
     id="tspan1786">naturally in terms of wavelength.</tspan><tspan
     sodipodi:role="line"
     x="179.90680"
     y="115.12476"
     id="tspan1788">Required in order to explain the</tspan><tspan
     sodipodi:role="line"
     x="179.90680"
     y="127.62476"
     id="tspan1790">interaction of light with material</tspan><tspan
     sodipodi:role="line"
     x="179.90680"
     y="140.12476"
     id="tspan1792">objects of sizes comparable to or</tspan><tspan
     sodipodi:role="line"
     x="179.90680"
     y="152.62476"
     id="tspan1794">smaller than a wavelength of light.</tspan></text>
<text
   xml:space="preserve"
   style="font-size:10.000000px;font-style:normal;font-variant:normal;font-weight:normal;font-stretch:normal;text-align:start;line-height:125.00000%;writing-mode:lr-tb;text-anchor:start;fill:#000000;fill-opacity:1.0000000;stroke:none;stroke-width:1.0000000pt;stroke-linecap:butt;stroke-linejoin:miter;stroke-opacity:1.0000000;font-family:Bitstream Vera Sans"
   x="179.38434"
   y="184.30963"
   id="text1796"
   sodipodi:linespacing="125.00000%"><tspan
     sodipodi:role="line"
     id="tspan1798"
     x="179.38434"
     y="184.30963">Required in order to explain the</tspan><tspan
     sodipodi:role="line"
     x="179.38434"
     y="196.80963"
     id="tspan1800">interaction of light with individual</tspan><tspan
     sodipodi:role="line"
     x="179.38434"
     y="209.30963"
     id="tspan1802">atoms. At the atomic level, it</tspan><tspan
     sodipodi:role="line"
     x="179.38434"
     y="221.80963"
     id="tspan1804">becomes apparent that a beam of</tspan><tspan
     sodipodi:role="line"
     x="179.38434"
     y="234.30963"
     id="tspan1806">light has a certain graininess to it.</tspan></text>
<g
   style="overflow:visible"
   id="g3310"
   transform="translate(22.49062,23.74684)"><polygon
     style="fill:url(#linearGradient3316)"
     points="114.97100,170.72800 114.65600,174.32500 138.94000,176.45000 139.25400,172.85200 114.97100,170.72800 "
     id="polygon3312" /><circle
     cx="139.09599"
     cy="174.64999"
     r="1.8099999"
     id="circle3314"
     sodipodi:cx="139.09599"
     sodipodi:cy="174.64999"
     sodipodi:rx="1.8099999"
     sodipodi:ry="1.8099999" /></g><g
   style="overflow:visible"
   id="g3318"
   transform="translate(8.011327,31.18215)"><polygon
     style="fill:url(#linearGradient3324)"
     points="114.97100,170.72800 114.65600,174.32500 138.94000,176.45000 139.25400,172.85200 114.97100,170.72800 "
     id="polygon3320" /><circle
     cx="139.09599"
     cy="174.64999"
     r="1.8099999"
     id="circle3322"
     sodipodi:cx="139.09599"
     sodipodi:cy="174.64999"
     sodipodi:rx="1.8099999"
     sodipodi:ry="1.8099999" /></g><g
   style="overflow:visible"
   id="g3326"
   transform="translate(13.22909,54.40120)"><polygon
     style="fill:url(#linearGradient3332)"
     points="114.97100,170.72800 114.65600,174.32500 138.94000,176.45000 139.25400,172.85200 114.97100,170.72800 "
     id="polygon3328" /><circle
     cx="139.09599"
     cy="174.64999"
     r="1.8099999"
     id="circle3330"
     sodipodi:cx="139.09599"
     sodipodi:cy="174.64999"
     sodipodi:rx="1.8099999"
     sodipodi:ry="1.8099999" /></g></svg>