<?xml version="1.0" encoding="iso-8859-1"?>
<!-- Generator: Adobe Illustrator 11 Build 196, SVG Export Plug-In . SVG Version: 6.0.0 Build 78)  -->
<!DOCTYPE svg PUBLIC "-//W3C//DTD SVG 1.0//EN"    "http://www.w3.org/TR/2001/REC-SVG-20010904/DTD/svg10.dtd" [
	<!ENTITY ns_flows "http://ns.adobe.com/Flows/1.0/">
	<!ENTITY ns_svg "http://www.w3.org/2000/svg">
	<!ENTITY ns_xlink "http://www.w3.org/1999/xlink">
]>
<svg
	 width="148.937" height="334.495" viewBox="0 0 148.937 334.495"
	 style="overflow:visible;enable-background:new 0 0 148.937 334.495" xml:space="preserve">
	<style type="text/css">
	
	</style>
	<g id="Layer_1">
		<polyline style="fill:none;stroke:#000000;stroke-width:0.5;stroke-dasharray:2;" points="25.832,4.203 25.832,334.409 
			148.457,0.203 "/>
		<g>
			<text transform="matrix(1 0 0 1 33.457 285.2026)"><tspan x="0" y="0" style="font-family:'Symbol'; font-size:10;">&#x3B8;</tspan></text>
		</g>
		<polyline style="fill:none;stroke:#000000;" points="50.457,334.203 148.457,0.203 0.457,334.203 "/>
		<line style="fill:none;stroke:#000000;stroke-width:0.5;" x1="0.457" y1="334.203" x2="50.457" y2="334.203"/>
		<path style="fill:none;stroke:#000000;stroke-width:0.5;" d="M25.832,287.448c5.685,0,11.134,1.01,16.178,2.861"/>
		<g>
			<text transform="matrix(1 0 0 1 59.457 166.2026)"><tspan x="0" y="0" style="font-family:Bitstream Vera Sans; font-size:8.500000;">L</tspan></text>
		</g>
		<g>
			<text transform="matrix(1 0 0 1 104.457 178.2026)"><tspan x="0" y="0" style="font-family:Bitstream Vera Sans; font-size:8.500000;">L&apos;</tspan></text>
		</g>
	</g>
</svg>
