<?xml version="1.0" encoding="UTF-8" standalone="no"?>
<!-- Generator: Adobe Illustrator 11 Build 196, SVG Export Plug-In . SVG Version: 6.0.0 Build 78)  -->
<svg
   xmlns:a="http://ns.adobe.com/AdobeSVGViewerExtensions/3.0/"
   xmlns:xml="http://www.w3.org/XML/1998/namespace"
   xmlns:dc="http://purl.org/dc/elements/1.1/"
   xmlns:cc="http://web.resource.org/cc/"
   xmlns:rdf="http://www.w3.org/1999/02/22-rdf-syntax-ns#"
   xmlns:svg="http://www.w3.org/2000/svg"
   xmlns="http://www.w3.org/2000/svg"
   xmlns:xlink="http://www.w3.org/1999/xlink"
   xmlns:sodipodi="http://inkscape.sourceforge.net/DTD/sodipodi-0.dtd"
   xmlns:inkscape="http://www.inkscape.org/namespaces/inkscape"
   sodipodi:docbase="/home/bcrowell/Documents/writing/lm/trunk/1np/ch10/figs"
   sodipodi:docname="cannon.svg"
   inkscape:version="0.41"
   sodipodi:version="0.32"
   id="svg1"
   xml:space="preserve"
   style="overflow:visible;enable-background:new 0 0 144.593 105.173"
   viewBox="0 0 144.593 105.173"
   height="105.173"
   width="144.593"><defs
   id="defs532">
		<linearGradient
   y2="69.1009"
   x2="116.4535"
   y1="10.4341"
   x1="79.1204"
   gradientUnits="userSpaceOnUse"
   id="XMLID_16_">
			<stop
   id="stop8"
   style="stop-color:#FFFFFF"
   offset="0" />


			<stop
   id="stop10"
   style="stop-color:#7F7F7F"
   offset="1" />


			<midPointStop
   id="midPointStop12"
   style="stop-color:#FFFFFF"
   offset="0" />


			<midPointStop
   id="midPointStop14"
   style="stop-color:#FFFFFF"
   offset="0.5" />


			<midPointStop
   id="midPointStop16"
   style="stop-color:#7F7F7F"
   offset="1" />


		</linearGradient>


		

		
			<linearGradient
   gradientTransform="matrix(0.8 0 0 0.8 14.4465 10.5098)"
   y2="80.1953"
   x2="128.066"
   y1="-49.1377"
   x1="43.3987"
   gradientUnits="userSpaceOnUse"
   id="XMLID_17_">
			<stop
   id="stop22"
   style="stop-color:#FFFFFF"
   offset="0" />


			<stop
   id="stop24"
   style="stop-color:#E9E9E9"
   offset="1" />


			<midPointStop
   id="midPointStop26"
   style="stop-color:#FFFFFF"
   offset="0" />


			<midPointStop
   id="midPointStop28"
   style="stop-color:#FFFFFF"
   offset="0.5" />


			<midPointStop
   id="midPointStop30"
   style="stop-color:#E9E9E9"
   offset="1" />


		</linearGradient>


		

		
			<linearGradient
   gradientTransform="matrix(0.8 0 0 0.8 14.4465 10.5098)"
   y2="-1.7681"
   x2="158.2095"
   y1="-1.7681"
   x1="60.488"
   gradientUnits="userSpaceOnUse"
   id="XMLID_18_">
			<stop
   id="stop36"
   style="stop-color:#FFFFFF"
   offset="0" />


			<stop
   id="stop38"
   style="stop-color:#7F7F7F"
   offset="1" />


			<midPointStop
   id="midPointStop40"
   style="stop-color:#FFFFFF"
   offset="0" />


			<midPointStop
   id="midPointStop42"
   style="stop-color:#FFFFFF"
   offset="0.5" />


			<midPointStop
   id="midPointStop44"
   style="stop-color:#7F7F7F"
   offset="1" />


		</linearGradient>


		

		
			<linearGradient
   gradientTransform="matrix(0.8 0 0 0.8 14.4465 10.5098)"
   y2="6.6938"
   x2="80.3127"
   y1="6.6938"
   x1="56.7834"
   gradientUnits="userSpaceOnUse"
   id="XMLID_19_">
			<stop
   id="stop50"
   style="stop-color:#FFFFFF"
   offset="0" />


			<stop
   id="stop52"
   style="stop-color:#7F7F7F"
   offset="1" />


			<midPointStop
   id="midPointStop54"
   style="stop-color:#FFFFFF"
   offset="0" />


			<midPointStop
   id="midPointStop56"
   style="stop-color:#FFFFFF"
   offset="0.5" />


			<midPointStop
   id="midPointStop58"
   style="stop-color:#7F7F7F"
   offset="1" />


		</linearGradient>


		

		

		

		

		
			<radialGradient
   gradientUnits="userSpaceOnUse"
   gradientTransform="matrix(0.4 0 0 0.4 42.7142 10.269)"
   fy="43.3823"
   fx="89.4866"
   r="10.6301"
   cy="43.3823"
   cx="89.4866"
   id="XMLID_23_">
			<stop
   id="stop357"
   style="stop-color:#CACACA"
   offset="0" />


			<stop
   id="stop359"
   style="stop-color:#B6B6B6"
   offset="0.0875" />


			<stop
   id="stop361"
   style="stop-color:#989898"
   offset="0.226" />


			<stop
   id="stop363"
   style="stop-color:#797979"
   offset="0.3689" />


			<stop
   id="stop365"
   style="stop-color:#5B5B5B"
   offset="0.515" />


			<stop
   id="stop367"
   style="stop-color:#3B3B3B"
   offset="0.6655" />


			<stop
   id="stop369"
   style="stop-color:#1F1F1F"
   offset="0.8232" />


			<stop
   id="stop371"
   style="stop-color:#000000"
   offset="1" />


			<midPointStop
   id="midPointStop373"
   style="stop-color:#CACACA"
   offset="0" />


			<midPointStop
   id="midPointStop375"
   style="stop-color:#CACACA"
   offset="0.27" />


			<midPointStop
   id="midPointStop377"
   style="stop-color:#000000"
   offset="1" />


		</radialGradient>


		
 
		
			<radialGradient
   gradientUnits="userSpaceOnUse"
   gradientTransform="matrix(0.4 0 0 0.4 106.7977 -4.0979)"
   fy="43.3823"
   fx="89.4866"
   r="10.6301"
   cy="43.3823"
   cx="89.4866"
   id="XMLID_24_">
			<stop
   id="stop383"
   style="stop-color:#CACACA"
   offset="0" />


			<stop
   id="stop385"
   style="stop-color:#B6B6B6"
   offset="0.0875" />


			<stop
   id="stop387"
   style="stop-color:#989898"
   offset="0.226" />


			<stop
   id="stop389"
   style="stop-color:#797979"
   offset="0.3689" />


			<stop
   id="stop391"
   style="stop-color:#5B5B5B"
   offset="0.515" />


			<stop
   id="stop393"
   style="stop-color:#3B3B3B"
   offset="0.6655" />


			<stop
   id="stop395"
   style="stop-color:#1F1F1F"
   offset="0.8232" />


			<stop
   id="stop397"
   style="stop-color:#000000"
   offset="1" />


			<midPointStop
   id="midPointStop399"
   style="stop-color:#CACACA"
   offset="0" />


			<midPointStop
   id="midPointStop401"
   style="stop-color:#CACACA"
   offset="0.27" />


			<midPointStop
   id="midPointStop403"
   style="stop-color:#000000"
   offset="1" />


		</radialGradient>


		
 
		
			<linearGradient
   gradientTransform="matrix(0.8 0 0 0.8 14.4465 10.5098)"
   y2="122.6611"
   x2="42.9581"
   y1="67.3281"
   x1="114.2917"
   gradientUnits="userSpaceOnUse"
   id="XMLID_25_">
			<stop
   id="stop409"
   style="stop-color:#EDEDED"
   offset="0" />


			<stop
   id="stop411"
   style="stop-color:#E9E9E9"
   offset="1" />


			<midPointStop
   id="midPointStop413"
   style="stop-color:#EDEDED"
   offset="0" />


			<midPointStop
   id="midPointStop415"
   style="stop-color:#EDEDED"
   offset="0.5" />


			<midPointStop
   id="midPointStop417"
   style="stop-color:#E9E9E9"
   offset="1" />


		</linearGradient>


		

		
			<linearGradient
   gradientTransform="matrix(0.8 0 0 0.8 14.4465 10.5098)"
   y2="11.8909"
   x2="-47.0786"
   y1="144.2236"
   x1="44.2556"
   gradientUnits="userSpaceOnUse"
   id="XMLID_26_">
			<stop
   id="stop423"
   style="stop-color:#FFFFFF"
   offset="0" />


			<stop
   id="stop425"
   style="stop-color:#7F7F7F"
   offset="1" />


			<midPointStop
   id="midPointStop427"
   style="stop-color:#FFFFFF"
   offset="0" />


			<midPointStop
   id="midPointStop429"
   style="stop-color:#FFFFFF"
   offset="0.5" />


			<midPointStop
   id="midPointStop431"
   style="stop-color:#7F7F7F"
   offset="1" />


		</linearGradient>


		

		
			<linearGradient
   gradientTransform="matrix(0.8 0 0 0.8 14.4465 10.5098)"
   y2="4.6956"
   x2="4.8588"
   y1="93.6953"
   x1="-47.1416"
   gradientUnits="userSpaceOnUse"
   id="XMLID_27_">
			<stop
   id="stop437"
   style="stop-color:#FFFFFF"
   offset="0" />


			<stop
   id="stop439"
   style="stop-color:#7F7F7F"
   offset="1" />


			<midPointStop
   id="midPointStop441"
   style="stop-color:#FFFFFF"
   offset="0" />


			<midPointStop
   id="midPointStop443"
   style="stop-color:#FFFFFF"
   offset="0.5" />


			<midPointStop
   id="midPointStop445"
   style="stop-color:#7F7F7F"
   offset="1" />


		</linearGradient>


		

		
			<radialGradient
   gradientUnits="userSpaceOnUse"
   gradientTransform="matrix(0.4 0 0 0.4 -14.6193 -3.6812)"
   fy="43.3823"
   fx="89.4866"
   r="10.6301"
   cy="43.3823"
   cx="89.4866"
   id="XMLID_28_">
			<stop
   id="stop451"
   style="stop-color:#CACACA"
   offset="0" />


			<stop
   id="stop453"
   style="stop-color:#B6B6B6"
   offset="0.0875" />


			<stop
   id="stop455"
   style="stop-color:#989898"
   offset="0.226" />


			<stop
   id="stop457"
   style="stop-color:#797979"
   offset="0.3689" />


			<stop
   id="stop459"
   style="stop-color:#5B5B5B"
   offset="0.515" />


			<stop
   id="stop461"
   style="stop-color:#3B3B3B"
   offset="0.6655" />


			<stop
   id="stop463"
   style="stop-color:#1F1F1F"
   offset="0.8232" />


			<stop
   id="stop465"
   style="stop-color:#000000"
   offset="1" />


			<midPointStop
   id="midPointStop467"
   style="stop-color:#CACACA"
   offset="0" />


			<midPointStop
   id="midPointStop469"
   style="stop-color:#CACACA"
   offset="0.27" />


			<midPointStop
   id="midPointStop471"
   style="stop-color:#000000"
   offset="1" />


		</radialGradient>


		
 
		

		

		

		
			<radialGradient
   gradientUnits="userSpaceOnUse"
   gradientTransform="matrix(0.4 0 0 0.4 81.3356 54.323)"
   fy="43.3823"
   fx="89.4866"
   r="10.6301"
   cy="43.3823"
   cx="89.4866"
   id="XMLID_29_">
			<stop
   id="stop498"
   style="stop-color:#CACACA"
   offset="0" />


			<stop
   id="stop500"
   style="stop-color:#B6B6B6"
   offset="0.0875" />


			<stop
   id="stop502"
   style="stop-color:#989898"
   offset="0.226" />


			<stop
   id="stop504"
   style="stop-color:#797979"
   offset="0.3689" />


			<stop
   id="stop506"
   style="stop-color:#5B5B5B"
   offset="0.515" />


			<stop
   id="stop508"
   style="stop-color:#3B3B3B"
   offset="0.6655" />


			<stop
   id="stop510"
   style="stop-color:#1F1F1F"
   offset="0.8232" />


			<stop
   id="stop512"
   style="stop-color:#000000"
   offset="1" />


			<midPointStop
   id="midPointStop514"
   style="stop-color:#CACACA"
   offset="0" />


			<midPointStop
   id="midPointStop516"
   style="stop-color:#CACACA"
   offset="0.27" />


			<midPointStop
   id="midPointStop518"
   style="stop-color:#000000"
   offset="1" />


		</radialGradient>


		
 
		

	<linearGradient
   y2="4.6956"
   x2="4.8588"
   y1="93.6953"
   x1="-47.1416"
   gradientTransform="matrix(0.800000,0.000000,0.000000,0.800000,14.44650,10.50980)"
   gradientUnits="userSpaceOnUse"
   id="linearGradient1647"
   xlink:href="#XMLID_27_"
   inkscape:collect="always" />
<linearGradient
   y2="11.8909"
   x2="-47.0786"
   y1="144.2236"
   x1="44.2556"
   gradientTransform="matrix(0.800000,0.000000,0.000000,0.800000,14.44650,10.50980)"
   gradientUnits="userSpaceOnUse"
   id="linearGradient1650"
   xlink:href="#XMLID_26_"
   inkscape:collect="always" />
<linearGradient
   y2="122.6611"
   x2="42.9581"
   y1="67.3281"
   x1="114.2917"
   gradientTransform="matrix(0.800000,0.000000,0.000000,0.800000,14.44650,10.50980)"
   gradientUnits="userSpaceOnUse"
   id="linearGradient1653"
   xlink:href="#XMLID_25_"
   inkscape:collect="always" />
<linearGradient
   y2="6.6938"
   x2="80.3127"
   y1="6.6938"
   x1="56.7834"
   gradientTransform="matrix(0.800000,0.000000,0.000000,0.800000,14.44650,10.50980)"
   gradientUnits="userSpaceOnUse"
   id="linearGradient1796"
   xlink:href="#XMLID_19_"
   inkscape:collect="always" />
<linearGradient
   y2="-1.7681"
   x2="158.2095"
   y1="-1.7681"
   x1="60.488"
   gradientTransform="matrix(0.800000,0.000000,0.000000,0.800000,14.44650,10.50980)"
   gradientUnits="userSpaceOnUse"
   id="linearGradient1799"
   xlink:href="#XMLID_18_"
   inkscape:collect="always" />
<linearGradient
   y2="80.1953"
   x2="128.066"
   y1="-49.1377"
   x1="43.3987"
   gradientTransform="matrix(0.800000,0.000000,0.000000,0.800000,14.44650,10.50980)"
   gradientUnits="userSpaceOnUse"
   id="linearGradient1802"
   xlink:href="#XMLID_17_"
   inkscape:collect="always" />
<linearGradient
   y2="69.1009"
   x2="116.4535"
   y1="10.4341"
   x1="79.1204"
   gradientUnits="userSpaceOnUse"
   id="linearGradient1805"
   xlink:href="#XMLID_16_"
   inkscape:collect="always" />

			

			

			

		</defs>

<metadata
   id="metadata531">
  <rdf:RDF
   id="RDF533">
    <cc:Work
   id="Work534"
   rdf:about="">
      <dc:format
   id="format535">image/svg+xml</dc:format>

      <dc:type
   rdf:resource="http://purl.org/dc/dcmitype/StillImage"
   id="type537" />

    </cc:Work>

  </rdf:RDF>

</metadata>

<sodipodi:namedview
   inkscape:current-layer="svg1"
   inkscape:window-y="0"
   inkscape:window-x="0"
   inkscape:window-height="576"
   inkscape:window-width="798"
   inkscape:cy="88.101493"
   inkscape:cx="47.052362"
   inkscape:zoom="8.7839816"
   inkscape:pageshadow="2"
   inkscape:pageopacity="0.0"
   borderopacity="1.0"
   bordercolor="#666666"
   pagecolor="#ffffff"
   id="base" />


	<style
   id="style3"
   type="text/css">
	
	</style>


	<path
   id="path19"
   d="M 63.320000,3.0600000 L 63.320000,5.9400000 C 92.579000,12.551000 114.43600,38.688000 114.43600,69.945000 C 114.43600,70.148000 114.42300,70.347000 114.42100,70.549000 L 117.22700,70.549000 C 117.22900,70.347000 117.24200,70.148000 117.24200,69.945000 C 117.24200,37.129000 94.142000,9.7210000 63.320000,3.0600000 z "
   style="fill:url(#linearGradient1805)" />
<path
   id="path33"
   d="M 62.000000,6.2080000 C 87.804000,11.548000 104.41800,36.700000 99.163000,62.421000 L 102.64700,63.142000 C 108.29900,35.502000 90.446000,8.4730000 62.719000,2.7350000 C 62.374000,2.6640000 62.031000,2.6120000 61.686000,2.5480000 L 60.967000,6.0210000 C 61.311000,6.0840000 61.655000,6.1360000 62.000000,6.2080000 z "
   style="fill:url(#linearGradient1802)" />
<path
   id="path47"
   d="M 63.286000,2.4990000 C 91.955000,4.3160000 118.31500,7.8610000 140.32400,12.563000 L 140.58400,15.694000 C 118.57600,10.993000 92.216000,7.4470000 63.547000,5.6300000 L 63.286000,2.4990000 z "
   style="fill:url(#linearGradient1799)" />
<path
   id="path61"
   d="M 75.383000,28.696000 C 75.475000,27.782000 75.523000,26.850000 75.523000,25.904000 C 75.523000,14.942000 69.128000,5.9430000 60.974000,4.9930000 L 63.760000,3.0340000 C 71.915000,3.9830000 78.309000,12.983000 78.309000,23.945000 C 78.309000,24.892000 78.261000,25.824000 78.169000,26.737000 L 75.249000,28.029000"
   style="fill:url(#linearGradient1796)" />
<g
   id="g63">
			<g
   id="g65">
				
					<linearGradient
   gradientTransform="matrix(0.6176 0.0459 -0.0932 1.2537 10.3817 -101.3102)"
   y2="78.0428"
   x2="79.0567"
   y1="82.7095"
   x1="78.9734"
   gradientUnits="userSpaceOnUse"
   id="XMLID_20_">
					<stop
   id="stop68"
   style="stop-color:#FEC349"
   offset="0" />


					<stop
   id="stop70"
   style="stop-color:#FEC44C"
   offset="0.2161" />


					<stop
   id="stop72"
   style="stop-color:#FEC857"
   offset="0.3461" />


					<stop
   id="stop74"
   style="stop-color:#FECD67"
   offset="0.4534" />


					<stop
   id="stop76"
   style="stop-color:#FDD47B"
   offset="0.5482" />


					<stop
   id="stop78"
   style="stop-color:#FDDD93"
   offset="0.6349" />


					<stop
   id="stop80"
   style="stop-color:#FDE7AD"
   offset="0.7156" />


					<stop
   id="stop82"
   style="stop-color:#FDF2C8"
   offset="0.7902" />


					<stop
   id="stop84"
   style="stop-color:#FCF5D1"
   offset="0.81" />


					<stop
   id="stop86"
   style="stop-color:#FCF2CA"
   offset="0.8335" />


					<stop
   id="stop88"
   style="stop-color:#FCEBB8"
   offset="0.8718" />


					<stop
   id="stop90"
   style="stop-color:#FCDE99"
   offset="0.9201" />


					<stop
   id="stop92"
   style="stop-color:#FCCB66"
   offset="0.9761" />


					<stop
   id="stop94"
   style="stop-color:#FCC249"
   offset="1" />


					<midPointStop
   id="midPointStop96"
   style="stop-color:#FEC349"
   offset="0" />


					<midPointStop
   id="midPointStop98"
   style="stop-color:#FEC349"
   offset="0.8" />


					<midPointStop
   id="midPointStop100"
   style="stop-color:#FCF5D1"
   offset="0.81" />


					<midPointStop
   id="midPointStop102"
   style="stop-color:#FCF5D1"
   offset="0.6" />


					<midPointStop
   id="midPointStop104"
   style="stop-color:#FCC249"
   offset="1" />


				</linearGradient>


				<path
   id="path107"
   d="M59.329,0.839c-1.417-0.351-3.055-0.613-4.81-0.744      c-5.547-0.413-10.148,0.642-10.276,2.355c-0.127,1.714,4.267,3.438,9.814,3.85c1.755,0.131,3.414,0.113,4.867-0.024      L59.329,0.839z"
   style="fill:url(#XMLID_20_);" />


				
					<linearGradient
   gradientTransform="matrix(0.6176 0.0459 -0.0932 1.2537 10.2274 -101.3215)"
   y2="78.9847"
   x2="95.5427"
   y1="81.9014"
   x1="95.2927"
   gradientUnits="userSpaceOnUse"
   id="XMLID_21_">
					<stop
   id="stop110"
   style="stop-color:#FEC349"
   offset="0" />


					<stop
   id="stop112"
   style="stop-color:#FEC44C"
   offset="0.2161" />


					<stop
   id="stop114"
   style="stop-color:#FEC857"
   offset="0.3461" />


					<stop
   id="stop116"
   style="stop-color:#FECD67"
   offset="0.4534" />


					<stop
   id="stop118"
   style="stop-color:#FDD47B"
   offset="0.5482" />


					<stop
   id="stop120"
   style="stop-color:#FDDD93"
   offset="0.6349" />


					<stop
   id="stop122"
   style="stop-color:#FDE7AD"
   offset="0.7156" />


					<stop
   id="stop124"
   style="stop-color:#FDF2C8"
   offset="0.7902" />


					<stop
   id="stop126"
   style="stop-color:#FCF5D1"
   offset="0.81" />


					<stop
   id="stop128"
   style="stop-color:#FCF2CA"
   offset="0.8335" />


					<stop
   id="stop130"
   style="stop-color:#FCEBB8"
   offset="0.8718" />


					<stop
   id="stop132"
   style="stop-color:#FCDE99"
   offset="0.9201" />


					<stop
   id="stop134"
   style="stop-color:#FCCB66"
   offset="0.9761" />


					<stop
   id="stop136"
   style="stop-color:#FCC249"
   offset="1" />


					<midPointStop
   id="midPointStop138"
   style="stop-color:#FEC349"
   offset="0" />


					<midPointStop
   id="midPointStop140"
   style="stop-color:#FEC349"
   offset="0.8" />


					<midPointStop
   id="midPointStop142"
   style="stop-color:#FCF5D1"
   offset="0.81" />


					<midPointStop
   id="midPointStop144"
   style="stop-color:#FCF5D1"
   offset="0.6" />


					<midPointStop
   id="midPointStop146"
   style="stop-color:#FCC249"
   offset="1" />


				</linearGradient>


				<path
   id="path149"
   d="M64.484,1.172l-0.348,0.499l-2.625-0.195c-0.652-0.256-1.402-0.489-2.226-0.693      l-0.404,5.438c0.844-0.08,1.621-0.2,2.304-0.356l2.625,0.195l0.262,0.65l0.206-2.77c0.002-0.017,0.011-0.033,0.012-0.05      c0.001-0.018-0.005-0.035-0.005-0.052L64.484,1.172z"
   style="fill:url(#XMLID_21_);" />


			</g>


			<path
   id="path152"
   d="M64.059,1.915L61.434,1.72c-0.652-0.256-1.402-0.489-2.226-0.693     l-0.003,0.045c-1.407-0.345-3.027-0.604-4.763-0.733c-5.548-0.413-10.148,0.642-10.276,2.355     c-0.127,1.714,4.267,3.437,9.814,3.85c1.754,0.13,3.413,0.113,4.867-0.024l0.004-0.062c0.825-0.08,1.586-0.197,2.256-0.351     l2.625,0.195l0.262,0.65l0.206-2.77c0.002-0.017,0.011-0.033,0.012-0.05c0.001-0.018-0.005-0.035-0.005-0.052l0.198-2.666     L64.059,1.915z"
   style="fill:none;stroke:#000000;stroke-width:0.5;" />


		</g>
<g
   id="g157">
				<g
   id="g159">
					<defs
   id="defs161">
						<path
   d="M60.428,83.356c-15.553,5.646-29.022-0.765-35.831-7.97c-11.586-12.261-11.028-27.14-6.642-36.977        c2.585-5.799,7.95-13.591,18.823-17.78c-4.712,1.773-8.712,5.564-11.229,11.25c2.517-5.686,6.517-9.477,11.229-11.25        c5.435-1.854,11.695-3.257,20.627-0.991c6.128,1.554,11.695,5.06,16.545,10.42c7.131,7.88,11.639,22.766,4.687,36.828        C73.274,77.732,64.116,82.018,60.428,83.356z"
   id="XMLID_7_" />


					</defs>


					<use
   id="use165"
   style="fill:#EEEEEE;"
   xlink:href="#XMLID_7_" />


					<clipPath
   id="XMLID_22_">
						<use
   id="use168"
   xlink:href="#XMLID_7_" />


					</clipPath>


					<g
   id="g171"
   style="clip-path:url(#XMLID_22_);">
						<path
   id="path173"
   d="M60.428,83.356c-15.553,5.646-29.022-0.765-35.831-7.97        c-11.586-12.261-11.028-27.14-6.642-36.977c2.585-5.799,7.95-13.591,18.823-17.78c-4.712,1.773-8.712,5.564-11.229,11.25        c2.517-5.686,6.517-9.477,11.229-11.25c5.435-1.854,11.695-3.257,20.627-0.991c6.128,1.554,11.695,5.06,16.545,10.42        c7.131,7.88,11.639,22.766,4.687,36.828C73.274,77.732,64.116,82.018,60.428,83.356"
   style="fill:#E5E5E5;" />


						<g
   id="g175">
							<path
   id="path177"
   d="M17.955,38.41c0.254-0.566,0.64-1.422,1.305-2.633l0.626-1.085         c0.199-0.317,0.459-0.744,0.664-1.058l0.636-0.938c0.198-0.271,0.457-0.636,0.659-0.903l0.658-0.843         c0.204-0.245,0.47-0.575,0.679-0.814l0.7-0.788l0.726-0.768l0.768-0.762c0.243-0.226,0.562-0.53,0.808-0.751l0.874-0.759         c0.282-0.229,0.655-0.538,0.941-0.762l1.034-0.773c0.348-0.239,0.807-0.565,1.16-0.797l1.27-0.793         c0.458-0.258,1.065-0.609,1.53-0.855l1.597-0.785c0.655-0.279,1.525-0.657,2.189-0.913         c-4.624,1.74-8.561,5.422-11.085,10.931l0,0c-1.968,0.608-5.622,2.381-7.981,7.414C17.784,38.806,17.879,38.579,17.955,38.41         "
   style="fill:#E5E5E5;" />


							<path
   id="path179"
   d="M36.779,20.63c1.543-0.526,3.657-1.247,6.213-1.683l2.32-0.312         c1.125-0.072,2.626-0.153,3.753-0.162l2.467,0.123c1.019,0.127,2.38,0.291,3.391,0.47l2.482,0.574         c0.94,0.295,2.2,0.676,3.124,1.017l2.403,1.025c0.865,0.453,2.027,1.041,2.868,1.535l2.242,1.469         c0.782,0.607,1.837,1.402,2.589,2.046l1.978,1.87l1.341,1.458l1.662,2.078c0.543,0.802,1.283,1.863,1.787,2.69l1.24,2.274         c0.4,0.891,0.946,2.073,1.302,2.982l0.803,2.382c0.251,0.979,0.592,2.285,0.793,3.276l0.362,2.374         c0.088,1.09,0.195,2.545,0.224,3.638l-0.057,2.199c-0.115,1.271-0.32,2.962-0.516,4.223l-0.386,1.785         c-0.55,2.009-0.882,3.222-1.913,5.617l-0.614,1.31c-0.207,0.397-0.476,0.93-0.691,1.323l-0.626,1.086         c-0.199,0.317-0.458,0.744-0.664,1.057l-0.636,0.938c-0.197,0.271-0.457,0.636-0.659,0.903l-0.658,0.843         c-0.204,0.245-0.471,0.574-0.679,0.815l-0.7,0.788c-0.218,0.23-0.505,0.54-0.726,0.767l-0.768,0.762         c-0.242,0.226-0.562,0.53-0.808,0.751l-0.873,0.759c-0.282,0.229-0.655,0.538-0.941,0.762l-1.033,0.773         c-0.348,0.239-0.808,0.565-1.16,0.797l-1.269,0.792c-0.458,0.258-1.066,0.61-1.531,0.856l-1.596,0.784         c-0.654,0.279-1.525,0.657-2.189,0.913l-1.991,0.679c-2.717,0.74-2.823,0.769-4.397,1.033l-2.326,0.301         c-1.121,0.066-2.618,0.14-3.741,0.143l-2.468-0.135c-1.017-0.132-2.375-0.302-3.384-0.486l-2.481-0.586         c-0.938-0.299-2.194-0.686-3.117-1.031l-2.399-1.038c-0.862-0.457-2.022-1.051-2.861-1.55l0.356,0.203         c8.459,3.92,16.091-3.953,18.229-6.46c14.445-16.939,18.805-22.051,14.347-31.739c-6.301-13.693-33.688-13.152-38.502-11.128         C28.217,26.052,32.155,22.37,36.779,20.63"
   style="fill:#E5E5E5;" />


						</g>


						<g
   id="g182">
							<path
   id="path184"
   d="M19.26,35.777c0.829-1.438,0.829-1.438,1.29-2.143l0.636-0.938         c0.198-0.271,0.457-0.636,0.659-0.903l0.658-0.843c0.204-0.245,0.47-0.575,0.679-0.814l0.7-0.788l0.726-0.768l0.768-0.762         c0.243-0.226,0.562-0.53,0.808-0.751l0.874-0.759c0.282-0.229,0.655-0.538,0.941-0.762l1.034-0.773         c0.348-0.239,0.807-0.565,1.16-0.797l1.27-0.793c0.458-0.258,1.065-0.609,1.53-0.855l1.597-0.785         c0.655-0.279,1.525-0.657,2.189-0.913c-4.347,1.636-8.087,4.988-10.617,9.962l0,0c-0.05,0.013-5.068,1.474-7.699,6.728         l0.638-1.246L19.26,35.777"
   style="fill:#E4E4E4;" />


							<path
   id="path186"
   d="M36.779,20.63c1.543-0.526,3.657-1.247,6.213-1.683l2.32-0.312         c1.125-0.072,2.626-0.153,3.753-0.162l2.467,0.123c1.019,0.127,2.38,0.291,3.391,0.47l2.482,0.574         c0.94,0.295,2.2,0.676,3.124,1.017l2.403,1.025c0.865,0.453,2.027,1.041,2.868,1.535l2.242,1.469         c0.782,0.607,1.837,1.402,2.589,2.046l1.978,1.87l1.341,1.458l1.662,2.078c0.543,0.802,1.283,1.863,1.787,2.69l1.24,2.274         c0.4,0.891,0.946,2.073,1.302,2.982l0.803,2.382c0.251,0.979,0.592,2.285,0.793,3.276l0.362,2.374         c0.088,1.09,0.195,2.545,0.224,3.638l-0.057,2.199c-0.115,1.271-0.32,2.962-0.516,4.223l-0.386,1.785         c-0.55,2.009-0.882,3.222-1.913,5.617l-0.614,1.31c-0.207,0.397-0.476,0.93-0.691,1.323l-0.626,1.086         c-0.199,0.317-0.458,0.744-0.664,1.057l-0.636,0.938c-0.197,0.271-0.457,0.636-0.659,0.903l-0.658,0.843         c-0.204,0.245-0.471,0.574-0.679,0.815l-0.7,0.788c-0.218,0.23-0.505,0.54-0.726,0.767l-0.768,0.762         c-0.242,0.226-0.562,0.53-0.808,0.751l-0.873,0.759c-0.282,0.229-0.655,0.538-0.941,0.762l-1.033,0.773         c-0.348,0.239-0.808,0.565-1.16,0.797l-1.269,0.792c-0.458,0.258-1.066,0.61-1.531,0.856l-1.596,0.784         c-0.654,0.279-1.525,0.657-2.189,0.913l-1.991,0.679c-2.717,0.74-2.823,0.769-4.397,1.033l-2.326,0.301         c-1.121,0.066-2.618,0.14-3.741,0.143l-2.468-0.135c-1.017-0.132-2.375-0.302-3.384-0.486l-2.481-0.586         c-0.938-0.299-2.194-0.686-3.117-1.031l-2.399-1.038l-1.522-0.779l0.127,0.068c7.628,3.414,14.812-2.509,19.495-8.079         c11.317-13.459,16.997-20.215,12.97-30.532c-6.055-15.512-34.594-14.198-39.034-12.321         C28.69,25.618,32.431,22.266,36.779,20.63"
   style="fill:#E4E4E4;" />


						</g>


						<g
   id="g189">
							<path
   id="path191"
   d="M20.55,33.634c0.846-1.246,0.846-1.246,1.295-1.841l0.658-0.843         c0.204-0.245,0.47-0.575,0.679-0.814l0.7-0.788l0.726-0.768l0.768-0.762c0.243-0.226,0.562-0.53,0.808-0.751l0.874-0.759         c0.282-0.229,0.655-0.538,0.941-0.762l1.034-0.773c0.348-0.239,0.807-0.565,1.16-0.797l1.27-0.793         c0.458-0.258,1.065-0.609,1.53-0.855l1.597-0.785c0.655-0.279,1.525-0.657,2.189-0.913c-4.07,1.532-7.609,4.569-10.12,9.033         l0,0c-0.046,0.011-4.749,1.419-7.348,6.024l0.628-1.081L20.55,33.634"
   style="fill:#E3E3E3;" />


							<path
   id="path193"
   d="M36.779,20.63c1.543-0.526,3.657-1.247,6.213-1.683l2.32-0.312         c1.125-0.072,2.626-0.153,3.753-0.162l2.467,0.123c1.019,0.127,2.38,0.291,3.391,0.47l2.482,0.574         c0.94,0.295,2.2,0.676,3.124,1.017l2.403,1.025c0.865,0.453,2.027,1.041,2.868,1.535l2.242,1.469         c0.782,0.607,1.837,1.402,2.589,2.046l1.978,1.87l1.341,1.458l1.662,2.078c0.543,0.802,1.283,1.863,1.787,2.69l1.24,2.274         c0.4,0.891,0.946,2.073,1.302,2.982l0.803,2.382c0.251,0.979,0.592,2.285,0.793,3.276l0.362,2.374         c0.088,1.09,0.195,2.545,0.224,3.638l-0.057,2.199c-0.115,1.271-0.32,2.962-0.516,4.223l-0.386,1.785         c-0.55,2.009-0.882,3.222-1.913,5.617l-0.614,1.31c-0.207,0.397-0.476,0.93-0.691,1.323l-0.626,1.086         c-0.199,0.317-0.458,0.744-0.664,1.057l-0.636,0.938c-0.197,0.271-0.457,0.636-0.659,0.903l-0.658,0.843         c-0.204,0.245-0.471,0.574-0.679,0.815l-0.7,0.788c-0.218,0.23-0.505,0.54-0.726,0.767l-0.768,0.762         c-0.242,0.226-0.562,0.53-0.808,0.751l-0.873,0.759c-0.282,0.229-0.655,0.538-0.941,0.762l-1.033,0.773         c-0.348,0.239-0.808,0.565-1.16,0.797l-1.269,0.792c-0.458,0.258-1.066,0.61-1.531,0.856l-1.596,0.784         c-0.654,0.279-1.525,0.657-2.189,0.913l-1.991,0.679c-2.717,0.74-2.823,0.769-4.397,1.033l-2.326,0.301         c-1.121,0.066-2.618,0.14-3.741,0.143l-2.468-0.135c-1.017-0.132-2.375-0.302-3.384-0.486l-2.481-0.586         c-0.938-0.299-2.194-0.686-3.117-1.031c-0.708-0.306-1.652-0.714-2.36-1.02c0.398,0.159,0.93,0.371,1.328,0.529         c7.327,2.117,15.611-4.102,26.864-20.164c5.812-8.297,6.861-15.913,3.118-22.634C59.591,29.421,34.26,26.083,26.658,29.663         C29.169,25.199,32.708,22.162,36.779,20.63"
   style="fill:#E3E3E3;" />


						</g>


						<g
   id="g196">
							<path
   id="path198"
   d="M20.55,33.634c0.23-0.349,0.659-0.999,1.295-1.841l0.658-0.843         c0.204-0.245,0.47-0.575,0.679-0.814l0.7-0.788l0.726-0.768l0.768-0.762c0.243-0.226,0.562-0.53,0.808-0.751l0.874-0.759         c0.282-0.229,0.655-0.538,0.941-0.762l1.034-0.773c0.348-0.239,0.807-0.565,1.16-0.797l1.27-0.793         c0.458-0.258,1.065-0.609,1.53-0.855l1.597-0.785c0.655-0.279,1.525-0.657,2.189-0.913c-3.775,1.421-7.093,4.137-9.558,8.084         h0c-0.042,0.012-4.341,1.266-6.999,5.433C20.32,33.993,20.449,33.787,20.55,33.634"
   style="fill:#E2E2E2;" />


							<path
   id="path200"
   d="M36.779,20.63c1.543-0.526,3.657-1.247,6.213-1.683l2.32-0.312         c1.125-0.072,2.626-0.153,3.753-0.162l2.467,0.123c1.019,0.127,2.38,0.291,3.391,0.47l2.482,0.574         c0.94,0.295,2.2,0.676,3.124,1.017l2.403,1.025c0.865,0.453,2.027,1.041,2.868,1.535l2.242,1.469         c0.782,0.607,1.837,1.402,2.589,2.046l1.978,1.87l1.341,1.458l1.662,2.078c0.543,0.802,1.283,1.863,1.787,2.69l1.24,2.274         c0.4,0.891,0.946,2.073,1.302,2.982l0.803,2.382c0.251,0.979,0.592,2.285,0.793,3.276l0.362,2.374         c0.088,1.09,0.195,2.545,0.224,3.638l-0.057,2.199c-0.115,1.271-0.32,2.962-0.516,4.223l-0.386,1.785         c-0.55,2.009-0.882,3.222-1.913,5.617l-0.614,1.31c-0.207,0.397-0.476,0.93-0.691,1.323l-0.626,1.086         c-0.199,0.317-0.458,0.744-0.664,1.057l-0.636,0.938c-0.197,0.271-0.457,0.636-0.659,0.903l-0.658,0.843         c-0.204,0.245-0.471,0.574-0.679,0.815l-0.7,0.788c-0.218,0.23-0.505,0.54-0.726,0.767l-0.768,0.762         c-0.242,0.226-0.562,0.53-0.808,0.751l-0.873,0.759c-0.282,0.229-0.655,0.538-0.941,0.762l-1.033,0.773         c-0.348,0.239-0.808,0.565-1.16,0.797l-1.269,0.792c-0.458,0.258-1.066,0.61-1.531,0.856l-1.596,0.784         c-0.654,0.279-1.525,0.657-2.189,0.913l-1.991,0.679c-2.717,0.74-2.823,0.769-4.397,1.033l-2.326,0.301         c-1.121,0.066-2.618,0.14-3.741,0.143l-2.468-0.135c-1.017-0.132-2.375-0.302-3.384-0.486l-2.481-0.586         c-0.938-0.299-2.194-0.686-3.117-1.031c-0.239-0.096-0.557-0.224-0.796-0.32c0.406,0.139,0.947,0.324,1.353,0.463         c9.48,2.439,20.88-11.49,28.773-23.604c3.442-5.283,5.051-14.186,0.449-21.246c-8.599-13.193-34.83-11.952-39.083-9.852         C29.684,24.766,33.003,22.05,36.779,20.63"
   style="fill:#E2E2E2;" />


						</g>


						<g
   id="g203">
							<path
   id="path205"
   d="M21.845,31.793c0.709-0.939,1.312-1.629,1.337-1.658l0.7-0.788l0.726-0.768l0.768-0.762         c0.243-0.226,0.562-0.53,0.808-0.751l0.874-0.759c0.282-0.229,0.655-0.538,0.941-0.762l1.034-0.773         c0.348-0.239,0.807-0.565,1.16-0.797l1.27-0.793c0.458-0.258,1.065-0.609,1.53-0.855l1.597-0.785         c0.655-0.279,1.525-0.657,2.189-0.913c-3.477,1.308-6.565,3.715-8.957,7.17l0,0c-0.04,0.012-4.065,1.272-6.583,4.823         C21.42,32.375,21.659,32.04,21.845,31.793"
   style="fill:#E2E2E2;" />


							<path
   id="path207"
   d="M36.779,20.63c1.543-0.526,3.657-1.247,6.213-1.683l2.32-0.312         c1.125-0.072,2.626-0.153,3.753-0.162l2.467,0.123c1.019,0.127,2.38,0.291,3.391,0.47l2.482,0.574         c0.94,0.295,2.2,0.676,3.124,1.017l2.403,1.025c0.865,0.453,2.027,1.041,2.868,1.535l2.242,1.469         c0.782,0.607,1.837,1.402,2.589,2.046l1.978,1.87l1.341,1.458l1.662,2.078c0.543,0.802,1.283,1.863,1.787,2.69l1.24,2.274         c0.4,0.891,0.946,2.073,1.302,2.982l0.803,2.382c0.251,0.979,0.592,2.285,0.793,3.276l0.362,2.374         c0.088,1.09,0.195,2.545,0.224,3.638l-0.057,2.199c-0.115,1.271-0.32,2.962-0.516,4.223l-0.386,1.785         c-0.55,2.009-0.882,3.222-1.913,5.617l-0.614,1.31c-0.207,0.397-0.476,0.93-0.691,1.323l-0.626,1.086         c-0.199,0.317-0.458,0.744-0.664,1.057l-0.636,0.938c-0.197,0.271-0.457,0.636-0.659,0.903l-0.658,0.843         c-0.204,0.245-0.471,0.574-0.679,0.815l-0.7,0.788c-0.218,0.23-0.505,0.54-0.726,0.767l-0.768,0.762         c-0.242,0.226-0.562,0.53-0.808,0.751l-0.873,0.759c-0.282,0.229-0.655,0.538-0.941,0.762l-1.033,0.773         c-0.348,0.239-0.808,0.565-1.16,0.797l-1.269,0.792c-0.458,0.258-1.066,0.61-1.531,0.856l-1.596,0.784         c-0.654,0.279-1.525,0.657-2.189,0.913l-1.991,0.679c-2.717,0.74-2.823,0.769-4.397,1.033l-2.326,0.301         c-1.121,0.066-2.618,0.14-3.741,0.143l-2.468-0.135c-1.017-0.132-2.375-0.302-3.384-0.486l-2.481-0.586l-2.218-0.699         l1.246,0.358c12.959,1.716,28.268-22.749,28.415-22.997c5.559-9.419,5.524-17.824-0.103-24.98         C57.578,24.032,32.587,25.534,27.821,27.8C30.213,24.345,33.302,21.938,36.779,20.63"
   style="fill:#E2E2E2;" />


						</g>


						<g
   id="g210">
							<path
   id="path212"
   d="M23.182,30.136c0.42-0.474,0.991-1.096,1.426-1.556l0.768-0.762         c0.243-0.226,0.562-0.53,0.808-0.751l0.874-0.759c0.282-0.229,0.655-0.538,0.941-0.762l1.034-0.773         c0.348-0.239,0.807-0.565,1.16-0.797l1.27-0.793c0.458-0.258,1.065-0.609,1.53-0.855l1.597-0.785         c0.655-0.279,1.525-0.657,2.189-0.913c-3.157,1.188-5.994,3.282-8.28,6.244l0,0c-1.006,0.304-4.068,1.659-6.125,4.238         l0.675-0.82L23.182,30.136"
   style="fill:#E1E1E1;" />


							<path
   id="path214"
   d="M36.779,20.63c1.543-0.526,3.657-1.247,6.213-1.683l2.32-0.312         c1.125-0.072,2.626-0.153,3.753-0.162l2.467,0.123c1.019,0.127,2.38,0.291,3.391,0.47l2.482,0.574         c0.94,0.295,2.2,0.676,3.124,1.017l2.403,1.025c0.865,0.453,2.027,1.041,2.868,1.535l2.242,1.469         c0.782,0.607,1.837,1.402,2.589,2.046l1.978,1.87l1.341,1.458l1.662,2.078c0.543,0.802,1.283,1.863,1.787,2.69l1.24,2.274         c0.4,0.891,0.946,2.073,1.302,2.982l0.803,2.382c0.251,0.979,0.592,2.285,0.793,3.276l0.362,2.374         c0.088,1.09,0.195,2.545,0.224,3.638l-0.057,2.199c-0.115,1.271-0.32,2.962-0.516,4.223l-0.386,1.785         c-0.55,2.009-0.882,3.222-1.913,5.617l-0.614,1.31c-0.207,0.397-0.476,0.93-0.691,1.323l-0.626,1.086         c-0.199,0.317-0.458,0.744-0.664,1.057l-0.636,0.938c-0.197,0.271-0.457,0.636-0.659,0.903l-0.658,0.843         c-0.204,0.245-0.471,0.574-0.679,0.815l-0.7,0.788c-0.218,0.23-0.505,0.54-0.726,0.767l-0.768,0.762         c-0.242,0.226-0.562,0.53-0.808,0.751l-0.873,0.759c-0.282,0.229-0.655,0.538-0.941,0.762l-1.033,0.773         c-0.348,0.239-0.808,0.565-1.16,0.797l-1.269,0.792c-0.458,0.258-1.066,0.61-1.531,0.856l-1.596,0.784         c-0.654,0.279-1.525,0.657-2.189,0.913l-1.991,0.679c-2.717,0.74-2.823,0.769-4.397,1.033l-2.326,0.301         c-1.121,0.066-2.618,0.14-3.741,0.143l-2.468-0.135c-1.017-0.132-2.375-0.302-3.384-0.486l-2.481-0.586l-0.442-0.126         l0.782,0.197c13.165,1.693,30.699-25.355,30.854-25.631c0.277-0.491,6.688-12.168-2.643-24.307         c-9.859-12.826-35.497-9.547-39.693-7.563C30.784,23.912,33.621,21.818,36.779,20.63"
   style="fill:#E1E1E1;" />


						</g>


						<g
   id="g217">
							<path
   id="path219"
   d="M24.608,28.58c1.02-1.012,1.02-1.012,1.576-1.513l0.874-0.759         c0.282-0.229,0.655-0.538,0.941-0.762l1.034-0.773c0.348-0.239,0.807-0.565,1.16-0.797l1.27-0.793         c0.458-0.258,1.065-0.609,1.53-0.855l1.597-0.785c0.655-0.279,1.525-0.657,2.189-0.913c-2.818,1.061-5.382,2.843-7.526,5.321         l0,0c-0.331,0.107-3.298,1.122-5.596,3.645l0.718-0.774L24.608,28.58"
   style="fill:#E0E0E0;" />


							<path
   id="path221"
   d="M36.779,20.63c1.543-0.526,3.657-1.247,6.213-1.683l2.32-0.312         c1.125-0.072,2.626-0.153,3.753-0.162l2.467,0.123c1.019,0.127,2.38,0.291,3.391,0.47l2.482,0.574         c0.94,0.295,2.2,0.676,3.124,1.017l2.403,1.025c0.865,0.453,2.027,1.041,2.868,1.535l2.242,1.469         c0.782,0.607,1.837,1.402,2.589,2.046l1.978,1.87l1.341,1.458l1.662,2.078c0.543,0.802,1.283,1.863,1.787,2.69l1.24,2.274         c0.4,0.891,0.946,2.073,1.302,2.982l0.803,2.382c0.251,0.979,0.592,2.285,0.793,3.276l0.362,2.374         c0.088,1.09,0.195,2.545,0.224,3.638l-0.057,2.199c-0.115,1.271-0.32,2.962-0.516,4.223l-0.386,1.785         c-0.55,2.009-0.882,3.222-1.913,5.617l-0.614,1.31c-0.207,0.397-0.476,0.93-0.691,1.323l-0.626,1.086         c-0.199,0.317-0.458,0.744-0.664,1.057l-0.636,0.938c-0.197,0.271-0.457,0.636-0.659,0.903l-0.658,0.843         c-0.204,0.245-0.471,0.574-0.679,0.815l-0.7,0.788c-0.218,0.23-0.505,0.54-0.726,0.767l-0.768,0.762         c-0.242,0.226-0.562,0.53-0.808,0.751l-0.873,0.759c-0.282,0.229-0.655,0.538-0.941,0.762l-1.033,0.773         c-0.348,0.239-0.808,0.565-1.16,0.797l-1.269,0.792c-0.458,0.258-1.066,0.61-1.531,0.856l-1.596,0.784         c-0.654,0.279-1.525,0.657-2.189,0.913l-1.991,0.679c-2.717,0.74-2.823,0.769-4.397,1.033l-2.326,0.301         c-1.121,0.066-2.618,0.14-3.741,0.143l-2.468-0.135c-1.017-0.132-2.375-0.302-3.384-0.486c-0.3-0.063-0.701-0.149-1-0.212         c0.081,0.017,0.188,0.04,0.268,0.058c12.461,1.551,30.795-24.028,30.945-24.291c3.803-6.642,4.653-17.33-2.02-26.234         c-12.755-17.02-40.804-8.378-41.063-8.26C31.396,23.473,33.96,21.69,36.779,20.63"
   style="fill:#E0E0E0;" />


						</g>


						<g
   id="g224">
							<path
   id="path226"
   d="M26.184,27.067c1.157-1.005,1.179-1.024,1.815-1.521l1.034-0.773         c0.348-0.239,0.807-0.565,1.16-0.797l1.27-0.793c0.458-0.258,1.065-0.609,1.53-0.855l1.597-0.785         c0.655-0.279,1.525-0.657,2.189-0.913c-2.447,0.921-4.702,2.386-6.657,4.378c0,0,0,0,0,0         c-0.999,0.332-2.976,1.168-4.991,3.05l0.792-0.752L26.184,27.067"
   style="fill:#E0E0E0;" />


							<path
   id="path228"
   d="M36.779,20.63c1.543-0.526,3.657-1.247,6.213-1.683l2.32-0.312         c1.125-0.072,2.626-0.153,3.753-0.162l2.467,0.123c1.019,0.127,2.38,0.291,3.391,0.47l2.482,0.574         c0.94,0.295,2.2,0.676,3.124,1.017l2.403,1.025c0.865,0.453,2.027,1.041,2.868,1.535l2.242,1.469         c0.782,0.607,1.837,1.402,2.589,2.046l1.978,1.87l1.341,1.458l1.662,2.078c0.543,0.802,1.283,1.863,1.787,2.69l1.24,2.274         c0.4,0.891,0.946,2.073,1.302,2.982l0.803,2.382c0.251,0.979,0.592,2.285,0.793,3.276l0.362,2.374         c0.088,1.09,0.195,2.545,0.224,3.638l-0.057,2.199c-0.115,1.271-0.32,2.962-0.516,4.223l-0.386,1.785         c-0.55,2.009-0.882,3.222-1.913,5.617l-0.614,1.31c-0.207,0.397-0.476,0.93-0.691,1.323l-0.626,1.086         c-0.199,0.317-0.458,0.744-0.664,1.057l-0.636,0.938c-0.197,0.271-0.457,0.636-0.659,0.903l-0.658,0.843         c-0.204,0.245-0.471,0.574-0.679,0.815l-0.7,0.788c-0.218,0.23-0.505,0.54-0.726,0.767l-0.768,0.762         c-0.242,0.226-0.562,0.53-0.808,0.751l-0.873,0.759c-0.282,0.229-0.655,0.538-0.941,0.762l-1.033,0.773         c-0.348,0.239-0.808,0.565-1.16,0.797l-1.269,0.792c-0.458,0.258-1.066,0.61-1.531,0.856l-1.596,0.784         c-0.654,0.279-1.525,0.657-2.189,0.913l-1.991,0.679c-2.717,0.74-2.823,0.769-4.397,1.033l-2.326,0.301         c-1.121,0.066-2.618,0.14-3.741,0.143l-2.468-0.135l-2.309-0.293l1.16,0.106c7.19-0.025,26.31-16.075,30.534-25.632         c1.201-2.716,6.546-16.905-6.167-29.496c-13.724-13.591-38.372-5.158-38.602-5.053C32.076,23.016,34.331,21.551,36.779,20.63         "
   style="fill:#E0E0E0;" />


						</g>


						<g
   id="g231">
							<path
   id="path233"
   d="M27.999,25.546c1.354-1.014,1.407-1.053,2.193-1.57l1.27-0.793         c0.458-0.258,1.065-0.609,1.53-0.855l1.597-0.785c0.655-0.279,1.525-0.657,2.189-0.913c-2.042,0.769-3.95,1.916-5.661,3.432         c0,0,0,0,0,0c-1.585,0.563-3.022,1.379-4.271,2.426l0.91-0.749L27.999,25.546"
   style="fill:#DEDEDE;" />


							<path
   id="path235"
   d="M36.779,20.63c1.543-0.526,3.657-1.247,6.213-1.683l2.32-0.312         c1.125-0.072,2.626-0.153,3.753-0.162l2.467,0.123c1.019,0.127,2.38,0.291,3.391,0.47l2.482,0.574         c0.94,0.295,2.2,0.676,3.124,1.017l2.403,1.025c0.865,0.453,2.027,1.041,2.868,1.535l2.242,1.469         c0.782,0.607,1.837,1.402,2.589,2.046l1.978,1.87l1.341,1.458l1.662,2.078c0.543,0.802,1.283,1.863,1.787,2.69l1.24,2.274         c0.4,0.891,0.946,2.073,1.302,2.982l0.803,2.382c0.251,0.979,0.592,2.285,0.793,3.276l0.362,2.374         c0.088,1.09,0.195,2.545,0.224,3.638l-0.057,2.199c-0.115,1.271-0.32,2.962-0.516,4.223l-0.386,1.785         c-0.55,2.009-0.882,3.222-1.913,5.617l-0.614,1.31c-0.207,0.397-0.476,0.93-0.691,1.323l-0.626,1.086         c-0.199,0.317-0.458,0.744-0.664,1.057l-0.636,0.938c-0.197,0.271-0.457,0.636-0.659,0.903l-0.658,0.843         c-0.204,0.245-0.471,0.574-0.679,0.815l-0.7,0.788c-0.218,0.23-0.505,0.54-0.726,0.767l-0.768,0.762         c-0.242,0.226-0.562,0.53-0.808,0.751l-0.873,0.759c-0.282,0.229-0.655,0.538-0.941,0.762l-1.033,0.773         c-0.348,0.239-0.808,0.565-1.16,0.797l-1.269,0.792c-0.458,0.258-1.066,0.61-1.531,0.856l-1.596,0.784         c-0.654,0.279-1.525,0.657-2.189,0.913l-1.991,0.679c-2.717,0.74-2.823,0.769-4.397,1.033l-2.326,0.301         c-1.121,0.066-2.618,0.14-3.741,0.143l-2.468-0.135l-0.125-0.012l0.229,0.018c5.833,0.077,25.53-12.999,30.963-25.086         c3.744-8.329,2.877-21.448-6.022-30.407c-15.526-15.631-39.199-5.93-39.434-5.828C32.828,22.545,34.737,21.398,36.779,20.63"
   style="fill:#DEDEDE;" />


						</g>


						<g
   id="g238">
							<path
   id="path240"
   d="M30.192,23.976c1.652-1.032,1.751-1.094,2.8-1.648l1.597-0.785         c0.655-0.279,1.525-0.657,2.189-0.913c-1.542,0.58-3.006,1.376-4.369,2.384l0,0c-0.777,0.286-1.842,0.678-3.458,1.818         l1.093-0.758L30.192,23.976"
   style="fill:#DEDEDE;" />


							<path
   id="path242"
   d="M36.779,20.63c1.543-0.526,3.657-1.247,6.213-1.683l2.32-0.312         c1.125-0.072,2.626-0.153,3.753-0.162l2.467,0.123c1.019,0.127,2.38,0.291,3.391,0.47l2.482,0.574         c0.94,0.295,2.2,0.676,3.124,1.017l2.403,1.025c0.865,0.453,2.027,1.041,2.868,1.535l2.242,1.469         c0.782,0.607,1.837,1.402,2.589,2.046l1.978,1.87l1.341,1.458l1.662,2.078c0.543,0.802,1.283,1.863,1.787,2.69l1.24,2.274         c0.4,0.891,0.946,2.073,1.302,2.982l0.803,2.382c0.251,0.979,0.592,2.285,0.793,3.276l0.362,2.374         c0.088,1.09,0.195,2.545,0.224,3.638l-0.057,2.199c-0.115,1.271-0.32,2.962-0.516,4.223l-0.386,1.785         c-0.55,2.009-0.882,3.222-1.913,5.617l-0.614,1.31c-0.207,0.397-0.476,0.93-0.691,1.323l-0.626,1.086         c-0.199,0.317-0.458,0.744-0.664,1.057l-0.636,0.938c-0.197,0.271-0.457,0.636-0.659,0.903l-0.658,0.843         c-0.204,0.245-0.471,0.574-0.679,0.815l-0.7,0.788c-0.218,0.23-0.505,0.54-0.726,0.767l-0.768,0.762         c-0.242,0.226-0.562,0.53-0.808,0.751l-0.873,0.759c-0.282,0.229-0.655,0.538-0.941,0.762l-1.033,0.773         c-0.348,0.239-0.808,0.565-1.16,0.797l-1.269,0.792c-0.458,0.258-1.066,0.61-1.531,0.856l-1.596,0.784         c-0.654,0.279-1.525,0.657-2.189,0.913l-1.991,0.679c-2.717,0.74-2.823,0.769-4.397,1.033l-2.326,0.301         c-1.085,0.063-2.533,0.14-3.62,0.145l0.513-0.007c0.223-0.025,23.898-7.412,30.264-26.793         c2.332-7.102,2.688-21.952-10.771-32.562c-14.92-11.762-34.85-3.496-35.691-3.138C33.771,22.006,35.237,21.21,36.779,20.63"
   style="fill:#DEDEDE;" />


						</g>


						<g
   id="g245">
							<path
   id="path247"
   d="M32.992,22.328c1.354-0.701,2.31-1.129,3.786-1.698c-0.898,0.338-1.771,0.75-2.613,1.234l0,0         c-1.014,0.394-1.033,0.401-2.014,0.92C32.403,22.647,32.737,22.459,32.992,22.328"
   style="fill:#DDDDDD;" />


							<path
   id="path249"
   d="M36.779,20.63c1.543-0.526,3.657-1.247,6.213-1.683l2.32-0.312         c1.125-0.072,2.626-0.153,3.753-0.162l2.467,0.123c1.019,0.127,2.38,0.291,3.391,0.47l2.482,0.574         c0.94,0.295,2.2,0.676,3.124,1.017l2.403,1.025c0.865,0.453,2.027,1.041,2.868,1.535l2.242,1.469         c0.782,0.607,1.837,1.402,2.589,2.046l1.978,1.87l1.341,1.458l1.662,2.078c0.543,0.802,1.283,1.863,1.787,2.69l1.24,2.274         c0.4,0.891,0.946,2.073,1.302,2.982l0.803,2.382c0.251,0.979,0.592,2.285,0.793,3.276l0.362,2.374         c0.088,1.09,0.195,2.545,0.224,3.638l-0.057,2.199c-0.115,1.271-0.32,2.962-0.516,4.223l-0.386,1.785         c-0.55,2.009-0.882,3.222-1.913,5.617l-0.614,1.31c-0.207,0.397-0.476,0.93-0.691,1.323l-0.626,1.086         c-0.199,0.317-0.458,0.744-0.664,1.057l-0.636,0.938c-0.197,0.271-0.457,0.636-0.659,0.903l-0.658,0.843         c-0.204,0.245-0.471,0.574-0.679,0.815l-0.7,0.788c-0.218,0.23-0.505,0.54-0.726,0.767l-0.768,0.762         c-0.242,0.226-0.562,0.53-0.808,0.751l-0.873,0.759c-0.282,0.229-0.655,0.538-0.941,0.762l-1.033,0.773         c-0.348,0.239-0.808,0.565-1.16,0.797l-1.269,0.792c-0.458,0.258-1.066,0.61-1.531,0.856l-1.596,0.784         c-0.654,0.279-1.525,0.657-2.189,0.913l-1.991,0.679c-2.717,0.74-2.823,0.769-4.397,1.033l-2.326,0.301l-0.111,0.01         l1.002-0.157c1.005-0.301,24.651-7.623,28.368-29.407c2.312-13.55-4.928-27.386-17.608-33.645         c-11.765-5.807-23.345-2.685-29.2-0.307C35.007,21.38,35.88,20.968,36.779,20.63"
   style="fill:#DDDDDD;" />


						</g>


						<path
   id="path252"
   d="M59.718,38.006c8.083,8.066,4.331,16.559,2.988,18.97        c-3.687,6.621-16.207,19.298-16.318,19.398c-5.167,4.663-9.357,5.174-10.919,5.178c-2.801,0.006-4.639-1.166-5.98-2.021        l-2.159-1.635l-0.756-0.641l-1.977-1.869c-0.655-0.727-1.543-1.684-2.162-2.442l-1.572-2.126        c-0.513-0.822-1.211-1.909-1.684-2.755l-1.146-2.304c-0.368-0.91-0.871-2.119-1.195-3.045l-0.708-2.391        c-0.217-1.001-0.511-2.335-0.677-3.346l-0.268-2.352c-0.049-1.12-0.099-2.616-0.085-3.738l0.138-2.132        c0.35-2.723,0.364-2.83,0.727-4.414l0.449-1.709c0.176-0.551,0.4-1.29,0.592-1.836l0.02-0.057        c2.575-6.171,6.935-8.901,15.049-9.42C32.271,31.308,53.855,32.156,59.718,38.006"
   style="fill:#E5E5E5;" />


						<path
   id="path254"
   d="M58.596,38.348c6.987,5.189,5.914,13.904,3.595,18.179c-0.046,0.084-2.463,3.692-2.51,3.748        L45.495,75.804c-1.457,1.33-5.342,4.482-9.938,5.031c-1.668,0.199-4.271,0.163-7.605-2.439        c-1.042-0.862-2.373-2.08-3.355-3.009c-0.655-0.727-1.543-1.684-2.162-2.442l-1.572-2.126        c-0.513-0.822-1.211-1.909-1.684-2.755l-1.146-2.304c-0.368-0.91-0.871-2.119-1.195-3.045l-0.708-2.391        c-0.217-1.001-0.511-2.335-0.677-3.346l-0.268-2.352c-0.049-1.12-0.099-2.616-0.085-3.738l0.138-2.132        c0.35-2.723,0.364-2.83,0.727-4.414l0.449-1.709l0.017-0.057l0.274-0.868c3.071-7.372,9.039-8.915,12.322-9.178        c6.712-0.539,19.547,1.893,22.052,2.386C55.018,35.691,56.676,36.922,58.596,38.348"
   style="fill:#E6E6E6;" />


						<path
   id="path256"
   d="M59.103,39.267c5.146,4.494,5.039,13.026,2.704,16.927c-0.694,1.16-1.626,2.724-2.531,3.728        L44.711,75.174c-4.167,3.674-7.789,4.74-10.093,4.987c-3.742,0.402-6.444-1.519-8.15-2.999l-1.968-1.876        c-0.624-0.698-1.474-1.614-2.064-2.341l-1.572-2.126c-0.513-0.822-1.211-1.909-1.684-2.755l-1.146-2.304        c-0.368-0.91-0.871-2.119-1.195-3.045l-0.708-2.391c-0.217-1.001-0.511-2.335-0.677-3.346l-0.268-2.352        c-0.049-1.12-0.099-2.616-0.085-3.738l0.138-2.132c0.35-2.723,0.364-2.83,0.727-4.414l0.49-1.705        c2.528-6.037,6.549-8.628,14.341-9.244c2.071-0.164,19.904,2.001,20.03,2.027C54.972,36.281,58.274,38.542,59.103,39.267"
   style="fill:#E7E7E7;" />


						<path
   id="path258"
   d="M58.888,39.688c2.862,2.648,6.127,10.744,1.117,18.331c-0.318,0.481-0.693,1.17-1.1,1.58        L42.306,75.814c-1.833,1.437-5.942,3.829-9.711,3.683c-3.723-0.144-6.085-2.318-7.648-3.757l-1.831-1.973l-0.681-0.821        l-1.572-2.126c-0.513-0.822-1.211-1.909-1.684-2.755l-1.146-2.304c-0.368-0.91-0.871-2.119-1.195-3.045l-0.708-2.391        c-0.217-1.001-0.511-2.335-0.677-3.346l-0.268-2.352c-0.049-1.12-0.099-2.616-0.085-3.738l0.138-2.132        c0.087-0.677,0.186-1.581,0.296-2.255l0.162-0.881c0.638-2.393,2.579-9.676,11.968-10.965        c1.938-0.267,3.052-0.265,4.966-0.159c2.755,0.153,5.413,0.972,8.159,1.191c3.254,0.259,6.527-0.285,9.774,0.238        C54.46,36.554,57.855,38.732,58.888,39.688"
   style="fill:#E7E7E7;" />


						<path
   id="path260"
   d="M58.668,40.11c1.839,1.803,7.264,8.513-0.135,19.164c-1.781,2.564-4.799,3.598-6.991,5.653        c-3.483,3.265-6.068,7.402-9.979,10.251c-0.522,0.38-5.228,3.709-9.716,3.538c-3.074-0.117-5.694-1.56-8.496-4.679        c-0.784-0.936-1.762-2.238-2.488-3.219c-0.513-0.822-1.211-1.909-1.684-2.755l-1.146-2.304        c-0.368-0.91-0.871-2.119-1.195-3.045l-0.708-2.391c-0.217-1.001-0.511-2.335-0.677-3.346l-0.268-2.352        c-0.049-1.12-0.099-2.616-0.085-3.738l0.138-2.132l0.001-0.009l0.285-1.996c1.899-9.527,10.155-10.798,12.868-11.215        c0.721-0.111,0.721-0.111,10.978,0.992c3.646,0.392,7.277-0.648,10.924-0.097C55.604,37.234,58.37,39.818,58.668,40.11"
   style="fill:#E8E8E8;" />


						<path
   id="path262"
   d="M58.443,40.533c1.773,1.839,6.994,8.603-0.284,18.417c-1.863,2.512-4.925,3.456-7.161,5.48        c-3.543,3.208-6.106,7.39-10.102,10.148c-2.653,1.832-6.819,3.561-10.146,3.294c-1.35-0.108-4.935-0.396-9.052-5.881        l-1.487-2.17l-1.032-1.758l-1.146-2.304c-0.368-0.91-0.871-2.119-1.195-3.045l-0.708-2.391        c-0.217-1.001-0.511-2.335-0.677-3.346l-0.268-2.352c-0.045-1.025-0.102-2.394-0.095-3.42l0.083-1.524        c0.373-2.67,1.508-10.798,10.603-12.721c2.55-0.54,3.504-0.741,8.059-0.243c6.068,0.664,6.068,0.664,12.781,0.22        C53.112,36.509,56.633,38.656,58.443,40.533"
   style="fill:#E9E9E9;" />


						<path
   id="path264"
   d="M58.213,40.954c4.525,4.969,4.365,11.574-0.429,17.67c-1.928,2.452-4.979,3.389-7.252,5.376        c-3.6,3.147-6.232,7.292-10.292,9.963c-3.161,2.08-7.426,3.327-10.373,3.033c-5.446-0.545-8.509-5.378-9.981-7.702        c-0.596-1.038-1.32-2.463-1.853-3.535c-0.368-0.91-0.871-2.119-1.195-3.045l-0.708-2.391        c-0.217-1.001-0.511-2.335-0.677-3.346c-0.134-1.159-0.285-2.708-0.348-3.873c0.074-3.347,0.27-12.237,9.944-14.964        c1.491-0.42,3.604-0.894,5.197-0.758c2.918,0.248,5.788,0.936,8.732,0.945c3.609,0.011,7.106-1.352,10.752-0.886        C51.366,37.65,55.709,38.205,58.213,40.954"
   style="fill:#EAEAEA;" />


						<path
   id="path266"
   d="M57.978,41.376c1.645,1.843,6.464,8.511-0.571,16.921c-0.629,0.752-1.735,1.49-2.484,2.123        c-1.485,1.255-3.37,1.893-4.856,3.146c-3.654,3.082-6.338,7.199-10.465,9.775c-2.643,1.649-7.094,3.198-10.621,2.699        c-6.684-0.946-10.367-8.438-11.968-12.82c-0.3-0.868-0.3-0.868-1.01-3.409c-2.668-12.896,1.93-17.231,7.296-19.995        c2.896-1.491,6.333-1.53,7.463-1.542c2.57-0.029,5.037,0.854,7.603,0.866c1.153,0.004,1.153,0.004,5.09-0.811        c0.075-0.016,7.614-1.478,12.087,1.124C56.347,39.921,57.359,40.681,57.978,41.376"
   style="fill:#EAEAEA;" />


						<path
   id="path268"
   d="M57.74,41.798c1.578,1.789,6.198,8.245-0.617,16.252c-0.499,0.585-1.371,1.157-1.966,1.645        c-1.699,1.392-3.853,2.046-5.553,3.436c-3.697,3.022-6.376,7.148-10.512,9.695c-0.705,0.434-4.489,2.587-9.741,2.326        C18.666,74.619,9.663,51.96,19.792,43.104c0.043-0.038,4.448-3.772,9.397-3.943c2.889-0.1,5.688,0.86,8.58,0.734        c3.873-0.168,7.518-1.969,11.465-1.604C50.845,38.44,55.124,38.835,57.74,41.798"
   style="fill:#EBEBEB;" />


						<path
   id="path270"
   d="M57.448,42.177c0.684,0.741,6.476,7.472-0.587,15.646c-3.022,3.498-7.626,4.646-11.097,7.479        c-2.078,1.695-2.944,4.479-5.312,5.912c-1.623,0.983-5.424,3.284-10.712,3.031c-13.183-0.631-18.224-22.342-9.921-29.944        c2.782-2.548,6.492-4.184,9.923-4.378c2.508-0.142,4.903,0.882,7.414,0.719c4.015-0.261,7.733-2.303,11.846-1.968        C53.697,39.056,54.795,39.97,57.448,42.177"
   style="fill:#ECECEC;" />


						<path
   id="path272"
   d="M55.023,40.714c5.646,4.454,6.549,9.614,2.685,15.335c-0.32,0.474-0.667,1.185-1.107,1.549        c-2.381,1.972-5.452,2.79-7.869,4.701c-1.001,0.792-2.451,1.71-3.369,2.596c-1.906,1.838-3.151,4.284-5.372,5.832        c-3.078,2.144-5.969,2.402-6.918,2.487c-16.927,1.512-20.449-19.766-13.731-27.155c1.975-2.171,6.026-4.787,8.911-5.219        c3.056-0.458,6.029,0.722,9.076,0.458c3.894-0.338,7.484-2.222,11.44-2.241C52.154,39.041,54.27,40.21,55.023,40.714"
   style="fill:#ECECEC;" />


						<path
   id="path274"
   d="M57.168,42.773c0.062,0.068,6.099,6.908-0.83,14.598c-2.163,2.4-5.538,2.671-7.996,4.552        c-0.583,0.446-1.352,1.053-1.932,1.504c-2.563,1.995-3.998,5.129-6.876,6.805c-1.742,1.013-4.373,2.545-9.105,2.221        c-13.221-0.906-18.876-18.493-8.769-27.273c4.005-3.479,6.451-3.645,9.04-3.82c2.442-0.166,4.805,0.723,7.248,0.549        c0.473-0.034,0.473-0.034,5.89-1.484C46.302,39.766,52.853,38.012,57.168,42.773"
   style="fill:#EDEDED;" />


						<path
   id="path276"
   d="M57,43.053c0.584,0.664,5.52,6.702-0.924,14.092c-2.16,2.477-5.63,2.537-8.122,4.402        c-0.586,0.438-1.356,1.038-1.937,1.483c-2.575,1.971-4.039,5.064-6.866,6.78c-2.52,1.529-4.137,1.974-7.21,1.981        c-12.6,0.033-20.5-15.498-9.675-25.989c3.451-3.345,6.094-3.554,8.892-3.775c2.688-0.213,5.311,0.71,8.001,0.462        c1.759-0.162,3.231-1.171,4.882-1.651C46.441,40.14,52.811,38.288,57,43.053"
   style="fill:#EEEEEE;" />


						<path
   id="path278"
   d="M56.831,43.331c1.553,1.821,4.398,7.811-1.018,13.587c-2.245,2.394-5.722,2.397-8.245,4.251        c-0.587,0.432-1.359,1.022-1.942,1.46c-2.589,1.946-3.929,5.147-6.825,6.785c-3.245,1.835-6.113,1.894-7.948,1.62        c-12.596-1.88-16.666-18.177-6.5-26.027c2.158-1.667,4.8-2.232,4.821-2.233c3.148-0.163,6.249,0.824,9.408,0.391        c3.318-0.455,5.971-3.033,9.455-2.963C50.518,40.251,54.269,40.327,56.831,43.331"
   style="fill:#EEEEEE;" />


						<path
   id="path280"
   d="M56.66,43.609c0.051,0.062,5.071,6.279-1.109,13.082c-2.247,2.474-5.812,2.255-8.368,4.098        c-0.588,0.424-1.361,1.006-1.945,1.438c-2.601,1.923-3.94,5.106-6.782,6.789c-0.473,0.28-2.995,1.667-6.222,1.482        c-12.032-0.688-15.676-17.65-7.793-24.722c1.631-1.463,4.174-2.373,5.024-2.43c2.868-0.193,5.667,0.896,8.549,0.461        c3.441-0.519,6.148-3.261,9.771-3.226C50.792,40.61,54.2,40.643,56.66,43.609"
   style="fill:#E9E9E9;" />


						<path
   id="path282"
   d="M56.487,43.886c2.406,2.989,2.631,8.648-1.2,12.577c-0.017,0.018-2.002,1.864-6.297,3.244        c-0.648,0.208-1.605,0.301-2.162,0.694c-0.596,0.422-1.37,1.012-1.958,1.446c-2.592,1.916-3.854,5.16-6.758,6.765        c-2.862,1.581-4.603,1.368-6.807,1.098c-9.289-1.136-14.688-18.101-5.237-24.436c2.057-1.378,2.057-1.378,10.418-0.859        c4.282,0.266,7.39-3.324,11.534-3.513C49.467,40.836,53.87,40.635,56.487,43.886"
   style="fill:#EAEAEA;" />


						<path
   id="path284"
   d="M56.312,44.164c1.874,2.397,3.088,7.575-1.247,12.015c-0.31,0.317-4.41,3.124-7.652,3.665        c-0.303,0.05-0.757-0.007-1.01,0.168c-0.589,0.41-1.329,1.019-1.898,1.455c-2.542,1.949-3.854,5.126-6.732,6.739        c-2.446,1.37-4.577,1.099-5.85,0.937c-10.555-1.343-12.96-18.063-5.705-23.256c1.234-0.883,1.682-0.977,3.832-1.43        c2.407-0.506,4.646,1.009,7.045,0.585c4-0.706,7.26-3.608,11.417-3.846C49.81,41.122,53.758,40.896,56.312,44.164"
   style="fill:#EAEAEA;" />


						<path
   id="path286"
   d="M56.135,44.442c0.992,1.285,3.827,5.917-1.354,11.585c-0.383,0.419-4.583,2.874-6.787,3.25        c-2.409,0.412-2.91,0.497-5.25,2.839c-1.833,1.834-3.209,4.094-5.308,5.68c-0.906,0.685-2.497,1.001-3.63,1.073        c-9.473,0.597-14.249-13.665-9.018-20.796c1.12-1.526,3.547-2.901,5.526-3.131c1.33-0.154,3.714,0.238,4.86,0.426        c1.282,0.21,3.668,0.603,7.764-1.833C46.889,41.186,52.716,40.014,56.135,44.442"
   style="fill:#EBEBEB;" />


						<path
   id="path288"
   d="M55.957,44.718c0.681,0.888,3.811,5.599-1.418,11.1c-0.022,0.024-2.718,2.446-8.429,3.325        c-0.147,0.022-0.363-0.001-0.491,0.076c-4.387,2.615-6.006,8.901-12.164,9.167c-7.963,0.344-13.464-12.289-8.531-19.589        c0.199-0.295,2.048-2.892,5.661-3.366c0.352-0.046,1.479-0.043,5.069,0.499c1.953,0.295,3.132,0.473,5.904-1.119        C44.043,43.383,51.607,39.041,55.957,44.718"
   style="fill:#EBEBEB;" />


						<path
   id="path290"
   d="M55.777,44.995c0.402,0.527,3.775,5.304-1.48,10.615c-0.021,0.021-2.405,2.153-7.611,2.979        c-0.437,0.069-1.074,0.009-1.457,0.231c-4.396,2.55-5.926,8.926-12.119,9.078c-7.486,0.184-13.608-14.075-6.433-20.323        c0.492-0.429,1.219-0.987,1.854-1.136c2.472-0.581,2.472-0.581,5.113-0.251l5.036,0.472c1.327-0.269,4.813-2.505,4.961-2.6        c1.063-0.684,2.518-1.621,6.35-1.96C50.024,42.096,53.561,42.09,55.777,44.995"
   style="fill:#EBEBEB;" />


						<path
   id="path292"
   d="M55.594,45.271c0.039,0.051,3.797,5.137-1.542,10.13c-0.02,0.019-2.019,1.846-6.796,2.625        c-3.225,0.525-3.286,0.536-5.521,2.961c-1.74,1.889-2.942,4.265-5.168,5.715c-0.02,0.013-3.396,0.926-4.537,0.606        c-10.297-2.883-9.543-17.939-3.31-20.411c3.529-1.399,6.958,1.009,10.469,0.277c0.175-0.037,3.721-2.143,4.803-2.853        c0.697-0.458,2.548-1.672,6.152-1.89C51.694,42.338,54.154,43.375,55.594,45.271"
   style="fill:#EBEBEB;" />


						<path
   id="path294"
   d="M55.411,45.547c0.015,0.02,1.49,2.333,0.873,6.05c-0.214,1.292-1.514,2.704-2.474,3.595        c-1.403,1.304-7.127,2.86-8.891,2.779c-1.202-0.055-3.507,2.591-3.53,2.618c-0.869,1.043-1.324,2.359-2.229,3.378        c-0.742,0.835-1.961,1.724-2.875,2.366c-0.015,0.011-3.268,0.676-3.859,0.559c-8.968-1.781-9.492-14.361-5.437-18.288        c1.433-1.388,2.693-1.523,4.437-1.711c2.801-0.301,5.427,1.27,8.247,0.767c1.043-0.186,2.039-1.398,2.924-1.979        c0.518-0.339,1.232-0.756,1.753-1.09C45.063,44.133,51.424,40.278,55.411,45.547"
   style="fill:#EBEBEB;" />


						<path
   id="path296"
   d="M53.891,44.625c3.701,3.353,3.581,12.118-8.454,12.849c-0.47,0.029-1.13-0.239-1.569-0.068        c-0.366,0.143-1.733,0.906-3.969,4.725c-1.909,3.26-5.203,5.03-7.833,4.208c-6.733-2.104-8.333-10.08-6.476-14.646        c0.987-2.427,2.689-3.665,3.53-3.875c3.553-0.887,7.019,0.654,10.549,0.376c0.728-0.057,1.516-0.798,2.084-1.256        c4.072-3.286,4.144-3.295,7.895-3.779C49.742,43.146,51.968,42.882,53.891,44.625"
   style="fill:#ECECEC;" />


						<path
   id="path298"
   d="M54.969,46.199c0.013,0.023,1.116,3.418,0.813,4.998c-0.246,1.279-1.504,2.691-2.458,3.578        c-1.52,1.413-7.159,2.203-7.373,2.194c-0.74-0.029-1.779-0.373-2.467-0.098c-0.146,0.059-1.502,0.692-3.925,4.847        c-2.038,3.494-4.678,4.861-7.848,4.063c-4.703-1.184-7.915-8.429-5.925-13.366c1.387-3.441,3.058-4.042,3.537-4.144        c2.783-0.593,2.892-0.616,6.322,0.352c1.896,0.536,4.986,0.021,5.006,0.013c0.98-0.418,1.815-1.703,2.648-2.368        c0.599-0.478,1.497-0.978,2.115-1.43c1.084-0.792,1.533-1.121,3.98-1.318C52.898,43.237,54.46,45.299,54.969,46.199"
   style="fill:#ECECEC;" />


						<path
   id="path300"
   d="M54.738,46.533c0.013,0.022,0.912,3.884,0.792,4.462c-0.263,1.272-1.447,2.745-2.45,3.57        c-0.026,0.022-3.565,2.155-9.088,1.821c-0.344-0.021-0.833-0.209-1.147-0.069c-0.011,0.004-1.162,0.662-3.594,5.006        c-2.726,4.869-5.708,4.306-7.886,3.895c-3.135-0.592-7.155-7.325-5.37-12.081c0.368-0.979,1.486-3.96,3.528-4.429        c3.21-0.738,6.232,0.928,9.4,0.734c0.677-0.041,1.669,0.067,2.242-0.296c1.62-1.026,2.687-2.666,4.215-3.793        c0.946-0.698,2.471-1.346,3.643-1.447C52.39,43.615,53.989,45.174,54.738,46.533"
   style="fill:#ECECEC;" />


						<path
   id="path302"
   d="M54.504,46.867c2.301,4.269-1.203,7.101-1.609,7.41c-0.036,0.027-4.516,2.477-10.063,1.448        c-0.229-0.043-0.54-0.336-0.745-0.226c-0.353,0.189-0.27,0.895-0.385,1.278l-3.68,5.763c-0.692,0.848-1.982,1.613-2.863,2.263        c-0.999,0.736-2.905,0.024-4.134-0.152c-2.443-0.35-6.38-6.642-4.6-11.392c0.377-1.006,1.378-3.676,3.302-4.115        c2.348-0.534,2.397-0.519,4.991,0.271c4.656,1.418,5.907,1.799,8.331-1.333C48.132,41.51,53.234,44.509,54.504,46.867"
   style="fill:#ECECEC;" />


						<path
   id="path304"
   d="M54.269,47.2c0.471,0.884,0.854,2.31,0.613,3.283c-0.312,1.256-1.19,3.013-2.327,3.633        c-4.444,2.424-9.312,0.888-11.391,0.231c-0.054-0.017-0.129-0.085-0.179-0.059c-0.607,0.317-0.456,1.532-0.651,2.188        c-1.148,3.858-2.585,5.685-2.598,5.695c-2.795,2.42-2.795,2.42-6.379,2.075c-1.974-0.19-6.582-5.15-4.349-11.304        c1-2.757,2.493-3.269,2.927-3.36c2.185-0.46,2.602-0.337,4.916,0.349c1.287,0.381,2.263,1.493,3.682,1.562        c1.193,0.058,2.854-0.464,3.796-1.199c0.505-0.394,0.826-1.246,1.158-1.792c1.862-3.067,3.888-3.664,3.908-3.669        C48.219,44.619,52.422,43.729,54.269,47.2"
   style="fill:#ECECEC;" />


						<path
   id="path306"
   d="M39.17,57.946c-0.214,0.839-0.611,2.4-1.714,3.856c-0.653,0.862-1.798,2.011-2.865,2.188        c-4.196,0.695-5.925-2.327-6.958-4.133c-1.751-3.062-0.249-7.069,0.416-8.232c0.393-0.689,1.344-1.366,2.1-1.605        c0.897-0.284,2.207-0.197,3.136-0.052c4.481,0.703,6.714,3.904,6.79,4.179C40.384,55.277,39.459,56.811,39.17,57.946"
   style="fill:#ECECEC;" />


						<path
   id="path308"
   d="M39.294,54.856c0.016,0.079-1.195,4.868-1.27,5.024c-0.489,1.02-1.591,2.146-2.494,2.826        c-1.215,0.916-2.363,1.782-5.895-0.567c-1.124-0.747-2.585-3.95-2.46-5.949c0.001-0.024,1-3.945,1.068-4.066        c0.394-0.708,1.372-1.364,2.123-1.666c0.294-0.118,3.469-0.069,4.474,0.426c0.834,0.411,2.003,0.91,2.697,1.529        C38.21,53.013,39.117,53.971,39.294,54.856"
   style="fill:#EDEDED;" />


						<path
   id="path310"
   d="M38.51,55.546c0.003,0.023-0.808,4.145-1.611,5.513c-0.54,0.92-1.988,1.5-2.863,2.11        c-0.598,0.417-4.25-1.499-4.279-1.523c-0.508-0.432-2.355-2.667-2.114-5.702c0.08-1.002,0.317-2.382,0.83-3.247        c0.423-0.713,1.344-1.51,2.136-1.757c0.021-0.007,3.678,0.238,3.801,0.31c0.798,0.465,1.986,0.942,2.624,1.61        C37.669,53.525,38.39,54.635,38.51,55.546"
   style="fill:#EDEDED;" />


						<path
   id="path312"
   d="M37.675,56.057c0.155,0.399-1.071,4.489-1.088,4.519c-0.544,0.92-1.789,1.996-2.848,2.144        c-1.112,0.156-2.591-0.668-3.497-1.331c-0.74-0.541-1.318-1.695-1.748-2.503c-0.33-0.619-0.653-4.214,0.221-5.603        c0.452-0.717,1.361-1.553,2.168-1.809c0.855-0.271,2.129-0.048,2.983,0.228c0.886,0.287,1.89,1.077,2.662,1.598        C37.272,53.8,37.351,55.222,37.675,56.057"
   style="fill:#EDEDED;" />


						<path
   id="path314"
   d="M54.031,47.531c0.379,0.722,0.722,1.889,0.496,2.672c-0.357,1.239-1.253,2.885-2.311,3.622        c-1.088,0.758-2.958,1.012-4.281,1.103c-0.345,0.024-0.769-0.253-1.111-0.304c-0.779-0.116-1.905,0.093-2.615-0.25        c-0.821-0.395-2.056-1.233-2.155-2.139l2.61-4.821c0.718-0.907,2.119-1.675,3.064-2.342c0.519-0.365,4.058,0.276,4.084,0.289        C52.656,45.757,53.598,46.707,54.031,47.531"
   style="fill:#ECECEC;" />


						<path
   id="path316"
   d="M36.134,54.006c0.304,0.813,0.941,1.867,0.95,2.735c0.01,1.038-0.555,2.362-0.892,3.344        c-0.341,0.99-1.806,1.894-2.845,2.022c-0.833,0.102-1.956-0.471-2.616-0.989c-0.721-0.565-1.366-1.66-1.796-2.469        c-0.188-0.354-0.676-3.658,0.033-4.782c0.46-0.731,1.378-1.592,2.199-1.86c0.602-0.197,1.515-0.06,2.102,0.176        C33.293,52.194,35.88,53.327,36.134,54.006"
   style="fill:#EDEDED;" />


						<path
   id="path318"
   d="M53.791,47.862c0.292,0.558,0.582,1.467,0.38,2.063c-0.41,1.216-1.222,2.907-2.296,3.609        c-0.907,0.593-2.411,0.89-3.494,0.913c-1.073,0.023-2.622-0.14-3.494-0.765c-0.832-0.596-1.498-2.26-1.134-3.217        c0.322-0.851,0.668-2.064,1.252-2.762c0.746-0.892,1.939-2.06,3.055-2.387c1.019-0.3,2.551-0.063,3.521,0.368        C52.433,46.061,53.36,47.037,53.791,47.862"
   style="fill:#EDEDED;" />


						<path
   id="path320"
   d="M36.435,57.259c0.018,0.712-0.17,1.741-0.623,2.292c-0.656,0.8-1.823,1.83-2.852,1.941        c-1.457,0.159-2.982-1.95-3.586-3.086c-0.012-0.022-0.577-3.27-0.151-3.954c0.465-0.748,1.393-1.635,2.229-1.911        c0.347-0.114,0.876-0.029,1.213,0.111c0.881,0.368,2.085,0.897,2.779,1.554C36.145,54.868,36.411,56.296,36.435,57.259"
   style="fill:#EDEDED;" />


						<path
   id="path322"
   d="M53.549,48.192c0.205,0.394,0.432,1.043,0.268,1.455c-0.473,1.187-1.185,2.938-2.28,3.596        c-0.721,0.434-1.871,0.748-2.712,0.718c-1.032-0.037-2.617-0.17-3.314-0.932c-0.755-0.825-1.209-2.617-0.775-3.648        c0.177-0.42,0.284-1.075,0.614-1.389c0.863-0.821,2.089-2.01,3.248-2.286c0.808-0.192,2.011-0.075,2.753,0.298        C52.182,46.421,53.119,47.366,53.549,48.192"
   style="fill:#EDEDED;" />


						<path
   id="path324"
   d="M35.786,57.762c0.004,0.39-0.066,0.98-0.346,1.252c-0.733,0.712-1.839,1.757-2.856,1.859        c-1.081,0.107-2.751-2.692-2.766-2.721c-0.422-0.794-0.563-2.137-0.268-2.986c0.06-0.172,2.011-2.029,2.197-2.092        c0.091-0.031,0.233-0.013,0.318,0.031c0.854,0.44,2.179,0.832,2.793,1.572C35.476,55.421,35.775,56.796,35.786,57.762"
   style="fill:#EDEDED;" />


						<path
   id="path326"
   d="M53.304,48.521c0.119,0.23,0.266,0.615,0.155,0.849c-0.546,1.148-1.197,2.891-2.263,3.583        c-1.104,0.716-3.125,0.17-4.38-0.224c-0.237-0.074-0.634-0.059-0.787-0.255c-0.775-0.995-0.896-3.062-0.333-4.191        c0.545-1.095,2.224-2.216,3.447-2.177c0.595,0.019,1.458-0.082,1.974,0.218C51.921,46.791,52.878,47.694,53.304,48.521"
   style="fill:#EDEDED;" />


						<path
   id="path328"
   d="M53.058,48.849c0.246,0.478-2.176,3.782-2.202,3.813c-0.227,0.279-0.797,0.324-1.156,0.314        c-0.999-0.027-2.549-0.27-3.158-1.063c-0.575-0.748-0.667-2.284-0.259-3.134c0.531-1.106,2.177-2.283,3.404-2.271        c0.36,0.004,0.897-0.071,1.193,0.135C51.643,47.173,52.633,48.021,53.058,48.849"
   style="fill:#EDEDED;" />


						<path
   id="path330"
   d="M35.135,58.25c0,0.5-2.893,2.006-2.922,2.001c-0.906-0.156-1.516-1.552-1.952-2.361        c-0.222-0.413-0.308-1.112-0.154-1.556c0.313-0.9,1.233-2.164,2.174-2.316c0.676-0.109,1.555,0.589,1.989,1.119        C34.885,55.886,35.136,57.28,35.135,58.25"
   style="fill:#EDEDED;" />


						<path
   id="path332"
   d="M51.659,47.989c0.011,0.027,0.498,3.188-1.143,4.383c-0.097,0.07-0.271,0.14-0.386,0.106        c-0.944-0.28-2.488-0.346-3.082-1.132c-0.375-0.497-0.444-1.506-0.177-2.069c0.528-1.113,2.169-2.043,3.359-2.363        C50.749,46.774,51.463,47.49,51.659,47.989"
   style="fill:#EDEDED;" />


						<path
   id="path334"
   d="M34.019,56.875c-0.478,0.866-2.226,1.243-3.165,0.929c-0.099-0.033-0.195-0.21-0.161-0.308        c0.326-0.917,1.312-2.167,2.274-2.313c0.243-0.037,0.563,0.206,0.713,0.4C33.927,55.9,34.213,56.525,34.019,56.875"
   style="fill:#EDEDED;" />


						<path
   id="path336"
   d="M49.525,51.528c-0.534,0.342-1.592-0.249-1.974-0.754c-0.181-0.239-0.214-0.724-0.088-0.996        c0.343-0.74,1.561-1.091,2.218-1.575C49.641,49.2,50.365,50.988,49.525,51.528"
   style="fill:#EDEDED;" />


					</g>


					<path
   id="path339"
   d="M72.908,43.348c1.245,3.055,1.87,4.588,2.852,8.788       c2.472,1.342,2.948,1.693,4.249,3.126c-0.43,2.982-0.626,4.344-1.635,8.073c0.268,0.327,0.584,0.801,0.761,1.185       c-0.434,1.828-0.551,2.319-1.425,4.106c-0.311,0.521-0.729,1.214-1.056,1.726c-0.846,1.247-0.846,1.247-1.295,1.841       c-0.277,0.355-0.647,0.83-0.933,1.179c-0.178,0.107-0.443,0.201-0.644,0.254c-0.624,0.059-1.212,0.115-2.68,0.019       c-0.818-1.311-1.626-2.629-2.439-3.943c-0.798-0.69-1.682-1.456-2.647-2.294c-2.532-0.129-3.133-0.16-5.298-0.358       c-1.614,1.699-3.286,3.311-4.987,4.804c-2.794,2.676-3.667,3.46-6.568,5.685c-3.047-0.495-3.867-0.628-7.167-1.533       c-0.162-0.137-0.324-0.276-0.485-0.417c-2.421-2.112-4.64-4.53-6.62-7.151c0.732-3.112,1.561-6.638,2.273-11.058       c-0.296-0.553-0.575-1.075,2.306-5.47c1.197,0.838,2.809,1.934,4.031,2.735c1.864-1.793,3.095-2.978,5.362-5.566       c-0.284-1.307-0.689-3.044-1.024-4.339c2.367-2.627,3.072-3.459,5.167-6.311c3.113,0.964,3.438,1.064,5.527,1.784       c5.549-0.358,5.881-0.38,7.465-0.453c0.895-2.631,0.968-2.846,1.261-4.086C70.11,38.971,72.01,41.553,72.908,43.348"
   style="clip-path:url(#XMLID_22_);fill:#008837;" />


					<path
   id="path341"
   d="M29.392,42.587c-0.366,0.37-0.854,0.863-1.229,1.223l-0.495-0.527       c-0.242-0.854-0.566-1.992-0.789-2.851c-0.232-0.778-0.547-1.815-0.744-2.603l-0.176-1.511l0.308,0.116       c0.215,0.564,0.484,1.324,0.729,1.876c0.34,0.652,0.788,1.525,1.165,2.157l0.785,0.662L29.392,42.587"
   style="clip-path:url(#XMLID_22_);fill:#008837;" />


					<path
   id="path343"
   d="M26.459,43.056c-0.231,0.158-0.461,0.309-0.691,0.454l-0.506-1.762       l0.143-1.682l0.531,0.039l0.486,1.287L26.459,43.056"
   style="clip-path:url(#XMLID_22_);fill:#008837;" />


					<path
   id="path345"
   d="M30.794,24.719c-0.75,0.792-1.727,1.871-2.417,2.716       c0.316-0.218,0.745-0.499,1.073-0.699c0.49-0.573,1.144-1.338,1.648-1.898c1.361-1.189,2.903-2.538,5.072-3.706       c0.479-0.145,1.115-0.345,1.6-0.471c-0.565,0.301-1.332,0.68-1.884,1.005c-0.625,0.482-1.45,1.136-2.055,1.643       c0.334-0.042,0.782-0.089,1.119-0.103c2.909-1.587,2.909-1.587,4.513-2.224c-0.621,0.154-1.453,0.349-2.065,0.532       c2.185-1.424,3.363-2.081,4.999-2.46l0.596-0.107c2.787-0.375,3.367-0.453,6.073-0.475l0.593,0.013       c1.078,0.074,2.514,0.21,3.584,0.363c0.83,0.119,1.939,0.27,2.759,0.442c1.371,0.365,3.187,0.904,4.528,1.366l0.331,0.128       c0.088,0.07,0.221,0.155,0.278,0.252c0.236,0.156,0.458,0.328,0.664,0.518c3.964,1.834,5.064,2.45,8.771,5.389       c0.495,0.582,1.165,1.35,1.622,1.962c-2.362-1.686-2.504-1.787-4.26-2.673c-2.696-1.282-2.978-1.416-5.225-2.129       c-1.146-0.063-2.678-0.098-3.826-0.087c-0.373,1.344-0.42,1.517-0.749,2.303c-1.187,1.41-1.284,1.525-2.117,2.423       c-0.491,0.804-1.165,1.864-1.687,2.649l1.34,0.136c0.6-0.388,1.401-0.903,1.998-1.295c0.801,0.022,1.87,0.042,2.67,0.08       c-0.049-0.73-0.116-1.705-0.213-2.43c0.722,0.348,1.695,0.789,2.405,1.162c0.637,0.803,1.485,1.876,2.074,2.715       c0.171,0.897,0.397,2.095,0.518,3c0.043,1.082,0.083,2.525,0.066,3.608c-1.366-0.455-3.197-1.031-4.578-1.436       c-0.927,0.127-2.163,0.296-3.09,0.421c-1.112,0.16-2.596,0.37-3.709,0.52l-0.398-2.087c-0.596-0.559-1.377-1.319-1.993-1.855       c-0.527,1.14-1.123,2.286-1.775,3.428l-2.253-0.344c-1.023-0.471-2.044-0.916-3.057-1.331c-0.47,0.533-1.096,1.245-1.578,1.767       c0.838,0.743,1.947,1.744,2.753,2.521c-0.7,0.133-1.631,0.322-2.334,0.438c-1.027-0.229-2.396-0.536-3.418-0.785       c-0.507,0.455-1.182,1.064-1.699,1.508c2.711,1.28,2.874,1.356,4.935,2.245c1.006,0.363,2.347,0.846,3.358,1.196L44.18,44.91       c-0.192,1.137-0.468,2.65-0.7,3.779c-0.295-0.821-0.681-1.919-0.995-2.733c-0.944-0.427-2.202-0.997-3.137-1.445       c-0.767-0.575-1.79-1.342-2.551-1.925c-0.375,0.931-0.896,2.165-1.304,3.082c0.825,2.733,0.931,3.084,1.622,5.82       c-1.368,1.934-1.692,2.393-3.263,4.352c-0.694-0.442-1.628-1.018-2.302-1.491c-1.087-1.993-2.052-4-2.875-5.986       c1.175-1.492,1.326-1.684,2.188-2.917c-0.214-0.769-0.497-1.795-0.719-2.562c0.041,0.078,0.096,0.182,0.137,0.26       c0.622-0.26,1.184-1.98,1.342-2.502c-0.254-0.582-0.583-1.362-0.852-1.938l0.208-0.698c0.467,0.623,1.091,1.453,1.552,2.081       c0.155-0.401,0.368-0.934,0.513-1.339l-0.035-1.276c-0.586-0.518-1.367-1.209-1.963-1.716c-1.774-0.44-1.88-0.467-2.74-0.867       c0.569,0.415,1.329,0.966,1.917,1.352l1.052,1.199c-0.496-0.16-1.162-0.358-1.646-0.551l0.495,1.307       c-1.597-1.591-1.764-1.758-2.374-2.53c-0.287-0.545-0.666-1.274-0.966-1.812l-0.489-0.844c0.019-0.392,0.02-0.424-0.026-0.623       c0.305,0.112,0.71,0.271,1.026,0.347c0.455,0.217,1.061,0.507,1.517,0.722c-0.071,0.22-0.167,0.513-0.247,0.729       c1.373,0.224,1.62,0.264,3.139,0.236c-0.045-1.089-0.05-1.204-0.199-1.853c-0.757-0.075-1.767-0.174-2.524-0.254       c-0.856-0.524-1.097-0.622-2.194-0.687c-0.351-0.037-0.424-0.044-0.822,0.071c0.307-0.156,0.717-0.362,1.017-0.53       c0.629-0.431,0.779-0.533,1.499-1.134c-0.652,0.351-1.516,0.833-2.133,1.242c-0.107,0.059-0.254,0.131-0.354,0.201       c0.332-0.354,0.571-0.622,0.873-1.109c0.295-0.492,0.379-0.653,0.521-1.098c-0.244,0.188-0.546,0.42-0.869,0.754       C27.556,28.424,28.732,26.612,30.794,24.719"
   style="clip-path:url(#XMLID_22_);fill:#008837;" />


				</g>


			</g>
<polygon
   id="polygon349"
   points="42.983,20.952 50.984,12.725 54.089,12.64 60.691,21.754 "
   style="fill:#008632;fill-opacity:1.0000000" />
<path
   id="path351"
   d="M 54.208000,12.685000 L 51.103000,12.769000 L 45.192000,18.847000 C 35.342000,20.023000 26.102000,25.513000 20.498000,34.617000 C 10.753000,50.446000 15.685000,71.179000 31.514000,80.925000 C 47.343000,90.670000 68.076000,85.738000 77.821000,69.909000 C 87.567000,54.080000 82.634000,33.347000 66.805000,23.601000 C 64.534000,22.203000 62.159000,21.116000 59.732000,20.311000 L 54.208000,12.685000 z "
   style="fill:none;stroke:#000000" />
<path
   id="path354"
   d="M 49.111000,6.6100000 C 47.801000,8.7380000 48.464000,11.526000 50.592000,12.836000 C 52.720000,14.147000 55.508000,13.483000 56.818000,11.355000 C 58.129000,9.2270000 57.465000,6.4390000 55.337000,5.1280000 C 53.209000,3.8190000 50.421000,4.4820000 49.111000,6.6100000 z M 50.163000,6.6940000 C 50.571000,6.1940000 51.093000,5.8260000 51.667000,5.6060000 L 52.229000,7.9660000 L 50.163000,6.6940000 z M 51.726000,8.7840000 L 49.366000,9.3460000 C 49.304000,8.7340000 49.397000,8.1020000 49.660000,7.5130000 L 51.726000,8.7840000 z M 51.948000,9.7180000 L 50.676000,11.784000 C 50.176000,11.376000 49.808000,10.855000 49.588000,10.280000 L 51.948000,9.7180000 z M 52.766000,10.221000 L 53.327000,12.581000 C 52.715000,12.643000 52.083000,12.550000 51.494000,12.287000 L 52.766000,10.221000 z M 53.699000,9.9990000 L 55.765000,11.271000 C 55.357000,11.771000 54.836000,12.139000 54.261000,12.359000 L 53.699000,9.9990000 z M 54.203000,9.1820000 L 56.563000,8.6200000 C 56.625000,9.2330000 56.532000,9.8640000 56.269000,10.453000 L 54.203000,9.1820000 z M 53.981000,8.2480000 L 55.253000,6.1820000 C 55.753000,6.5900000 56.121000,7.1120000 56.341000,7.6860000 L 53.981000,8.2480000 z M 53.163000,7.7440000 L 52.601000,5.3840000 C 53.214000,5.3220000 53.845000,5.4150000 54.434000,5.6780000 L 53.163000,7.7440000 z "
   style="fill:#d3a488" />
<circle
   id="circle380"
   r="3.394"
   cy="28.828"
   cx="77.115"
   style="fill:url(#XMLID_23_)" />
<circle
   id="circle406"
   r="3.394"
   cy="14.461"
   cx="141.199"
   style="fill:url(#XMLID_24_)" />
<path
   id="path420"
   d="M 98.916000,63.482000 C 93.576000,89.285000 68.424000,105.89900 42.703000,100.64500 L 41.982000,104.12900 C 69.622000,109.78100 96.651000,91.928000 102.38900,64.201000 C 102.46100,63.856000 102.51200,63.512000 102.57600,63.168000 L 99.103000,62.449000 C 99.039000,62.794000 98.988000,63.138000 98.916000,63.482000 z "
   style="fill:url(#linearGradient1653)" />
<path
   id="path434"
   d="M 41.691000,100.44900 C 15.887000,95.108000 -0.72700000,69.957000 4.5280000,44.235000 L 1.0440000,43.514000 C -4.6070000,71.153000 13.245000,98.182000 40.972000,103.92100 C 41.317000,103.99200 41.660000,104.04400 42.005000,104.10800 L 42.724000,100.63500 C 42.380000,100.57200 42.036000,100.52000 41.691000,100.44900 z "
   style="fill:url(#linearGradient1650)" />
<path
   id="path448"
   d="M 18.191000,13.828000 C 9.8200000,20.978000 3.6590000,30.859000 1.2520000,42.488000 C 1.1800000,42.833000 1.1290000,43.176000 1.0650000,43.521000 L 4.5380000,44.240000 C 4.6020000,43.895000 4.6530000,43.552000 4.7250000,43.207000 C 6.9710000,32.353000 12.732000,23.135000 20.557000,16.477000 L 18.191000,13.828000 z "
   style="fill:url(#linearGradient1647)" />
<circle
   id="circle474"
   r="3.394"
   cy="14.878"
   cx="19.781"
   style="fill:url(#XMLID_28_)" />
<g
   id="g476">
			<text
   id="text478"
   transform="translate(81.64870,34.02830)"><tspan
     id="tspan479"
     style="font-size:6.8000002;font-family:Bitstream Vera Sans"
     y="0"
     x="0">1</tspan></text>


		</g>
<g
   id="g483">
			<text
   id="text485"
   transform="translate(26.18190,14.69480)"><tspan
     id="tspan486"
     style="font-size:6.8000002;font-family:Bitstream Vera Sans"
     y="0"
     x="0">2</tspan></text>


		</g>
<g
   id="g490">
			<text
   id="text492"
   transform="translate(139.7156,28.56150)"><tspan
     id="tspan493"
     style="font-size:6.8000002;font-family:Bitstream Vera Sans"
     y="0"
     x="0">4</tspan></text>


		</g>
<circle
   id="circle521"
   r="3.394"
   cy="72.882"
   cx="115.737"
   style="fill:url(#XMLID_29_)" />
<g
   id="g523">
			<text
   id="text525"
   transform="translate(113.8201,88.29540)"><tspan
     id="tspan526"
     style="font-size:6.8000002;font-family:Bitstream Vera Sans"
     y="0"
     x="0">3</tspan></text>


		</g>


</svg>
