<?xml version="1.0" encoding="UTF-8" standalone="no"?>
<!-- Generator: Adobe Illustrator 11 Build 196, SVG Export Plug-In . SVG Version: 6.0.0 Build 78)  -->
<svg
   xmlns:dc="http://purl.org/dc/elements/1.1/"
   xmlns:cc="http://web.resource.org/cc/"
   xmlns:rdf="http://www.w3.org/1999/02/22-rdf-syntax-ns#"
   xmlns:svg="http://www.w3.org/2000/svg"
   xmlns="http://www.w3.org/2000/svg"
   xmlns:sodipodi="http://inkscape.sourceforge.net/DTD/sodipodi-0.dtd"
   xmlns:inkscape="http://www.inkscape.org/namespaces/inkscape"
   width="112.521"
   height="112.479"
   viewBox="0 0 112.521 112.479"
   style="overflow:visible;enable-background:new 0 0 112.521 112.479"
   xml:space="preserve"
   id="svg2"
   sodipodi:version="0.32"
   inkscape:version="0.42.2"
   sodipodi:docname="crossed-fields-half.svg"
   sodipodi:docbase="/home/bcrowell/Documents/writing/lm/trunk/4em/ch99/figs"><metadata
   id="metadata42"><rdf:RDF><cc:Work
       rdf:about=""><dc:format>image/svg+xml</dc:format><dc:type
         rdf:resource="http://purl.org/dc/dcmitype/StillImage" /></cc:Work></rdf:RDF></metadata><defs
   id="defs40">
		
		
		
	</defs><sodipodi:namedview
   inkscape:cy="94.144926"
   inkscape:cx="208.25311"
   inkscape:zoom="1.4271801"
   inkscape:window-height="627"
   inkscape:window-width="869"
   inkscape:pageshadow="2"
   inkscape:pageopacity="0.0"
   borderopacity="1.0"
   bordercolor="#666666"
   pagecolor="#ffffff"
   id="base"
   inkscape:window-x="95"
   inkscape:window-y="95"
   inkscape:current-layer="svg2" />
	<g
   id="g5">
			<circle
   sodipodi:ry="11.879000"
   sodipodi:rx="11.879000"
   sodipodi:cy="28.375000"
   sodipodi:cx="84.271004"
   id="circle7"
   r="11.879000"
   cy="28.375000"
   cx="84.271004"
   style="fill:none;stroke:#000000;stroke-width:0.50000000" /> 
			<circle
   sodipodi:ry="9.5030003"
   sodipodi:rx="9.5030003"
   sodipodi:cy="28.375000"
   sodipodi:cx="84.271004"
   id="circle9"
   r="9.5030003"
   cy="28.375000"
   cx="84.271004"
   style="fill:none;stroke:#000000;stroke-width:0.50000000" /> 
			<polygon
   id="polygon11"
   points="82.097000,20.261000 82.320000,29.208000 85.845000,28.264000 82.097000,20.261000 "
   style="fill:none;stroke:#000000;stroke-width:0.50000000" />
			<polygon
   id="polygon13"
   points="86.067000,37.266000 85.845000,28.319000 82.319000,29.263000 86.067000,37.266000 "
   style="stroke:#000000;stroke-width:0.50000000" />
		</g><g
   id="g15">
			<rect
   id="rect17"
   height="55.500000"
   width="55.500000"
   style="fill:#dcdcdc"
   y="0.54200000"
   x="0.54200000" /> 
			<rect
   id="rect19"
   height="29.914000"
   width="55.500000"
   style="fill:#ffffff"
   y="13.334000"
   x="0.54200000" /> 
			<line
   id="line21"
   y2="13.397000"
   x2="0.54200000"
   y1="13.397000"
   x1="56.042000"
   style="fill:#ffffff;stroke:#000000;stroke-dasharray:2.0000000 " />
			<line
   id="line23"
   y2="43.311001"
   x2="56.042000"
   y1="43.311001"
   x1="0.54200000"
   style="fill:#ffffff;stroke:#000000;stroke-dasharray:2.0000000 " />
			<rect
   id="rect25"
   height="55.500000"
   width="55.500000"
   style="fill:none;stroke:#000000"
   y="0.50000000"
   x="0.50000000" /> 
		</g><g
   id="g27">
			<rect
   id="rect29"
   height="55.500000"
   width="55.500000"
   style="fill:#dcdcdc"
   y="56.438000"
   x="56.562000" /> 
			<rect
   id="rect31"
   height="55.500000"
   width="29.915001"
   style="fill:#ffffff"
   y="56.438000"
   x="69.355003" /> 
			<line
   id="line33"
   y2="111.93800"
   x2="69.417000"
   y1="56.438000"
   x1="69.417000"
   style="fill:#ffffff;stroke:#000000;stroke-dasharray:2.0000000 " />
			<line
   id="line35"
   y2="56.438000"
   x2="99.332001"
   y1="111.93800"
   x1="99.332001"
   style="fill:#ffffff;stroke:#000000;stroke-dasharray:2.0000000 " />
			<rect
   id="rect37"
   height="55.500000"
   width="55.500000"
   style="fill:none;stroke:#000000"
   y="56.479000"
   x="56.521000" /> 
		</g>
<g
   style="overflow:visible"
   id="g1418"
   transform="translate(245.7504,-20.77730)">
			<rect
   id="rect1420"
   height="55.500000"
   width="55.500000"
   style="fill:#dcdcdc"
   y="56.438000"
   x="56.562000" /> 
			<rect
   id="rect1422"
   height="55.500000"
   width="29.915001"
   style="fill:#ffffff"
   y="56.438000"
   x="69.355003" /> 
			<line
   id="line1424"
   y2="111.93800"
   x2="69.417000"
   y1="56.438000"
   x1="69.417000"
   style="fill:#ffffff;stroke:#000000;stroke-dasharray:2.0000000 " />
			<line
   id="line1426"
   y2="56.438000"
   x2="99.332001"
   y1="111.93800"
   x1="99.332001"
   style="fill:#ffffff;stroke:#000000;stroke-dasharray:2.0000000 " />
			<rect
   id="rect1428"
   height="55.500000"
   width="55.500000"
   style="fill:none;stroke:#000000"
   y="56.479000"
   x="56.521000" /> 
		</g><rect
   style="fill:none;fill-opacity:0.75000000;fill-rule:evenodd;stroke:#000000;stroke-width:1.0000000pt;stroke-linecap:butt;stroke-linejoin:miter;stroke-opacity:1.0000000"
   id="rect1430"
   width="58.156639"
   height="75.673698"
   x="207.40199"
   y="39.608025" /><path
   style="fill:none;fill-opacity:0.75000000;fill-rule:evenodd;stroke:#000000;stroke-width:0.87500003;stroke-linecap:butt;stroke-linejoin:miter;stroke-opacity:1.0000000;stroke-miterlimit:4.0000000;stroke-dasharray:none"
   d="M 208.10267,93.560575 C 93.891440,139.80561 -20.319794,143.30903 -25.925253,131.39743 C -31.530713,119.48582 -57.455962,97.764669 -39.938902,76.043514 C -22.421841,54.322359 -0.70068614,49.417582 -0.70068614,49.417582"
   id="path1432" /><path
   style="fill:none;fill-opacity:0.75000000;fill-rule:evenodd;stroke:#000000;stroke-width:0.87500003;stroke-linecap:butt;stroke-linejoin:miter;stroke-opacity:1.0000000;stroke-miterlimit:4.0000000;stroke-dasharray:none"
   d="M -0.70068614,7.3766372 C -30.129348,24.193015 -53.952550,29.798475 -56.054597,53.621677 C -58.156644,77.444879 -72.170293,93.560575 -51.850503,116.68309 C -31.530713,139.80561 13.312962,154.51995 43.442306,149.61517 C 73.571650,144.71039 207.40199,107.57422 207.40199,107.57422 C 207.40199,107.57422 177.27265,120.18651 179.37470,127.89401 C 181.47674,135.60152 226.32042,145.41107 242.43611,141.20698 C 258.55181,137.00288 292.88525,111.07764 297.79002,105.47218 C 302.69480,99.866716 307.59958,92.859892 307.59958,92.859892"
   id="path1434" /><path
   style="fill:none;fill-opacity:0.75000000;fill-rule:evenodd;stroke:#000000;stroke-width:0.87500003;stroke-linecap:butt;stroke-linejoin:miter;stroke-opacity:1.0000000;stroke-miterlimit:4.0000000;stroke-dasharray:none"
   d="M 350.34121,92.159210 C 350.34121,92.159210 298.49071,149.61517 264.15727,152.41790 C 229.82383,155.22063 187.78288,162.92813 156.95286,161.52677 C 126.12283,160.12540 74.973015,147.51312 70.068238,139.80561 C 65.163461,132.09811 63.762096,113.88036 63.762096,113.88036"
   id="path1436" /><path
   style="fill:none;fill-opacity:0.75000000;fill-rule:evenodd;stroke:#000000;stroke-width:0.87500003;stroke-linecap:butt;stroke-linejoin:miter;stroke-opacity:1.0000000;stroke-miterlimit:4.0000000;stroke-dasharray:none"
   d="M 103.70099,113.88036 C 103.70099,113.88036 151.34740,109.67627 173.76924,101.96876 C 196.19107,94.261257 206.70131,92.859892 206.70131,92.859892"
   id="path1438" /><text
   xml:space="preserve"
   style="font-size:10.000000px;font-style:normal;font-variant:normal;font-weight:normal;font-stretch:normal;text-align:start;line-height:125.00000%;writing-mode:lr-tb;text-anchor:start;fill:#000000;fill-opacity:1.0000000;stroke:none;stroke-width:1.0000000pt;stroke-linecap:butt;stroke-linejoin:miter;stroke-opacity:1.0000000;font-family:Bitstream Vera Sans"
   x="220.01428"
   y="68.336006"
   id="text2166"
   sodipodi:linespacing="125.00000%"><tspan
     sodipodi:role="line"
     id="tspan2168"
     x="220.01428"
     y="68.336006">power</tspan><tspan
     sodipodi:role="line"
     x="220.01428"
     y="80.836006"
     id="tspan2170">supply</tspan></text>
<text
   xml:space="preserve"
   style="font-size:10.000000px;font-style:normal;font-variant:normal;font-weight:normal;font-stretch:normal;text-align:start;line-height:125.00000%;writing-mode:lr-tb;text-anchor:start;fill:#000000;fill-opacity:1.0000000;stroke:none;stroke-width:1.0000000pt;stroke-linecap:butt;stroke-linejoin:miter;stroke-opacity:1.0000000;font-family:Bitstream Vera Sans"
   x="-19.619112"
   y="10.880049"
   id="text2172"
   sodipodi:linespacing="125.00000%"><tspan
     sodipodi:role="line"
     id="tspan2174"
     x="-19.619112"
     y="10.880049">I</tspan></text>
<text
   xml:space="preserve"
   style="font-size:10.000000px;font-style:normal;font-variant:normal;font-weight:normal;font-stretch:normal;text-align:start;line-height:125.00000%;writing-mode:lr-tb;text-anchor:start;fill:#000000;fill-opacity:1.0000000;stroke:none;stroke-width:1.0000000pt;stroke-linecap:butt;stroke-linejoin:miter;stroke-opacity:1.0000000;font-family:Bitstream Vera Sans"
   x="49.047764"
   y="123.68991"
   id="text2176"
   sodipodi:linespacing="125.00000%"><tspan
     sodipodi:role="line"
     id="tspan2178"
     x="49.047764"
     y="123.68991">I/2</tspan></text>
</svg>