<?xml version="1.0" encoding="iso-8859-1"?>
<!-- Generator: Adobe Illustrator 11 Build 196, SVG Export Plug-In . SVG Version: 6.0.0 Build 78)  -->
<!DOCTYPE svg PUBLIC "-//W3C//DTD SVG 1.0//EN"    "http://www.w3.org/TR/2001/REC-SVG-20010904/DTD/svg10.dtd" [
	<!ENTITY ns_flows "http://ns.adobe.com/Flows/1.0/">
	<!ENTITY ns_svg "http://www.w3.org/2000/svg">
	<!ENTITY ns_xlink "http://www.w3.org/1999/xlink">
]>
<svg  
	 width="141.927" height="138.82" viewBox="0 0 141.927 138.82" style="overflow:visible;enable-background:new 0 0 141.927 138.82"
	 xml:space="preserve">
	<style type="text/css">
	
	</style>
	<g id="Layer_1">
		<g>
			<circle cx="17.484" cy="17.01" r="6.654"/> 
			<g>
				<text transform="matrix(1 0 0 1 14.8699 21.7146)"><tspan x="0" y="0" style="fill:#FFFFFF; font-family:Bitstream Vera Sans-Bold'; font-size:13.600000;">-</tspan></text>
			</g>
		</g>
		<g>
			<circle style="fill:#FFFFFF;stroke:#000000;" cx="37.959" cy="17.514" r="5.668"/> 
			<g>
				<text transform="matrix(1 0 0 1 34.1252 21.0911)"><tspan x="0" y="0" style="font-family:Bitstream Vera Sans-Bold'; font-size:10.200000;">+</tspan></text>
			</g>
		</g>
		<g>
			<circle cx="59.304" cy="17.01" r="6.654"/> 
			<g>
				<text transform="matrix(1 0 0 1 56.6907 21.7146)"><tspan x="0" y="0" style="fill:#FFFFFF; font-family:Bitstream Vera Sans-Bold'; font-size:13.600000;">-</tspan></text>
			</g>
		</g>
		<g>
			<circle style="fill:#FFFFFF;stroke:#000000;" cx="79.779" cy="17.514" r="5.668"/> 
			<g>
				<text transform="matrix(1 0 0 1 75.9456 21.0911)"><tspan x="0" y="0" style="font-family:Bitstream Vera Sans-Bold'; font-size:10.200000;">+</tspan></text>
			</g>
		</g>
		<g>
			<circle cx="101.125" cy="17.01" r="6.654"/> 
			<g>
				<text transform="matrix(1 0 0 1 98.5115 21.7146)"><tspan x="0" y="0" style="fill:#FFFFFF; font-family:Bitstream Vera Sans-Bold'; font-size:13.600000;">-</tspan></text>
			</g>
		</g>
		<g>
			<circle style="fill:#FFFFFF;stroke:#000000;" cx="121.6" cy="17.514" r="5.668"/> 
			<g>
				<text transform="matrix(1 0 0 1 117.7664 21.0911)"><tspan x="0" y="0" style="font-family:Bitstream Vera Sans-Bold'; font-size:10.200000;">+</tspan></text>
			</g>
		</g>
		<g>
			<circle cx="120.963" cy="37.92" r="6.654"/> 
			<g>
				<text transform="matrix(-1 0 0 1 123.5769 42.6252)"><tspan x="0" y="0" style="fill:#FFFFFF; font-family:Bitstream Vera Sans-Bold'; font-size:13.600000;">-</tspan></text>
			</g>
		</g>
		<g>
			<circle style="fill:#FFFFFF;stroke:#000000;" cx="100.488" cy="38.425" r="5.668"/> 
			<g>
				<text transform="matrix(-1 0 0 1 104.321 42.0012)"><tspan x="0" y="0" style="font-family:Bitstream Vera Sans-Bold'; font-size:10.200000;">+</tspan></text>
			</g>
		</g>
		<g>
			<circle cx="79.142" cy="37.92" r="6.654"/> 
			<g>
				<text transform="matrix(-1 0 0 1 81.7556 42.6252)"><tspan x="0" y="0" style="fill:#FFFFFF; font-family:Bitstream Vera Sans-Bold'; font-size:13.600000;">-</tspan></text>
			</g>
		</g>
		<g>
			<circle style="fill:#FFFFFF;stroke:#000000;" cx="58.667" cy="38.425" r="5.668"/> 
			<g>
				<text transform="matrix(-1 0 0 1 62.5007 42.0012)"><tspan x="0" y="0" style="font-family:Bitstream Vera Sans-Bold'; font-size:10.200000;">+</tspan></text>
			</g>
		</g>
		<g>
			<circle cx="37.322" cy="37.92" r="6.654"/> 
			<g>
				<text transform="matrix(-1 0 0 1 39.9348 42.6252)"><tspan x="0" y="0" style="fill:#FFFFFF; font-family:Bitstream Vera Sans-Bold'; font-size:13.600000;">-</tspan></text>
			</g>
		</g>
		<g>
			<circle style="fill:#FFFFFF;stroke:#000000;" cx="16.846" cy="38.425" r="5.668"/> 
			<g>
				<text transform="matrix(-1 0 0 1 20.6799 42.0012)"><tspan x="0" y="0" style="font-family:Bitstream Vera Sans-Bold'; font-size:10.200000;">+</tspan></text>
			</g>
		</g>
		<g>
			<circle cx="17.484" cy="58.83" r="6.654"/> 
			<g>
				<text transform="matrix(1 0 0 1 14.8699 63.5354)"><tspan x="0" y="0" style="fill:#FFFFFF; font-family:Bitstream Vera Sans-Bold'; font-size:13.600000;">-</tspan></text>
			</g>
		</g>
		<g>
			<circle style="fill:#FFFFFF;stroke:#000000;" cx="37.959" cy="59.335" r="5.668"/> 
			<g>
				<text transform="matrix(1 0 0 1 34.1252 62.9119)"><tspan x="0" y="0" style="font-family:Bitstream Vera Sans-Bold'; font-size:10.200000;">+</tspan></text>
			</g>
		</g>
		<g>
			<circle cx="59.304" cy="58.83" r="6.654"/> 
			<g>
				<text transform="matrix(1 0 0 1 56.6907 63.5354)"><tspan x="0" y="0" style="fill:#FFFFFF; font-family:Bitstream Vera Sans-Bold'; font-size:13.600000;">-</tspan></text>
			</g>
		</g>
		<g>
			<circle style="fill:#FFFFFF;stroke:#000000;" cx="79.779" cy="59.335" r="5.668"/> 
			<g>
				<text transform="matrix(1 0 0 1 75.9456 62.9119)"><tspan x="0" y="0" style="font-family:Bitstream Vera Sans-Bold'; font-size:10.200000;">+</tspan></text>
			</g>
		</g>
		<g>
			<circle cx="101.125" cy="58.83" r="6.654"/> 
			<g>
				<text transform="matrix(1 0 0 1 98.5115 63.5354)"><tspan x="0" y="0" style="fill:#FFFFFF; font-family:Bitstream Vera Sans-Bold'; font-size:13.600000;">-</tspan></text>
			</g>
		</g>
		<g>
			<circle style="fill:#FFFFFF;stroke:#000000;" cx="121.6" cy="59.335" r="5.668"/> 
			<g>
				<text transform="matrix(1 0 0 1 117.7664 62.9119)"><tspan x="0" y="0" style="font-family:Bitstream Vera Sans-Bold'; font-size:10.200000;">+</tspan></text>
			</g>
		</g>
		<g>
			<circle cx="120.963" cy="79.741" r="6.654"/> 
			<g>
				<text transform="matrix(-1 0 0 1 123.5769 84.4456)"><tspan x="0" y="0" style="fill:#FFFFFF; font-family:Bitstream Vera Sans-Bold'; font-size:13.600000;">-</tspan></text>
			</g>
		</g>
		<g>
			<circle style="fill:#FFFFFF;stroke:#000000;" cx="100.488" cy="80.245" r="5.668"/> 
			<g>
				<text transform="matrix(-1 0 0 1 104.321 83.822)"><tspan x="0" y="0" style="font-family:Bitstream Vera Sans-Bold'; font-size:10.200000;">+</tspan></text>
			</g>
		</g>
		<g>
			<circle style="fill:#FFFFFF;stroke:#000000;" cx="58.667" cy="80.245" r="5.668"/> 
			<g>
				<text transform="matrix(-1 0 0 1 62.5007 83.822)"><tspan x="0" y="0" style="font-family:Bitstream Vera Sans-Bold'; font-size:10.200000;">+</tspan></text>
			</g>
		</g>
		<g>
			<circle cx="37.322" cy="79.741" r="6.654"/> 
			<g>
				<text transform="matrix(-1 0 0 1 39.9348 84.4456)"><tspan x="0" y="0" style="fill:#FFFFFF; font-family:Bitstream Vera Sans-Bold'; font-size:13.600000;">-</tspan></text>
			</g>
		</g>
		<g>
			<circle style="fill:#FFFFFF;stroke:#000000;" cx="16.846" cy="80.245" r="5.668"/> 
			<g>
				<text transform="matrix(-1 0 0 1 20.6799 83.822)"><tspan x="0" y="0" style="font-family:Bitstream Vera Sans-Bold'; font-size:10.200000;">+</tspan></text>
			</g>
		</g>
		<g>
			<circle cx="17.484" cy="100.651" r="6.654"/> 
			<g>
				<text transform="matrix(1 0 0 1 14.8699 105.3557)"><tspan x="0" y="0" style="fill:#FFFFFF; font-family:Bitstream Vera Sans-Bold'; font-size:13.600000;">-</tspan></text>
			</g>
		</g>
		<g>
			<circle style="fill:#FFFFFF;stroke:#000000;" cx="37.959" cy="101.156" r="5.668"/> 
			<g>
				<text transform="matrix(1 0 0 1 34.1252 104.7327)"><tspan x="0" y="0" style="font-family:Bitstream Vera Sans-Bold'; font-size:10.200000;">+</tspan></text>
			</g>
		</g>
		<g>
			<circle cx="59.304" cy="100.651" r="6.654"/> 
			<g>
				<text transform="matrix(1 0 0 1 56.6907 105.3557)"><tspan x="0" y="0" style="fill:#FFFFFF; font-family:Bitstream Vera Sans-Bold'; font-size:13.600000;">-</tspan></text>
			</g>
		</g>
		<g>
			<circle style="fill:#FFFFFF;stroke:#000000;" cx="79.779" cy="101.156" r="5.668"/> 
			<g>
				<text transform="matrix(1 0 0 1 75.9456 104.7327)"><tspan x="0" y="0" style="font-family:Bitstream Vera Sans-Bold'; font-size:10.200000;">+</tspan></text>
			</g>
		</g>
		<g>
			<circle cx="101.125" cy="100.651" r="6.654"/> 
			<g>
				<text transform="matrix(1 0 0 1 98.5115 105.3557)"><tspan x="0" y="0" style="fill:#FFFFFF; font-family:Bitstream Vera Sans-Bold'; font-size:13.600000;">-</tspan></text>
			</g>
		</g>
		<g>
			<circle style="fill:#FFFFFF;stroke:#000000;" cx="121.6" cy="101.156" r="5.668"/> 
			<g>
				<text transform="matrix(1 0 0 1 117.7664 104.7327)"><tspan x="0" y="0" style="font-family:Bitstream Vera Sans-Bold'; font-size:10.200000;">+</tspan></text>
			</g>
		</g>
		<g>
			<circle cx="120.963" cy="121.562" r="6.654"/> 
			<g>
				<text transform="matrix(-1 0 0 1 123.5769 126.2664)"><tspan x="0" y="0" style="fill:#FFFFFF; font-family:Bitstream Vera Sans-Bold'; font-size:13.600000;">-</tspan></text>
			</g>
		</g>
		<g>
			<circle style="fill:#FFFFFF;stroke:#000000;" cx="100.488" cy="122.066" r="5.668"/> 
			<g>
				<text transform="matrix(-1 0 0 1 104.321 125.6428)"><tspan x="0" y="0" style="font-family:Bitstream Vera Sans-Bold'; font-size:10.200000;">+</tspan></text>
			</g>
		</g>
		<g>
			<circle cx="79.142" cy="121.562" r="6.654"/> 
			<g>
				<text transform="matrix(-1 0 0 1 81.7556 126.2664)"><tspan x="0" y="0" style="fill:#FFFFFF; font-family:Bitstream Vera Sans-Bold'; font-size:13.600000;">-</tspan></text>
			</g>
		</g>
		<g>
			<circle style="fill:#FFFFFF;stroke:#000000;" cx="58.667" cy="122.066" r="5.668"/> 
			<g>
				<text transform="matrix(-1 0 0 1 62.5007 125.6428)"><tspan x="0" y="0" style="font-family:Bitstream Vera Sans-Bold'; font-size:10.200000;">+</tspan></text>
			</g>
		</g>
		<g>
			<circle cx="37.322" cy="121.562" r="6.654"/> 
			<g>
				<text transform="matrix(-1 0 0 1 39.9348 126.2664)"><tspan x="0" y="0" style="fill:#FFFFFF; font-family:Bitstream Vera Sans-Bold'; font-size:13.600000;">-</tspan></text>
			</g>
		</g>
		<g>
			<circle style="fill:#FFFFFF;stroke:#000000;" cx="16.846" cy="122.066" r="5.668"/> 
			<g>
				<text transform="matrix(-1 0 0 1 20.6799 125.6428)"><tspan x="0" y="0" style="font-family:Bitstream Vera Sans-Bold'; font-size:10.200000;">+</tspan></text>
			</g>
		</g>
		<circle style="fill:#B4B4B4;stroke:#000000;" cx="27.677" cy="69.494" r="4.436"/> 
		
			<linearGradient id="XMLID_15_" gradientUnits="userSpaceOnUse" x1="153.8601" y1="5.5427" x2="149.6306" y2="5.5427" gradientTransform="matrix(0.82 0 0 0.82 12.7438 12.4648)">
			<stop  offset="0" style="stop-color:#FFFFFF"/>
			<stop  offset="1" style="stop-color:#000000"/>
			<midPointStop  offset="0" style="stop-color:#FFFFFF"/>
			<midPointStop  offset="0.5" style="stop-color:#FFFFFF"/>
			<midPointStop  offset="1" style="stop-color:#000000"/>
		</linearGradient>
		<path style="fill:url(#XMLID_15_);" d="M138.94,11.168c-2.066,1.129-3.468,3.322-3.468,5.842c0,2.52,1.402,4.713,3.468,5.842
			V11.168z"/>
		<path style="fill:#FFFFFF;stroke:#BFBFBF;" d="M138.94,33.367c-0.563,0.284-1.073,0.659-1.509,1.106"/>
		<path style="fill:#FFFFFF;stroke:#808080;" d="M137.431,34.473c-0.429,0.439-0.788,0.948-1.057,1.508"/>
		<path style="fill:#FFFFFF;stroke:#000000;" d="M136.375,35.981c-0.355,0.74-0.554,1.568-0.554,2.444
			c0,0.872,0.197,1.696,0.549,2.433"/>
		<path style="fill:#FFFFFF;stroke:#808080;" d="M136.369,40.858c0.294,0.616,0.697,1.17,1.183,1.639"/>
		<path style="fill:#FFFFFF;stroke:#BFBFBF;" d="M137.552,42.497c0.408,0.394,0.876,0.727,1.388,0.986"/>
		
			<linearGradient id="XMLID_16_" gradientUnits="userSpaceOnUse" x1="153.8601" y1="5.5427" x2="149.6306" y2="5.5427" gradientTransform="matrix(0.82 0 0 0.82 12.7438 54.3633)">
			<stop  offset="0" style="stop-color:#FFFFFF"/>
			<stop  offset="1" style="stop-color:#000000"/>
			<midPointStop  offset="0" style="stop-color:#FFFFFF"/>
			<midPointStop  offset="0.5" style="stop-color:#FFFFFF"/>
			<midPointStop  offset="1" style="stop-color:#000000"/>
		</linearGradient>
		<path style="fill:url(#XMLID_16_);" d="M138.94,53.066c-2.066,1.129-3.468,3.322-3.468,5.842s1.402,4.713,3.468,5.842V53.066z"/>
		<path style="fill:#FFFFFF;stroke:#BFBFBF;" d="M138.94,75.265c-0.563,0.284-1.073,0.659-1.509,1.106"/>
		<path style="fill:#FFFFFF;stroke:#808080;" d="M137.431,76.371c-0.429,0.439-0.788,0.948-1.057,1.508"/>
		<path style="fill:#FFFFFF;stroke:#000000;" d="M136.375,77.879c-0.355,0.74-0.554,1.568-0.554,2.444
			c0,0.872,0.197,1.696,0.549,2.433"/>
		<path style="fill:#FFFFFF;stroke:#808080;" d="M136.369,82.756c0.294,0.616,0.697,1.17,1.183,1.639"/>
		<path style="fill:#FFFFFF;stroke:#BFBFBF;" d="M137.552,84.395c0.408,0.394,0.876,0.727,1.388,0.986"/>
		
			<linearGradient id="XMLID_17_" gradientUnits="userSpaceOnUse" x1="153.8601" y1="5.543" x2="149.6306" y2="5.543" gradientTransform="matrix(0.82 0 0 0.82 12.7438 96.2612)">
			<stop  offset="0" style="stop-color:#FFFFFF"/>
			<stop  offset="1" style="stop-color:#000000"/>
			<midPointStop  offset="0" style="stop-color:#FFFFFF"/>
			<midPointStop  offset="0.5" style="stop-color:#FFFFFF"/>
			<midPointStop  offset="1" style="stop-color:#000000"/>
		</linearGradient>
		<path style="fill:url(#XMLID_17_);" d="M138.94,94.964c-2.066,1.129-3.468,3.321-3.468,5.842s1.402,4.713,3.468,5.842V94.964z"/>
		<path style="fill:#FFFFFF;stroke:#BFBFBF;" d="M138.94,117.163c-0.563,0.284-1.073,0.659-1.509,1.106"/>
		<path style="fill:#FFFFFF;stroke:#808080;" d="M137.431,118.269c-0.429,0.439-0.788,0.948-1.057,1.508"/>
		<path style="fill:#FFFFFF;stroke:#000000;" d="M136.375,119.777c-0.355,0.739-0.554,1.568-0.554,2.444
			c0,0.872,0.197,1.696,0.549,2.433"/>
		<path style="fill:#FFFFFF;stroke:#808080;" d="M136.369,124.654c0.294,0.616,0.697,1.17,1.183,1.639"/>
		<path style="fill:#FFFFFF;stroke:#BFBFBF;" d="M137.552,126.293c0.408,0.394,0.876,0.728,1.388,0.986"/>
		
			<linearGradient id="XMLID_18_" gradientUnits="userSpaceOnUse" x1="153.8601" y1="5.543" x2="149.6306" y2="5.543" gradientTransform="matrix(-0.82 0 0 -0.82 126.7674 126.3403)">
			<stop  offset="0" style="stop-color:#FFFFFF"/>
			<stop  offset="1" style="stop-color:#000000"/>
			<midPointStop  offset="0" style="stop-color:#FFFFFF"/>
			<midPointStop  offset="0.5" style="stop-color:#FFFFFF"/>
			<midPointStop  offset="1" style="stop-color:#000000"/>
		</linearGradient>
		<path style="fill:url(#XMLID_18_);" d="M0.571,127.637c2.066-1.129,3.468-3.322,3.468-5.842c0-2.52-1.402-4.713-3.468-5.842
			V127.637z"/>
		<path style="fill:#FFFFFF;stroke:#BFBFBF;" d="M0.571,105.438c0.563-0.285,1.073-0.66,1.509-1.106"/>
		<path style="fill:#FFFFFF;stroke:#808080;" d="M2.08,104.332c0.429-0.439,0.787-0.948,1.056-1.508"/>
		<path style="fill:#FFFFFF;stroke:#000000;" d="M3.137,102.824c0.355-0.739,0.554-1.568,0.554-2.444
			c0-0.872-0.197-1.696-0.549-2.433"/>
		<path style="fill:#FFFFFF;stroke:#808080;" d="M3.142,97.948c-0.294-0.616-0.697-1.17-1.183-1.639"/>
		<path style="fill:#FFFFFF;stroke:#BFBFBF;" d="M1.959,96.308c-0.409-0.394-0.876-0.727-1.388-0.985"/>
		
			<linearGradient id="XMLID_19_" gradientUnits="userSpaceOnUse" x1="153.8601" y1="5.543" x2="149.6306" y2="5.543" gradientTransform="matrix(-0.82 0 0 -0.82 126.7674 84.4419)">
			<stop  offset="0" style="stop-color:#FFFFFF"/>
			<stop  offset="1" style="stop-color:#000000"/>
			<midPointStop  offset="0" style="stop-color:#FFFFFF"/>
			<midPointStop  offset="0.5" style="stop-color:#FFFFFF"/>
			<midPointStop  offset="1" style="stop-color:#000000"/>
		</linearGradient>
		<path style="fill:url(#XMLID_19_);" d="M0.571,85.739c2.066-1.129,3.468-3.321,3.468-5.842s-1.402-4.713-3.468-5.842V85.739z"/>
		<path style="fill:#FFFFFF;stroke:#BFBFBF;" d="M0.571,63.54c0.563-0.284,1.073-0.659,1.509-1.106"/>
		<path style="fill:#FFFFFF;stroke:#808080;" d="M2.08,62.434c0.429-0.439,0.787-0.948,1.056-1.508"/>
		<path style="fill:#FFFFFF;stroke:#000000;" d="M3.137,60.926c0.355-0.74,0.554-1.568,0.554-2.444c0-0.872-0.197-1.697-0.549-2.433
			"/>
		<path style="fill:#FFFFFF;stroke:#808080;" d="M3.142,56.049c-0.294-0.616-0.697-1.17-1.183-1.639"/>
		<path style="fill:#FFFFFF;stroke:#BFBFBF;" d="M1.959,54.41c-0.409-0.394-0.876-0.727-1.388-0.986"/>
		
			<linearGradient id="XMLID_20_" gradientUnits="userSpaceOnUse" x1="153.8601" y1="5.5422" x2="149.6306" y2="5.5422" gradientTransform="matrix(-0.82 0 0 -0.82 126.7674 42.5435)">
			<stop  offset="0" style="stop-color:#FFFFFF"/>
			<stop  offset="1" style="stop-color:#000000"/>
			<midPointStop  offset="0" style="stop-color:#FFFFFF"/>
			<midPointStop  offset="0.5" style="stop-color:#FFFFFF"/>
			<midPointStop  offset="1" style="stop-color:#000000"/>
		</linearGradient>
		<path style="fill:url(#XMLID_20_);" d="M0.571,43.841c2.066-1.129,3.468-3.322,3.468-5.842s-1.402-4.713-3.468-5.842V43.841z"/>
		<path style="fill:#FFFFFF;stroke:#BFBFBF;" d="M0.571,21.642c0.563-0.284,1.073-0.659,1.509-1.106"/>
		<path style="fill:#FFFFFF;stroke:#808080;" d="M2.08,20.536c0.429-0.439,0.787-0.948,1.056-1.508"/>
		<path style="fill:#FFFFFF;stroke:#000000;" d="M3.137,19.028c0.355-0.74,0.554-1.568,0.554-2.444c0-0.872-0.197-1.696-0.549-2.433
			"/>
		<path style="fill:#FFFFFF;stroke:#808080;" d="M3.142,14.151c-0.294-0.616-0.697-1.17-1.183-1.639"/>
		<path style="fill:#FFFFFF;stroke:#BFBFBF;" d="M1.959,12.512c-0.409-0.394-0.876-0.727-1.388-0.986"/>
		
			<linearGradient id="XMLID_21_" gradientUnits="userSpaceOnUse" x1="153.8601" y1="5.5427" x2="149.6306" y2="5.5427" gradientTransform="matrix(0 -0.82 -0.82 0 126.7007 126.4213)">
			<stop  offset="0" style="stop-color:#FFFFFF"/>
			<stop  offset="1" style="stop-color:#000000"/>
			<midPointStop  offset="0" style="stop-color:#FFFFFF"/>
			<midPointStop  offset="0.5" style="stop-color:#FFFFFF"/>
			<midPointStop  offset="1" style="stop-color:#000000"/>
		</linearGradient>
		<path style="fill:url(#XMLID_21_);" d="M127.998,0.226c-1.129,2.066-3.322,3.468-5.842,3.468c-2.521,0-4.713-1.402-5.842-3.468
			H127.998z"/>
		<path style="fill:#FFFFFF;stroke:#BFBFBF;" d="M105.799,0.226c-0.284,0.563-0.659,1.073-1.106,1.509"/>
		<path style="fill:#FFFFFF;stroke:#808080;" d="M104.693,1.734c-0.439,0.429-0.948,0.787-1.508,1.056"/>
		<path style="fill:#FFFFFF;stroke:#000000;" d="M103.185,2.791c-0.739,0.355-1.568,0.554-2.444,0.554
			c-0.872,0-1.696-0.197-2.433-0.549"/>
		<path style="fill:#FFFFFF;stroke:#808080;" d="M98.308,2.796c-0.616-0.294-1.17-0.697-1.639-1.183"/>
		<path style="fill:#FFFFFF;stroke:#BFBFBF;" d="M96.669,1.613c-0.394-0.408-0.728-0.876-0.986-1.388"/>
		
			<linearGradient id="XMLID_22_" gradientUnits="userSpaceOnUse" x1="153.8601" y1="5.5425" x2="149.6306" y2="5.5425" gradientTransform="matrix(0 -0.82 -0.82 0 84.8022 126.4213)">
			<stop  offset="0" style="stop-color:#FFFFFF"/>
			<stop  offset="1" style="stop-color:#000000"/>
			<midPointStop  offset="0" style="stop-color:#FFFFFF"/>
			<midPointStop  offset="0.5" style="stop-color:#FFFFFF"/>
			<midPointStop  offset="1" style="stop-color:#000000"/>
		</linearGradient>
		<path style="fill:url(#XMLID_22_);" d="M86.099,0.226c-1.129,2.066-3.321,3.468-5.842,3.468s-4.713-1.402-5.842-3.468H86.099z"/>
		<path style="fill:#FFFFFF;stroke:#BFBFBF;" d="M63.901,0.226c-0.285,0.563-0.66,1.073-1.106,1.509"/>
		<path style="fill:#FFFFFF;stroke:#808080;" d="M62.795,1.734c-0.439,0.429-0.948,0.787-1.508,1.056"/>
		<path style="fill:#FFFFFF;stroke:#000000;" d="M61.287,2.791c-0.74,0.355-1.568,0.554-2.444,0.554
			c-0.871,0-1.696-0.197-2.433-0.549"/>
		<path style="fill:#FFFFFF;stroke:#808080;" d="M56.41,2.796c-0.616-0.294-1.17-0.697-1.639-1.183"/>
		<path style="fill:#FFFFFF;stroke:#BFBFBF;" d="M54.771,1.613c-0.394-0.408-0.727-0.876-0.986-1.388"/>
		
			<linearGradient id="XMLID_23_" gradientUnits="userSpaceOnUse" x1="153.8601" y1="5.542" x2="149.6306" y2="5.542" gradientTransform="matrix(0 -0.82 -0.82 0 42.9038 126.4213)">
			<stop  offset="0" style="stop-color:#FFFFFF"/>
			<stop  offset="1" style="stop-color:#000000"/>
			<midPointStop  offset="0" style="stop-color:#FFFFFF"/>
			<midPointStop  offset="0.5" style="stop-color:#FFFFFF"/>
			<midPointStop  offset="1" style="stop-color:#000000"/>
		</linearGradient>
		<path style="fill:url(#XMLID_23_);" d="M44.201,0.226c-1.129,2.066-3.321,3.468-5.842,3.468s-4.713-1.402-5.842-3.468H44.201z"/>
		<path style="fill:#FFFFFF;stroke:#BFBFBF;" d="M22.002,0.226c-0.284,0.563-0.659,1.073-1.106,1.509"/>
		<path style="fill:#FFFFFF;stroke:#808080;" d="M20.896,1.734c-0.439,0.429-0.948,0.787-1.508,1.056"/>
		<path style="fill:#FFFFFF;stroke:#000000;" d="M19.388,2.791c-0.739,0.355-1.568,0.554-2.444,0.554
			c-0.872,0-1.696-0.197-2.433-0.549"/>
		<path style="fill:#FFFFFF;stroke:#808080;" d="M14.511,2.796c-0.616-0.294-1.17-0.697-1.639-1.183"/>
		<path style="fill:#FFFFFF;stroke:#BFBFBF;" d="M12.873,1.613c-0.394-0.408-0.728-0.876-0.986-1.388"/>
		
			<linearGradient id="XMLID_24_" gradientUnits="userSpaceOnUse" x1="153.8601" y1="5.5425" x2="149.6311" y2="5.5425" gradientTransform="matrix(0 0.82 0.82 0 12.8254 12.3978)">
			<stop  offset="0" style="stop-color:#FFFFFF"/>
			<stop  offset="1" style="stop-color:#000000"/>
			<midPointStop  offset="0" style="stop-color:#FFFFFF"/>
			<midPointStop  offset="0.5" style="stop-color:#FFFFFF"/>
			<midPointStop  offset="1" style="stop-color:#000000"/>
		</linearGradient>
		<path style="fill:url(#XMLID_24_);" d="M11.528,138.594c1.129-2.066,3.322-3.468,5.842-3.468c2.52,0,4.713,1.402,5.842,3.468
			H11.528z"/>
		<path style="fill:#FFFFFF;stroke:#BFBFBF;" d="M33.727,138.594c0.284-0.563,0.659-1.072,1.106-1.509"/>
		<path style="fill:#FFFFFF;stroke:#808080;" d="M34.833,137.085c0.439-0.429,0.948-0.787,1.508-1.056"/>
		<path style="fill:#FFFFFF;stroke:#000000;" d="M36.341,136.029c0.74-0.355,1.568-0.555,2.444-0.555
			c0.872,0,1.696,0.197,2.433,0.549"/>
		<path style="fill:#FFFFFF;stroke:#808080;" d="M41.218,136.024c0.616,0.294,1.17,0.697,1.639,1.183"/>
		<path style="fill:#FFFFFF;stroke:#BFBFBF;" d="M42.857,137.206c0.394,0.409,0.727,0.876,0.985,1.388"/>
		
			<linearGradient id="XMLID_25_" gradientUnits="userSpaceOnUse" x1="153.8601" y1="5.543" x2="149.6311" y2="5.543" gradientTransform="matrix(0 0.82 0.82 0 54.7236 12.3978)">
			<stop  offset="0" style="stop-color:#FFFFFF"/>
			<stop  offset="1" style="stop-color:#000000"/>
			<midPointStop  offset="0" style="stop-color:#FFFFFF"/>
			<midPointStop  offset="0.5" style="stop-color:#FFFFFF"/>
			<midPointStop  offset="1" style="stop-color:#000000"/>
		</linearGradient>
		<path style="fill:url(#XMLID_25_);" d="M53.427,138.594c1.129-2.066,3.321-3.468,5.842-3.468s4.713,1.402,5.842,3.468H53.427z"/>
		<path style="fill:#FFFFFF;stroke:#BFBFBF;" d="M75.626,138.594c0.284-0.563,0.659-1.072,1.106-1.509"/>
		<path style="fill:#FFFFFF;stroke:#808080;" d="M76.732,137.085c0.439-0.429,0.948-0.787,1.507-1.056"/>
		<path style="fill:#FFFFFF;stroke:#000000;" d="M78.239,136.029c0.74-0.355,1.568-0.555,2.444-0.555
			c0.872,0,1.696,0.197,2.433,0.549"/>
		<path style="fill:#FFFFFF;stroke:#808080;" d="M83.116,136.024c0.616,0.294,1.17,0.697,1.639,1.183"/>
		<path style="fill:#FFFFFF;stroke:#BFBFBF;" d="M84.755,137.206c0.394,0.409,0.727,0.876,0.986,1.388"/>
		
			<linearGradient id="XMLID_26_" gradientUnits="userSpaceOnUse" x1="153.8601" y1="5.5425" x2="149.6311" y2="5.5425" gradientTransform="matrix(0 0.82 0.82 0 96.6216 12.3978)">
			<stop  offset="0" style="stop-color:#FFFFFF"/>
			<stop  offset="1" style="stop-color:#000000"/>
			<midPointStop  offset="0" style="stop-color:#FFFFFF"/>
			<midPointStop  offset="0.5" style="stop-color:#FFFFFF"/>
			<midPointStop  offset="1" style="stop-color:#000000"/>
		</linearGradient>
		<path style="fill:url(#XMLID_26_);" d="M95.324,138.594c1.129-2.066,3.322-3.468,5.842-3.468c2.52,0,4.713,1.402,5.842,3.468
			H95.324z"/>
		<path style="fill:#FFFFFF;stroke:#BFBFBF;" d="M117.524,138.594c0.284-0.563,0.659-1.072,1.106-1.509"/>
		<path style="fill:#FFFFFF;stroke:#808080;" d="M118.63,137.085c0.439-0.429,0.948-0.787,1.508-1.056"/>
		<path style="fill:#FFFFFF;stroke:#000000;" d="M120.137,136.029c0.739-0.355,1.568-0.555,2.444-0.555
			c0.872,0,1.696,0.197,2.433,0.549"/>
		<path style="fill:#FFFFFF;stroke:#808080;" d="M125.014,136.024c0.616,0.294,1.17,0.697,1.639,1.183"/>
		<path style="fill:#FFFFFF;stroke:#BFBFBF;" d="M126.653,137.206c0.394,0.409,0.728,0.876,0.986,1.388"/>
		<path style="fill:#FFFFFF;stroke:#BFBFBF;" d="M141.911,3.342c-0.802-0.026-1.561-0.22-2.245-0.546"/>
		<path style="fill:#FFFFFF;stroke:#808080;" d="M139.666,2.796c-0.616-0.294-1.17-0.697-1.639-1.183"/>
		<path style="fill:#FFFFFF;stroke:#BFBFBF;" d="M138.028,1.613c-0.394-0.408-0.728-0.876-0.986-1.388"/>
		<path style="fill:#FFFFFF;stroke:#BFBFBF;" d="M0.172,134.101c0.802,0.026,1.561,0.219,2.244,0.546"/>
		<path style="fill:#FFFFFF;stroke:#808080;" d="M2.417,134.647c0.616,0.294,1.17,0.697,1.639,1.183"/>
		<path style="fill:#FFFFFF;stroke:#BFBFBF;" d="M4.055,135.83c0.394,0.409,0.727,0.876,0.986,1.388"/>
		
			<linearGradient id="XMLID_27_" gradientUnits="userSpaceOnUse" x1="-12.572" y1="-12.4688" x2="-18.6345" y2="-17.9063" gradientTransform="matrix(0.82 0 0 0.82 12.7438 12.4648)">
			<stop  offset="0" style="stop-color:#FFFFFF"/>
			<stop  offset="1" style="stop-color:#000000"/>
			<midPointStop  offset="0" style="stop-color:#FFFFFF"/>
			<midPointStop  offset="0.5" style="stop-color:#FFFFFF"/>
			<midPointStop  offset="1" style="stop-color:#000000"/>
		</linearGradient>
		<path style="fill:url(#XMLID_27_);" d="M0,0.226v3.179c1.685-0.509,3.09-1.662,3.919-3.179H0z"/>
		
			<linearGradient id="XMLID_28_" gradientUnits="userSpaceOnUse" x1="-12.5715" y1="-12.4695" x2="-18.634" y2="-17.907" gradientTransform="matrix(-0.82 0 0 -0.82 126.5277 126.4492)">
			<stop  offset="0" style="stop-color:#FFFFFF"/>
			<stop  offset="1" style="stop-color:#000000"/>
			<midPointStop  offset="0" style="stop-color:#FFFFFF"/>
			<midPointStop  offset="0.5" style="stop-color:#FFFFFF"/>
			<midPointStop  offset="1" style="stop-color:#000000"/>
		</linearGradient>
		<path style="fill:url(#XMLID_28_);" d="M139.271,138.689v-3.179c-1.685,0.509-3.09,1.662-3.919,3.179H139.271z"/>
	</g>
</svg>
