<?xml version="1.0" encoding="iso-8859-1"?>
<!-- Generator: Adobe Illustrator 11 Build 196, SVG Export Plug-In . SVG Version: 6.0.0 Build 78)  -->
<!DOCTYPE svg PUBLIC "-//W3C//DTD SVG 1.0//EN"    "http://www.w3.org/TR/2001/REC-SVG-20010904/DTD/svg10.dtd" [
	<!ENTITY ns_flows "http://ns.adobe.com/Flows/1.0/">
	<!ENTITY ns_svg "http://www.w3.org/2000/svg">
	<!ENTITY ns_xlink "http://www.w3.org/1999/xlink">
]>
<svg  
	 width="91.78" height="78.752" viewBox="0 0 91.78 78.752" style="overflow:visible;enable-background:new 0 0 91.78 78.752"
	 xml:space="preserve">
	<style type="text/css">
	
	</style>
	<g id="Layer_1">
		<circle style="fill:none;stroke:#000000;" cx="22.757" cy="22.614" r="8.984"/> 
		<path style="fill:none;stroke:#000000;" d="M17.825,30.17c5.198,0,9.817-12.705,4.62-12.705c-5.198,0,0.578,12.705,5.197,12.705"
			/>
		<line style="fill:none;stroke:#000000;" x1="27.45" y1="30.17" x2="44.39" y2="30.17"/>
		<line style="fill:none;stroke:#000000;" x1="1.173" y1="30.17" x2="18.114" y2="30.17"/>
		<line style="fill:none;stroke:#000000;" x1="37.46" y1="62.582" x2="37.46" y2="70.09"/>
		<line style="fill:none;stroke:#000000;" x1="40.347" y1="53.92" x2="40.347" y2="78.752"/>
		<circle style="fill:none;stroke:#000000;" cx="64.193" cy="22.614" r="8.984"/> 
		<path style="fill:none;stroke:#000000;" d="M59.26,30.17c5.198,0,9.818-12.705,4.62-12.705c-5.197,0,0.578,12.705,5.198,12.705"/>
		<line style="fill:none;stroke:#000000;" x1="68.885" y1="30.17" x2="79.613" y2="30.17"/>
		<line style="fill:none;stroke:#000000;" x1="81.196" y1="30.17" x2="85.826" y2="30.17"/>
		<line style="fill:none;stroke:#000000;" x1="42.609" y1="30.17" x2="45.196" y2="30.17"/>
		<line style="fill:none;stroke:#000000;" x1="47.196" y1="30.17" x2="59.549" y2="30.17"/>
		<line style="fill:none;stroke:#000000;" x1="0.5" y1="29.954" x2="0.5" y2="66.144"/>
		<line style="fill:none;stroke:#000000;" x1="85.97" y1="29.954" x2="85.97" y2="66.144"/>
		<line style="fill:none;stroke:#000000;" x1="0.5" y1="66.528" x2="37.46" y2="66.528"/>
		<line style="fill:none;stroke:#000000;" x1="85.97" y1="66.528" x2="40.155" y2="66.528"/>
		<line style="fill:none;" x1="91.78" y1="31.938" x2="91.78" y2="55.938"/>
		<g>
			<polyline style="fill:none;stroke:#000000;stroke-width:0.5;" points="79.335,28.008 78.685,28.864 79.632,28.963 "/>
			<polyline style="fill:none;stroke:#000000;stroke-width:0.5;" points="79.672,29.09 79.021,29.947 79.968,30.045 "/>
			<polyline style="fill:none;stroke:#000000;stroke-width:0.5;" points="77.318,21.511 76.668,22.367 77.615,22.466 "/>
			<polyline style="fill:none;stroke:#000000;stroke-width:0.5;" points="77.654,22.594 77.004,23.45 77.951,23.548 "/>
			<polyline style="fill:none;stroke:#000000;stroke-width:0.5;" points="77.991,23.676 77.34,24.533 78.287,24.631 "/>
			<polyline style="fill:none;stroke:#000000;stroke-width:0.5;" points="78.327,24.759 77.677,25.616 78.624,25.714 "/>
			<polyline style="fill:none;stroke:#000000;stroke-width:0.5;" points="78.663,25.842 78.013,26.698 78.959,26.797 "/>
			<polyline style="fill:none;stroke:#000000;stroke-width:0.5;" points="79,26.925 78.349,27.781 79.296,27.88 "/>
			<polyline style="fill:none;stroke:#000000;stroke-width:0.5;" points="80.008,30.173 79.358,31.03 80.305,31.128 "/>
			<line style="fill:none;stroke:#000000;stroke-width:0.5;" x1="80.305" y1="31.128" x2="81.329" y2="30.213"/>
			<path style="fill:none;stroke:#000000;stroke-width:0.5;" d="M81.329,30.213c0,0-1.337-5.875-2.772-9.349
				c-0.264-0.638-0.968-1.008-0.968-1.008"/>
			<polyline style="fill:none;stroke:#000000;stroke-width:0.5;" points="77.567,19.994 76.584,16.83 75.63,17.127 "/>
			<path style="fill:none;stroke:#000000;stroke-width:0.5;" d="M79.629,31.273l-1.363-0.175c0,0-2.226-5.599-3.011-9.274
				c-0.144-0.675,0.227-1.379,0.227-1.379"/>
			<polyline style="fill:none;stroke:#000000;stroke-width:0.5;" points="75.597,20.605 74.614,17.442 75.569,17.146 "/>
		</g>
		<g>
			<polyline style="fill:none;stroke:#000000;stroke-width:0.5;" points="45.331,28.582 44.681,29.438 45.627,29.537 "/>
			<polyline style="fill:none;stroke:#000000;stroke-width:0.5;" points="45.667,29.665 45.017,30.521 45.964,30.62 "/>
			<polyline style="fill:none;stroke:#000000;stroke-width:0.5;" points="43.314,22.085 42.664,22.941 43.61,23.04 "/>
			<polyline style="fill:none;stroke:#000000;stroke-width:0.5;" points="43.65,23.167 43,24.024 43.947,24.123 "/>
			<polyline style="fill:none;stroke:#000000;stroke-width:0.5;" points="43.986,24.25 43.336,25.107 44.283,25.206 "/>
			<polyline style="fill:none;stroke:#000000;stroke-width:0.5;" points="44.322,25.333 43.672,26.189 44.619,26.288 "/>
			<polyline style="fill:none;stroke:#000000;stroke-width:0.5;" points="44.659,26.416 44.008,27.272 44.955,27.371 "/>
			<polyline style="fill:none;stroke:#000000;stroke-width:0.5;" points="44.995,27.499 44.345,28.355 45.292,28.454 "/>
			<polyline style="fill:none;stroke:#000000;stroke-width:0.5;" points="46.003,30.747 45.353,31.604 46.3,31.702 "/>
			<line style="fill:none;stroke:#000000;stroke-width:0.5;" x1="46.3" y1="31.702" x2="47.325" y2="30.787"/>
			<path style="fill:none;stroke:#000000;stroke-width:0.5;" d="M47.325,30.787c0,0-1.337-5.875-2.772-9.348
				c-0.264-0.638-0.968-1.009-0.968-1.009"/>
			<polyline style="fill:none;stroke:#000000;stroke-width:0.5;" points="43.562,20.568 42.58,17.404 41.625,17.701 "/>
			<path style="fill:none;stroke:#000000;stroke-width:0.5;" d="M45.625,31.847l-1.363-0.174c0,0-2.226-5.599-3.011-9.274
				c-0.144-0.675,0.227-1.379,0.227-1.379"/>
			<polyline style="fill:none;stroke:#000000;stroke-width:0.5;" points="41.592,21.18 40.61,18.016 41.565,17.72 "/>
		</g>
		<path style="fill:#B4B4B4;" d="M42.264,17.368c-0.25-0.867-0.789-1.664-0.664-2.57c0.414-3.047,1.062-6.18,3.312-8.406
			c2.719-2.703,6.531-3.078,10.18-3.641c2.875-0.438,5.633-0.969,8.516-0.648c0.07,0.008,0.086,0.266,0.188,0.367
			c0.266,0.273,0.453,0.562,0.648,0.883c0.438,0.695,0.664,1.453,1.305,2c2.172,1.844,4.703,2.875,6.469,5.25
			c1.211,1.617,1.484,3.414,1.906,5.328c0.109,0.523,0.43,0.914,0.711,1.336c0.328,0.445,0.953,0.539,1.398,0.211
			s0.539-0.953,0.211-1.398c-0.18-0.266-0.375-0.531-0.43-0.852c-0.461-3.07-1.641-5.852-4.102-7.852
			c-1.523-1.25-3.109-2.219-4.664-3.328c-0.984-1.273-1.469-2.906-2.945-3.797c-0.562-0.328-1.203-0.242-1.812-0.234
			c-2.602,0.016-5.125,0.336-7.75,0.758c-4.102,0.648-8.367,1.18-11.344,4.297c-2.578,2.703-3.531,6.438-3.789,10.039
			c-0.062,0.93,0.391,1.773,0.688,2.648c0.109,0.539,0.641,0.891,1.18,0.789C42.014,18.438,42.366,17.907,42.264,17.368
			L42.264,17.368z"/>
		<g>
			<text transform="matrix(1 0 0 1 28.7798 51.938)"><tspan x="0" y="0" style="font-family:Bitstream Vera Sans; font-size:10.200000;">2.4 V</tspan></text>
		</g>
	</g>
</svg>
