<?xml version="1.0" encoding="iso-8859-1"?>
<!DOCTYPE svg PUBLIC "-//W3C//DTD SVG 1.0//EN"    "http://www.w3.org/TR/2001/REC-SVG-20010904/DTD/svg10.dtd" [
	<!ENTITY ns_svg "http://www.w3.org/2000/svg">
	<!ENTITY ns_xlink "http://www.w3.org/1999/xlink">
]>
<svg
	 width="374.549" height="184.315" viewBox="0 0 374.549 184.315"
	 style="overflow:visible;enable-background:new 0 0 374.549 184.315" xml:space="preserve">
	<style type="text/css">
	
	</style>
	<g id="Layer_1">
		<g>
			<rect x="18.949" width="147.5" height="52"/> 
			<rect x="34.961" y="7.25" style="fill:#FFFFFF;" width="2.475" height="37.5"/> 
			<rect x="51.969" y="7.25" style="fill:#FFFFFF;" width="2.475" height="37.5"/> 
			<rect x="68.977" y="7.25" style="fill:#FFFFFF;" width="2.475" height="37.5"/> 
			<rect x="85.985" y="7.25" style="fill:#FFFFFF;" width="2.475" height="37.5"/> 
			<rect x="102.992" y="7.25" style="fill:#FFFFFF;" width="2.475" height="37.5"/> 
			<rect x="120" y="7.25" style="fill:#FFFFFF;" width="2.475" height="37.5"/> 
			<rect x="137.008" y="7.25" style="fill:#FFFFFF;" width="2.475" height="37.5"/> 
			<rect x="154.016" y="7.25" style="fill:#FFFFFF;" width="2.475" height="37.5"/> 
		</g>
		<g>
			<rect x="18.949" y="66.158" width="147.5" height="52"/> 
			<rect x="61.516" y="73.408" style="fill:#FFFFFF;" width="2.475" height="37.5"/> 
			<rect x="78.523" y="73.408" style="fill:#FFFFFF;" width="2.475" height="37.5"/> 
			<rect x="95.531" y="73.408" style="fill:#FFFFFF;" width="2.475" height="37.5"/> 
		</g>
		<g>
			
				<linearGradient id="XMLID_46_" gradientUnits="userSpaceOnUse" x1="77.165" y1="-133.1851" x2="96.6641" y2="-133.1851" gradientTransform="matrix(0.6 0 0 2 225.5738 424.9351)">
				<stop  offset="0" style="stop-color:#000000"/>
				<stop  offset="0.1036" style="stop-color:#2A2A2A"/>
				<stop  offset="0.1699" style="stop-color:#3D3D3D"/>
				<stop  offset="0.2257" style="stop-color:#51514F"/>
				<stop  offset="0.2757" style="stop-color:#6D6B6B"/>
				<stop  offset="0.3219" style="stop-color:#898685"/>
				<stop  offset="0.3652" style="stop-color:#A59F9E"/>
				<stop  offset="0.4063" style="stop-color:#C0B8B7"/>
				<stop  offset="0.4456" style="stop-color:#DDD0CE"/>
				<stop  offset="0.4823" style="stop-color:#F7E6E4"/>
				<stop  offset="0.49" style="stop-color:#FDEBE9"/>
				<stop  offset="0.501" style="stop-color:#F5E3E1"/>
				<stop  offset="0.537" style="stop-color:#DACAC8"/>
				<stop  offset="0.5758" style="stop-color:#BEB0AE"/>
				<stop  offset="0.6166" style="stop-color:#A29695"/>
				<stop  offset="0.6599" style="stop-color:#877D7C"/>
				<stop  offset="0.7063" style="stop-color:#6C6362"/>
				<stop  offset="0.7572" style="stop-color:#4F4A49"/>
				<stop  offset="0.8146" style="stop-color:#342F2F"/>
				<stop  offset="0.8842" style="stop-color:#1B1616"/>
				<stop  offset="1" style="stop-color:#000000"/>
				<midPointStop  offset="0" style="stop-color:#000000"/>
				<midPointStop  offset="0.79" style="stop-color:#000000"/>
				<midPointStop  offset="0.49" style="stop-color:#FDEBE9"/>
				<midPointStop  offset="0.2" style="stop-color:#FDEBE9"/>
				<midPointStop  offset="1" style="stop-color:#000000"/>
			</linearGradient>
			<rect x="271.899" y="148.065" style="fill:url(#XMLID_46_);" width="11.7" height="21"/> 
			
				<linearGradient id="XMLID_47_" gradientUnits="userSpaceOnUse" x1="153.665" y1="-180.9351" x2="173.665" y2="-180.9351" gradientTransform="matrix(0.6 0 0 2 190.9234 520.4351)">
				<stop  offset="0" style="stop-color:#000000"/>
				<stop  offset="0.0869" style="stop-color:#1B1B1B"/>
				<stop  offset="0.153" style="stop-color:#393434"/>
				<stop  offset="0.2122" style="stop-color:#554F4E"/>
				<stop  offset="0.2675" style="stop-color:#736B69"/>
				<stop  offset="0.32" style="stop-color:#908584"/>
				<stop  offset="0.3703" style="stop-color:#ADA19F"/>
				<stop  offset="0.4191" style="stop-color:#CBBCBA"/>
				<stop  offset="0.4653" style="stop-color:#E7D6D4"/>
				<stop  offset="0.49" style="stop-color:#F7E5E2"/>
				<stop  offset="0.5205" style="stop-color:#E4D3D1"/>
				<stop  offset="0.566" style="stop-color:#C7B8B7"/>
				<stop  offset="0.6143" style="stop-color:#AA9E9C"/>
				<stop  offset="0.6645" style="stop-color:#8D8382"/>
				<stop  offset="0.7172" style="stop-color:#706867"/>
				<stop  offset="0.7732" style="stop-color:#544E4E"/>
				<stop  offset="0.8342" style="stop-color:#373232"/>
				<stop  offset="0.9035" style="stop-color:#1B1616"/>
				<stop  offset="1" style="stop-color:#000000"/>
				<midPointStop  offset="0" style="stop-color:#000000"/>
				<midPointStop  offset="0.76" style="stop-color:#000000"/>
				<midPointStop  offset="0.49" style="stop-color:#F7E5E2"/>
				<midPointStop  offset="0.23" style="stop-color:#F7E5E2"/>
				<midPointStop  offset="1" style="stop-color:#000000"/>
			</linearGradient>
			<rect x="283.299" y="148.065" style="fill:url(#XMLID_47_);" width="11.7" height="21"/> 
			
				<linearGradient id="XMLID_48_" gradientUnits="userSpaceOnUse" x1="77.165" y1="-133.1851" x2="96.665" y2="-133.1851" gradientTransform="matrix(0.6 0 0 2 248.3741 424.9351)">
				<stop  offset="0" style="stop-color:#000000"/>
				<stop  offset="0.1005" style="stop-color:#2A2A2A"/>
				<stop  offset="0.1688" style="stop-color:#3F3F3F"/>
				<stop  offset="0.2275" style="stop-color:#525151"/>
				<stop  offset="0.2808" style="stop-color:#6F6D6D"/>
				<stop  offset="0.3305" style="stop-color:#8B8787"/>
				<stop  offset="0.3774" style="stop-color:#A7A2A1"/>
				<stop  offset="0.4222" style="stop-color:#C3BAB8"/>
				<stop  offset="0.4643" style="stop-color:#DFD1CE"/>
				<stop  offset="0.49" style="stop-color:#F1DFDD"/>
				<stop  offset="0.5156" style="stop-color:#E0D0CD"/>
				<stop  offset="0.5595" style="stop-color:#C4B6B4"/>
				<stop  offset="0.6063" style="stop-color:#A89B99"/>
				<stop  offset="0.6553" style="stop-color:#8B817F"/>
				<stop  offset="0.707" style="stop-color:#6F6766"/>
				<stop  offset="0.7626" style="stop-color:#524C4C"/>
				<stop  offset="0.8239" style="stop-color:#373232"/>
				<stop  offset="0.8951" style="stop-color:#1B1616"/>
				<stop  offset="1" style="stop-color:#000000"/>
				<midPointStop  offset="0" style="stop-color:#000000"/>
				<midPointStop  offset="0.78" style="stop-color:#000000"/>
				<midPointStop  offset="0.49" style="stop-color:#F1DFDD"/>
				<midPointStop  offset="0.22" style="stop-color:#F1DFDD"/>
				<midPointStop  offset="1" style="stop-color:#000000"/>
			</linearGradient>
			<rect x="294.699" y="148.065" style="fill:url(#XMLID_48_);" width="11.7" height="21"/> 
			
				<linearGradient id="XMLID_49_" gradientUnits="userSpaceOnUse" x1="77.165" y1="-133.1851" x2="96.6655" y2="-133.1851" gradientTransform="matrix(0.6 0 0 2 259.774 424.9351)">
				<stop  offset="0" style="stop-color:#000000"/>
				<stop  offset="0.0899" style="stop-color:#1B1B1B"/>
				<stop  offset="0.1583" style="stop-color:#393434"/>
				<stop  offset="0.2197" style="stop-color:#554F4E"/>
				<stop  offset="0.2769" style="stop-color:#736B69"/>
				<stop  offset="0.3312" style="stop-color:#908584"/>
				<stop  offset="0.3833" style="stop-color:#ADA19F"/>
				<stop  offset="0.4338" style="stop-color:#CBBCBA"/>
				<stop  offset="0.4817" style="stop-color:#E7D6D4"/>
				<stop  offset="0.49" style="stop-color:#ECDBD9"/>
				<stop  offset="0.4987" style="stop-color:#E7D6D4"/>
				<stop  offset="0.5485" style="stop-color:#CBBCBA"/>
				<stop  offset="0.601" style="stop-color:#ADA19F"/>
				<stop  offset="0.6553" style="stop-color:#908584"/>
				<stop  offset="0.7118" style="stop-color:#736B69"/>
				<stop  offset="0.7714" style="stop-color:#554F4E"/>
				<stop  offset="0.8352" style="stop-color:#393434"/>
				<stop  offset="0.9064" style="stop-color:#1B1B1B"/>
				<stop  offset="1" style="stop-color:#000000"/>
				<midPointStop  offset="0" style="stop-color:#000000"/>
				<midPointStop  offset="0.76" style="stop-color:#000000"/>
				<midPointStop  offset="0.49" style="stop-color:#ECDBD9"/>
				<midPointStop  offset="0.24" style="stop-color:#ECDBD9"/>
				<midPointStop  offset="1" style="stop-color:#000000"/>
			</linearGradient>
			<rect x="306.099" y="148.065" style="fill:url(#XMLID_49_);" width="11.7" height="21"/> 
			
				<linearGradient id="XMLID_50_" gradientUnits="userSpaceOnUse" x1="77.165" y1="-133.1851" x2="96.6655" y2="-133.1851" gradientTransform="matrix(0.6 0 0 2 282.2745 424.9351)">
				<stop  offset="0" style="stop-color:#000000"/>
				<stop  offset="0.0946" style="stop-color:#2A2A2A"/>
				<stop  offset="0.1665" style="stop-color:#414141"/>
				<stop  offset="0.231" style="stop-color:#555454"/>
				<stop  offset="0.2911" style="stop-color:#737070"/>
				<stop  offset="0.3482" style="stop-color:#908C8B"/>
				<stop  offset="0.403" style="stop-color:#ACA5A3"/>
				<stop  offset="0.455" style="stop-color:#C9BDBB"/>
				<stop  offset="0.49" style="stop-color:#DDCDCB"/>
				<stop  offset="0.5246" style="stop-color:#CABBBA"/>
				<stop  offset="0.579" style="stop-color:#ADA19F"/>
				<stop  offset="0.6363" style="stop-color:#908584"/>
				<stop  offset="0.6959" style="stop-color:#736B69"/>
				<stop  offset="0.7587" style="stop-color:#554F4E"/>
				<stop  offset="0.826" style="stop-color:#393434"/>
				<stop  offset="0.9012" style="stop-color:#1B1B1B"/>
				<stop  offset="1" style="stop-color:#000000"/>
				<midPointStop  offset="0" style="stop-color:#000000"/>
				<midPointStop  offset="0.76" style="stop-color:#000000"/>
				<midPointStop  offset="0.49" style="stop-color:#DDCDCB"/>
				<midPointStop  offset="0.24" style="stop-color:#DDCDCB"/>
				<midPointStop  offset="1" style="stop-color:#000000"/>
			</linearGradient>
			<rect x="328.599" y="148.065" style="fill:url(#XMLID_50_);" width="11.7" height="21"/> 
			
				<linearGradient id="XMLID_51_" gradientUnits="userSpaceOnUse" x1="77.165" y1="-133.1851" x2="96.666" y2="-133.1851" gradientTransform="matrix(0.6 0 0 2 270.8743 424.9351)">
				<stop  offset="0" style="stop-color:#000000"/>
				<stop  offset="0.1034" style="stop-color:#1B1616"/>
				<stop  offset="0.1737" style="stop-color:#373232"/>
				<stop  offset="0.2341" style="stop-color:#524C4C"/>
				<stop  offset="0.2889" style="stop-color:#6F6766"/>
				<stop  offset="0.34" style="stop-color:#8B817F"/>
				<stop  offset="0.3883" style="stop-color:#A89B99"/>
				<stop  offset="0.4344" style="stop-color:#C4B6B3"/>
				<stop  offset="0.4777" style="stop-color:#E0CFCD"/>
				<stop  offset="0.49" style="stop-color:#E8D7D5"/>
				<stop  offset="0.5028" style="stop-color:#E0CFCD"/>
				<stop  offset="0.5479" style="stop-color:#C4B6B3"/>
				<stop  offset="0.5959" style="stop-color:#A89B99"/>
				<stop  offset="0.6461" style="stop-color:#8B817F"/>
				<stop  offset="0.6993" style="stop-color:#6F6766"/>
				<stop  offset="0.7564" style="stop-color:#524C4C"/>
				<stop  offset="0.8192" style="stop-color:#373232"/>
				<stop  offset="0.8923" style="stop-color:#1B1616"/>
				<stop  offset="1" style="stop-color:#000000"/>
				<midPointStop  offset="0" style="stop-color:#000000"/>
				<midPointStop  offset="0.78" style="stop-color:#000000"/>
				<midPointStop  offset="0.49" style="stop-color:#E8D7D5"/>
				<midPointStop  offset="0.22" style="stop-color:#E8D7D5"/>
				<midPointStop  offset="1" style="stop-color:#000000"/>
			</linearGradient>
			<rect x="317.199" y="148.065" style="fill:url(#XMLID_51_);" width="11.7" height="21"/> 
			
				<linearGradient id="XMLID_52_" gradientUnits="userSpaceOnUse" x1="77.165" y1="-133.1851" x2="96.666" y2="-133.1851" gradientTransform="matrix(0.6 0 0 2 293.6744 424.9351)">
				<stop  offset="0" style="stop-color:#000000"/>
				<stop  offset="0.1139" style="stop-color:#1B1616"/>
				<stop  offset="0.1912" style="stop-color:#373232"/>
				<stop  offset="0.2577" style="stop-color:#524C4C"/>
				<stop  offset="0.3181" style="stop-color:#6F6766"/>
				<stop  offset="0.3743" style="stop-color:#8B817F"/>
				<stop  offset="0.4275" style="stop-color:#A89B99"/>
				<stop  offset="0.4773" style="stop-color:#C4B5B3"/>
				<stop  offset="0.49" style="stop-color:#CBBCBA"/>
				<stop  offset="0.5033" style="stop-color:#C4B5B3"/>
				<stop  offset="0.5551" style="stop-color:#A89B99"/>
				<stop  offset="0.6104" style="stop-color:#8B817F"/>
				<stop  offset="0.6689" style="stop-color:#6F6766"/>
				<stop  offset="0.7317" style="stop-color:#524C4C"/>
				<stop  offset="0.801" style="stop-color:#373232"/>
				<stop  offset="0.8814" style="stop-color:#1B1616"/>
				<stop  offset="1" style="stop-color:#000000"/>
				<midPointStop  offset="0" style="stop-color:#000000"/>
				<midPointStop  offset="0.78" style="stop-color:#000000"/>
				<midPointStop  offset="0.49" style="stop-color:#CBBCBA"/>
				<midPointStop  offset="0.22" style="stop-color:#CBBCBA"/>
				<midPointStop  offset="1" style="stop-color:#000000"/>
			</linearGradient>
			<rect x="340" y="148.065" style="fill:url(#XMLID_52_);" width="11.7" height="21"/> 
			
				<linearGradient id="XMLID_53_" gradientUnits="userSpaceOnUse" x1="267.415" y1="-180.9351" x2="286.9155" y2="-180.9351" gradientTransform="matrix(0.6 0 0 2 190.9234 520.4351)">
				<stop  offset="0" style="stop-color:#000000"/>
				<stop  offset="0.1349" style="stop-color:#1B1616"/>
				<stop  offset="0.2265" style="stop-color:#373232"/>
				<stop  offset="0.3053" style="stop-color:#524C4C"/>
				<stop  offset="0.3767" style="stop-color:#6F6766"/>
				<stop  offset="0.4426" style="stop-color:#8B817F"/>
				<stop  offset="0.49" style="stop-color:#A09493"/>
				<stop  offset="0.5319" style="stop-color:#8F8583"/>
				<stop  offset="0.608" style="stop-color:#736B69"/>
				<stop  offset="0.6889" style="stop-color:#554F4E"/>
				<stop  offset="0.7757" style="stop-color:#393434"/>
				<stop  offset="0.8726" style="stop-color:#1B1B1B"/>
				<stop  offset="1" style="stop-color:#000000"/>
				<midPointStop  offset="0" style="stop-color:#000000"/>
				<midPointStop  offset="0.78" style="stop-color:#000000"/>
				<midPointStop  offset="0.49" style="stop-color:#A09493"/>
				<midPointStop  offset="0.24" style="stop-color:#A09493"/>
				<midPointStop  offset="1" style="stop-color:#000000"/>
			</linearGradient>
			<rect x="351.399" y="148.065" style="fill:url(#XMLID_53_);" width="11.7" height="21"/> 
			<rect x="362.8" y="148.065" width="11.7" height="21"/> 
			
				<linearGradient id="XMLID_54_" gradientUnits="userSpaceOnUse" x1="153.665" y1="-180.9351" x2="173.665" y2="-180.9351" gradientTransform="matrix(-0.6 0 0 2 364.2988 520.4351)">
				<stop  offset="0" style="stop-color:#000000"/>
				<stop  offset="0.0869" style="stop-color:#1B1B1B"/>
				<stop  offset="0.153" style="stop-color:#393434"/>
				<stop  offset="0.2122" style="stop-color:#554F4E"/>
				<stop  offset="0.2675" style="stop-color:#736B69"/>
				<stop  offset="0.32" style="stop-color:#908584"/>
				<stop  offset="0.3703" style="stop-color:#ADA19F"/>
				<stop  offset="0.4191" style="stop-color:#CBBCBA"/>
				<stop  offset="0.4653" style="stop-color:#E7D6D4"/>
				<stop  offset="0.49" style="stop-color:#F7E5E2"/>
				<stop  offset="0.5205" style="stop-color:#E4D3D1"/>
				<stop  offset="0.566" style="stop-color:#C7B8B7"/>
				<stop  offset="0.6143" style="stop-color:#AA9E9C"/>
				<stop  offset="0.6645" style="stop-color:#8D8382"/>
				<stop  offset="0.7172" style="stop-color:#706867"/>
				<stop  offset="0.7732" style="stop-color:#544E4E"/>
				<stop  offset="0.8342" style="stop-color:#373232"/>
				<stop  offset="0.9035" style="stop-color:#1B1616"/>
				<stop  offset="1" style="stop-color:#000000"/>
				<midPointStop  offset="0" style="stop-color:#000000"/>
				<midPointStop  offset="0.76" style="stop-color:#000000"/>
				<midPointStop  offset="0.49" style="stop-color:#F7E5E2"/>
				<midPointStop  offset="0.23" style="stop-color:#F7E5E2"/>
				<midPointStop  offset="1" style="stop-color:#000000"/>
			</linearGradient>
			<rect x="260.224" y="148.065" style="fill:url(#XMLID_54_);" width="11.7" height="21"/> 
			
				<linearGradient id="XMLID_55_" gradientUnits="userSpaceOnUse" x1="77.165" y1="-133.1851" x2="96.6655" y2="-133.1851" gradientTransform="matrix(-0.6 0 0 2 306.8486 424.9351)">
				<stop  offset="0" style="stop-color:#000000"/>
				<stop  offset="0.1005" style="stop-color:#2A2A2A"/>
				<stop  offset="0.1688" style="stop-color:#3F3F3F"/>
				<stop  offset="0.2275" style="stop-color:#525151"/>
				<stop  offset="0.2808" style="stop-color:#6F6D6D"/>
				<stop  offset="0.3305" style="stop-color:#8B8787"/>
				<stop  offset="0.3774" style="stop-color:#A7A2A1"/>
				<stop  offset="0.4222" style="stop-color:#C3BAB8"/>
				<stop  offset="0.4643" style="stop-color:#DFD1CE"/>
				<stop  offset="0.49" style="stop-color:#F1DFDD"/>
				<stop  offset="0.5156" style="stop-color:#E0D0CD"/>
				<stop  offset="0.5595" style="stop-color:#C4B6B4"/>
				<stop  offset="0.6063" style="stop-color:#A89B99"/>
				<stop  offset="0.6553" style="stop-color:#8B817F"/>
				<stop  offset="0.707" style="stop-color:#6F6766"/>
				<stop  offset="0.7626" style="stop-color:#524C4C"/>
				<stop  offset="0.8239" style="stop-color:#373232"/>
				<stop  offset="0.8951" style="stop-color:#1B1616"/>
				<stop  offset="1" style="stop-color:#000000"/>
				<midPointStop  offset="0" style="stop-color:#000000"/>
				<midPointStop  offset="0.78" style="stop-color:#000000"/>
				<midPointStop  offset="0.49" style="stop-color:#F1DFDD"/>
				<midPointStop  offset="0.22" style="stop-color:#F1DFDD"/>
				<midPointStop  offset="1" style="stop-color:#000000"/>
			</linearGradient>
			<rect x="248.824" y="148.065" style="fill:url(#XMLID_55_);" width="11.7" height="21"/> 
			
				<linearGradient id="XMLID_56_" gradientUnits="userSpaceOnUse" x1="77.165" y1="-133.1851" x2="96.6655" y2="-133.1851" gradientTransform="matrix(-0.6 0 0 2 295.4487 424.9351)">
				<stop  offset="0" style="stop-color:#000000"/>
				<stop  offset="0.0899" style="stop-color:#1B1B1B"/>
				<stop  offset="0.1583" style="stop-color:#393434"/>
				<stop  offset="0.2197" style="stop-color:#554F4E"/>
				<stop  offset="0.2769" style="stop-color:#736B69"/>
				<stop  offset="0.3312" style="stop-color:#908584"/>
				<stop  offset="0.3833" style="stop-color:#ADA19F"/>
				<stop  offset="0.4338" style="stop-color:#CBBCBA"/>
				<stop  offset="0.4817" style="stop-color:#E7D6D4"/>
				<stop  offset="0.49" style="stop-color:#ECDBD9"/>
				<stop  offset="0.4987" style="stop-color:#E7D6D4"/>
				<stop  offset="0.5485" style="stop-color:#CBBCBA"/>
				<stop  offset="0.601" style="stop-color:#ADA19F"/>
				<stop  offset="0.6553" style="stop-color:#908584"/>
				<stop  offset="0.7118" style="stop-color:#736B69"/>
				<stop  offset="0.7714" style="stop-color:#554F4E"/>
				<stop  offset="0.8352" style="stop-color:#393434"/>
				<stop  offset="0.9064" style="stop-color:#1B1B1B"/>
				<stop  offset="1" style="stop-color:#000000"/>
				<midPointStop  offset="0" style="stop-color:#000000"/>
				<midPointStop  offset="0.76" style="stop-color:#000000"/>
				<midPointStop  offset="0.49" style="stop-color:#ECDBD9"/>
				<midPointStop  offset="0.24" style="stop-color:#ECDBD9"/>
				<midPointStop  offset="1" style="stop-color:#000000"/>
			</linearGradient>
			<rect x="237.424" y="148.065" style="fill:url(#XMLID_56_);" width="11.7" height="21"/> 
			
				<linearGradient id="XMLID_57_" gradientUnits="userSpaceOnUse" x1="77.165" y1="-133.1851" x2="96.665" y2="-133.1851" gradientTransform="matrix(-0.6 0 0 2 272.9487 424.9351)">
				<stop  offset="0" style="stop-color:#000000"/>
				<stop  offset="0.0946" style="stop-color:#2A2A2A"/>
				<stop  offset="0.1665" style="stop-color:#414141"/>
				<stop  offset="0.231" style="stop-color:#555454"/>
				<stop  offset="0.2911" style="stop-color:#737070"/>
				<stop  offset="0.3482" style="stop-color:#908C8B"/>
				<stop  offset="0.403" style="stop-color:#ACA5A3"/>
				<stop  offset="0.455" style="stop-color:#C9BDBB"/>
				<stop  offset="0.49" style="stop-color:#DDCDCB"/>
				<stop  offset="0.5246" style="stop-color:#CABBBA"/>
				<stop  offset="0.579" style="stop-color:#ADA19F"/>
				<stop  offset="0.6363" style="stop-color:#908584"/>
				<stop  offset="0.6959" style="stop-color:#736B69"/>
				<stop  offset="0.7587" style="stop-color:#554F4E"/>
				<stop  offset="0.826" style="stop-color:#393434"/>
				<stop  offset="0.9012" style="stop-color:#1B1B1B"/>
				<stop  offset="1" style="stop-color:#000000"/>
				<midPointStop  offset="0" style="stop-color:#000000"/>
				<midPointStop  offset="0.76" style="stop-color:#000000"/>
				<midPointStop  offset="0.49" style="stop-color:#DDCDCB"/>
				<midPointStop  offset="0.24" style="stop-color:#DDCDCB"/>
				<midPointStop  offset="1" style="stop-color:#000000"/>
			</linearGradient>
			<rect x="214.923" y="148.065" style="fill:url(#XMLID_57_);" width="11.7" height="21"/> 
			
				<linearGradient id="XMLID_58_" gradientUnits="userSpaceOnUse" x1="77.165" y1="-133.1851" x2="96.6655" y2="-133.1851" gradientTransform="matrix(-0.6 0 0 2 284.3486 424.9351)">
				<stop  offset="0" style="stop-color:#000000"/>
				<stop  offset="0.1034" style="stop-color:#1B1616"/>
				<stop  offset="0.1737" style="stop-color:#373232"/>
				<stop  offset="0.2341" style="stop-color:#524C4C"/>
				<stop  offset="0.2889" style="stop-color:#6F6766"/>
				<stop  offset="0.34" style="stop-color:#8B817F"/>
				<stop  offset="0.3883" style="stop-color:#A89B99"/>
				<stop  offset="0.4344" style="stop-color:#C4B6B3"/>
				<stop  offset="0.4777" style="stop-color:#E0CFCD"/>
				<stop  offset="0.49" style="stop-color:#E8D7D5"/>
				<stop  offset="0.5028" style="stop-color:#E0CFCD"/>
				<stop  offset="0.5479" style="stop-color:#C4B6B3"/>
				<stop  offset="0.5959" style="stop-color:#A89B99"/>
				<stop  offset="0.6461" style="stop-color:#8B817F"/>
				<stop  offset="0.6993" style="stop-color:#6F6766"/>
				<stop  offset="0.7564" style="stop-color:#524C4C"/>
				<stop  offset="0.8192" style="stop-color:#373232"/>
				<stop  offset="0.8923" style="stop-color:#1B1616"/>
				<stop  offset="1" style="stop-color:#000000"/>
				<midPointStop  offset="0" style="stop-color:#000000"/>
				<midPointStop  offset="0.78" style="stop-color:#000000"/>
				<midPointStop  offset="0.49" style="stop-color:#E8D7D5"/>
				<midPointStop  offset="0.22" style="stop-color:#E8D7D5"/>
				<midPointStop  offset="1" style="stop-color:#000000"/>
			</linearGradient>
			<rect x="226.324" y="148.065" style="fill:url(#XMLID_58_);" width="11.7" height="21"/> 
			
				<linearGradient id="XMLID_59_" gradientUnits="userSpaceOnUse" x1="77.165" y1="-133.1851" x2="96.6655" y2="-133.1851" gradientTransform="matrix(-0.6 0 0 2 261.5488 424.9351)">
				<stop  offset="0" style="stop-color:#000000"/>
				<stop  offset="0.1139" style="stop-color:#1B1616"/>
				<stop  offset="0.1912" style="stop-color:#373232"/>
				<stop  offset="0.2577" style="stop-color:#524C4C"/>
				<stop  offset="0.3181" style="stop-color:#6F6766"/>
				<stop  offset="0.3743" style="stop-color:#8B817F"/>
				<stop  offset="0.4275" style="stop-color:#A89B99"/>
				<stop  offset="0.4773" style="stop-color:#C4B5B3"/>
				<stop  offset="0.49" style="stop-color:#CBBCBA"/>
				<stop  offset="0.5033" style="stop-color:#C4B5B3"/>
				<stop  offset="0.5551" style="stop-color:#A89B99"/>
				<stop  offset="0.6104" style="stop-color:#8B817F"/>
				<stop  offset="0.6689" style="stop-color:#6F6766"/>
				<stop  offset="0.7317" style="stop-color:#524C4C"/>
				<stop  offset="0.801" style="stop-color:#373232"/>
				<stop  offset="0.8814" style="stop-color:#1B1616"/>
				<stop  offset="1" style="stop-color:#000000"/>
				<midPointStop  offset="0" style="stop-color:#000000"/>
				<midPointStop  offset="0.78" style="stop-color:#000000"/>
				<midPointStop  offset="0.49" style="stop-color:#CBBCBA"/>
				<midPointStop  offset="0.22" style="stop-color:#CBBCBA"/>
				<midPointStop  offset="1" style="stop-color:#000000"/>
			</linearGradient>
			<rect x="203.523" y="148.065" style="fill:url(#XMLID_59_);" width="11.7" height="21"/> 
			
				<linearGradient id="XMLID_60_" gradientUnits="userSpaceOnUse" x1="267.415" y1="-180.9351" x2="286.9146" y2="-180.9351" gradientTransform="matrix(-0.6 0 0 2 364.2988 520.4351)">
				<stop  offset="0" style="stop-color:#000000"/>
				<stop  offset="0.1349" style="stop-color:#1B1616"/>
				<stop  offset="0.2265" style="stop-color:#373232"/>
				<stop  offset="0.3053" style="stop-color:#524C4C"/>
				<stop  offset="0.3767" style="stop-color:#6F6766"/>
				<stop  offset="0.4426" style="stop-color:#8B817F"/>
				<stop  offset="0.49" style="stop-color:#A09493"/>
				<stop  offset="0.5319" style="stop-color:#8F8583"/>
				<stop  offset="0.608" style="stop-color:#736B69"/>
				<stop  offset="0.6889" style="stop-color:#554F4E"/>
				<stop  offset="0.7757" style="stop-color:#393434"/>
				<stop  offset="0.8726" style="stop-color:#1B1B1B"/>
				<stop  offset="1" style="stop-color:#000000"/>
				<midPointStop  offset="0" style="stop-color:#000000"/>
				<midPointStop  offset="0.78" style="stop-color:#000000"/>
				<midPointStop  offset="0.49" style="stop-color:#A09493"/>
				<midPointStop  offset="0.24" style="stop-color:#A09493"/>
				<midPointStop  offset="1" style="stop-color:#000000"/>
			</linearGradient>
			<rect x="192.124" y="148.065" style="fill:url(#XMLID_60_);" width="11.7" height="21"/> 
			<rect x="180.723" y="148.065" width="11.7" height="21"/> 
		</g>
		<g>
			
				<linearGradient id="XMLID_61_" gradientUnits="userSpaceOnUse" x1="77.165" y1="-133.1851" x2="96.6641" y2="-133.1851" gradientTransform="matrix(0.6 0 0 2 225.5738 368.9575)">
				<stop  offset="0" style="stop-color:#000000"/>
				<stop  offset="0.1006" style="stop-color:#6D5F58"/>
				<stop  offset="0.3277" style="stop-color:#CCB2A6"/>
				<stop  offset="0.49" style="stop-color:#FDDDCE"/>
				<stop  offset="1" style="stop-color:#000000"/>
				<midPointStop  offset="0" style="stop-color:#000000"/>
				<midPointStop  offset="0.52" style="stop-color:#000000"/>
				<midPointStop  offset="0.49" style="stop-color:#FDDDCE"/>
				<midPointStop  offset="0.5" style="stop-color:#FDDDCE"/>
				<midPointStop  offset="1" style="stop-color:#000000"/>
			</linearGradient>
			<rect x="271.899" y="92.087" style="fill:url(#XMLID_61_);" width="11.7" height="21"/> 
			
				<linearGradient id="XMLID_62_" gradientUnits="userSpaceOnUse" x1="153.665" y1="-180.9351" x2="173.665" y2="-180.9351" gradientTransform="matrix(0.6 0 0 2 190.9234 464.4575)">
				<stop  offset="0" style="stop-color:#000000"/>
				<stop  offset="0.1105" style="stop-color:#6D5F58"/>
				<stop  offset="0.3601" style="stop-color:#CCB2A6"/>
				<stop  offset="0.49" style="stop-color:#F1D2C4"/>
				<stop  offset="1" style="stop-color:#000000"/>
				<midPointStop  offset="0" style="stop-color:#000000"/>
				<midPointStop  offset="0.52" style="stop-color:#000000"/>
				<midPointStop  offset="0.49" style="stop-color:#F1D2C4"/>
				<midPointStop  offset="0.5" style="stop-color:#F1D2C4"/>
				<midPointStop  offset="1" style="stop-color:#000000"/>
			</linearGradient>
			<rect x="283.299" y="92.087" style="fill:url(#XMLID_62_);" width="11.7" height="21"/> 
			
				<linearGradient id="XMLID_63_" gradientUnits="userSpaceOnUse" x1="77.165" y1="-133.1851" x2="96.665" y2="-133.1851" gradientTransform="matrix(0.6 0 0 2 248.3741 368.9575)">
				<stop  offset="0" style="stop-color:#000000"/>
				<stop  offset="0.06" style="stop-color:#545251"/>
				<stop  offset="0.2718" style="stop-color:#B0A39D"/>
				<stop  offset="0.4197" style="stop-color:#D6BEB3"/>
				<stop  offset="0.49" style="stop-color:#E4C7B9"/>
				<stop  offset="0.5447" style="stop-color:#DDC0B3"/>
				<stop  offset="0.6461" style="stop-color:#C8AEA2"/>
				<stop  offset="0.7831" style="stop-color:#A08C82"/>
				<stop  offset="0.9488" style="stop-color:#4F4541"/>
				<stop  offset="1" style="stop-color:#000000"/>
				<midPointStop  offset="0" style="stop-color:#000000"/>
				<midPointStop  offset="0.46" style="stop-color:#000000"/>
				<midPointStop  offset="0.49" style="stop-color:#E4C7B9"/>
				<midPointStop  offset="0.57" style="stop-color:#E4C7B9"/>
				<midPointStop  offset="1" style="stop-color:#000000"/>
			</linearGradient>
			<rect x="294.699" y="92.087" style="fill:url(#XMLID_63_);" width="11.7" height="21"/> 
			
				<linearGradient id="XMLID_64_" gradientUnits="userSpaceOnUse" x1="77.165" y1="-133.1851" x2="96.6655" y2="-133.1851" gradientTransform="matrix(0.6 0 0 2 259.774 368.9575)">
				<stop  offset="0" style="stop-color:#000000"/>
				<stop  offset="0.0204" style="stop-color:#2F2A27"/>
				<stop  offset="0.2517" style="stop-color:#A28D84"/>
				<stop  offset="0.4133" style="stop-color:#CCB1A6"/>
				<stop  offset="0.49" style="stop-color:#DABEB1"/>
				<stop  offset="0.5489" style="stop-color:#D2B7AB"/>
				<stop  offset="0.6581" style="stop-color:#BCA499"/>
				<stop  offset="0.8057" style="stop-color:#927E76"/>
				<stop  offset="0.9843" style="stop-color:#2A2323"/>
				<stop  offset="1" style="stop-color:#000000"/>
				<midPointStop  offset="0" style="stop-color:#000000"/>
				<midPointStop  offset="0.46" style="stop-color:#000000"/>
				<midPointStop  offset="0.49" style="stop-color:#DABEB1"/>
				<midPointStop  offset="0.57" style="stop-color:#DABEB1"/>
				<midPointStop  offset="1" style="stop-color:#000000"/>
			</linearGradient>
			<rect x="306.099" y="92.087" style="fill:url(#XMLID_64_);" width="11.7" height="21"/> 
			
				<linearGradient id="XMLID_65_" gradientUnits="userSpaceOnUse" x1="77.165" y1="-133.1851" x2="96.6655" y2="-133.1851" gradientTransform="matrix(0.6 0 0 2 282.2745 368.9575)">
				<stop  offset="0" style="stop-color:#000000"/>
				<stop  offset="0.49" style="stop-color:#B79F94"/>
				<stop  offset="1" style="stop-color:#000000"/>
				<midPointStop  offset="0" style="stop-color:#000000"/>
				<midPointStop  offset="0.5" style="stop-color:#000000"/>
				<midPointStop  offset="0.49" style="stop-color:#B79F94"/>
				<midPointStop  offset="0.5" style="stop-color:#B79F94"/>
				<midPointStop  offset="1" style="stop-color:#000000"/>
			</linearGradient>
			<rect x="328.599" y="92.087" style="fill:url(#XMLID_65_);" width="11.7" height="21"/> 
			
				<linearGradient id="XMLID_66_" gradientUnits="userSpaceOnUse" x1="77.165" y1="-133.1851" x2="96.666" y2="-133.1851" gradientTransform="matrix(0.6 0 0 2 270.8743 368.9575)">
				<stop  offset="0" style="stop-color:#000000"/>
				<stop  offset="0.49" style="stop-color:#CFB4A8"/>
				<stop  offset="1" style="stop-color:#000000"/>
				<midPointStop  offset="0" style="stop-color:#000000"/>
				<midPointStop  offset="0.5" style="stop-color:#000000"/>
				<midPointStop  offset="0.49" style="stop-color:#CFB4A8"/>
				<midPointStop  offset="0.5" style="stop-color:#CFB4A8"/>
				<midPointStop  offset="1" style="stop-color:#000000"/>
			</linearGradient>
			<rect x="317.199" y="92.087" style="fill:url(#XMLID_66_);" width="11.7" height="21"/> 
			
				<linearGradient id="XMLID_67_" gradientUnits="userSpaceOnUse" x1="77.165" y1="-133.1851" x2="96.666" y2="-133.1851" gradientTransform="matrix(0.6 0 0 2 293.6744 368.9575)">
				<stop  offset="0" style="stop-color:#000000"/>
				<stop  offset="0.49" style="stop-color:#85746C"/>
				<stop  offset="1" style="stop-color:#000000"/>
				<midPointStop  offset="0" style="stop-color:#000000"/>
				<midPointStop  offset="0.5" style="stop-color:#000000"/>
				<midPointStop  offset="0.49" style="stop-color:#85746C"/>
				<midPointStop  offset="0.5" style="stop-color:#85746C"/>
				<midPointStop  offset="1" style="stop-color:#000000"/>
			</linearGradient>
			<rect x="340" y="92.087" style="fill:url(#XMLID_67_);" width="11.7" height="21"/> 
			
				<linearGradient id="XMLID_68_" gradientUnits="userSpaceOnUse" x1="267.415" y1="-180.9351" x2="286.9155" y2="-180.9351" gradientTransform="matrix(0.6 0 0 2 190.9234 464.4575)">
				<stop  offset="0" style="stop-color:#000000"/>
				<stop  offset="0.49" style="stop-color:#5E514C"/>
				<stop  offset="1" style="stop-color:#000000"/>
				<midPointStop  offset="0" style="stop-color:#000000"/>
				<midPointStop  offset="0.5" style="stop-color:#000000"/>
				<midPointStop  offset="0.49" style="stop-color:#5E514C"/>
				<midPointStop  offset="0.5" style="stop-color:#5E514C"/>
				<midPointStop  offset="1" style="stop-color:#000000"/>
			</linearGradient>
			<rect x="351.399" y="92.087" style="fill:url(#XMLID_68_);" width="11.7" height="21"/> 
			<rect x="362.8" y="92.087" width="11.7" height="21"/> 
			
				<linearGradient id="XMLID_69_" gradientUnits="userSpaceOnUse" x1="153.665" y1="-180.9351" x2="173.665" y2="-180.9351" gradientTransform="matrix(-0.6 0 0 2 364.2988 464.4575)">
				<stop  offset="0" style="stop-color:#000000"/>
				<stop  offset="0.1105" style="stop-color:#6D5F58"/>
				<stop  offset="0.3601" style="stop-color:#CCB2A6"/>
				<stop  offset="0.49" style="stop-color:#F1D2C4"/>
				<stop  offset="1" style="stop-color:#000000"/>
				<midPointStop  offset="0" style="stop-color:#000000"/>
				<midPointStop  offset="0.52" style="stop-color:#000000"/>
				<midPointStop  offset="0.49" style="stop-color:#F1D2C4"/>
				<midPointStop  offset="0.5" style="stop-color:#F1D2C4"/>
				<midPointStop  offset="1" style="stop-color:#000000"/>
			</linearGradient>
			<rect x="260.224" y="92.087" style="fill:url(#XMLID_69_);" width="11.7" height="21"/> 
			
				<linearGradient id="XMLID_70_" gradientUnits="userSpaceOnUse" x1="77.165" y1="-133.1851" x2="96.6655" y2="-133.1851" gradientTransform="matrix(-0.6 0 0 2 306.8486 368.9575)">
				<stop  offset="0" style="stop-color:#000000"/>
				<stop  offset="0.06" style="stop-color:#545251"/>
				<stop  offset="0.2718" style="stop-color:#B0A39D"/>
				<stop  offset="0.4197" style="stop-color:#D6BEB3"/>
				<stop  offset="0.49" style="stop-color:#E4C7B9"/>
				<stop  offset="0.5447" style="stop-color:#DDC0B3"/>
				<stop  offset="0.6461" style="stop-color:#C8AEA2"/>
				<stop  offset="0.7831" style="stop-color:#A08C82"/>
				<stop  offset="0.9488" style="stop-color:#4F4541"/>
				<stop  offset="1" style="stop-color:#000000"/>
				<midPointStop  offset="0" style="stop-color:#000000"/>
				<midPointStop  offset="0.46" style="stop-color:#000000"/>
				<midPointStop  offset="0.49" style="stop-color:#E4C7B9"/>
				<midPointStop  offset="0.57" style="stop-color:#E4C7B9"/>
				<midPointStop  offset="1" style="stop-color:#000000"/>
			</linearGradient>
			<rect x="248.824" y="92.087" style="fill:url(#XMLID_70_);" width="11.7" height="21"/> 
			
				<linearGradient id="XMLID_71_" gradientUnits="userSpaceOnUse" x1="77.165" y1="-133.1851" x2="96.6655" y2="-133.1851" gradientTransform="matrix(-0.6 0 0 2 295.4487 368.9575)">
				<stop  offset="0" style="stop-color:#000000"/>
				<stop  offset="0.0204" style="stop-color:#2F2A27"/>
				<stop  offset="0.2517" style="stop-color:#A28D84"/>
				<stop  offset="0.4133" style="stop-color:#CCB1A6"/>
				<stop  offset="0.49" style="stop-color:#DABEB1"/>
				<stop  offset="0.5489" style="stop-color:#D2B7AB"/>
				<stop  offset="0.6581" style="stop-color:#BCA499"/>
				<stop  offset="0.8057" style="stop-color:#927E76"/>
				<stop  offset="0.9843" style="stop-color:#2A2323"/>
				<stop  offset="1" style="stop-color:#000000"/>
				<midPointStop  offset="0" style="stop-color:#000000"/>
				<midPointStop  offset="0.46" style="stop-color:#000000"/>
				<midPointStop  offset="0.49" style="stop-color:#DABEB1"/>
				<midPointStop  offset="0.57" style="stop-color:#DABEB1"/>
				<midPointStop  offset="1" style="stop-color:#000000"/>
			</linearGradient>
			<rect x="237.424" y="92.087" style="fill:url(#XMLID_71_);" width="11.7" height="21"/> 
			
				<linearGradient id="XMLID_72_" gradientUnits="userSpaceOnUse" x1="77.165" y1="-133.1851" x2="96.665" y2="-133.1851" gradientTransform="matrix(-0.6 0 0 2 272.9487 368.9575)">
				<stop  offset="0" style="stop-color:#000000"/>
				<stop  offset="0.49" style="stop-color:#B79F94"/>
				<stop  offset="1" style="stop-color:#000000"/>
				<midPointStop  offset="0" style="stop-color:#000000"/>
				<midPointStop  offset="0.5" style="stop-color:#000000"/>
				<midPointStop  offset="0.49" style="stop-color:#B79F94"/>
				<midPointStop  offset="0.5" style="stop-color:#B79F94"/>
				<midPointStop  offset="1" style="stop-color:#000000"/>
			</linearGradient>
			<rect x="214.923" y="92.087" style="fill:url(#XMLID_72_);" width="11.7" height="21"/> 
			
				<linearGradient id="XMLID_73_" gradientUnits="userSpaceOnUse" x1="77.165" y1="-133.1851" x2="96.6655" y2="-133.1851" gradientTransform="matrix(-0.6 0 0 2 284.3486 368.9575)">
				<stop  offset="0" style="stop-color:#000000"/>
				<stop  offset="0.49" style="stop-color:#CFB4A8"/>
				<stop  offset="1" style="stop-color:#000000"/>
				<midPointStop  offset="0" style="stop-color:#000000"/>
				<midPointStop  offset="0.5" style="stop-color:#000000"/>
				<midPointStop  offset="0.49" style="stop-color:#CFB4A8"/>
				<midPointStop  offset="0.5" style="stop-color:#CFB4A8"/>
				<midPointStop  offset="1" style="stop-color:#000000"/>
			</linearGradient>
			<rect x="226.324" y="92.087" style="fill:url(#XMLID_73_);" width="11.7" height="21"/> 
			
				<linearGradient id="XMLID_74_" gradientUnits="userSpaceOnUse" x1="77.165" y1="-133.1851" x2="96.6655" y2="-133.1851" gradientTransform="matrix(-0.6 0 0 2 261.5488 368.9575)">
				<stop  offset="0" style="stop-color:#000000"/>
				<stop  offset="0.49" style="stop-color:#85746C"/>
				<stop  offset="1" style="stop-color:#000000"/>
				<midPointStop  offset="0" style="stop-color:#000000"/>
				<midPointStop  offset="0.5" style="stop-color:#000000"/>
				<midPointStop  offset="0.49" style="stop-color:#85746C"/>
				<midPointStop  offset="0.5" style="stop-color:#85746C"/>
				<midPointStop  offset="1" style="stop-color:#000000"/>
			</linearGradient>
			<rect x="203.523" y="92.087" style="fill:url(#XMLID_74_);" width="11.7" height="21"/> 
			
				<linearGradient id="XMLID_75_" gradientUnits="userSpaceOnUse" x1="267.415" y1="-180.9351" x2="286.9146" y2="-180.9351" gradientTransform="matrix(-0.6 0 0 2 364.2988 464.4575)">
				<stop  offset="0" style="stop-color:#000000"/>
				<stop  offset="0.49" style="stop-color:#5E514C"/>
				<stop  offset="1" style="stop-color:#000000"/>
				<midPointStop  offset="0" style="stop-color:#000000"/>
				<midPointStop  offset="0.5" style="stop-color:#000000"/>
				<midPointStop  offset="0.49" style="stop-color:#5E514C"/>
				<midPointStop  offset="0.5" style="stop-color:#5E514C"/>
				<midPointStop  offset="1" style="stop-color:#000000"/>
			</linearGradient>
			<rect x="192.124" y="92.087" style="fill:url(#XMLID_75_);" width="11.7" height="21"/> 
			<rect x="180.723" y="92.087" width="11.7" height="21"/> 
		</g>
		<g>
			<rect x="180.674" y="36.602" width="193.875" height="21.062"/> 
			<g>
				
					<linearGradient id="XMLID_76_" gradientUnits="userSpaceOnUse" x1="77.165" y1="-133.1851" x2="96.666" y2="-133.1851" gradientTransform="matrix(0.3996 0 0 2 242.9534 313.5034)">
					<stop  offset="0" style="stop-color:#000000"/>
					<stop  offset="0.1006" style="stop-color:#6D5F58"/>
					<stop  offset="0.3277" style="stop-color:#CCB2A6"/>
					<stop  offset="0.49" style="stop-color:#FDDDCE"/>
					<stop  offset="1" style="stop-color:#000000"/>
					<midPointStop  offset="0" style="stop-color:#000000"/>
					<midPointStop  offset="0.52" style="stop-color:#000000"/>
					<midPointStop  offset="0.49" style="stop-color:#FDDDCE"/>
					<midPointStop  offset="0.5" style="stop-color:#FDDDCE"/>
					<midPointStop  offset="1" style="stop-color:#000000"/>
				</linearGradient>
				<rect x="273.807" y="36.633" style="fill:url(#XMLID_76_);" width="7.792" height="21"/> 
				
					<linearGradient id="XMLID_77_" gradientUnits="userSpaceOnUse" x1="153.665" y1="-180.9351" x2="173.665" y2="-180.9351" gradientTransform="matrix(0.3996 0 0 2 219.8762 409.0034)">
					<stop  offset="0" style="stop-color:#000000"/>
					<stop  offset="0.1105" style="stop-color:#6D5F58"/>
					<stop  offset="0.3601" style="stop-color:#CCB2A6"/>
					<stop  offset="0.49" style="stop-color:#F1D2C4"/>
					<stop  offset="1" style="stop-color:#000000"/>
					<midPointStop  offset="0" style="stop-color:#000000"/>
					<midPointStop  offset="0.52" style="stop-color:#000000"/>
					<midPointStop  offset="0.49" style="stop-color:#F1D2C4"/>
					<midPointStop  offset="0.5" style="stop-color:#F1D2C4"/>
					<midPointStop  offset="1" style="stop-color:#000000"/>
				</linearGradient>
				<rect x="281.399" y="36.633" style="fill:url(#XMLID_77_);" width="7.792" height="21"/> 
				
					<linearGradient id="XMLID_78_" gradientUnits="userSpaceOnUse" x1="77.165" y1="-133.1851" x2="96.666" y2="-133.1851" gradientTransform="matrix(0.3996 0 0 2 258.1382 313.5034)">
					<stop  offset="0" style="stop-color:#000000"/>
					<stop  offset="0.06" style="stop-color:#545251"/>
					<stop  offset="0.2718" style="stop-color:#B0A39D"/>
					<stop  offset="0.4197" style="stop-color:#D6BEB3"/>
					<stop  offset="0.49" style="stop-color:#E4C7B9"/>
					<stop  offset="0.5447" style="stop-color:#DDC0B3"/>
					<stop  offset="0.6461" style="stop-color:#C8AEA2"/>
					<stop  offset="0.7831" style="stop-color:#A08C82"/>
					<stop  offset="0.9488" style="stop-color:#4F4541"/>
					<stop  offset="1" style="stop-color:#000000"/>
					<midPointStop  offset="0" style="stop-color:#000000"/>
					<midPointStop  offset="0.46" style="stop-color:#000000"/>
					<midPointStop  offset="0.49" style="stop-color:#E4C7B9"/>
					<midPointStop  offset="0.57" style="stop-color:#E4C7B9"/>
					<midPointStop  offset="1" style="stop-color:#000000"/>
				</linearGradient>
				<rect x="288.992" y="36.633" style="fill:url(#XMLID_78_);" width="7.792" height="21"/> 
				
					<linearGradient id="XMLID_79_" gradientUnits="userSpaceOnUse" x1="77.165" y1="-133.1851" x2="96.665" y2="-133.1851" gradientTransform="matrix(0.3996 0 0 2 265.7307 313.5034)">
					<stop  offset="0" style="stop-color:#000000"/>
					<stop  offset="0.0204" style="stop-color:#2F2A27"/>
					<stop  offset="0.2517" style="stop-color:#A28D84"/>
					<stop  offset="0.4133" style="stop-color:#CCB1A6"/>
					<stop  offset="0.49" style="stop-color:#DABEB1"/>
					<stop  offset="0.5489" style="stop-color:#D2B7AB"/>
					<stop  offset="0.6581" style="stop-color:#BCA499"/>
					<stop  offset="0.8057" style="stop-color:#927E76"/>
					<stop  offset="0.9843" style="stop-color:#2A2323"/>
					<stop  offset="1" style="stop-color:#000000"/>
					<midPointStop  offset="0" style="stop-color:#000000"/>
					<midPointStop  offset="0.46" style="stop-color:#000000"/>
					<midPointStop  offset="0.49" style="stop-color:#DABEB1"/>
					<midPointStop  offset="0.57" style="stop-color:#DABEB1"/>
					<midPointStop  offset="1" style="stop-color:#000000"/>
				</linearGradient>
				<rect x="296.584" y="36.633" style="fill:url(#XMLID_79_);" width="7.792" height="21"/> 
				
					<linearGradient id="XMLID_80_" gradientUnits="userSpaceOnUse" x1="77.165" y1="-133.1851" x2="96.665" y2="-133.1851" gradientTransform="matrix(0.3996 0 0 2 280.7158 313.5034)">
					<stop  offset="0" style="stop-color:#000000"/>
					<stop  offset="0.49" style="stop-color:#B79F94"/>
					<stop  offset="1" style="stop-color:#000000"/>
					<midPointStop  offset="0" style="stop-color:#000000"/>
					<midPointStop  offset="0.5" style="stop-color:#000000"/>
					<midPointStop  offset="0.49" style="stop-color:#B79F94"/>
					<midPointStop  offset="0.5" style="stop-color:#B79F94"/>
					<midPointStop  offset="1" style="stop-color:#000000"/>
				</linearGradient>
				<rect x="311.569" y="36.633" style="fill:url(#XMLID_80_);" width="7.792" height="21"/> 
				
					<linearGradient id="XMLID_81_" gradientUnits="userSpaceOnUse" x1="77.165" y1="-133.1851" x2="96.6641" y2="-133.1851" gradientTransform="matrix(0.3996 0 0 2 273.1233 313.5034)">
					<stop  offset="0" style="stop-color:#000000"/>
					<stop  offset="0.49" style="stop-color:#CFB4A8"/>
					<stop  offset="1" style="stop-color:#000000"/>
					<midPointStop  offset="0" style="stop-color:#000000"/>
					<midPointStop  offset="0.5" style="stop-color:#000000"/>
					<midPointStop  offset="0.49" style="stop-color:#CFB4A8"/>
					<midPointStop  offset="0.5" style="stop-color:#CFB4A8"/>
					<midPointStop  offset="1" style="stop-color:#000000"/>
				</linearGradient>
				<rect x="303.977" y="36.633" style="fill:url(#XMLID_81_);" width="7.792" height="21"/> 
				
					<linearGradient id="XMLID_82_" gradientUnits="userSpaceOnUse" x1="77.165" y1="-133.1851" x2="96.666" y2="-133.1851" gradientTransform="matrix(0.3996 0 0 2 288.3083 313.5034)">
					<stop  offset="0" style="stop-color:#000000"/>
					<stop  offset="0.49" style="stop-color:#85746C"/>
					<stop  offset="1" style="stop-color:#000000"/>
					<midPointStop  offset="0" style="stop-color:#000000"/>
					<midPointStop  offset="0.5" style="stop-color:#000000"/>
					<midPointStop  offset="0.49" style="stop-color:#85746C"/>
					<midPointStop  offset="0.5" style="stop-color:#85746C"/>
					<midPointStop  offset="1" style="stop-color:#000000"/>
				</linearGradient>
				<rect x="319.162" y="36.633" style="fill:url(#XMLID_82_);" width="7.792" height="21"/> 
				
					<linearGradient id="XMLID_83_" gradientUnits="userSpaceOnUse" x1="267.415" y1="-180.9351" x2="286.916" y2="-180.9351" gradientTransform="matrix(0.3996 0 0 2 219.8762 409.0034)">
					<stop  offset="0" style="stop-color:#000000"/>
					<stop  offset="0.49" style="stop-color:#5E514C"/>
					<stop  offset="1" style="stop-color:#000000"/>
					<midPointStop  offset="0" style="stop-color:#000000"/>
					<midPointStop  offset="0.5" style="stop-color:#000000"/>
					<midPointStop  offset="0.49" style="stop-color:#5E514C"/>
					<midPointStop  offset="0.5" style="stop-color:#5E514C"/>
					<midPointStop  offset="1" style="stop-color:#000000"/>
				</linearGradient>
				<rect x="326.754" y="36.633" style="fill:url(#XMLID_83_);" width="7.792" height="21"/> 
				<rect x="334.347" y="36.633" width="7.792" height="21"/> 
				
					<linearGradient id="XMLID_84_" gradientUnits="userSpaceOnUse" x1="153.665" y1="-180.9351" x2="173.665" y2="-180.9351" gradientTransform="matrix(-0.3996 0 0 2 335.3464 409.0034)">
					<stop  offset="0" style="stop-color:#000000"/>
					<stop  offset="0.1105" style="stop-color:#6D5F58"/>
					<stop  offset="0.3601" style="stop-color:#CCB2A6"/>
					<stop  offset="0.49" style="stop-color:#F1D2C4"/>
					<stop  offset="1" style="stop-color:#000000"/>
					<midPointStop  offset="0" style="stop-color:#000000"/>
					<midPointStop  offset="0.52" style="stop-color:#000000"/>
					<midPointStop  offset="0.49" style="stop-color:#F1D2C4"/>
					<midPointStop  offset="0.5" style="stop-color:#F1D2C4"/>
					<midPointStop  offset="1" style="stop-color:#000000"/>
				</linearGradient>
				<rect x="266.031" y="36.633" style="fill:url(#XMLID_84_);" width="7.792" height="21"/> 
				
					<linearGradient id="XMLID_85_" gradientUnits="userSpaceOnUse" x1="77.165" y1="-133.1851" x2="96.665" y2="-133.1851" gradientTransform="matrix(-0.3996 0 0 2 297.0842 313.5034)">
					<stop  offset="0" style="stop-color:#000000"/>
					<stop  offset="0.06" style="stop-color:#545251"/>
					<stop  offset="0.2718" style="stop-color:#B0A39D"/>
					<stop  offset="0.4197" style="stop-color:#D6BEB3"/>
					<stop  offset="0.49" style="stop-color:#E4C7B9"/>
					<stop  offset="0.5447" style="stop-color:#DDC0B3"/>
					<stop  offset="0.6461" style="stop-color:#C8AEA2"/>
					<stop  offset="0.7831" style="stop-color:#A08C82"/>
					<stop  offset="0.9488" style="stop-color:#4F4541"/>
					<stop  offset="1" style="stop-color:#000000"/>
					<midPointStop  offset="0" style="stop-color:#000000"/>
					<midPointStop  offset="0.46" style="stop-color:#000000"/>
					<midPointStop  offset="0.49" style="stop-color:#E4C7B9"/>
					<midPointStop  offset="0.57" style="stop-color:#E4C7B9"/>
					<midPointStop  offset="1" style="stop-color:#000000"/>
				</linearGradient>
				<rect x="258.439" y="36.633" style="fill:url(#XMLID_85_);" width="7.792" height="21"/> 
				
					<linearGradient id="XMLID_86_" gradientUnits="userSpaceOnUse" x1="77.165" y1="-133.1851" x2="96.665" y2="-133.1851" gradientTransform="matrix(-0.3996 0 0 2 289.4919 313.5034)">
					<stop  offset="0" style="stop-color:#000000"/>
					<stop  offset="0.0204" style="stop-color:#2F2A27"/>
					<stop  offset="0.2517" style="stop-color:#A28D84"/>
					<stop  offset="0.4133" style="stop-color:#CCB1A6"/>
					<stop  offset="0.49" style="stop-color:#DABEB1"/>
					<stop  offset="0.5489" style="stop-color:#D2B7AB"/>
					<stop  offset="0.6581" style="stop-color:#BCA499"/>
					<stop  offset="0.8057" style="stop-color:#927E76"/>
					<stop  offset="0.9843" style="stop-color:#2A2323"/>
					<stop  offset="1" style="stop-color:#000000"/>
					<midPointStop  offset="0" style="stop-color:#000000"/>
					<midPointStop  offset="0.46" style="stop-color:#000000"/>
					<midPointStop  offset="0.49" style="stop-color:#DABEB1"/>
					<midPointStop  offset="0.57" style="stop-color:#DABEB1"/>
					<midPointStop  offset="1" style="stop-color:#000000"/>
				</linearGradient>
				<rect x="250.846" y="36.633" style="fill:url(#XMLID_86_);" width="7.792" height="21"/> 
				
					<linearGradient id="XMLID_87_" gradientUnits="userSpaceOnUse" x1="77.165" y1="-133.1851" x2="96.665" y2="-133.1851" gradientTransform="matrix(-0.3996 0 0 2 274.5071 313.5034)">
					<stop  offset="0" style="stop-color:#000000"/>
					<stop  offset="0.49" style="stop-color:#B79F94"/>
					<stop  offset="1" style="stop-color:#000000"/>
					<midPointStop  offset="0" style="stop-color:#000000"/>
					<midPointStop  offset="0.5" style="stop-color:#000000"/>
					<midPointStop  offset="0.49" style="stop-color:#B79F94"/>
					<midPointStop  offset="0.5" style="stop-color:#B79F94"/>
					<midPointStop  offset="1" style="stop-color:#000000"/>
				</linearGradient>
				<rect x="235.861" y="36.633" style="fill:url(#XMLID_87_);" width="7.792" height="21"/> 
				
					<linearGradient id="XMLID_88_" gradientUnits="userSpaceOnUse" x1="77.165" y1="-133.1851" x2="96.665" y2="-133.1851" gradientTransform="matrix(-0.3996 0 0 2 282.0994 313.5034)">
					<stop  offset="0" style="stop-color:#000000"/>
					<stop  offset="0.49" style="stop-color:#CFB4A8"/>
					<stop  offset="1" style="stop-color:#000000"/>
					<midPointStop  offset="0" style="stop-color:#000000"/>
					<midPointStop  offset="0.5" style="stop-color:#000000"/>
					<midPointStop  offset="0.49" style="stop-color:#CFB4A8"/>
					<midPointStop  offset="0.5" style="stop-color:#CFB4A8"/>
					<midPointStop  offset="1" style="stop-color:#000000"/>
				</linearGradient>
				<rect x="243.454" y="36.633" style="fill:url(#XMLID_88_);" width="7.792" height="21"/> 
				
					<linearGradient id="XMLID_89_" gradientUnits="userSpaceOnUse" x1="77.165" y1="-133.1851" x2="96.666" y2="-133.1851" gradientTransform="matrix(-0.3996 0 0 2 266.9143 313.5034)">
					<stop  offset="0" style="stop-color:#000000"/>
					<stop  offset="0.49" style="stop-color:#85746C"/>
					<stop  offset="1" style="stop-color:#000000"/>
					<midPointStop  offset="0" style="stop-color:#000000"/>
					<midPointStop  offset="0.5" style="stop-color:#000000"/>
					<midPointStop  offset="0.49" style="stop-color:#85746C"/>
					<midPointStop  offset="0.5" style="stop-color:#85746C"/>
					<midPointStop  offset="1" style="stop-color:#000000"/>
				</linearGradient>
				<rect x="228.269" y="36.633" style="fill:url(#XMLID_89_);" width="7.792" height="21"/> 
				
					<linearGradient id="XMLID_90_" gradientUnits="userSpaceOnUse" x1="267.415" y1="-180.9351" x2="286.916" y2="-180.9351" gradientTransform="matrix(-0.3996 0 0 2 335.3464 409.0034)">
					<stop  offset="0" style="stop-color:#000000"/>
					<stop  offset="0.49" style="stop-color:#5E514C"/>
					<stop  offset="1" style="stop-color:#000000"/>
					<midPointStop  offset="0" style="stop-color:#000000"/>
					<midPointStop  offset="0.5" style="stop-color:#000000"/>
					<midPointStop  offset="0.49" style="stop-color:#5E514C"/>
					<midPointStop  offset="0.5" style="stop-color:#5E514C"/>
					<midPointStop  offset="1" style="stop-color:#000000"/>
				</linearGradient>
				<rect x="220.676" y="36.633" style="fill:url(#XMLID_90_);" width="7.792" height="21"/> 
				<rect x="213.084" y="36.633" width="7.792" height="21"/> 
			</g>
		</g>
		<g>
			<text transform="matrix(1 0 0 1 0.3301 28.0649)"><tspan x="0" y="0" style="font-family:Bitstream Vera Sans; font-size:10.200000;">A</tspan></text>
		</g>
		<g>
			<text transform="matrix(1 0 0 1 0.3301 94.3984)"><tspan x="0" y="0" style="font-family:Bitstream Vera Sans; font-size:10.200000;">B</tspan></text>
		</g>
		<g>
			<text transform="matrix(1 0 0 1 0 160.7314)"><tspan x="0" y="0" style="font-family:Bitstream Vera Sans; font-size:10.200000;">C</tspan></text>
		</g>
		<g>
			<text transform="matrix(1 0 0 1 191.165 33.0649)"><tspan x="0" y="0" style="font-family:Bitstream Vera Sans; font-size:10.200000;">1</tspan></text>
		</g>
		<g>
			<text transform="matrix(1 0 0 1 191.165 88.0649)"><tspan x="0" y="0" style="font-family:Bitstream Vera Sans; font-size:10.200000;">2</tspan></text>
		</g>
		<g>
			<text transform="matrix(1 0 0 1 191.165 143.0649)"><tspan x="0" y="0" style="font-family:Bitstream Vera Sans; font-size:10.200000;">3</tspan></text>
		</g>
		<g>
			<rect x="18.949" y="132.315" width="147.5" height="52"/> 
			<rect x="53.74" y="139.69" style="fill:#FFFFFF;" width="2.475" height="37.5"/> 
			<rect x="78.74" y="139.69" style="fill:#FFFFFF;" width="2.475" height="37.5"/> 
			<rect x="104.24" y="139.69" style="fill:#FFFFFF;" width="2.475" height="37.5"/> 
			<rect x="129.74" y="139.69" style="fill:#FFFFFF;" width="2.475" height="37.5"/> 
		</g>
	</g>
</svg>
