<?xml version="1.0" encoding="UTF-8" standalone="no"?>
<!-- Created with Inkscape (http://www.inkscape.org/) -->
<svg
   xmlns:dc="http://purl.org/dc/elements/1.1/"
   xmlns:cc="http://creativecommons.org/ns#"
   xmlns:rdf="http://www.w3.org/1999/02/22-rdf-syntax-ns#"
   xmlns:svg="http://www.w3.org/2000/svg"
   xmlns="http://www.w3.org/2000/svg"
   xmlns:sodipodi="http://sodipodi.sourceforge.net/DTD/sodipodi-0.dtd"
   xmlns:inkscape="http://www.inkscape.org/namespaces/inkscape"
   width="744.09448819"
   height="1052.3622047"
   id="svg2540"
   sodipodi:version="0.32"
   inkscape:version="0.46"
   sodipodi:docname="correspondence-dramatized.svg"
   inkscape:output_extension="org.inkscape.output.svg.inkscape">
  <defs
     id="defs2542">
    <inkscape:perspective
       sodipodi:type="inkscape:persp3d"
       inkscape:vp_x="0 : 526.18109 : 1"
       inkscape:vp_y="0 : 1000 : 0"
       inkscape:vp_z="744.09448 : 526.18109 : 1"
       inkscape:persp3d-origin="372.04724 : 350.78739 : 1"
       id="perspective2548" />
    <inkscape:perspective
       id="perspective4192"
       inkscape:persp3d-origin="372.04724 : 350.78739 : 1"
       inkscape:vp_z="744.09448 : 526.18109 : 1"
       inkscape:vp_y="0 : 1000 : 0"
       inkscape:vp_x="0 : 526.18109 : 1"
       sodipodi:type="inkscape:persp3d" />
    <inkscape:perspective
       id="perspective4422"
       inkscape:persp3d-origin="372.04724 : 350.78739 : 1"
       inkscape:vp_z="744.09448 : 526.18109 : 1"
       inkscape:vp_y="0 : 1000 : 0"
       inkscape:vp_x="0 : 526.18109 : 1"
       sodipodi:type="inkscape:persp3d" />
  </defs>
  <sodipodi:namedview
     id="base"
     pagecolor="#ffffff"
     bordercolor="#666666"
     borderopacity="1.0"
     gridtolerance="10000"
     guidetolerance="10"
     objecttolerance="10"
     inkscape:pageopacity="0.0"
     inkscape:pageshadow="2"
     inkscape:zoom="1.2169335"
     inkscape:cx="177.28696"
     inkscape:cy="538.74117"
     inkscape:document-units="px"
     inkscape:current-layer="layer1"
     showgrid="false"
     inkscape:window-width="1278"
     inkscape:window-height="996"
     inkscape:window-x="1"
     inkscape:window-y="1" />
  <metadata
     id="metadata2545">
    <rdf:RDF>
      <cc:Work
         rdf:about="">
        <dc:format>image/svg+xml</dc:format>
        <dc:type
           rdf:resource="http://purl.org/dc/dcmitype/StillImage" />
      </cc:Work>
    </rdf:RDF>
  </metadata>
  <g
     inkscape:label="Layer 1"
     inkscape:groupmode="layer"
     id="layer1">
    <g
       id="g4465"
       transform="translate(26.186871,-60.018528)">
      <path
         id="path4200"
         d="M 124.38239,682.44893 L 79.381496,692.24325 L 71.969584,706.27293 L 119.61759,697.53747 L 122.79413,690.91969"
         style="fill:none;fill-opacity:1;fill-rule:evenodd;stroke:#000000;stroke-width:1;stroke-linecap:butt;stroke-linejoin:miter;marker:none;marker-start:none;marker-mid:none;marker-end:none;stroke-miterlimit:4;stroke-dasharray:none;stroke-dashoffset:0;stroke-opacity:1;visibility:visible;display:inline;overflow:visible;enable-background:accumulate" />
      <path
         id="path4202"
         d="M 94.734741,689.33142 L 87.587541,702.30227"
         style="fill:none;fill-opacity:1;fill-rule:evenodd;stroke:#646464;stroke-width:0.75;stroke-linecap:butt;stroke-linejoin:miter;marker:none;marker-start:none;marker-mid:none;marker-end:none;stroke-miterlimit:4;stroke-dasharray:none;stroke-dashoffset:0;stroke-opacity:1;visibility:visible;display:inline;overflow:visible;enable-background:accumulate" />
      <path
         id="path4204"
         d="M 110.88212,685.62547 L 103.99963,699.39045"
         style="fill:none;fill-opacity:1;fill-rule:evenodd;stroke:#646464;stroke-width:0.75;stroke-linecap:butt;stroke-linejoin:miter;marker:none;marker-start:none;marker-mid:none;marker-end:none;stroke-miterlimit:4;stroke-dasharray:none;stroke-dashoffset:0;stroke-opacity:1;visibility:visible;display:inline;overflow:visible;enable-background:accumulate" />
      <path
         id="path4206"
         d="M 166.47146,673.18404 L 156.67715,688.27258 L 225.23733,677.15471 L 235.29635,660.21319 L 166.47146,673.18404 z"
         style="fill:none;fill-opacity:1;fill-rule:evenodd;stroke:#000000;stroke-width:1;stroke-linecap:butt;stroke-linejoin:miter;marker:none;marker-start:none;marker-mid:none;marker-end:none;stroke-miterlimit:4;stroke-dasharray:none;stroke-dashoffset:0;stroke-opacity:1;visibility:visible;display:inline;overflow:visible;enable-background:accumulate" />
      <path
         id="path4208"
         d="M 187.11892,669.47808 L 178.91288,683.24307"
         style="fill:none;fill-opacity:1;fill-rule:evenodd;stroke:#646464;stroke-width:0.75;stroke-linecap:butt;stroke-linejoin:miter;marker:none;marker-start:none;marker-mid:none;marker-end:none;stroke-miterlimit:4;stroke-dasharray:none;stroke-dashoffset:0;stroke-opacity:1;visibility:visible;display:inline;overflow:visible;enable-background:accumulate" />
      <path
         id="path4210"
         d="M 209.88409,666.03684 L 201.94275,680.06653"
         style="fill:none;fill-opacity:1;fill-rule:evenodd;stroke:#646464;stroke-width:0.75;stroke-linecap:butt;stroke-linejoin:miter;marker:none;marker-start:none;marker-mid:none;marker-end:none;stroke-miterlimit:4;stroke-dasharray:none;stroke-dashoffset:0;stroke-opacity:1;visibility:visible;display:inline;overflow:visible;enable-background:accumulate" />
      <path
         id="path4212"
         d="M 149.26524,682.18422 L 156.14773,682.44893 L 157.20657,686.94902"
         style="fill:none;fill-opacity:1;fill-rule:evenodd;stroke:#000000;stroke-width:1;stroke-linecap:butt;stroke-linejoin:miter;marker:none;marker-start:none;marker-mid:none;marker-end:none;stroke-miterlimit:4;stroke-dasharray:none;stroke-dashoffset:0;stroke-opacity:1;visibility:visible;display:inline;overflow:visible;enable-background:accumulate" />
      <path
         id="path4214"
         d="M 155.88301,681.91951 L 164.61848,674.5076"
         style="fill:none;fill-opacity:1;fill-rule:evenodd;stroke:#000000;stroke-width:1;stroke-linecap:butt;stroke-linejoin:miter;marker:none;marker-start:none;marker-mid:none;marker-end:none;stroke-miterlimit:4;stroke-dasharray:none;stroke-dashoffset:0;stroke-opacity:1;visibility:visible;display:inline;overflow:visible;enable-background:accumulate" />
      <path
         id="path4216"
         d="M 158.00071,677.41942 L 141.58862,667.88982 C 141.58862,667.88982 135.50025,667.62511 133.64728,668.15453 C 131.7943,668.68395 127.82363,671.59577 127.82363,671.59577 L 123.05884,689.33142 C 123.05884,689.33142 123.85297,687.74315 127.82363,687.47844 C 131.7943,687.21373 136.82381,687.47844 136.82381,687.47844 L 156.41244,698.3316 L 157.73599,692.24325"
         style="fill:none;fill-opacity:1;fill-rule:evenodd;stroke:#000000;stroke-width:1;stroke-linecap:butt;stroke-linejoin:miter;marker:none;marker-start:none;marker-mid:none;marker-end:none;stroke-miterlimit:4;stroke-dasharray:none;stroke-dashoffset:0;stroke-opacity:1;visibility:visible;display:inline;overflow:visible;enable-background:accumulate" />
      <path
         id="path4218"
         d="M 140.00035,667.09569 L 141.05919,665.77213 L 142.91216,665.50742 L 142.91216,667.88982"
         style="fill:none;fill-opacity:1;fill-rule:evenodd;stroke:#000000;stroke-width:1;stroke-linecap:butt;stroke-linejoin:miter;marker:none;marker-start:none;marker-mid:none;marker-end:none;stroke-miterlimit:4;stroke-dasharray:none;stroke-dashoffset:0;stroke-opacity:1;visibility:visible;display:inline;overflow:visible;enable-background:accumulate" />
      <path
         id="path4220"
         d="M 143.7063,665.50742 L 145.02986,666.03684"
         style="fill:none;fill-opacity:1;fill-rule:evenodd;stroke:#000000;stroke-width:1;stroke-linecap:butt;stroke-linejoin:miter;marker:none;marker-start:none;marker-mid:none;marker-end:none;stroke-miterlimit:4;stroke-dasharray:none;stroke-dashoffset:0;stroke-opacity:1;visibility:visible;display:inline;overflow:visible;enable-background:accumulate" />
      <path
         id="path4222"
         d="M 145.55928,668.68395 L 145.82399,666.03684 L 160.11839,674.24289 L 160.11839,675.83116"
         style="fill:none;fill-opacity:1;fill-rule:evenodd;stroke:#000000;stroke-width:1;stroke-linecap:butt;stroke-linejoin:miter;marker:none;marker-start:none;marker-mid:none;marker-end:none;stroke-miterlimit:4;stroke-dasharray:none;stroke-dashoffset:0;stroke-opacity:1;visibility:visible;display:inline;overflow:visible;enable-background:accumulate" />
      <path
         id="path4224"
         d="M 150.05937,680.59595 L 147.94168,679.53711 L 145.82399,681.91951 L 149.52995,686.15488 L 151.11821,685.36076"
         style="fill:none;fill-opacity:1;fill-rule:evenodd;stroke:#646464;stroke-width:0.75;stroke-linecap:butt;stroke-linejoin:miter;marker:none;marker-start:none;marker-mid:none;marker-end:none;stroke-miterlimit:4;stroke-dasharray:none;stroke-dashoffset:0;stroke-opacity:1;visibility:visible;display:inline;overflow:visible;enable-background:accumulate" />
      <path
         id="path4226"
         d="M 168.99071,686.81775 L 174.17942,689.54866 L 174.04288,692.21128 L 171.78988,695.89799 C 171.78988,695.89799 171.92643,694.94218 173.90634,695.35182 C 175.88623,695.76145 178.13923,697.19517 178.13923,697.19517 L 177.66132,693.30364 C 177.66132,693.30364 176.77378,692.48437 176.02279,692.4161 C 175.27179,692.34783 174.31597,692.21128 174.31597,692.21128"
         style="fill:none;fill-opacity:1;fill-rule:evenodd;stroke:#000000;stroke-width:1;stroke-linecap:butt;stroke-linejoin:miter;marker:none;marker-start:none;marker-mid:none;marker-end:none;stroke-miterlimit:4;stroke-dasharray:none;stroke-dashoffset:0;stroke-opacity:1;visibility:visible;display:inline;overflow:visible;enable-background:accumulate" />
      <path
         id="path4228"
         d="M 171.78988,696.37591 L 172.54089,697.26344"
         style="fill:none;fill-opacity:1;fill-rule:evenodd;stroke:#000000;stroke-width:1;stroke-linecap:butt;stroke-linejoin:miter;marker:none;marker-start:none;marker-mid:none;marker-end:none;stroke-miterlimit:4;stroke-dasharray:none;stroke-dashoffset:0;stroke-opacity:1;visibility:visible;display:inline;overflow:visible;enable-background:accumulate" />
      <path
         id="path4230"
         d="M 173.01879,696.23936 L 170.83408,706.00233 C 170.83408,706.00233 171.9947,705.93405 172.67743,706.34369 C 173.36016,706.75333 173.83806,706.95814 173.83806,706.95814 L 176.36415,696.85381"
         style="fill:none;fill-opacity:1;fill-rule:evenodd;stroke:#000000;stroke-width:1;stroke-linecap:butt;stroke-linejoin:miter;marker:none;marker-start:none;marker-mid:none;marker-end:none;stroke-miterlimit:4;stroke-dasharray:none;stroke-dashoffset:0;stroke-opacity:1;visibility:visible;display:inline;overflow:visible;enable-background:accumulate" />
      <path
         id="path4232"
         d="M 133.48901,688.04665 L 132.66974,690.50447 L 133.07938,692.4161 L 135.74201,692.82573 L 137.38054,688.9342"
         style="fill:none;fill-opacity:1;fill-rule:evenodd;stroke:#646464;stroke-width:0.75;stroke-linecap:butt;stroke-linejoin:miter;marker:none;marker-start:none;marker-mid:none;marker-end:none;stroke-miterlimit:4;stroke-dasharray:none;stroke-dashoffset:0;stroke-opacity:1;visibility:visible;display:inline;overflow:visible;enable-background:accumulate" />
      <path
         id="path4234"
         d="M 124.8184,689.61693 L 124.40877,692.4161 L 129.59748,691.80164 L 136.42473,693.84982 L 143.11543,697.94617"
         style="fill:none;fill-opacity:1;fill-rule:evenodd;stroke:#646464;stroke-width:0.75;stroke-linecap:butt;stroke-linejoin:miter;marker:none;marker-start:none;marker-mid:none;marker-end:none;stroke-miterlimit:4;stroke-dasharray:none;stroke-dashoffset:0;stroke-opacity:1;visibility:visible;display:inline;overflow:visible;enable-background:accumulate" />
      <path
         id="path4236"
         d="M 130.68984,688.45629 L 129.73402,690.91411"
         style="fill:none;fill-opacity:1;fill-rule:evenodd;stroke:#646464;stroke-width:0.75;stroke-linecap:butt;stroke-linejoin:miter;marker:none;marker-start:none;marker-mid:none;marker-end:none;stroke-miterlimit:4;stroke-dasharray:none;stroke-dashoffset:0;stroke-opacity:1;visibility:visible;display:inline;overflow:visible;enable-background:accumulate" />
      <path
         id="path4238"
         d="M 138.06327,690.36792 L 136.97091,692.894"
         style="fill:none;fill-opacity:1;fill-rule:evenodd;stroke:#646464;stroke-width:0.75;stroke-linecap:butt;stroke-linejoin:miter;marker:none;marker-start:none;marker-mid:none;marker-end:none;stroke-miterlimit:4;stroke-dasharray:none;stroke-dashoffset:0;stroke-opacity:1;visibility:visible;display:inline;overflow:visible;enable-background:accumulate" />
      <path
         id="path4240"
         d="M 144.00298,693.78155 L 142.56925,696.71727"
         style="fill:none;fill-opacity:1;fill-rule:evenodd;stroke:#646464;stroke-width:0.75;stroke-linecap:butt;stroke-linejoin:miter;marker:none;marker-start:none;marker-mid:none;marker-end:none;stroke-miterlimit:4;stroke-dasharray:none;stroke-dashoffset:0;stroke-opacity:1;visibility:visible;display:inline;overflow:visible;enable-background:accumulate" />
      <path
         id="path4242"
         d="M 128.43684,694.19118 L 127.41275,698.15099"
         style="fill:none;fill-opacity:1;fill-rule:evenodd;stroke:#646464;stroke-width:0.75;stroke-linecap:butt;stroke-linejoin:miter;marker:none;marker-start:none;marker-mid:none;marker-end:none;stroke-miterlimit:4;stroke-dasharray:none;stroke-dashoffset:0;stroke-opacity:1;visibility:visible;display:inline;overflow:visible;enable-background:accumulate" />
      <path
         id="path4244"
         d="M 126.52522,696.03454 L 125.50113,699.92607"
         style="fill:none;fill-opacity:1;fill-rule:evenodd;stroke:#646464;stroke-width:0.75;stroke-linecap:butt;stroke-linejoin:miter;marker:none;marker-start:none;marker-mid:none;marker-end:none;stroke-miterlimit:4;stroke-dasharray:none;stroke-dashoffset:0;stroke-opacity:1;visibility:visible;display:inline;overflow:visible;enable-background:accumulate" />
      <path
         id="path4246"
         d="M 129.18784,698.28753 L 128.09548,702.38388"
         style="fill:none;fill-opacity:1;fill-rule:evenodd;stroke:#646464;stroke-width:0.75;stroke-linecap:butt;stroke-linejoin:miter;marker:none;marker-start:none;marker-mid:none;marker-end:none;stroke-miterlimit:4;stroke-dasharray:none;stroke-dashoffset:0;stroke-opacity:1;visibility:visible;display:inline;overflow:visible;enable-background:accumulate" />
      <path
         id="path4248"
         d="M 132.60146,694.80564 L 131.44083,698.42408"
         style="fill:none;fill-opacity:1;fill-rule:evenodd;stroke:#646464;stroke-width:0.75;stroke-linecap:butt;stroke-linejoin:miter;marker:none;marker-start:none;marker-mid:none;marker-end:none;stroke-miterlimit:4;stroke-dasharray:none;stroke-dashoffset:0;stroke-opacity:1;visibility:visible;display:inline;overflow:visible;enable-background:accumulate" />
      <path
         id="path4250"
         d="M 133.42074,696.99035 L 132.05529,700.33571"
         style="fill:none;fill-opacity:1;fill-rule:evenodd;stroke:#646464;stroke-width:0.75;stroke-linecap:butt;stroke-linejoin:miter;marker:none;marker-start:none;marker-mid:none;marker-end:none;stroke-miterlimit:4;stroke-dasharray:none;stroke-dashoffset:0;stroke-opacity:1;visibility:visible;display:inline;overflow:visible;enable-background:accumulate" />
      <path
         id="path4252"
         d="M 132.19183,702.79352 L 133.07938,700.19917"
         style="fill:none;fill-opacity:1;fill-rule:evenodd;stroke:#646464;stroke-width:0.75;stroke-linecap:butt;stroke-linejoin:miter;marker:none;marker-start:none;marker-mid:none;marker-end:none;stroke-miterlimit:4;stroke-dasharray:none;stroke-dashoffset:0;stroke-opacity:1;visibility:visible;display:inline;overflow:visible;enable-background:accumulate" />
      <path
         id="path4254"
         d="M 132.80629,704.63688 L 133.89864,701.15498"
         style="fill:none;fill-opacity:1;fill-rule:evenodd;stroke:#646464;stroke-width:0.75;stroke-linecap:butt;stroke-linejoin:miter;marker:none;marker-start:none;marker-mid:none;marker-end:none;stroke-miterlimit:4;stroke-dasharray:none;stroke-dashoffset:0;stroke-opacity:1;visibility:visible;display:inline;overflow:visible;enable-background:accumulate" />
      <path
         id="path4256"
         d="M 136.28818,700.74534 L 137.65363,696.51245"
         style="fill:none;fill-opacity:1;fill-rule:evenodd;stroke:#646464;stroke-width:0.75;stroke-linecap:butt;stroke-linejoin:miter;marker:none;marker-start:none;marker-mid:none;marker-end:none;stroke-miterlimit:4;stroke-dasharray:none;stroke-dashoffset:0;stroke-opacity:1;visibility:visible;display:inline;overflow:visible;enable-background:accumulate" />
      <path
         id="path4258"
         d="M 137.65363,716.78938 L 138.67772,712.82957"
         style="fill:none;fill-opacity:1;fill-rule:evenodd;stroke:#000000;stroke-width:1;stroke-linecap:butt;stroke-linejoin:miter;marker:none;marker-start:none;marker-mid:none;marker-end:none;stroke-miterlimit:4;stroke-dasharray:none;stroke-dashoffset:0;stroke-opacity:1;visibility:visible;display:inline;overflow:visible;enable-background:accumulate" />
      <path
         id="path4260"
         d="M 137.79018,712.21513 L 139.56527,713.03439 L 142.36444,704.84169"
         style="fill:none;fill-opacity:1;fill-rule:evenodd;stroke:#000000;stroke-width:1;stroke-linecap:butt;stroke-linejoin:miter;marker:none;marker-start:none;marker-mid:none;marker-end:none;stroke-miterlimit:4;stroke-dasharray:none;stroke-dashoffset:0;stroke-opacity:1;visibility:visible;display:inline;overflow:visible;enable-background:accumulate" />
      <path
         id="path4262"
         d="M 137.58536,711.73722 L 139.36045,705.93405"
         style="fill:none;fill-opacity:1;fill-rule:evenodd;stroke:#000000;stroke-width:1;stroke-linecap:butt;stroke-linejoin:miter;marker:none;marker-start:none;marker-mid:none;marker-end:none;stroke-miterlimit:4;stroke-dasharray:none;stroke-dashoffset:0;stroke-opacity:1;visibility:visible;display:inline;overflow:visible;enable-background:accumulate" />
      <path
         id="path4264"
         d="M 134.24001,703.88587 C 136.01509,703.61279 139.2239,705.45615 139.2239,705.45615"
         style="fill:none;fill-opacity:1;fill-rule:evenodd;stroke:#000000;stroke-width:1;stroke-linecap:butt;stroke-linejoin:miter;marker:none;marker-start:none;marker-mid:none;marker-end:none;stroke-miterlimit:4;stroke-dasharray:none;stroke-dashoffset:0;stroke-opacity:1;visibility:visible;display:inline;overflow:visible;enable-background:accumulate" />
      <path
         id="path4266"
         d="M 139.63354,705.31961 L 140.11144,702.58871"
         style="fill:none;fill-opacity:1;fill-rule:evenodd;stroke:#646464;stroke-width:0.75;stroke-linecap:butt;stroke-linejoin:miter;marker:none;marker-start:none;marker-mid:none;marker-end:none;stroke-miterlimit:4;stroke-dasharray:none;stroke-dashoffset:0;stroke-opacity:1;visibility:visible;display:inline;overflow:visible;enable-background:accumulate" />
      <path
         id="path4268"
         d="M 134.71792,700.33571 L 134.03519,703.74933 C 135.67373,704.97824 138.06327,705.79751 138.06327,705.79751"
         style="fill:none;fill-opacity:1;fill-rule:evenodd;stroke:#646464;stroke-width:0.75;stroke-linecap:butt;stroke-linejoin:miter;marker:none;marker-start:none;marker-mid:none;marker-end:none;stroke-miterlimit:4;stroke-dasharray:none;stroke-dashoffset:0;stroke-opacity:1;visibility:visible;display:inline;overflow:visible;enable-background:accumulate" />
      <path
         id="path4270"
         d="M 145.30015,695.21527 L 150.69368,697.33171 L 149.05514,702.04252 L 146.52906,702.04252"
         style="fill:none;fill-opacity:1;fill-rule:evenodd;stroke:#646464;stroke-width:0.75;stroke-linecap:butt;stroke-linejoin:miter;marker:none;marker-start:none;marker-mid:none;marker-end:none;stroke-miterlimit:4;stroke-dasharray:none;stroke-dashoffset:0;stroke-opacity:1;visibility:visible;display:inline;overflow:visible;enable-background:accumulate" />
      <path
         id="path4272"
         d="M 150.62541,697.39999 L 151.99086,696.58072"
         style="fill:none;fill-opacity:1;fill-rule:evenodd;stroke:#646464;stroke-width:0.75;stroke-linecap:butt;stroke-linejoin:miter;marker:none;marker-start:none;marker-mid:none;marker-end:none;stroke-miterlimit:4;stroke-dasharray:none;stroke-dashoffset:0;stroke-opacity:1;visibility:visible;display:inline;overflow:visible;enable-background:accumulate" />
      <path
         id="path4274"
         d="M 145.4367,695.35182 L 144.95879,692.68919"
         style="fill:none;fill-opacity:1;fill-rule:evenodd;stroke:#646464;stroke-width:0.75;stroke-linecap:butt;stroke-linejoin:miter;marker:none;marker-start:none;marker-mid:none;marker-end:none;stroke-miterlimit:4;stroke-dasharray:none;stroke-dashoffset:0;stroke-opacity:1;visibility:visible;display:inline;overflow:visible;enable-background:accumulate" />
      <path
         id="path4276"
         d="M 150.42059,700.40398 L 154.17558,700.47225 L 155.33622,699.65298 L 151.78604,699.51644 L 150.42059,700.40398 z"
         style="fill:none;fill-opacity:1;fill-rule:evenodd;stroke:#646464;stroke-width:0.75;stroke-linecap:butt;stroke-linejoin:miter;marker:none;marker-start:none;marker-mid:none;marker-end:none;stroke-miterlimit:4;stroke-dasharray:none;stroke-dashoffset:0;stroke-opacity:1;visibility:visible;display:inline;overflow:visible;enable-background:accumulate" />
      <path
         id="path4278"
         d="M 151.58123,699.44817 L 152.19567,696.92208"
         style="fill:none;fill-opacity:1;fill-rule:evenodd;stroke:#646464;stroke-width:0.75;stroke-linecap:butt;stroke-linejoin:miter;marker:none;marker-start:none;marker-mid:none;marker-end:none;stroke-miterlimit:4;stroke-dasharray:none;stroke-dashoffset:0;stroke-opacity:1;visibility:visible;display:inline;overflow:visible;enable-background:accumulate" />
      <path
         id="path4280"
         d="M 123.10578,692.26803 C 123.76116,695.46302 125.39962,697.1834 125.39962,697.1834"
         style="fill:none;fill-opacity:1;fill-rule:evenodd;stroke:#000000;stroke-width:1;stroke-linecap:butt;stroke-linejoin:miter;marker:none;marker-start:none;marker-mid:none;marker-end:none;stroke-miterlimit:4;stroke-dasharray:none;stroke-dashoffset:0;stroke-opacity:1;visibility:visible;display:inline;overflow:visible;enable-background:accumulate" />
      <path
         id="path4282"
         d="M 126.46462,698.33032 L 127.52961,699.3134"
         style="fill:none;fill-opacity:1;fill-rule:evenodd;stroke:#000000;stroke-width:1;stroke-linecap:butt;stroke-linejoin:miter;marker:none;marker-start:none;marker-mid:none;marker-end:none;stroke-miterlimit:4;stroke-dasharray:none;stroke-dashoffset:0;stroke-opacity:1;visibility:visible;display:inline;overflow:visible;enable-background:accumulate" />
      <path
         id="path4284"
         d="M 129.41383,700.54223 L 131.95344,702.42646"
         style="fill:none;fill-opacity:1;fill-rule:evenodd;stroke:#000000;stroke-width:1;stroke-linecap:butt;stroke-linejoin:miter;marker:none;marker-start:none;marker-mid:none;marker-end:none;stroke-miterlimit:4;stroke-dasharray:none;stroke-dashoffset:0;stroke-opacity:1;visibility:visible;display:inline;overflow:visible;enable-background:accumulate" />
      <path
         id="path4286"
         d="M 142.68533,706.35875 L 147.6007,705.86722 L 153.58107,701.52531"
         style="fill:none;fill-opacity:1;fill-rule:evenodd;stroke:#000000;stroke-width:1;stroke-linecap:butt;stroke-linejoin:miter;marker:none;marker-start:none;marker-mid:none;marker-end:none;stroke-miterlimit:4;stroke-dasharray:none;stroke-dashoffset:0;stroke-opacity:1;visibility:visible;display:inline;overflow:visible;enable-background:accumulate" />
    </g>
    <g
       id="g4448"
       transform="translate(0,-4)">
      <g
         style="fill:none;stroke:#000000;stroke-width:1.000018;stroke-miterlimit:4;stroke-dasharray:none;stroke-opacity:1"
         transform="matrix(0.999982,0,0,0.999982,86.780783,342.41531)"
         id="g119">
        <path
           sodipodi:nodetypes="csssssssssssssssssccccscscccccccscsscccccsscccccccccccccccccsccccccccccccsssccccc"
           id="path121"
           style="fill:none;stroke:#000000;stroke-width:1.000018;stroke-miterlimit:4;stroke-dasharray:none;stroke-opacity:1"
           d="M 144.381,20.621 C 149.158,20.977 153.153,22.932 156.747,24.491 C 160.341,26.051 163.146,28.413 165.944,29.98 C 168.743,31.547 173.40467,34.812331 174.20467,35.203331 C 175.00367,35.594331 175.952,37.053 175.174,39.049 C 174.396,41.045 173.223,42.205559 172.03,42.215559 C 170.837,42.226559 166.76311,41.468559 164.37311,41.091559 C 161.98311,40.714559 157.24456,40.47689 154.06556,40.90189 C 150.88656,41.32789 147.734,40.084 145.814,48.057 C 143.895,56.03 143.901,56.826 142.726,58.825 C 141.55,60.824 137.216,65.636 136.438,67.632 C 135.66,69.628 132.896,72.039 132.52,74.429 C 132.143,76.819 132.174,80.399 131.389,81.599 C 130.603,82.8 125.854,85.625 123.876,86.836 C 121.898,88.046 119.113,88.071 117.934,89.672 C 116.755,91.274 115.966,92.076 112.452,99.665 C 108.938,107.254 106.223,115.234 106.638,117.22 C 107.053,119.205 109.45,120.378 109.464,121.969 C 109.478,123.56 107.091,123.581 107.091,123.581 L 102.304,122.032 L 102.269,118.054 L 104.192,110.479 C 104.192,110.479 97.015,108.553 95.42,108.169 C 93.825,107.785 89.446,107.425 89.446,107.425 C 89.446,107.425 86.64,105.063 84.243,103.89 C 81.846,102.718 77.062,101.566 77.062,101.566 L 81.808,98.342 L 85.388,98.311 L 86.602,100.687 L 94.98,103.399 L 103.745,104.914 L 108.009,92.147 C 108.009,92.147 108.77,88.162 107.176,87.778 C 105.582,87.394 99.593,85.059 88.048,83.967 C 76.502,82.874 80.469,81.646 77.274,80.083 C 74.078,78.52 72.065,75.752 69.291,76.97 C 66.517,78.188 67.728,80.166 67.728,80.166 L 64.968,82.975 L 57.822,84.629 L 51.071,85.881 L 49.497,87.883 C 49.497,87.883 54.71,92.612 57.117,94.977 C 59.525,97.343 61.52,98.121 61.555,102.099 C 61.59,106.077 61.569,103.69 61.569,103.69 L 54.398,102.559 L 53.969,98.982 L 45.948,91.494 L 41.538,87.555 L 38.349,86.787 L 38.08,101.509 L 30.166,106.352 L 22.601,105.623 L 24.143,100.04 L 29.31,99.597 L 32.852,95.19 L 31.115,78.497 L 33.474,75.294 L 43.823,75.999 L 47.787,74.373 L 44.562,69.627 C 44.562,69.627 42.145,66.068 42.532,64.871 C 42.92,63.674 43.542212,55.220694 43.542212,55.220694 L 33.18378,63.006457 L 25.065,67.218956 L 18.539956,69.355086 L 10.868218,69.854086 L 3.3134025,67.569736 L 0.697,57.679 L 7.9733944,62.420193 L 13.855,61.144 L 24.66513,59.435392 L 31.680696,56.310914 L 54.705,46.864 C 54.705,46.864 63.445,45.593 69.81,45.539 C 76.175,45.484 79.783,48.635 86.942,48.572 C 94.102,48.51 114.382,47.537 119.525,44.31 C 124.668,41.082 130.953,31.878 130.953,31.878 L 138.832,23.058 L 137.6013,18.285 L 143.169,18.644 L 144.381,20.621 z" />
      </g>
      <path
         id="path4428"
         d="M 157.33427,409.42451 L 158.26158,415.2975 L 156.71606,418.07944"
         style="opacity:1;fill:none;fill-opacity:1;fill-rule:evenodd;stroke:#646464;stroke-width:0.75;stroke-linecap:butt;stroke-linejoin:miter;marker:none;marker-start:none;marker-mid:none;marker-end:none;stroke-miterlimit:4;stroke-dasharray:none;stroke-dashoffset:0;stroke-opacity:1;visibility:visible;display:inline;overflow:visible;enable-background:accumulate" />
      <path
         id="path4430"
         d="M 127.66022,427.35258 L 127.66022,424.57063 L 137.24247,423.64332"
         style="opacity:1;fill:none;fill-opacity:1;fill-rule:evenodd;stroke:#000000;stroke-width:1;stroke-linecap:butt;stroke-linejoin:miter;marker:none;marker-start:none;marker-mid:none;marker-end:none;stroke-miterlimit:4;stroke-dasharray:none;stroke-dashoffset:0;stroke-opacity:1;visibility:visible;display:inline;overflow:visible;enable-background:accumulate" />
      <path
         id="path4432"
         d="M 198.75429,419.00675 L 195.97235,426.73437 L 195.04504,430.75273"
         style="opacity:1;fill:none;fill-opacity:1;fill-rule:evenodd;stroke:#646464;stroke-width:0.75;stroke-linecap:butt;stroke-linejoin:miter;marker:none;marker-start:none;marker-mid:none;marker-end:none;stroke-miterlimit:4;stroke-dasharray:none;stroke-dashoffset:0;stroke-opacity:1;visibility:visible;display:inline;overflow:visible;enable-background:accumulate" />
      <path
         id="path4434"
         d="M 218.84609,403.55152 C 215.44594,407.26077 214.20952,413.44287 214.20952,413.44287"
         style="opacity:1;fill:none;fill-opacity:1;fill-rule:evenodd;stroke:#646464;stroke-width:0.75;stroke-linecap:butt;stroke-linejoin:miter;marker:none;marker-start:none;marker-mid:none;marker-end:none;stroke-miterlimit:4;stroke-dasharray:none;stroke-dashoffset:0;stroke-opacity:1;visibility:visible;display:inline;overflow:visible;enable-background:accumulate" />
      <path
         id="path4436"
         d="M 191.02515,447.3947 L 190.69805,452.79181"
         style="opacity:1;fill:none;fill-opacity:1;fill-rule:evenodd;stroke:#000000;stroke-width:1;stroke-linecap:butt;stroke-linejoin:miter;marker:none;marker-start:none;marker-mid:none;marker-end:none;stroke-miterlimit:4;stroke-dasharray:none;stroke-dashoffset:0;stroke-opacity:1;visibility:visible;display:inline;overflow:visible;enable-background:accumulate" />
    </g>
    <g
       id="g4457"
       transform="translate(4.9879755,-46.114724)">
      <path
         id="path5216"
         d="M 243.30561,562.99311 C 240.19861,559.68135 233.59851,555.51737 232.69985,555.18796 C 231.50166,554.74899 224.94722,555.38795 214.22183,556.09398 C 203.49633,556.79982 185.28564,562.04623 175.02786,561.99625 L 171.93627,562.51483 C 159.75971,558.33276 151.75618,555.50557 144.17492,551.56039 C 132.12984,545.29216 114.63465,535.66756 114.63465,535.66756 L 113.59716,536.90876 L 112.49903,535.74926 L 114.32653,559.70882 L 115.10882,565.48609 L 100.77055,560.02633 L 96.550113,561.1888 L 110.70475,571.46138 L 109.17926,571.51971 C 109.17926,571.51971 110.3226,575.08955 111.7414,576.22779 C 113.16034,577.3659 144.28638,584.21432 149.81494,584.3855 C 155.34326,584.55686 227.69393,579.53255 231.29351,578.06979 C 234.89308,576.60718 244.55708,568.72047 244.85106,565.73752 C 244.92457,564.99177 244.34126,564.09705 243.30561,562.99311 z M 150.81391,565.52425 L 128.77618,568.56863 L 119.52526,542.88991 L 150.81391,565.52425 z"
         style="fill:none;fill-opacity:1;fill-rule:evenodd;stroke:#000000;stroke-width:1;stroke-linecap:butt;stroke-linejoin:miter;stroke-miterlimit:4;stroke-dasharray:none;stroke-opacity:1" />
      <path
         id="path4438"
         d="M 172.16322,562.54571 L 182.74431,566.9545"
         style="opacity:1;fill:none;fill-opacity:1;fill-rule:evenodd;stroke:#000000;stroke-width:1;stroke-linecap:butt;stroke-linejoin:miter;marker:none;marker-start:none;marker-mid:none;marker-end:none;stroke-miterlimit:4;stroke-dasharray:none;stroke-dashoffset:0;stroke-opacity:1;visibility:visible;display:inline;overflow:visible;enable-background:accumulate" />
      <path
         id="path4440"
         d="M 150.56015,565.41142 L 158.49597,570.92241"
         style="opacity:1;fill:none;fill-opacity:1;fill-rule:evenodd;stroke:#000000;stroke-width:1;stroke-linecap:butt;stroke-linejoin:miter;marker:none;marker-start:none;marker-mid:none;marker-end:none;stroke-miterlimit:4;stroke-dasharray:none;stroke-dashoffset:0;stroke-opacity:1;visibility:visible;display:inline;overflow:visible;enable-background:accumulate" />
      <path
         id="path4442"
         d="M 119.47819,542.48572 L 113.74676,537.41561"
         style="opacity:1;fill:none;fill-opacity:1;fill-rule:evenodd;stroke:#000000;stroke-width:1;stroke-linecap:butt;stroke-linejoin:miter;marker:none;marker-start:none;marker-mid:none;marker-end:none;stroke-miterlimit:4;stroke-dasharray:none;stroke-dashoffset:0;stroke-opacity:1;visibility:visible;display:inline;overflow:visible;enable-background:accumulate" />
      <path
         id="path4444"
         d="M 114.84896,565.63186 L 129.83884,571.14285"
         style="opacity:1;fill:none;fill-opacity:1;fill-rule:evenodd;stroke:#000000;stroke-width:1;stroke-linecap:butt;stroke-linejoin:miter;marker:none;marker-start:none;marker-mid:none;marker-end:none;stroke-miterlimit:4;stroke-dasharray:none;stroke-dashoffset:0;stroke-opacity:1;visibility:visible;display:inline;overflow:visible;enable-background:accumulate" />
      <path
         id="path4446"
         d="M 110.66061,571.36329 L 114.62852,573.34724 L 114.62852,573.34724"
         style="opacity:1;fill:none;fill-opacity:1;fill-rule:evenodd;stroke:#000000;stroke-width:1;stroke-linecap:butt;stroke-linejoin:miter;marker:none;marker-start:none;marker-mid:none;marker-end:none;stroke-miterlimit:4;stroke-dasharray:none;stroke-dashoffset:0;stroke-opacity:1;visibility:visible;display:inline;overflow:visible;enable-background:accumulate" />
    </g>
    <g
       id="g4612"
       transform="translate(-241.46611,-146.33791)">
      <path
         transform="matrix(4.5122567,0,0,4.5122567,676.41283,-360.54351)"
         sodipodi:open="true"
         sodipodi:end="10.575948"
         sodipodi:start="4.2932211"
         d="M -58.672671,193.29752 A 4.6998582,4.6998582 0 1 1 -58.674639,193.2984"
         sodipodi:ry="4.6998582"
         sodipodi:rx="4.6998582"
         sodipodi:cy="197.5905"
         sodipodi:cx="-56.759827"
         id="path4129"
         style="fill:#ffffff;fill-opacity:1;stroke:#000000;stroke-width:0.55404651;stroke-miterlimit:4;stroke-dasharray:none;stroke-dashoffset:0;stroke-opacity:1"
         sodipodi:type="arc" />
      <path
         sodipodi:nodetypes="ccc"
         id="path4131"
         d="M 419.98968,513.50164 L 419.98968,532.70025 L 429.80966,526.08005"
         style="fill:none;fill-rule:evenodd;stroke:#000000;stroke-width:2.5;stroke-linecap:butt;stroke-linejoin:miter;stroke-miterlimit:4;stroke-dasharray:none;stroke-opacity:1" />
      <g
         transform="translate(4.7716155,-1.5905385)"
         id="g4549">
        <path
           style="fill:none;fill-rule:evenodd;stroke:#000000;stroke-width:1.25;stroke-linecap:butt;stroke-linejoin:miter;stroke-miterlimit:4;stroke-dasharray:none;stroke-opacity:1"
           d="M 415.21805,549.54489 L 415.21805,545.90377"
           id="path4135" />
        <path
           style="fill:none;fill-rule:evenodd;stroke:#000000;stroke-width:1.25;stroke-linecap:butt;stroke-linejoin:miter;stroke-miterlimit:4;stroke-dasharray:none;stroke-opacity:1"
           d="M 415.21801,518.92638 L 415.21801,515.28526"
           id="path4137" />
        <g
           id="g4141"
           transform="matrix(4.5122567,0,0,4.5122567,671.92183,-358.90744)"
           style="stroke-width:0.27702326;stroke-miterlimit:4;stroke-dasharray:none">
          <path
             id="path4143"
             d="M -60.618311,197.58042 L -59.811371,197.58042"
             style="fill:none;fill-rule:evenodd;stroke:#000000;stroke-width:0.27702326;stroke-linecap:butt;stroke-linejoin:miter;stroke-miterlimit:4;stroke-dasharray:none;stroke-opacity:1" />
          <path
             id="path4145"
             d="M -53.83268,197.58041 L -53.02574,197.58041"
             style="fill:none;fill-rule:evenodd;stroke:#000000;stroke-width:0.27702326;stroke-linecap:butt;stroke-linejoin:miter;stroke-miterlimit:4;stroke-dasharray:none;stroke-opacity:1" />
        </g>
        <g
           id="g4147"
           transform="matrix(3.9077289,-2.2561284,2.2561284,3.9077289,191.80454,-367.66238)"
           style="stroke-width:0.27702326;stroke-miterlimit:4;stroke-dasharray:none">
          <path
             id="path4149"
             d="M -60.618311,197.58042 L -59.811371,197.58042"
             style="fill:none;fill-rule:evenodd;stroke:#000000;stroke-width:0.27702326;stroke-linecap:butt;stroke-linejoin:miter;stroke-miterlimit:4;stroke-dasharray:none;stroke-opacity:1" />
          <path
             id="path4151"
             d="M -53.83268,197.58041 L -53.02574,197.58041"
             style="fill:none;fill-rule:evenodd;stroke:#000000;stroke-width:0.27702326;stroke-linecap:butt;stroke-linejoin:miter;stroke-miterlimit:4;stroke-dasharray:none;stroke-opacity:1" />
        </g>
        <g
           id="g4153"
           transform="matrix(2.2561284,-3.9077289,3.9077289,2.2561284,-228.36665,-135.18574)"
           style="stroke-width:0.27702326;stroke-miterlimit:4;stroke-dasharray:none">
          <path
             id="path4155"
             d="M -60.618311,197.58042 L -59.811371,197.58042"
             style="fill:none;fill-rule:evenodd;stroke:#000000;stroke-width:0.27702326;stroke-linecap:butt;stroke-linejoin:miter;stroke-miterlimit:4;stroke-dasharray:none;stroke-opacity:1" />
          <path
             id="path4157"
             d="M -53.83268,197.58041 L -53.02574,197.58041"
             style="fill:none;fill-rule:evenodd;stroke:#000000;stroke-width:0.27702326;stroke-linecap:butt;stroke-linejoin:miter;stroke-miterlimit:4;stroke-dasharray:none;stroke-opacity:1" />
        </g>
        <g
           id="g4159"
           transform="matrix(-2.2561284,-3.9077289,3.9077289,-2.2561284,-484.76224,756.34779)"
           style="stroke-width:0.27702326;stroke-miterlimit:4;stroke-dasharray:none">
          <path
             id="path4161"
             d="M -60.618311,197.58042 L -59.811371,197.58042"
             style="fill:none;fill-rule:evenodd;stroke:#000000;stroke-width:0.27702326;stroke-linecap:butt;stroke-linejoin:miter;stroke-miterlimit:4;stroke-dasharray:none;stroke-opacity:1" />
          <path
             id="path4163"
             d="M -53.83268,197.58041 L -53.02574,197.58041"
             style="fill:none;fill-rule:evenodd;stroke:#000000;stroke-width:0.27702326;stroke-linecap:butt;stroke-linejoin:miter;stroke-miterlimit:4;stroke-dasharray:none;stroke-opacity:1" />
        </g>
        <g
           id="g4165"
           transform="matrix(-3.9077289,-2.2561284,2.2561284,-3.9077289,-252.28558,1176.519)"
           style="stroke-width:0.27702326;stroke-miterlimit:4;stroke-dasharray:none">
          <path
             id="path4167"
             d="M -60.618311,197.58042 L -59.811371,197.58042"
             style="fill:none;fill-rule:evenodd;stroke:#000000;stroke-width:0.27702326;stroke-linecap:butt;stroke-linejoin:miter;stroke-miterlimit:4;stroke-dasharray:none;stroke-opacity:1" />
          <path
             id="path4169"
             d="M -53.83268,197.58041 L -53.02574,197.58041"
             style="fill:none;fill-rule:evenodd;stroke:#000000;stroke-width:0.27702326;stroke-linecap:butt;stroke-linejoin:miter;stroke-miterlimit:4;stroke-dasharray:none;stroke-opacity:1" />
        </g>
      </g>
      <path
         id="path4610"
         d="M 411.25591,511.85602 L 412.04222,511.50499"
         style="opacity:1;fill:none;fill-opacity:1;fill-rule:evenodd;stroke:#000000;stroke-width:2.5;stroke-linecap:butt;stroke-linejoin:miter;marker:none;marker-start:none;marker-mid:none;marker-end:none;stroke-miterlimit:4;stroke-dasharray:none;stroke-dashoffset:0;stroke-opacity:1;visibility:visible;display:inline;overflow:visible;enable-background:accumulate" />
    </g>
    <g
       id="g4635"
       transform="translate(-234.75023,-18.96191)">
      <path
         transform="matrix(4.5122567,0,0,4.5122567,676.41283,-360.54351)"
         sodipodi:open="true"
         sodipodi:end="10.575948"
         sodipodi:start="4.2932211"
         d="M -58.672671,193.29752 A 4.6998582,4.6998582 0 1 1 -58.674639,193.2984"
         sodipodi:ry="4.6998582"
         sodipodi:rx="4.6998582"
         sodipodi:cy="197.5905"
         sodipodi:cx="-56.759827"
         id="path4637"
         style="fill:#ffffff;fill-opacity:1;stroke:#000000;stroke-width:0.55404651;stroke-miterlimit:4;stroke-dasharray:none;stroke-dashoffset:0;stroke-opacity:1"
         sodipodi:type="arc" />
      <path
         sodipodi:nodetypes="ccc"
         id="path4639"
         d="M 419.98968,513.50164 L 419.98968,532.70025 L 429.80966,526.08005"
         style="fill:none;fill-rule:evenodd;stroke:#000000;stroke-width:2.5;stroke-linecap:butt;stroke-linejoin:miter;stroke-miterlimit:4;stroke-dasharray:none;stroke-opacity:1" />
      <g
         transform="translate(4.7716155,-1.5905385)"
         id="g4641">
        <path
           style="fill:none;fill-rule:evenodd;stroke:#000000;stroke-width:1.25;stroke-linecap:butt;stroke-linejoin:miter;stroke-miterlimit:4;stroke-dasharray:none;stroke-opacity:1"
           d="M 415.21805,549.54489 L 415.21805,545.90377"
           id="path4643" />
        <path
           style="fill:none;fill-rule:evenodd;stroke:#000000;stroke-width:1.25;stroke-linecap:butt;stroke-linejoin:miter;stroke-miterlimit:4;stroke-dasharray:none;stroke-opacity:1"
           d="M 415.21801,518.92638 L 415.21801,515.28526"
           id="path4645" />
        <g
           id="g4647"
           transform="matrix(4.5122567,0,0,4.5122567,671.92183,-358.90744)"
           style="stroke-width:0.27702326;stroke-miterlimit:4;stroke-dasharray:none">
          <path
             id="path4649"
             d="M -60.618311,197.58042 L -59.811371,197.58042"
             style="fill:none;fill-rule:evenodd;stroke:#000000;stroke-width:0.27702326;stroke-linecap:butt;stroke-linejoin:miter;stroke-miterlimit:4;stroke-dasharray:none;stroke-opacity:1" />
          <path
             id="path4651"
             d="M -53.83268,197.58041 L -53.02574,197.58041"
             style="fill:none;fill-rule:evenodd;stroke:#000000;stroke-width:0.27702326;stroke-linecap:butt;stroke-linejoin:miter;stroke-miterlimit:4;stroke-dasharray:none;stroke-opacity:1" />
        </g>
        <g
           id="g4653"
           transform="matrix(3.9077289,-2.2561284,2.2561284,3.9077289,191.80454,-367.66238)"
           style="stroke-width:0.27702326;stroke-miterlimit:4;stroke-dasharray:none">
          <path
             id="path4655"
             d="M -60.618311,197.58042 L -59.811371,197.58042"
             style="fill:none;fill-rule:evenodd;stroke:#000000;stroke-width:0.27702326;stroke-linecap:butt;stroke-linejoin:miter;stroke-miterlimit:4;stroke-dasharray:none;stroke-opacity:1" />
          <path
             id="path4657"
             d="M -53.83268,197.58041 L -53.02574,197.58041"
             style="fill:none;fill-rule:evenodd;stroke:#000000;stroke-width:0.27702326;stroke-linecap:butt;stroke-linejoin:miter;stroke-miterlimit:4;stroke-dasharray:none;stroke-opacity:1" />
        </g>
        <g
           id="g4659"
           transform="matrix(2.2561284,-3.9077289,3.9077289,2.2561284,-228.36665,-135.18574)"
           style="stroke-width:0.27702326;stroke-miterlimit:4;stroke-dasharray:none">
          <path
             id="path4661"
             d="M -60.618311,197.58042 L -59.811371,197.58042"
             style="fill:none;fill-rule:evenodd;stroke:#000000;stroke-width:0.27702326;stroke-linecap:butt;stroke-linejoin:miter;stroke-miterlimit:4;stroke-dasharray:none;stroke-opacity:1" />
          <path
             id="path4663"
             d="M -53.83268,197.58041 L -53.02574,197.58041"
             style="fill:none;fill-rule:evenodd;stroke:#000000;stroke-width:0.27702326;stroke-linecap:butt;stroke-linejoin:miter;stroke-miterlimit:4;stroke-dasharray:none;stroke-opacity:1" />
        </g>
        <g
           id="g4665"
           transform="matrix(-2.2561284,-3.9077289,3.9077289,-2.2561284,-484.76224,756.34779)"
           style="stroke-width:0.27702326;stroke-miterlimit:4;stroke-dasharray:none">
          <path
             id="path4667"
             d="M -60.618311,197.58042 L -59.811371,197.58042"
             style="fill:none;fill-rule:evenodd;stroke:#000000;stroke-width:0.27702326;stroke-linecap:butt;stroke-linejoin:miter;stroke-miterlimit:4;stroke-dasharray:none;stroke-opacity:1" />
          <path
             id="path4669"
             d="M -53.83268,197.58041 L -53.02574,197.58041"
             style="fill:none;fill-rule:evenodd;stroke:#000000;stroke-width:0.27702326;stroke-linecap:butt;stroke-linejoin:miter;stroke-miterlimit:4;stroke-dasharray:none;stroke-opacity:1" />
        </g>
        <g
           id="g4671"
           transform="matrix(-3.9077289,-2.2561284,2.2561284,-3.9077289,-252.28558,1176.519)"
           style="stroke-width:0.27702326;stroke-miterlimit:4;stroke-dasharray:none">
          <path
             id="path4673"
             d="M -60.618311,197.58042 L -59.811371,197.58042"
             style="fill:none;fill-rule:evenodd;stroke:#000000;stroke-width:0.27702326;stroke-linecap:butt;stroke-linejoin:miter;stroke-miterlimit:4;stroke-dasharray:none;stroke-opacity:1" />
          <path
             id="path4675"
             d="M -53.83268,197.58041 L -53.02574,197.58041"
             style="fill:none;fill-rule:evenodd;stroke:#000000;stroke-width:0.27702326;stroke-linecap:butt;stroke-linejoin:miter;stroke-miterlimit:4;stroke-dasharray:none;stroke-opacity:1" />
        </g>
      </g>
      <path
         id="path4677"
         d="M 411.25591,511.85602 L 412.04222,511.50499"
         style="opacity:1;fill:none;fill-opacity:1;fill-rule:evenodd;stroke:#000000;stroke-width:2.5;stroke-linecap:butt;stroke-linejoin:miter;marker:none;marker-start:none;marker-mid:none;marker-end:none;stroke-miterlimit:4;stroke-dasharray:none;stroke-dashoffset:0;stroke-opacity:1;visibility:visible;display:inline;overflow:visible;enable-background:accumulate" />
    </g>
    <g
       id="g4679"
       transform="translate(-218.22887,70.581802)">
      <path
         transform="matrix(4.5122567,0,0,4.5122567,676.41283,-360.54351)"
         sodipodi:open="true"
         sodipodi:end="10.575948"
         sodipodi:start="4.2932211"
         d="M -58.672671,193.29752 A 4.6998582,4.6998582 0 1 1 -58.674639,193.2984"
         sodipodi:ry="4.6998582"
         sodipodi:rx="4.6998582"
         sodipodi:cy="197.5905"
         sodipodi:cx="-56.759827"
         id="path4681"
         style="fill:#ffffff;fill-opacity:1;stroke:#000000;stroke-width:0.55404651;stroke-miterlimit:4;stroke-dasharray:none;stroke-dashoffset:0;stroke-opacity:1"
         sodipodi:type="arc" />
      <path
         sodipodi:nodetypes="ccc"
         id="path4683"
         d="M 419.98968,513.50164 L 419.98968,532.70025 L 429.80966,526.08005"
         style="fill:none;fill-rule:evenodd;stroke:#000000;stroke-width:2.5;stroke-linecap:butt;stroke-linejoin:miter;stroke-miterlimit:4;stroke-dasharray:none;stroke-opacity:1" />
      <g
         transform="translate(4.7716155,-1.5905385)"
         id="g4685">
        <path
           style="fill:none;fill-rule:evenodd;stroke:#000000;stroke-width:1.25;stroke-linecap:butt;stroke-linejoin:miter;stroke-miterlimit:4;stroke-dasharray:none;stroke-opacity:1"
           d="M 415.21805,549.54489 L 415.21805,545.90377"
           id="path4687" />
        <path
           style="fill:none;fill-rule:evenodd;stroke:#000000;stroke-width:1.25;stroke-linecap:butt;stroke-linejoin:miter;stroke-miterlimit:4;stroke-dasharray:none;stroke-opacity:1"
           d="M 415.21801,518.92638 L 415.21801,515.28526"
           id="path4689" />
        <g
           id="g4691"
           transform="matrix(4.5122567,0,0,4.5122567,671.92183,-358.90744)"
           style="stroke-width:0.27702326;stroke-miterlimit:4;stroke-dasharray:none">
          <path
             id="path4693"
             d="M -60.618311,197.58042 L -59.811371,197.58042"
             style="fill:none;fill-rule:evenodd;stroke:#000000;stroke-width:0.27702326;stroke-linecap:butt;stroke-linejoin:miter;stroke-miterlimit:4;stroke-dasharray:none;stroke-opacity:1" />
          <path
             id="path4695"
             d="M -53.83268,197.58041 L -53.02574,197.58041"
             style="fill:none;fill-rule:evenodd;stroke:#000000;stroke-width:0.27702326;stroke-linecap:butt;stroke-linejoin:miter;stroke-miterlimit:4;stroke-dasharray:none;stroke-opacity:1" />
        </g>
        <g
           id="g4697"
           transform="matrix(3.9077289,-2.2561284,2.2561284,3.9077289,191.80454,-367.66238)"
           style="stroke-width:0.27702326;stroke-miterlimit:4;stroke-dasharray:none">
          <path
             id="path4699"
             d="M -60.618311,197.58042 L -59.811371,197.58042"
             style="fill:none;fill-rule:evenodd;stroke:#000000;stroke-width:0.27702326;stroke-linecap:butt;stroke-linejoin:miter;stroke-miterlimit:4;stroke-dasharray:none;stroke-opacity:1" />
          <path
             id="path4701"
             d="M -53.83268,197.58041 L -53.02574,197.58041"
             style="fill:none;fill-rule:evenodd;stroke:#000000;stroke-width:0.27702326;stroke-linecap:butt;stroke-linejoin:miter;stroke-miterlimit:4;stroke-dasharray:none;stroke-opacity:1" />
        </g>
        <g
           id="g4703"
           transform="matrix(2.2561284,-3.9077289,3.9077289,2.2561284,-228.36665,-135.18574)"
           style="stroke-width:0.27702326;stroke-miterlimit:4;stroke-dasharray:none">
          <path
             id="path4705"
             d="M -60.618311,197.58042 L -59.811371,197.58042"
             style="fill:none;fill-rule:evenodd;stroke:#000000;stroke-width:0.27702326;stroke-linecap:butt;stroke-linejoin:miter;stroke-miterlimit:4;stroke-dasharray:none;stroke-opacity:1" />
          <path
             id="path4707"
             d="M -53.83268,197.58041 L -53.02574,197.58041"
             style="fill:none;fill-rule:evenodd;stroke:#000000;stroke-width:0.27702326;stroke-linecap:butt;stroke-linejoin:miter;stroke-miterlimit:4;stroke-dasharray:none;stroke-opacity:1" />
        </g>
        <g
           id="g4709"
           transform="matrix(-2.2561284,-3.9077289,3.9077289,-2.2561284,-484.76224,756.34779)"
           style="stroke-width:0.27702326;stroke-miterlimit:4;stroke-dasharray:none">
          <path
             id="path4711"
             d="M -60.618311,197.58042 L -59.811371,197.58042"
             style="fill:none;fill-rule:evenodd;stroke:#000000;stroke-width:0.27702326;stroke-linecap:butt;stroke-linejoin:miter;stroke-miterlimit:4;stroke-dasharray:none;stroke-opacity:1" />
          <path
             id="path4713"
             d="M -53.83268,197.58041 L -53.02574,197.58041"
             style="fill:none;fill-rule:evenodd;stroke:#000000;stroke-width:0.27702326;stroke-linecap:butt;stroke-linejoin:miter;stroke-miterlimit:4;stroke-dasharray:none;stroke-opacity:1" />
        </g>
        <g
           id="g4715"
           transform="matrix(-3.9077289,-2.2561284,2.2561284,-3.9077289,-252.28558,1176.519)"
           style="stroke-width:0.27702326;stroke-miterlimit:4;stroke-dasharray:none">
          <path
             id="path4717"
             d="M -60.618311,197.58042 L -59.811371,197.58042"
             style="fill:none;fill-rule:evenodd;stroke:#000000;stroke-width:0.27702326;stroke-linecap:butt;stroke-linejoin:miter;stroke-miterlimit:4;stroke-dasharray:none;stroke-opacity:1" />
          <path
             id="path4719"
             d="M -53.83268,197.58041 L -53.02574,197.58041"
             style="fill:none;fill-rule:evenodd;stroke:#000000;stroke-width:0.27702326;stroke-linecap:butt;stroke-linejoin:miter;stroke-miterlimit:4;stroke-dasharray:none;stroke-opacity:1" />
        </g>
      </g>
      <path
         id="path4721"
         d="M 411.25591,511.85602 L 412.04222,511.50499"
         style="opacity:1;fill:none;fill-opacity:1;fill-rule:evenodd;stroke:#000000;stroke-width:2.5;stroke-linecap:butt;stroke-linejoin:miter;marker:none;marker-start:none;marker-mid:none;marker-end:none;stroke-miterlimit:4;stroke-dasharray:none;stroke-dashoffset:0;stroke-opacity:1;visibility:visible;display:inline;overflow:visible;enable-background:accumulate" />
    </g>
    <text
       xml:space="preserve"
       style="font-size:14px;font-style:normal;font-variant:normal;font-weight:normal;font-stretch:normal;text-align:start;line-height:125%;writing-mode:lr-tb;text-anchor:start;fill:#000000;fill-opacity:1;stroke:none;stroke-width:1px;stroke-linecap:butt;stroke-linejoin:miter;stroke-opacity:1;font-family:Bitstream Vera Sans;-inkscape-font-specification:Bitstream Vera Sans"
       x="159.26007"
       y="357.11835"
       id="text4723"
       sodipodi:linespacing="125%"><tspan
         sodipodi:role="line"
         id="tspan4725"
         x="159.26007"
         y="357.11835">10</tspan></text>
    <text
       xml:space="preserve"
       style="font-size:12px;font-style:normal;font-variant:normal;font-weight:normal;font-stretch:normal;text-align:start;line-height:125%;writing-mode:lr-tb;text-anchor:start;fill:#000000;fill-opacity:1;stroke:none;stroke-width:1px;stroke-linecap:butt;stroke-linejoin:miter;stroke-opacity:1;font-family:Bitstream Vera Sans;-inkscape-font-specification:Bitstream Vera Sans"
       x="177.05231"
       y="348.22223"
       id="text4727"
       sodipodi:linespacing="125%"><tspan
         sodipodi:role="line"
         id="tspan4729"
         x="177.05231"
         y="348.22223">-15</tspan></text>
    <text
       xml:space="preserve"
       style="font-size:14px;font-style:normal;font-variant:normal;font-weight:normal;font-stretch:normal;text-align:start;line-height:125%;writing-mode:lr-tb;text-anchor:start;fill:#000000;fill-opacity:1;stroke:none;stroke-width:1px;stroke-linecap:butt;stroke-linejoin:miter;stroke-opacity:1;font-family:Bitstream Vera Sans;-inkscape-font-specification:Bitstream Vera Sans"
       x="203.59811"
       y="494.2648"
       id="text4731"
       sodipodi:linespacing="125%"><tspan
         sodipodi:role="line"
         id="tspan4733"
         x="203.59811"
         y="494.2648">10</tspan></text>
    <text
       xml:space="preserve"
       style="font-size:12px;font-style:normal;font-variant:normal;font-weight:normal;font-stretch:normal;text-align:start;line-height:125%;writing-mode:lr-tb;text-anchor:start;fill:#000000;fill-opacity:1;stroke:none;stroke-width:1px;stroke-linecap:butt;stroke-linejoin:miter;stroke-opacity:1;font-family:Bitstream Vera Sans;-inkscape-font-specification:Bitstream Vera Sans"
       x="221.39035"
       y="485.36868"
       id="text4735"
       sodipodi:linespacing="125%"><tspan
         sodipodi:role="line"
         id="tspan4737"
         x="221.39035"
         y="485.36868">-12</tspan></text>
    <text
       xml:space="preserve"
       style="font-size:14px;font-style:normal;font-variant:normal;font-weight:normal;font-stretch:normal;text-align:start;line-height:125%;writing-mode:lr-tb;text-anchor:start;fill:#000000;fill-opacity:1;stroke:none;stroke-width:1px;stroke-linecap:butt;stroke-linejoin:miter;stroke-opacity:1;font-family:Bitstream Vera Sans;-inkscape-font-specification:Bitstream Vera Sans"
       x="215.21924"
       y="582.00427"
       id="text4739"
       sodipodi:linespacing="125%"><tspan
         sodipodi:role="line"
         id="tspan4741"
         x="215.21924"
         y="582.00427">10</tspan></text>
    <text
       xml:space="preserve"
       style="font-size:12px;font-style:normal;font-variant:normal;font-weight:normal;font-stretch:normal;text-align:start;line-height:125%;writing-mode:lr-tb;text-anchor:start;fill:#000000;fill-opacity:1;stroke:none;stroke-width:1px;stroke-linecap:butt;stroke-linejoin:miter;stroke-opacity:1;font-family:Bitstream Vera Sans;-inkscape-font-specification:Bitstream Vera Sans"
       x="233.01147"
       y="573.10815"
       id="text4743"
       sodipodi:linespacing="125%"><tspan
         sodipodi:role="line"
         id="tspan4745"
         x="233.01147"
         y="573.10815">-10</tspan></text>
  </g>
</svg>
