<?xml version="1.0" encoding="UTF-8" standalone="no"?>
<!-- Created with Inkscape (http://www.inkscape.org/) -->

<svg
   xmlns:dc="http://purl.org/dc/elements/1.1/"
   xmlns:cc="http://creativecommons.org/ns#"
   xmlns:rdf="http://www.w3.org/1999/02/22-rdf-syntax-ns#"
   xmlns:svg="http://www.w3.org/2000/svg"
   xmlns="http://www.w3.org/2000/svg"
   xmlns:sodipodi="http://sodipodi.sourceforge.net/DTD/sodipodi-0.dtd"
   xmlns:inkscape="http://www.inkscape.org/namespaces/inkscape"
   width="210mm"
   height="297mm"
   id="svg5587"
   version="1.1"
   inkscape:version="0.48.1 r9760"
   sodipodi:docname="New document 10">
  <defs
     id="defs3" />
  <sodipodi:namedview
     inkscape:document-units="mm"
     id="base"
     pagecolor="#ffffff"
     bordercolor="#666666"
     borderopacity="1.0"
     inkscape:pageopacity="0.0"
     inkscape:pageshadow="2"
     inkscape:zoom="0.98994949"
     inkscape:cx="410.58288"
     inkscape:cy="731.80629"
     inkscape:current-layer="layer1"
     showgrid="false"
     inkscape:window-width="1355"
     inkscape:window-height="845"
     inkscape:window-x="74"
     inkscape:window-y="31"
     inkscape:window-maximized="0">
    <inkscape:grid
       type="xygrid"
       id="grid6101" />
  </sodipodi:namedview>
  <metadata
     id="metadata4">
    <rdf:RDF>
      <cc:Work
         rdf:about="">
        <dc:format>image/svg+xml</dc:format>
        <dc:type
           rdf:resource="http://purl.org/dc/dcmitype/StillImage" />
        <dc:title></dc:title>
      </cc:Work>
    </rdf:RDF>
  </metadata>
  <g
     inkscape:label="Layer 1"
     inkscape:groupmode="layer"
     id="layer1">
    <rect
       style="fill:none;stroke:#bf9d9d;stroke-width:1.77165353000000003;stroke-linejoin:round;stroke-miterlimit:4;stroke-opacity:1;stroke-dasharray:none;stroke-dashoffset:0"
       id="rect6103"
       width="640"
       height="300"
       x="40"
       y="212.36218"
       ry="12.121831" />
    <rect
       style="fill:none;stroke:#bf9d9d;stroke-width:1.77165353000000003;stroke-linejoin:round;stroke-miterlimit:4;stroke-opacity:1;stroke-dasharray:none;stroke-dashoffset:0"
       id="rect6105"
       width="120"
       height="280"
       x="70"
       y="222.36218"
       ry="5.0507627" />
    <rect
       style="fill:none;stroke:#bf9d9d;stroke-width:1.77165353000000003;stroke-linejoin:round;stroke-miterlimit:4;stroke-opacity:1;stroke-dasharray:none;stroke-dashoffset:0"
       id="rect6107"
       width="470"
       height="280"
       x="200"
       y="222.36218"
       ry="4.0406103" />
    <rect
       style="fill:none;stroke:#bf9d9d;stroke-width:1.77165353000000003;stroke-linejoin:round;stroke-miterlimit:4;stroke-opacity:1;stroke-dasharray:none;stroke-dashoffset:0"
       id="rect6109"
       width="130"
       height="210"
       x="210"
       y="282.36218" />
    <rect
       style="fill:none;stroke:#bf9d9d;stroke-width:1.77165353000000003;stroke-linejoin:round;stroke-miterlimit:4;stroke-opacity:1;stroke-dasharray:none;stroke-dashoffset:0"
       id="rect6111"
       width="310"
       height="210"
       x="350"
       y="282.36218" />
    <text
       xml:space="preserve"
       style="font-size:18px;font-style:normal;font-variant:normal;font-weight:normal;font-stretch:normal;text-align:start;line-height:125%;letter-spacing:0px;word-spacing:0px;writing-mode:lr-tb;text-anchor:start;fill:#000000;fill-opacity:1;stroke:none;font-family:Liberation Sans;-inkscape-font-specification:Liberation Sans"
       x="213.1422"
       y="242.21983"
       id="text6113"
       sodipodi:linespacing="125%"><tspan
         sodipodi:role="line"
         id="tspan6115"
         x="213.1422"
         y="242.21983"
         style="font-weight:bold">/dev/sda2</tspan><tspan
         sodipodi:role="line"
         x="213.1422"
         y="264.71985"
         id="tspan6145">LVM physical volume</tspan></text>
    <text
       xml:space="preserve"
       style="font-size:18px;font-style:normal;font-variant:normal;font-weight:normal;font-stretch:normal;text-align:start;line-height:125%;letter-spacing:0px;word-spacing:0px;writing-mode:lr-tb;text-anchor:start;fill:#000000;fill-opacity:1;stroke:none;font-family:Liberation Sans;-inkscape-font-specification:Liberation Sans"
       x="81.822357"
       y="241.20969"
       id="text6117"
       sodipodi:linespacing="125%"><tspan
         sodipodi:role="line"
         id="tspan6119"
         x="81.822357"
         y="241.20969"
         style="font-weight:bold">/dev/sda1</tspan><tspan
         sodipodi:role="line"
         x="81.822357"
         y="263.70969"
         id="tspan6121" /><tspan
         sodipodi:role="line"
         x="81.822357"
         y="286.20969"
         id="tspan6147">/boot</tspan><tspan
         sodipodi:role="line"
         x="81.822357"
         y="308.70969"
         id="tspan6123">partition</tspan></text>
    <text
       xml:space="preserve"
       style="font-size:18px;font-style:normal;font-variant:normal;font-weight:normal;font-stretch:normal;text-align:start;line-height:125%;letter-spacing:0px;word-spacing:0px;writing-mode:lr-tb;text-anchor:start;fill:#000000;fill-opacity:1;stroke:none;font-family:Liberation Sans;-inkscape-font-specification:Liberation Sans"
       x="219.20309"
       y="303.83914"
       id="text6125"
       sodipodi:linespacing="125%"><tspan
         sodipodi:role="line"
         id="tspan6127"
         x="219.20309"
         y="303.83914"
         style="font-weight:bold">/dev/VG/swap</tspan><tspan
         sodipodi:role="line"
         x="219.20309"
         y="326.33914"
         id="tspan6129" /><tspan
         sodipodi:role="line"
         x="219.20309"
         y="348.83914"
         id="tspan6133">swap volume</tspan></text>
    <text
       xml:space="preserve"
       style="font-size:18px;font-style:normal;font-variant:normal;font-weight:normal;font-stretch:normal;text-align:start;line-height:125%;letter-spacing:0px;word-spacing:0px;writing-mode:lr-tb;text-anchor:start;fill:#000000;fill-opacity:1;stroke:none;font-family:Liberation Sans;-inkscape-font-specification:Liberation Sans"
       x="362.64474"
       y="303.83914"
       id="text6135"
       sodipodi:linespacing="125%"><tspan
         sodipodi:role="line"
         id="tspan6137"
         x="362.64474"
         y="303.83914"
         style="font-weight:bold">/dev/VG/root</tspan><tspan
         sodipodi:role="line"
         x="362.64474"
         y="326.33914"
         id="tspan6139" /><tspan
         sodipodi:role="line"
         x="362.64474"
         y="348.83914"
         id="tspan6141">root volume</tspan></text>
    <text
       xml:space="preserve"
       style="font-size:18px;font-style:normal;font-variant:normal;font-weight:normal;font-stretch:normal;text-align:start;line-height:125%;letter-spacing:0px;word-spacing:0px;writing-mode:lr-tb;text-anchor:start;fill:#000000;fill-opacity:1;stroke:none;font-family:Liberation Sans;-inkscape-font-specification:Liberation Sans"
       x="39.39595"
       y="144.72237"
       id="text6149"
       sodipodi:linespacing="125%"><tspan
         sodipodi:role="line"
         id="tspan6151"
         x="39.39595"
         y="144.72237">host file: <tspan
   style="font-weight:bold"
   id="tspan6159">new-disk.img</tspan></tspan><tspan
         sodipodi:role="line"
         x="39.39595"
         y="167.22237"
         id="tspan6155">10 G raw format, sparse (thin-provisioned)</tspan></text>
  </g>
</svg>
