%!PS-Adobe-2.0 EPSF-2.0
%%Title: /afs/ms.mff.cuni.cz/u/s/sandp9am/BIG/les/doc/doc/lyx/ss2pi_overview.dia
%%Creator: Dia v0.94
%%CreationDate: Thu May 26 00:09:36 2005
%%For: sandp9am
%%Orientation: Portrait
%%Magnification: 1.0000
%%BoundingBox: 0 0 964 604
%%BeginSetup
%%EndSetup
%%EndComments
%%BeginProlog
[ /.notdef /.notdef /.notdef /.notdef /.notdef /.notdef /.notdef /.notdef /.notdef /.notdef
/.notdef /.notdef /.notdef /.notdef /.notdef /.notdef /.notdef /.notdef /.notdef /.notdef
/.notdef /.notdef /.notdef /.notdef /.notdef /.notdef /.notdef /.notdef /.notdef /.notdef
/.notdef /.notdef /space /exclam /quotedbl /numbersign /dollar /percent /ampersand /quoteright
/parenleft /parenright /asterisk /plus /comma /hyphen /period /slash /zero /one
/two /three /four /five /six /seven /eight /nine /colon /semicolon
/less /equal /greater /question /at /A /B /C /D /E
/F /G /H /I /J /K /L /M /N /O
/P /Q /R /S /T /U /V /W /X /Y
/Z /bracketleft /backslash /bracketright /asciicircum /underscore /quoteleft /a /b /c
/d /e /f /g /h /i /j /k /l /m
/n /o /p /q /r /s /t /u /v /w
/x /y /z /braceleft /bar /braceright /asciitilde /.notdef /.notdef /.notdef
/.notdef /.notdef /.notdef /.notdef /.notdef /.notdef /.notdef /.notdef /.notdef /.notdef
/.notdef /.notdef /.notdef /.notdef /.notdef /.notdef /.notdef /.notdef /.notdef /.notdef
/.notdef /.notdef /.notdef /.notdef /.notdef /.notdef /.notdef /.notdef /.notdef /.notdef
/space /exclamdown /cent /sterling /currency /yen /brokenbar /section /dieresis /copyright
/ordfeminine /guillemotleft /logicalnot /hyphen /registered /macron /degree /plusminus /twosuperior /threesuperior
/acute /mu /paragraph /periodcentered /cedilla /onesuperior /ordmasculine /guillemotright /onequarter /onehalf
/threequarters /questiondown /Agrave /Aacute /Acircumflex /Atilde /Adieresis /Aring /AE /Ccedilla
/Egrave /Eacute /Ecircumflex /Edieresis /Igrave /Iacute /Icircumflex /Idieresis /Eth /Ntilde
/Ograve /Oacute /Ocircumflex /Otilde /Odieresis /multiply /Oslash /Ugrave /Uacute /Ucircumflex
/Udieresis /Yacute /Thorn /germandbls /agrave /aacute /acircumflex /atilde /adieresis /aring
/ae /ccedilla /egrave /eacute /ecircumflex /edieresis /igrave /iacute /icircumflex /idieresis
/eth /ntilde /ograve /oacute /ocircumflex /otilde /odieresis /divide /oslash /ugrave
/uacute /ucircumflex /udieresis /yacute /thorn /ydieresis] /isolatin1encoding exch def
/cp {closepath} bind def
/c {curveto} bind def
/f {fill} bind def
/a {arc} bind def
/ef {eofill} bind def
/ex {exch} bind def
/gr {grestore} bind def
/gs {gsave} bind def
/sa {save} bind def
/rs {restore} bind def
/l {lineto} bind def
/m {moveto} bind def
/rm {rmoveto} bind def
/n {newpath} bind def
/s {stroke} bind def
/sh {show} bind def
/slc {setlinecap} bind def
/slj {setlinejoin} bind def
/slw {setlinewidth} bind def
/srgb {setrgbcolor} bind def
/rot {rotate} bind def
/sc {scale} bind def
/sd {setdash} bind def
/ff {findfont} bind def
/sf {setfont} bind def
/scf {scalefont} bind def
/sw {stringwidth pop} bind def
/tr {translate} bind def

/ellipsedict 8 dict def
ellipsedict /mtrx matrix put
/ellipse
{ ellipsedict begin
   /endangle exch def
   /startangle exch def
   /yrad exch def
   /xrad exch def
   /y exch def
   /x exch def   /savematrix mtrx currentmatrix def
   x y tr xrad yrad sc
   0 0 1 startangle endangle arc
   savematrix setmatrix
   end
} def

/mergeprocs {
dup length
3 -1 roll
dup
length
dup
5 1 roll
3 -1 roll
add
array cvx
dup
3 -1 roll
0 exch
putinterval
dup
4 2 roll
putinterval
} bind def
/Times-Roman-latin1
    /Times-Roman findfont
    dup length dict begin
	{1 index /FID ne {def} {pop pop} ifelse} forall
	/Encoding isolatin1encoding def
    currentdict end
definefont pop
/Times-Italic-latin1
    /Times-Italic findfont
    dup length dict begin
	{1 index /FID ne {def} {pop pop} ifelse} forall
	/Encoding isolatin1encoding def
    currentdict end
definefont pop
/Times-Bold-latin1
    /Times-Bold findfont
    dup length dict begin
	{1 index /FID ne {def} {pop pop} ifelse} forall
	/Encoding isolatin1encoding def
    currentdict end
definefont pop
/Times-BoldItalic-latin1
    /Times-BoldItalic findfont
    dup length dict begin
	{1 index /FID ne {def} {pop pop} ifelse} forall
	/Encoding isolatin1encoding def
    currentdict end
definefont pop
/AvantGarde-Book-latin1
    /AvantGarde-Book findfont
    dup length dict begin
	{1 index /FID ne {def} {pop pop} ifelse} forall
	/Encoding isolatin1encoding def
    currentdict end
definefont pop
/AvantGarde-BookOblique-latin1
    /AvantGarde-BookOblique findfont
    dup length dict begin
	{1 index /FID ne {def} {pop pop} ifelse} forall
	/Encoding isolatin1encoding def
    currentdict end
definefont pop
/AvantGarde-Demi-latin1
    /AvantGarde-Demi findfont
    dup length dict begin
	{1 index /FID ne {def} {pop pop} ifelse} forall
	/Encoding isolatin1encoding def
    currentdict end
definefont pop
/AvantGarde-DemiOblique-latin1
    /AvantGarde-DemiOblique findfont
    dup length dict begin
	{1 index /FID ne {def} {pop pop} ifelse} forall
	/Encoding isolatin1encoding def
    currentdict end
definefont pop
/Bookman-Light-latin1
    /Bookman-Light findfont
    dup length dict begin
	{1 index /FID ne {def} {pop pop} ifelse} forall
	/Encoding isolatin1encoding def
    currentdict end
definefont pop
/Bookman-LightItalic-latin1
    /Bookman-LightItalic findfont
    dup length dict begin
	{1 index /FID ne {def} {pop pop} ifelse} forall
	/Encoding isolatin1encoding def
    currentdict end
definefont pop
/Bookman-Demi-latin1
    /Bookman-Demi findfont
    dup length dict begin
	{1 index /FID ne {def} {pop pop} ifelse} forall
	/Encoding isolatin1encoding def
    currentdict end
definefont pop
/Bookman-DemiItalic-latin1
    /Bookman-DemiItalic findfont
    dup length dict begin
	{1 index /FID ne {def} {pop pop} ifelse} forall
	/Encoding isolatin1encoding def
    currentdict end
definefont pop
/Courier-latin1
    /Courier findfont
    dup length dict begin
	{1 index /FID ne {def} {pop pop} ifelse} forall
	/Encoding isolatin1encoding def
    currentdict end
definefont pop
/Courier-Oblique-latin1
    /Courier-Oblique findfont
    dup length dict begin
	{1 index /FID ne {def} {pop pop} ifelse} forall
	/Encoding isolatin1encoding def
    currentdict end
definefont pop
/Courier-Bold-latin1
    /Courier-Bold findfont
    dup length dict begin
	{1 index /FID ne {def} {pop pop} ifelse} forall
	/Encoding isolatin1encoding def
    currentdict end
definefont pop
/Courier-BoldOblique-latin1
    /Courier-BoldOblique findfont
    dup length dict begin
	{1 index /FID ne {def} {pop pop} ifelse} forall
	/Encoding isolatin1encoding def
    currentdict end
definefont pop
/Helvetica-latin1
    /Helvetica findfont
    dup length dict begin
	{1 index /FID ne {def} {pop pop} ifelse} forall
	/Encoding isolatin1encoding def
    currentdict end
definefont pop
/Helvetica-Oblique-latin1
    /Helvetica-Oblique findfont
    dup length dict begin
	{1 index /FID ne {def} {pop pop} ifelse} forall
	/Encoding isolatin1encoding def
    currentdict end
definefont pop
/Helvetica-Bold-latin1
    /Helvetica-Bold findfont
    dup length dict begin
	{1 index /FID ne {def} {pop pop} ifelse} forall
	/Encoding isolatin1encoding def
    currentdict end
definefont pop
/Helvetica-BoldOblique-latin1
    /Helvetica-BoldOblique findfont
    dup length dict begin
	{1 index /FID ne {def} {pop pop} ifelse} forall
	/Encoding isolatin1encoding def
    currentdict end
definefont pop
/Helvetica-Narrow-latin1
    /Helvetica-Narrow findfont
    dup length dict begin
	{1 index /FID ne {def} {pop pop} ifelse} forall
	/Encoding isolatin1encoding def
    currentdict end
definefont pop
/Helvetica-Narrow-Oblique-latin1
    /Helvetica-Narrow-Oblique findfont
    dup length dict begin
	{1 index /FID ne {def} {pop pop} ifelse} forall
	/Encoding isolatin1encoding def
    currentdict end
definefont pop
/Helvetica-Narrow-Bold-latin1
    /Helvetica-Narrow-Bold findfont
    dup length dict begin
	{1 index /FID ne {def} {pop pop} ifelse} forall
	/Encoding isolatin1encoding def
    currentdict end
definefont pop
/Helvetica-Narrow-BoldOblique-latin1
    /Helvetica-Narrow-BoldOblique findfont
    dup length dict begin
	{1 index /FID ne {def} {pop pop} ifelse} forall
	/Encoding isolatin1encoding def
    currentdict end
definefont pop
/NewCenturySchoolbook-Roman-latin1
    /NewCenturySchoolbook-Roman findfont
    dup length dict begin
	{1 index /FID ne {def} {pop pop} ifelse} forall
	/Encoding isolatin1encoding def
    currentdict end
definefont pop
/NewCenturySchoolbook-Italic-latin1
    /NewCenturySchoolbook-Italic findfont
    dup length dict begin
	{1 index /FID ne {def} {pop pop} ifelse} forall
	/Encoding isolatin1encoding def
    currentdict end
definefont pop
/NewCenturySchoolbook-Bold-latin1
    /NewCenturySchoolbook-Bold findfont
    dup length dict begin
	{1 index /FID ne {def} {pop pop} ifelse} forall
	/Encoding isolatin1encoding def
    currentdict end
definefont pop
/NewCenturySchoolbook-BoldItalic-latin1
    /NewCenturySchoolbook-BoldItalic findfont
    dup length dict begin
	{1 index /FID ne {def} {pop pop} ifelse} forall
	/Encoding isolatin1encoding def
    currentdict end
definefont pop
/Palatino-Roman-latin1
    /Palatino-Roman findfont
    dup length dict begin
	{1 index /FID ne {def} {pop pop} ifelse} forall
	/Encoding isolatin1encoding def
    currentdict end
definefont pop
/Palatino-Italic-latin1
    /Palatino-Italic findfont
    dup length dict begin
	{1 index /FID ne {def} {pop pop} ifelse} forall
	/Encoding isolatin1encoding def
    currentdict end
definefont pop
/Palatino-Bold-latin1
    /Palatino-Bold findfont
    dup length dict begin
	{1 index /FID ne {def} {pop pop} ifelse} forall
	/Encoding isolatin1encoding def
    currentdict end
definefont pop
/Palatino-BoldItalic-latin1
    /Palatino-BoldItalic findfont
    dup length dict begin
	{1 index /FID ne {def} {pop pop} ifelse} forall
	/Encoding isolatin1encoding def
    currentdict end
definefont pop
/Symbol-latin1
    /Symbol findfont
definefont pop
/ZapfChancery-MediumItalic-latin1
    /ZapfChancery-MediumItalic findfont
    dup length dict begin
	{1 index /FID ne {def} {pop pop} ifelse} forall
	/Encoding isolatin1encoding def
    currentdict end
definefont pop
/ZapfDingbats-latin1
    /ZapfDingbats findfont
    dup length dict begin
	{1 index /FID ne {def} {pop pop} ifelse} forall
	/Encoding isolatin1encoding def
    currentdict end
definefont pop
28.346000 -28.346000 scale
-5.170000 -23.039609 translate
%%EndProlog


1.000000 1.000000 1.000000 srgb
n 6.000000 4.000000 m 6.000000 7.100000 l 11.400000 7.100000 l 11.400000 4.000000 l f
0.100000 slw
[] 0 sd
[] 0 sd
0 slj
0.000000 0.000000 0.000000 srgb
n 6.000000 4.000000 m 6.000000 7.100000 l 11.400000 7.100000 l 11.400000 4.000000 l cp s
/Helvetica-latin1 ff 0.700000 scf sf
(statement) dup sw 2 div 8.700000 ex sub 5.282813 m gs 1 -1 sc sh gr
(visitor) dup sw 2 div 8.700000 ex sub 6.282813 m gs 1 -1 sc sh gr
0.200000 slw
[] 0 sd
[] 0 sd
0 slc
n 31.627867 5.583270 m 24.550000 5.550000 l s
0 slj
n 31.625987 5.983265 m 32.427858 5.587030 l 31.629747 5.183274 l ef
0.100000 slw
[1.000000] 0 sd
[0.300000] 0 sd
0 slj
0 slc
n 11.400000 5.550000 m 11.400000 5.550000 l 18.513197 5.550000 l s
[] 0 sd
0 slj
0 slc
n 18.888197 5.550000 m 18.388197 5.800000 l 18.513197 5.550000 l 18.388197 5.300000 l ef
n 18.888197 5.550000 m 18.388197 5.800000 l 18.513197 5.550000 l 18.388197 5.300000 l cp s
1.000000 1.000000 1.000000 srgb
n 18.929297 4.000000 m 18.929297 7.100000 l 24.620703 7.100000 l 24.620703 4.000000 l f
0.100000 slw
[] 0 sd
[] 0 sd
0 slj
0.000000 0.000000 0.000000 srgb
n 18.929297 4.000000 m 18.929297 7.100000 l 24.620703 7.100000 l 24.620703 4.000000 l cp s
/Helvetica-latin1 ff 0.700000 scf sf
(expression) dup sw 2 div 21.775000 ex sub 5.282813 m gs 1 -1 sc sh gr
(visitor) dup sw 2 div 21.775000 ex sub 6.282813 m gs 1 -1 sc sh gr
1.000000 1.000000 1.000000 srgb
n 19.224297 11.680000 m 19.224297 14.780000 l 25.065703 14.780000 l 25.065703 11.680000 l f
0.100000 slw
[] 0 sd
[] 0 sd
0 slj
0.000000 0.000000 0.000000 srgb
n 19.224297 11.680000 m 19.224297 14.780000 l 25.065703 14.780000 l 25.065703 11.680000 l cp s
/Helvetica-latin1 ff 0.700000 scf sf
(declaration) dup sw 2 div 22.145000 ex sub 12.962813 m gs 1 -1 sc sh gr
(visitor) dup sw 2 div 22.145000 ex sub 13.962813 m gs 1 -1 sc sh gr
0.100000 slw
[1.000000] 0 sd
[0.300000] 0 sd
0 slj
0 slc
n 11.400000 7.100000 m 11.400000 9.390000 l 19.345000 9.390000 l 19.345000 11.193197 l s
[] 0 sd
0 slj
0 slc
n 19.345000 11.568197 m 19.095000 11.068197 l 19.345000 11.193197 l 19.595000 11.068197 l ef
n 19.345000 11.568197 m 19.095000 11.068197 l 19.345000 11.193197 l 19.595000 11.068197 l cp s
0.100000 slw
[0.300000] 0 sd
[0.300000] 0 sd
0 slj
0 slc
n 19.345000 14.780000 m 10.050000 14.780000 l 10.050000 7.586803 l s
[] 0 sd
0 slj
0 slc
n 10.050000 7.211803 m 10.300000 7.711803 l 10.050000 7.586803 l 9.800000 7.711803 l ef
n 10.050000 7.211803 m 10.300000 7.711803 l 10.050000 7.586803 l 9.800000 7.711803 l cp s
0.100000 slw
[0.300000] 0 sd
[0.300000] 0 sd
0 slj
0 slc
n 25.065703 13.230000 m 26.065703 13.230000 l 26.065703 7.100000 l 25.036803 7.100000 l s
[] 0 sd
0 slj
0 slc
n 24.661803 7.100000 m 25.161803 6.850000 l 25.036803 7.100000 l 25.161803 7.350000 l ef
n 24.661803 7.100000 m 25.161803 6.850000 l 25.036803 7.100000 l 25.161803 7.350000 l cp s
/Helvetica-latin1 ff 0.700000 scf sf
(function body) 11.920000 15.730000 m gs 1 -1 sc sh gr
/Helvetica-latin1 ff 0.700000 scf sf
(declaration) 13.070000 10.530000 m gs 1 -1 sc sh gr
(statement) 13.070000 11.530000 m gs 1 -1 sc sh gr
/Helvetica-latin1 ff 0.700000 scf sf
(expression) 13.070000 6.480000 m gs 1 -1 sc sh gr
(statement) 13.070000 7.480000 m gs 1 -1 sc sh gr
/Helvetica-latin1 ff 0.700000 scf sf
(initialization) 26.600000 10.800000 m gs 1 -1 sc sh gr
0.200000 slw
[] 0 sd
[] 0 sd
0 slj
0 slc
n 22.145000 14.780000 m 22.145000 20.424752 l 14.534285 20.424752 l s
0 slj
n 14.534285 20.024752 m 13.734285 20.424752 l 14.534285 20.824752 l ef
/Helvetica-latin1 ff 0.700000 scf sf
(destructor) dup sw 2 div 17.970000 ex sub 21.575000 m gs 1 -1 sc sh gr
(add) dup sw 2 div 17.970000 ex sub 22.575000 m gs 1 -1 sc sh gr
/Helvetica-latin1 ff 0.700000 scf sf
(destructor) dup sw 2 div 28.945000 ex sub 6.630000 m gs 1 -1 sc sh gr
(add) dup sw 2 div 28.945000 ex sub 7.630000 m gs 1 -1 sc sh gr
0.100000 slw
[1.000000] 0 sd
[0.300000] 0 sd
0 slj
0 slc
n 8.700000 4.000000 m 8.700000 1.800000 l 34.173929 1.800000 l 34.173929 4.038197 l s
[] 0 sd
0 slj
0 slc
n 34.173929 4.413197 m 33.923929 3.913197 l 34.173929 4.038197 l 34.423929 3.913197 l ef
n 34.173929 4.413197 m 33.923929 3.913197 l 34.173929 4.038197 l 34.423929 3.913197 l cp s
/Helvetica-latin1 ff 0.700000 scf sf
(rollback) 20.420000 2.730000 m gs 1 -1 sc sh gr
/Helvetica-latin1 ff 0.700000 scf sf
(rollback) 5.170000 13.730000 m gs 1 -1 sc sh gr
0.100000 slw
[0.300000] 0 sd
[0.300000] 0 sd
0 slj
0 slc
n 8.700000 7.100000 m 8.700000 13.372500 l 8.696071 13.372500 l 8.696071 19.158197 l s
[] 0 sd
0 slj
0 slc
n 8.696071 19.533197 m 8.446071 19.033197 l 8.696071 19.158197 l 8.946071 19.033197 l ef
n 8.696071 19.533197 m 8.446071 19.033197 l 8.696071 19.158197 l 8.946071 19.033197 l cp s
0.100000 slw
[0.300000] 0 sd
[0.300000] 0 sd
0 slj
0 slc
n 30.150000 19.900000 m 30.150000 19.900000 l 35.663197 19.900000 l s
[] 0 sd
0 slj
0 slc
n 36.038197 19.900000 m 35.538197 20.150000 l 35.663197 19.900000 l 35.538197 19.650000 l ef
n 36.038197 19.900000 m 35.538197 20.150000 l 35.663197 19.900000 l 35.538197 19.650000 l cp s
/Helvetica-latin1 ff 0.700000 scf sf
(Controlflow) 30.720000 21.030000 m gs 1 -1 sc sh gr
0.200000 slw
[] 0 sd
[] 0 sd
0 slc
n 35.250000 17.650000 m 30.150000 17.650000 l s
0 slj
n 35.250000 18.050000 m 36.050000 17.650000 l 35.250000 17.250000 l ef
/Helvetica-latin1 ff 0.700000 scf sf
(Dataflow) 31.170000 18.680000 m gs 1 -1 sc sh gr
0.100000 slw
[] 0 sd
[] 0 sd
0 slc
0 slj
0 slc
0 slj
[] 0 sd
1.000000 1.000000 1.000000 srgb
n 32.527857 4.525000 m 32.527857 8.775000 l 39.112143 8.775000 l 39.112143 4.525000 l f
0.000000 0.000000 0.000000 srgb
n 32.527857 4.525000 m 32.527857 8.775000 l 39.112143 8.775000 l 39.112143 4.525000 l cp s
0 slc
0 slj
[] 0 sd
n 33.186286 4.525000 m 33.186286 8.775000 l s
0 slc
0 slj
[] 0 sd
n 32.527857 4.950000 m 39.112143 4.950000 l s
/Helvetica-latin1 ff 0.700000 scf sf
(temporaries) dup sw 2 div 36.149214 ex sub 6.595312 m gs 1 -1 sc sh gr
(table) dup sw 2 div 36.149214 ex sub 7.595312 m gs 1 -1 sc sh gr
0.100000 slw
[] 0 sd
[] 0 sd
0 slc
0 slj
0 slc
0 slj
[] 0 sd
1.000000 1.000000 1.000000 srgb
n 7.050000 19.645000 m 7.050000 22.764008 l 13.634285 22.764008 l 13.634285 19.645000 l f
0.000000 0.000000 0.000000 srgb
n 7.050000 19.645000 m 7.050000 22.764008 l 13.634285 22.764008 l 13.634285 19.645000 l cp s
0 slc
0 slj
[] 0 sd
n 7.708429 19.645000 m 7.708429 22.764008 l s
0 slc
0 slj
[] 0 sd
n 7.050000 19.956901 m 13.634285 19.956901 l s
/Helvetica-latin1 ff 0.700000 scf sf
(destructor) dup sw 2 div 10.671357 ex sub 21.093267 m gs 1 -1 sc sh gr
(tables) dup sw 2 div 10.671357 ex sub 22.093267 m gs 1 -1 sc sh gr
showpage
