<?xml version="1.0" encoding="UTF-8"?>
<dia:diagram xmlns:dia="http://www.lysator.liu.se/~alla/dia/">
  <dia:diagramdata>
    <dia:attribute name="background">
      <dia:color val="#ffffff"/>
    </dia:attribute>
    <dia:attribute name="pagebreak">
      <dia:color val="#000099"/>
    </dia:attribute>
    <dia:attribute name="paper">
      <dia:composite type="paper">
        <dia:attribute name="name">
          <dia:string>#A4#</dia:string>
        </dia:attribute>
        <dia:attribute name="tmargin">
          <dia:real val="2.8222"/>
        </dia:attribute>
        <dia:attribute name="bmargin">
          <dia:real val="2.8222"/>
        </dia:attribute>
        <dia:attribute name="lmargin">
          <dia:real val="2.8222"/>
        </dia:attribute>
        <dia:attribute name="rmargin">
          <dia:real val="2.8222"/>
        </dia:attribute>
        <dia:attribute name="is_portrait">
          <dia:boolean val="true"/>
        </dia:attribute>
        <dia:attribute name="scaling">
          <dia:real val="1"/>
        </dia:attribute>
        <dia:attribute name="fitto">
          <dia:boolean val="false"/>
        </dia:attribute>
      </dia:composite>
    </dia:attribute>
    <dia:attribute name="grid">
      <dia:composite type="grid">
        <dia:attribute name="width_x">
          <dia:real val="1"/>
        </dia:attribute>
        <dia:attribute name="width_y">
          <dia:real val="1"/>
        </dia:attribute>
        <dia:attribute name="visible_x">
          <dia:int val="1"/>
        </dia:attribute>
        <dia:attribute name="visible_y">
          <dia:int val="1"/>
        </dia:attribute>
        <dia:composite type="color"/>
      </dia:composite>
    </dia:attribute>
    <dia:attribute name="color">
      <dia:color val="#d8e5e5"/>
    </dia:attribute>
    <dia:attribute name="guides">
      <dia:composite type="guides">
        <dia:attribute name="hguides"/>
        <dia:attribute name="vguides"/>
      </dia:composite>
    </dia:attribute>
  </dia:diagramdata>
  <dia:layer name="Background" visible="true">
    <dia:object type="Standard - Line" version="0" id="O0">
      <dia:attribute name="obj_pos">
        <dia:point val="12.4,19.15"/>
      </dia:attribute>
      <dia:attribute name="obj_bb">
        <dia:rectangle val="11.9999,18.7728;17.6966,24.8361"/>
      </dia:attribute>
      <dia:attribute name="conn_endpoints">
        <dia:point val="12.4,19.15"/>
        <dia:point val="17.6259,24.7654"/>
      </dia:attribute>
      <dia:attribute name="numcp">
        <dia:int val="1"/>
      </dia:attribute>
      <dia:attribute name="start_arrow">
        <dia:enum val="3"/>
      </dia:attribute>
      <dia:attribute name="start_arrow_length">
        <dia:real val="0.5"/>
      </dia:attribute>
      <dia:attribute name="start_arrow_width">
        <dia:real val="0.5"/>
      </dia:attribute>
      <dia:connections>
        <dia:connection handle="0" to="O2" connection="13"/>
        <dia:connection handle="1" to="O16" connection="0"/>
      </dia:connections>
    </dia:object>
    <dia:object type="Flowchart - Box" version="0" id="O1">
      <dia:attribute name="obj_pos">
        <dia:point val="5.48901,17.0645"/>
      </dia:attribute>
      <dia:attribute name="obj_bb">
        <dia:rectangle val="5.43901,17.0145;8.18901,19.2145"/>
      </dia:attribute>
      <dia:attribute name="elem_corner">
        <dia:point val="5.48901,17.0645"/>
      </dia:attribute>
      <dia:attribute name="elem_width">
        <dia:real val="2.65"/>
      </dia:attribute>
      <dia:attribute name="elem_height">
        <dia:real val="2.1"/>
      </dia:attribute>
      <dia:attribute name="show_background">
        <dia:boolean val="true"/>
      </dia:attribute>
      <dia:attribute name="padding">
        <dia:real val="0.5"/>
      </dia:attribute>
      <dia:attribute name="text">
        <dia:composite type="text">
          <dia:attribute name="string">
            <dia:string>#LEX#</dia:string>
          </dia:attribute>
          <dia:attribute name="font">
            <dia:font family="sans" style="80" name="Helvetica"/>
          </dia:attribute>
          <dia:attribute name="height">
            <dia:real val="1"/>
          </dia:attribute>
          <dia:attribute name="pos">
            <dia:point val="6.81401,18.4645"/>
          </dia:attribute>
          <dia:attribute name="color">
            <dia:color val="#000000"/>
          </dia:attribute>
          <dia:attribute name="alignment">
            <dia:enum val="1"/>
          </dia:attribute>
        </dia:composite>
      </dia:attribute>
    </dia:object>
    <dia:object type="Flowchart - Box" version="0" id="O2">
      <dia:attribute name="obj_pos">
        <dia:point val="10.8,17.05"/>
      </dia:attribute>
      <dia:attribute name="obj_bb">
        <dia:rectangle val="10.75,17;14.05,19.2"/>
      </dia:attribute>
      <dia:attribute name="elem_corner">
        <dia:point val="10.8,17.05"/>
      </dia:attribute>
      <dia:attribute name="elem_width">
        <dia:real val="3.2"/>
      </dia:attribute>
      <dia:attribute name="elem_height">
        <dia:real val="2.1"/>
      </dia:attribute>
      <dia:attribute name="show_background">
        <dia:boolean val="true"/>
      </dia:attribute>
      <dia:attribute name="padding">
        <dia:real val="0.5"/>
      </dia:attribute>
      <dia:attribute name="text">
        <dia:composite type="text">
          <dia:attribute name="string">
            <dia:string>#HINT#</dia:string>
          </dia:attribute>
          <dia:attribute name="font">
            <dia:font family="sans" style="80" name="Helvetica"/>
          </dia:attribute>
          <dia:attribute name="height">
            <dia:real val="1"/>
          </dia:attribute>
          <dia:attribute name="pos">
            <dia:point val="12.4,18.45"/>
          </dia:attribute>
          <dia:attribute name="color">
            <dia:color val="#000000"/>
          </dia:attribute>
          <dia:attribute name="alignment">
            <dia:enum val="1"/>
          </dia:attribute>
        </dia:composite>
      </dia:attribute>
    </dia:object>
    <dia:object type="Flowchart - Box" version="0" id="O3">
      <dia:attribute name="obj_pos">
        <dia:point val="17,17"/>
      </dia:attribute>
      <dia:attribute name="obj_bb">
        <dia:rectangle val="16.95,16.95;19.85,19.15"/>
      </dia:attribute>
      <dia:attribute name="elem_corner">
        <dia:point val="17,17"/>
      </dia:attribute>
      <dia:attribute name="elem_width">
        <dia:real val="2.8"/>
      </dia:attribute>
      <dia:attribute name="elem_height">
        <dia:real val="2.1"/>
      </dia:attribute>
      <dia:attribute name="show_background">
        <dia:boolean val="true"/>
      </dia:attribute>
      <dia:attribute name="padding">
        <dia:real val="0.5"/>
      </dia:attribute>
      <dia:attribute name="text">
        <dia:composite type="text">
          <dia:attribute name="string">
            <dia:string>#SYN#</dia:string>
          </dia:attribute>
          <dia:attribute name="font">
            <dia:font family="sans" style="80" name="Helvetica"/>
          </dia:attribute>
          <dia:attribute name="height">
            <dia:real val="1"/>
          </dia:attribute>
          <dia:attribute name="pos">
            <dia:point val="18.4,18.4"/>
          </dia:attribute>
          <dia:attribute name="color">
            <dia:color val="#000000"/>
          </dia:attribute>
          <dia:attribute name="alignment">
            <dia:enum val="1"/>
          </dia:attribute>
        </dia:composite>
      </dia:attribute>
    </dia:object>
    <dia:object type="Flowchart - Box" version="0" id="O4">
      <dia:attribute name="obj_pos">
        <dia:point val="22.1894,16.9355"/>
      </dia:attribute>
      <dia:attribute name="obj_bb">
        <dia:rectangle val="22.1394,16.8855;25.0394,19.0855"/>
      </dia:attribute>
      <dia:attribute name="elem_corner">
        <dia:point val="22.1894,16.9355"/>
      </dia:attribute>
      <dia:attribute name="elem_width">
        <dia:real val="2.8"/>
      </dia:attribute>
      <dia:attribute name="elem_height">
        <dia:real val="2.1"/>
      </dia:attribute>
      <dia:attribute name="show_background">
        <dia:boolean val="true"/>
      </dia:attribute>
      <dia:attribute name="padding">
        <dia:real val="0.5"/>
      </dia:attribute>
      <dia:attribute name="text">
        <dia:composite type="text">
          <dia:attribute name="string">
            <dia:string>#SA#</dia:string>
          </dia:attribute>
          <dia:attribute name="font">
            <dia:font family="sans" style="80" name="Helvetica"/>
          </dia:attribute>
          <dia:attribute name="height">
            <dia:real val="1"/>
          </dia:attribute>
          <dia:attribute name="pos">
            <dia:point val="23.5894,18.3355"/>
          </dia:attribute>
          <dia:attribute name="color">
            <dia:color val="#000000"/>
          </dia:attribute>
          <dia:attribute name="alignment">
            <dia:enum val="1"/>
          </dia:attribute>
        </dia:composite>
      </dia:attribute>
    </dia:object>
    <dia:object type="Flowchart - Box" version="0" id="O5">
      <dia:attribute name="obj_pos">
        <dia:point val="27.4032,16.8968"/>
      </dia:attribute>
      <dia:attribute name="obj_bb">
        <dia:rectangle val="27.3532,16.8468;31.1532,19.0468"/>
      </dia:attribute>
      <dia:attribute name="elem_corner">
        <dia:point val="27.4032,16.8968"/>
      </dia:attribute>
      <dia:attribute name="elem_width">
        <dia:real val="3.7"/>
      </dia:attribute>
      <dia:attribute name="elem_height">
        <dia:real val="2.1"/>
      </dia:attribute>
      <dia:attribute name="show_background">
        <dia:boolean val="true"/>
      </dia:attribute>
      <dia:attribute name="padding">
        <dia:real val="0.5"/>
      </dia:attribute>
      <dia:attribute name="text">
        <dia:composite type="text">
          <dia:attribute name="string">
            <dia:string>#SS2PI#</dia:string>
          </dia:attribute>
          <dia:attribute name="font">
            <dia:font family="sans" style="80" name="Helvetica"/>
          </dia:attribute>
          <dia:attribute name="height">
            <dia:real val="1"/>
          </dia:attribute>
          <dia:attribute name="pos">
            <dia:point val="29.2532,18.2968"/>
          </dia:attribute>
          <dia:attribute name="color">
            <dia:color val="#000000"/>
          </dia:attribute>
          <dia:attribute name="alignment">
            <dia:enum val="1"/>
          </dia:attribute>
        </dia:composite>
      </dia:attribute>
    </dia:object>
    <dia:object type="Flowchart - Box" version="0" id="O6">
      <dia:attribute name="obj_pos">
        <dia:point val="33.1255,16.8355"/>
      </dia:attribute>
      <dia:attribute name="obj_bb">
        <dia:rectangle val="33.0755,16.7855;37.7255,18.9855"/>
      </dia:attribute>
      <dia:attribute name="elem_corner">
        <dia:point val="33.1255,16.8355"/>
      </dia:attribute>
      <dia:attribute name="elem_width">
        <dia:real val="4.55"/>
      </dia:attribute>
      <dia:attribute name="elem_height">
        <dia:real val="2.1"/>
      </dia:attribute>
      <dia:attribute name="show_background">
        <dia:boolean val="true"/>
      </dia:attribute>
      <dia:attribute name="padding">
        <dia:real val="0.5"/>
      </dia:attribute>
      <dia:attribute name="text">
        <dia:composite type="text">
          <dia:attribute name="string">
            <dia:string>#Backend#</dia:string>
          </dia:attribute>
          <dia:attribute name="font">
            <dia:font family="sans" style="80" name="Helvetica"/>
          </dia:attribute>
          <dia:attribute name="height">
            <dia:real val="1"/>
          </dia:attribute>
          <dia:attribute name="pos">
            <dia:point val="35.4005,18.2355"/>
          </dia:attribute>
          <dia:attribute name="color">
            <dia:color val="#000000"/>
          </dia:attribute>
          <dia:attribute name="alignment">
            <dia:enum val="1"/>
          </dia:attribute>
        </dia:composite>
      </dia:attribute>
    </dia:object>
    <dia:object type="Standard - Line" version="0" id="O7">
      <dia:attribute name="obj_pos">
        <dia:point val="10.8,18.1"/>
      </dia:attribute>
      <dia:attribute name="obj_bb">
        <dia:rectangle val="8.03847,17.2995;10.9044,18.9005"/>
      </dia:attribute>
      <dia:attribute name="conn_endpoints">
        <dia:point val="10.8,18.1"/>
        <dia:point val="8.13901,18.1145"/>
      </dia:attribute>
      <dia:attribute name="numcp">
        <dia:int val="1"/>
      </dia:attribute>
      <dia:attribute name="line_width">
        <dia:real val="0.2"/>
      </dia:attribute>
      <dia:attribute name="start_arrow">
        <dia:enum val="3"/>
      </dia:attribute>
      <dia:attribute name="start_arrow_length">
        <dia:real val="0.8"/>
      </dia:attribute>
      <dia:attribute name="start_arrow_width">
        <dia:real val="0.8"/>
      </dia:attribute>
      <dia:connections>
        <dia:connection handle="0" to="O2" connection="7"/>
        <dia:connection handle="1" to="O1" connection="8"/>
      </dia:connections>
    </dia:object>
    <dia:object type="Standard - Line" version="0" id="O8">
      <dia:attribute name="obj_pos">
        <dia:point val="17,18.05"/>
      </dia:attribute>
      <dia:attribute name="obj_bb">
        <dia:rectangle val="13.8983,17.2484;17.1133,18.8516"/>
      </dia:attribute>
      <dia:attribute name="conn_endpoints">
        <dia:point val="17,18.05"/>
        <dia:point val="14,18.1"/>
      </dia:attribute>
      <dia:attribute name="numcp">
        <dia:int val="1"/>
      </dia:attribute>
      <dia:attribute name="line_width">
        <dia:real val="0.2"/>
      </dia:attribute>
      <dia:attribute name="start_arrow">
        <dia:enum val="3"/>
      </dia:attribute>
      <dia:attribute name="start_arrow_length">
        <dia:real val="0.8"/>
      </dia:attribute>
      <dia:attribute name="start_arrow_width">
        <dia:real val="0.8"/>
      </dia:attribute>
      <dia:connections>
        <dia:connection handle="0" to="O3" connection="7"/>
        <dia:connection handle="1" to="O2" connection="8"/>
      </dia:connections>
    </dia:object>
    <dia:object type="Standard - Line" version="0" id="O9">
      <dia:attribute name="obj_pos">
        <dia:point val="22.1894,17.9855"/>
      </dia:attribute>
      <dia:attribute name="obj_bb">
        <dia:rectangle val="19.6973,17.1831;22.311,18.7879"/>
      </dia:attribute>
      <dia:attribute name="conn_endpoints">
        <dia:point val="22.1894,17.9855"/>
        <dia:point val="19.8,18.05"/>
      </dia:attribute>
      <dia:attribute name="numcp">
        <dia:int val="1"/>
      </dia:attribute>
      <dia:attribute name="line_width">
        <dia:real val="0.2"/>
      </dia:attribute>
      <dia:attribute name="start_arrow">
        <dia:enum val="3"/>
      </dia:attribute>
      <dia:attribute name="start_arrow_length">
        <dia:real val="0.8"/>
      </dia:attribute>
      <dia:attribute name="start_arrow_width">
        <dia:real val="0.8"/>
      </dia:attribute>
      <dia:connections>
        <dia:connection handle="0" to="O4" connection="7"/>
        <dia:connection handle="1" to="O3" connection="8"/>
      </dia:connections>
    </dia:object>
    <dia:object type="Standard - Line" version="0" id="O10">
      <dia:attribute name="obj_pos">
        <dia:point val="27.4032,17.9468"/>
      </dia:attribute>
      <dia:attribute name="obj_bb">
        <dia:rectangle val="24.8878,17.1453;27.516,18.7483"/>
      </dia:attribute>
      <dia:attribute name="conn_endpoints">
        <dia:point val="27.4032,17.9468"/>
        <dia:point val="24.9894,17.9855"/>
      </dia:attribute>
      <dia:attribute name="numcp">
        <dia:int val="1"/>
      </dia:attribute>
      <dia:attribute name="line_width">
        <dia:real val="0.2"/>
      </dia:attribute>
      <dia:attribute name="start_arrow">
        <dia:enum val="3"/>
      </dia:attribute>
      <dia:attribute name="start_arrow_length">
        <dia:real val="0.8"/>
      </dia:attribute>
      <dia:attribute name="start_arrow_width">
        <dia:real val="0.8"/>
      </dia:attribute>
      <dia:connections>
        <dia:connection handle="0" to="O5" connection="7"/>
        <dia:connection handle="1" to="O4" connection="8"/>
      </dia:connections>
    </dia:object>
    <dia:object type="Standard - Line" version="0" id="O11">
      <dia:attribute name="obj_pos">
        <dia:point val="33.1255,17.8855"/>
      </dia:attribute>
      <dia:attribute name="obj_bb">
        <dia:rectangle val="31.0002,17.0828;33.2497,18.6882"/>
      </dia:attribute>
      <dia:attribute name="conn_endpoints">
        <dia:point val="33.1255,17.8855"/>
        <dia:point val="31.1032,17.9468"/>
      </dia:attribute>
      <dia:attribute name="numcp">
        <dia:int val="1"/>
      </dia:attribute>
      <dia:attribute name="line_width">
        <dia:real val="0.2"/>
      </dia:attribute>
      <dia:attribute name="start_arrow">
        <dia:enum val="3"/>
      </dia:attribute>
      <dia:attribute name="start_arrow_length">
        <dia:real val="0.8"/>
      </dia:attribute>
      <dia:attribute name="start_arrow_width">
        <dia:real val="0.8"/>
      </dia:attribute>
      <dia:connections>
        <dia:connection handle="0" to="O6" connection="7"/>
        <dia:connection handle="1" to="O5" connection="8"/>
      </dia:connections>
    </dia:object>
    <dia:object type="Standard - Line" version="0" id="O12">
      <dia:attribute name="obj_pos">
        <dia:point val="5.48901,18.1145"/>
      </dia:attribute>
      <dia:attribute name="obj_bb">
        <dia:rectangle val="1.28281,17.3142;5.59183,18.9148"/>
      </dia:attribute>
      <dia:attribute name="conn_endpoints">
        <dia:point val="5.48901,18.1145"/>
        <dia:point val="1.38316,18.1"/>
      </dia:attribute>
      <dia:attribute name="numcp">
        <dia:int val="1"/>
      </dia:attribute>
      <dia:attribute name="line_width">
        <dia:real val="0.2"/>
      </dia:attribute>
      <dia:attribute name="start_arrow">
        <dia:enum val="3"/>
      </dia:attribute>
      <dia:attribute name="start_arrow_length">
        <dia:real val="0.8"/>
      </dia:attribute>
      <dia:attribute name="start_arrow_width">
        <dia:real val="0.8"/>
      </dia:attribute>
      <dia:connections>
        <dia:connection handle="0" to="O1" connection="7"/>
      </dia:connections>
    </dia:object>
    <dia:object type="Standard - Line" version="0" id="O13">
      <dia:attribute name="obj_pos">
        <dia:point val="41.2832,17.85"/>
      </dia:attribute>
      <dia:attribute name="obj_bb">
        <dia:rectangle val="37.5745,17.0491;41.391,18.6509"/>
      </dia:attribute>
      <dia:attribute name="conn_endpoints">
        <dia:point val="41.2832,17.85"/>
        <dia:point val="37.6755,17.8855"/>
      </dia:attribute>
      <dia:attribute name="numcp">
        <dia:int val="1"/>
      </dia:attribute>
      <dia:attribute name="line_width">
        <dia:real val="0.2"/>
      </dia:attribute>
      <dia:attribute name="start_arrow">
        <dia:enum val="3"/>
      </dia:attribute>
      <dia:attribute name="start_arrow_length">
        <dia:real val="0.8"/>
      </dia:attribute>
      <dia:attribute name="start_arrow_width">
        <dia:real val="0.8"/>
      </dia:attribute>
      <dia:connections>
        <dia:connection handle="1" to="O6" connection="8"/>
      </dia:connections>
    </dia:object>
    <dia:object type="Standard - ZigZagLine" version="0" id="O14">
      <dia:attribute name="obj_pos">
        <dia:point val="17.7,17"/>
      </dia:attribute>
      <dia:attribute name="obj_bb">
        <dia:rectangle val="11.9,15.003;17.75,17.1"/>
      </dia:attribute>
      <dia:attribute name="orth_points">
        <dia:point val="17.7,17"/>
        <dia:point val="17.7,15.053"/>
        <dia:point val="12.4,15.053"/>
        <dia:point val="12.4,17.05"/>
      </dia:attribute>
      <dia:attribute name="orth_orient">
        <dia:enum val="1"/>
        <dia:enum val="0"/>
        <dia:enum val="1"/>
      </dia:attribute>
      <dia:attribute name="autorouting">
        <dia:boolean val="false"/>
      </dia:attribute>
      <dia:attribute name="line_style">
        <dia:enum val="1"/>
      </dia:attribute>
      <dia:attribute name="end_arrow">
        <dia:enum val="22"/>
      </dia:attribute>
      <dia:attribute name="end_arrow_length">
        <dia:real val="0.5"/>
      </dia:attribute>
      <dia:attribute name="end_arrow_width">
        <dia:real val="0.5"/>
      </dia:attribute>
      <dia:attribute name="dashlength">
        <dia:real val="0.3"/>
      </dia:attribute>
      <dia:connections>
        <dia:connection handle="0" to="O3" connection="1"/>
        <dia:connection handle="1" to="O2" connection="2"/>
      </dia:connections>
    </dia:object>
    <dia:object type="Standard - ZigZagLine" version="0" id="O15">
      <dia:attribute name="obj_pos">
        <dia:point val="23.5894,16.9355"/>
      </dia:attribute>
      <dia:attribute name="obj_bb">
        <dia:rectangle val="11.1,13.975;23.6394,17.1"/>
      </dia:attribute>
      <dia:attribute name="orth_points">
        <dia:point val="23.5894,16.9355"/>
        <dia:point val="23.5894,14.025"/>
        <dia:point val="11.6,14.025"/>
        <dia:point val="11.6,17.05"/>
      </dia:attribute>
      <dia:attribute name="orth_orient">
        <dia:enum val="1"/>
        <dia:enum val="0"/>
        <dia:enum val="1"/>
      </dia:attribute>
      <dia:attribute name="autorouting">
        <dia:boolean val="false"/>
      </dia:attribute>
      <dia:attribute name="line_style">
        <dia:enum val="1"/>
      </dia:attribute>
      <dia:attribute name="end_arrow">
        <dia:enum val="22"/>
      </dia:attribute>
      <dia:attribute name="end_arrow_length">
        <dia:real val="0.5"/>
      </dia:attribute>
      <dia:attribute name="end_arrow_width">
        <dia:real val="0.5"/>
      </dia:attribute>
      <dia:attribute name="dashlength">
        <dia:real val="0.3"/>
      </dia:attribute>
      <dia:connections>
        <dia:connection handle="0" to="O4" connection="2"/>
        <dia:connection handle="1" to="O2" connection="1"/>
      </dia:connections>
    </dia:object>
    <dia:object type="Flowchart - Box" version="0" id="O16">
      <dia:attribute name="obj_pos">
        <dia:point val="17.6259,24.7654"/>
      </dia:attribute>
      <dia:attribute name="obj_bb">
        <dia:rectangle val="17.5759,24.7154;23.3759,27.9154"/>
      </dia:attribute>
      <dia:attribute name="elem_corner">
        <dia:point val="17.6259,24.7654"/>
      </dia:attribute>
      <dia:attribute name="elem_width">
        <dia:real val="5.7"/>
      </dia:attribute>
      <dia:attribute name="elem_height">
        <dia:real val="3.1"/>
      </dia:attribute>
      <dia:attribute name="show_background">
        <dia:boolean val="true"/>
      </dia:attribute>
      <dia:attribute name="padding">
        <dia:real val="0.5"/>
      </dia:attribute>
      <dia:attribute name="text">
        <dia:composite type="text">
          <dia:attribute name="string">
            <dia:string>#Declaration
tables#</dia:string>
          </dia:attribute>
          <dia:attribute name="font">
            <dia:font family="sans" style="80" name="Helvetica"/>
          </dia:attribute>
          <dia:attribute name="height">
            <dia:real val="1"/>
          </dia:attribute>
          <dia:attribute name="pos">
            <dia:point val="20.4759,26.1654"/>
          </dia:attribute>
          <dia:attribute name="color">
            <dia:color val="#000000"/>
          </dia:attribute>
          <dia:attribute name="alignment">
            <dia:enum val="1"/>
          </dia:attribute>
        </dia:composite>
      </dia:attribute>
    </dia:object>
    <dia:object type="Standard - Line" version="0" id="O17">
      <dia:attribute name="obj_pos">
        <dia:point val="23.5894,19.0355"/>
      </dia:attribute>
      <dia:attribute name="obj_bb">
        <dia:rectangle val="21.4072,18.8462;24.0831,24.9547"/>
      </dia:attribute>
      <dia:attribute name="conn_endpoints">
        <dia:point val="23.5894,19.0355"/>
        <dia:point val="21.9009,24.7654"/>
      </dia:attribute>
      <dia:attribute name="numcp">
        <dia:int val="1"/>
      </dia:attribute>
      <dia:attribute name="start_arrow">
        <dia:enum val="3"/>
      </dia:attribute>
      <dia:attribute name="start_arrow_length">
        <dia:real val="0.5"/>
      </dia:attribute>
      <dia:attribute name="start_arrow_width">
        <dia:real val="0.5"/>
      </dia:attribute>
      <dia:attribute name="end_arrow">
        <dia:enum val="3"/>
      </dia:attribute>
      <dia:attribute name="end_arrow_length">
        <dia:real val="0.5"/>
      </dia:attribute>
      <dia:attribute name="end_arrow_width">
        <dia:real val="0.5"/>
      </dia:attribute>
      <dia:connections>
        <dia:connection handle="0" to="O4" connection="13"/>
        <dia:connection handle="1" to="O16" connection="3"/>
      </dia:connections>
    </dia:object>
    <dia:object type="Standard - Line" version="0" id="O18">
      <dia:attribute name="obj_pos">
        <dia:point val="28.3282,18.9968"/>
      </dia:attribute>
      <dia:attribute name="obj_bb">
        <dia:rectangle val="23.2554,18.6315;28.7387,24.8359"/>
      </dia:attribute>
      <dia:attribute name="conn_endpoints">
        <dia:point val="28.3282,18.9968"/>
        <dia:point val="23.3259,24.7654"/>
      </dia:attribute>
      <dia:attribute name="numcp">
        <dia:int val="1"/>
      </dia:attribute>
      <dia:attribute name="start_arrow">
        <dia:enum val="3"/>
      </dia:attribute>
      <dia:attribute name="start_arrow_length">
        <dia:real val="0.5"/>
      </dia:attribute>
      <dia:attribute name="start_arrow_width">
        <dia:real val="0.5"/>
      </dia:attribute>
      <dia:connections>
        <dia:connection handle="0" to="O5" connection="12"/>
        <dia:connection handle="1" to="O16" connection="4"/>
      </dia:connections>
    </dia:object>
    <dia:object type="Standard - Line" version="0" id="O19">
      <dia:attribute name="obj_pos">
        <dia:point val="33.1255,18.9355"/>
      </dia:attribute>
      <dia:attribute name="obj_bb">
        <dia:rectangle val="23.2565,18.4929;33.4464,25.6098"/>
      </dia:attribute>
      <dia:attribute name="conn_endpoints">
        <dia:point val="33.1255,18.9355"/>
        <dia:point val="23.3259,25.5404"/>
      </dia:attribute>
      <dia:attribute name="numcp">
        <dia:int val="1"/>
      </dia:attribute>
      <dia:attribute name="start_arrow">
        <dia:enum val="3"/>
      </dia:attribute>
      <dia:attribute name="start_arrow_length">
        <dia:real val="0.5"/>
      </dia:attribute>
      <dia:attribute name="start_arrow_width">
        <dia:real val="0.5"/>
      </dia:attribute>
      <dia:connections>
        <dia:connection handle="0" to="O6" connection="11"/>
        <dia:connection handle="1" to="O16" connection="6"/>
      </dia:connections>
    </dia:object>
    <dia:object type="Standard - Text" version="0" id="O20">
      <dia:attribute name="obj_pos">
        <dia:point val="1.71607,17.2069"/>
      </dia:attribute>
      <dia:attribute name="obj_bb">
        <dia:rectangle val="1.71607,16.3294;4.44357,17.6619"/>
      </dia:attribute>
      <dia:attribute name="text">
        <dia:composite type="text">
          <dia:attribute name="string">
            <dia:string>#source#</dia:string>
          </dia:attribute>
          <dia:attribute name="font">
            <dia:font family="sans" style="80" name="Helvetica"/>
          </dia:attribute>
          <dia:attribute name="height">
            <dia:real val="1"/>
          </dia:attribute>
          <dia:attribute name="pos">
            <dia:point val="1.71607,17.2069"/>
          </dia:attribute>
          <dia:attribute name="color">
            <dia:color val="#000000"/>
          </dia:attribute>
          <dia:attribute name="alignment">
            <dia:enum val="0"/>
          </dia:attribute>
        </dia:composite>
      </dia:attribute>
    </dia:object>
    <dia:object type="Standard - Text" version="0" id="O21">
      <dia:attribute name="obj_pos">
        <dia:point val="15.3214,13.2973"/>
      </dia:attribute>
      <dia:attribute name="obj_bb">
        <dia:rectangle val="15.3214,12.4473;19.9714,13.6973"/>
      </dia:attribute>
      <dia:attribute name="text">
        <dia:composite type="text">
          <dia:attribute name="string">
            <dia:string>#Controlflow#</dia:string>
          </dia:attribute>
          <dia:attribute name="font">
            <dia:font family="sans" style="80" name="Helvetica"/>
          </dia:attribute>
          <dia:attribute name="height">
            <dia:real val="1"/>
          </dia:attribute>
          <dia:attribute name="pos">
            <dia:point val="15.3214,13.2973"/>
          </dia:attribute>
          <dia:attribute name="color">
            <dia:color val="#000000"/>
          </dia:attribute>
          <dia:attribute name="alignment">
            <dia:enum val="0"/>
          </dia:attribute>
        </dia:composite>
      </dia:attribute>
    </dia:object>
    <dia:object type="Standard - Line" version="0" id="O22">
      <dia:attribute name="obj_pos">
        <dia:point val="31.5,10"/>
      </dia:attribute>
      <dia:attribute name="obj_bb">
        <dia:rectangle val="31.4337,9.94995;31.5501,25.4974"/>
      </dia:attribute>
      <dia:attribute name="conn_endpoints">
        <dia:point val="31.5,10"/>
        <dia:point val="31.4838,25.4473"/>
      </dia:attribute>
      <dia:attribute name="numcp">
        <dia:int val="1"/>
      </dia:attribute>
      <dia:attribute name="line_style">
        <dia:enum val="4"/>
      </dia:attribute>
      <dia:connections>
        <dia:connection handle="0" to="O25" connection="6"/>
      </dia:connections>
    </dia:object>
    <dia:object type="Standard - Text" version="0" id="O23">
      <dia:attribute name="obj_pos">
        <dia:point val="20,9"/>
      </dia:attribute>
      <dia:attribute name="obj_bb">
        <dia:rectangle val="18.15,8.15;21.85,9.4"/>
      </dia:attribute>
      <dia:attribute name="text">
        <dia:composite type="text">
          <dia:attribute name="string">
            <dia:string>#Frontend#</dia:string>
          </dia:attribute>
          <dia:attribute name="font">
            <dia:font family="sans" style="80" name="Helvetica"/>
          </dia:attribute>
          <dia:attribute name="height">
            <dia:real val="1"/>
          </dia:attribute>
          <dia:attribute name="pos">
            <dia:point val="20,9"/>
          </dia:attribute>
          <dia:attribute name="color">
            <dia:color val="#000000"/>
          </dia:attribute>
          <dia:attribute name="alignment">
            <dia:enum val="1"/>
          </dia:attribute>
        </dia:composite>
      </dia:attribute>
    </dia:object>
    <dia:object type="Standard - Line" version="0" id="O24">
      <dia:attribute name="obj_pos">
        <dia:point val="31,9.5"/>
      </dia:attribute>
      <dia:attribute name="obj_bb">
        <dia:rectangle val="8.95,9;31.05,10"/>
      </dia:attribute>
      <dia:attribute name="conn_endpoints">
        <dia:point val="31,9.5"/>
        <dia:point val="9,9.5"/>
      </dia:attribute>
      <dia:attribute name="numcp">
        <dia:int val="1"/>
      </dia:attribute>
      <dia:attribute name="line_style">
        <dia:enum val="4"/>
      </dia:attribute>
      <dia:attribute name="end_arrow">
        <dia:enum val="3"/>
      </dia:attribute>
      <dia:attribute name="end_arrow_length">
        <dia:real val="0.5"/>
      </dia:attribute>
      <dia:attribute name="end_arrow_width">
        <dia:real val="0.5"/>
      </dia:attribute>
      <dia:connections>
        <dia:connection handle="0" to="O25" connection="3"/>
      </dia:connections>
    </dia:object>
    <dia:object type="Standard - Box" version="0" id="O25">
      <dia:attribute name="obj_pos">
        <dia:point val="31,9"/>
      </dia:attribute>
      <dia:attribute name="obj_bb">
        <dia:rectangle val="30.95,8.95;32.05,10.05"/>
      </dia:attribute>
      <dia:attribute name="elem_corner">
        <dia:point val="31,9"/>
      </dia:attribute>
      <dia:attribute name="elem_width">
        <dia:real val="1"/>
      </dia:attribute>
      <dia:attribute name="elem_height">
        <dia:real val="1"/>
      </dia:attribute>
      <dia:attribute name="show_background">
        <dia:boolean val="true"/>
      </dia:attribute>
    </dia:object>
    <dia:object type="Standard - Line" version="0" id="O26">
      <dia:attribute name="obj_pos">
        <dia:point val="32,9.5"/>
      </dia:attribute>
      <dia:attribute name="obj_bb">
        <dia:rectangle val="31.95,9;39.05,10"/>
      </dia:attribute>
      <dia:attribute name="conn_endpoints">
        <dia:point val="32,9.5"/>
        <dia:point val="39,9.5"/>
      </dia:attribute>
      <dia:attribute name="numcp">
        <dia:int val="1"/>
      </dia:attribute>
      <dia:attribute name="line_style">
        <dia:enum val="4"/>
      </dia:attribute>
      <dia:attribute name="end_arrow">
        <dia:enum val="3"/>
      </dia:attribute>
      <dia:attribute name="end_arrow_length">
        <dia:real val="0.5"/>
      </dia:attribute>
      <dia:attribute name="end_arrow_width">
        <dia:real val="0.5"/>
      </dia:attribute>
      <dia:connections>
        <dia:connection handle="0" to="O25" connection="4"/>
      </dia:connections>
    </dia:object>
    <dia:object type="Standard - Text" version="0" id="O27">
      <dia:attribute name="obj_pos">
        <dia:point val="35.4,9"/>
      </dia:attribute>
      <dia:attribute name="obj_bb">
        <dia:rectangle val="33.675,8.15;37.125,9.4"/>
      </dia:attribute>
      <dia:attribute name="text">
        <dia:composite type="text">
          <dia:attribute name="string">
            <dia:string>#Backend#</dia:string>
          </dia:attribute>
          <dia:attribute name="font">
            <dia:font family="sans" style="80" name="Helvetica"/>
          </dia:attribute>
          <dia:attribute name="height">
            <dia:real val="1"/>
          </dia:attribute>
          <dia:attribute name="pos">
            <dia:point val="35.4,9"/>
          </dia:attribute>
          <dia:attribute name="color">
            <dia:color val="#000000"/>
          </dia:attribute>
          <dia:attribute name="alignment">
            <dia:enum val="1"/>
          </dia:attribute>
        </dia:composite>
      </dia:attribute>
    </dia:object>
    <dia:object type="Standard - Text" version="0" id="O28">
      <dia:attribute name="obj_pos">
        <dia:point val="38.3432,17.03"/>
      </dia:attribute>
      <dia:attribute name="obj_bb">
        <dia:rectangle val="38.3432,16.1525;40.2207,17.485"/>
      </dia:attribute>
      <dia:attribute name="text">
        <dia:composite type="text">
          <dia:attribute name="string">
            <dia:string>#ASM#</dia:string>
          </dia:attribute>
          <dia:attribute name="font">
            <dia:font family="sans" style="80" name="Helvetica"/>
          </dia:attribute>
          <dia:attribute name="height">
            <dia:real val="1"/>
          </dia:attribute>
          <dia:attribute name="pos">
            <dia:point val="38.3432,17.03"/>
          </dia:attribute>
          <dia:attribute name="color">
            <dia:color val="#000000"/>
          </dia:attribute>
          <dia:attribute name="alignment">
            <dia:enum val="0"/>
          </dia:attribute>
        </dia:composite>
      </dia:attribute>
    </dia:object>
  </dia:layer>
</dia:diagram>
