%!PS-Adobe-2.0 EPSF-2.0
%%Title: /home/jikos/lestes_doc/papers/page0013.dia
%%Creator: Dia v0.94
%%CreationDate: Sun Mar 13 16:57:05 2005
%%For: jikos
%%Orientation: Portrait
%%Magnification: 1.0000
%%BoundingBox: 0 0 645 467
%%BeginSetup
%%EndSetup
%%EndComments
%%BeginProlog
[ /.notdef /.notdef /.notdef /.notdef /.notdef /.notdef /.notdef /.notdef /.notdef /.notdef
/.notdef /.notdef /.notdef /.notdef /.notdef /.notdef /.notdef /.notdef /.notdef /.notdef
/.notdef /.notdef /.notdef /.notdef /.notdef /.notdef /.notdef /.notdef /.notdef /.notdef
/.notdef /.notdef /space /exclam /quotedbl /numbersign /dollar /percent /ampersand /quoteright
/parenleft /parenright /asterisk /plus /comma /hyphen /period /slash /zero /one
/two /three /four /five /six /seven /eight /nine /colon /semicolon
/less /equal /greater /question /at /A /B /C /D /E
/F /G /H /I /J /K /L /M /N /O
/P /Q /R /S /T /U /V /W /X /Y
/Z /bracketleft /backslash /bracketright /asciicircum /underscore /quoteleft /a /b /c
/d /e /f /g /h /i /j /k /l /m
/n /o /p /q /r /s /t /u /v /w
/x /y /z /braceleft /bar /braceright /asciitilde /.notdef /.notdef /.notdef
/.notdef /.notdef /.notdef /.notdef /.notdef /.notdef /.notdef /.notdef /.notdef /.notdef
/.notdef /.notdef /.notdef /.notdef /.notdef /.notdef /.notdef /.notdef /.notdef /.notdef
/.notdef /.notdef /.notdef /.notdef /.notdef /.notdef /.notdef /.notdef /.notdef /.notdef
/space /exclamdown /cent /sterling /currency /yen /brokenbar /section /dieresis /copyright
/ordfeminine /guillemotleft /logicalnot /hyphen /registered /macron /degree /plusminus /twosuperior /threesuperior
/acute /mu /paragraph /periodcentered /cedilla /onesuperior /ordmasculine /guillemotright /onequarter /onehalf
/threequarters /questiondown /Agrave /Aacute /Acircumflex /Atilde /Adieresis /Aring /AE /Ccedilla
/Egrave /Eacute /Ecircumflex /Edieresis /Igrave /Iacute /Icircumflex /Idieresis /Eth /Ntilde
/Ograve /Oacute /Ocircumflex /Otilde /Odieresis /multiply /Oslash /Ugrave /Uacute /Ucircumflex
/Udieresis /Yacute /Thorn /germandbls /agrave /aacute /acircumflex /atilde /adieresis /aring
/ae /ccedilla /egrave /eacute /ecircumflex /edieresis /igrave /iacute /icircumflex /idieresis
/eth /ntilde /ograve /oacute /ocircumflex /otilde /odieresis /divide /oslash /ugrave
/uacute /ucircumflex /udieresis /yacute /thorn /ydieresis] /isolatin1encoding exch def
/cp {closepath} bind def
/c {curveto} bind def
/f {fill} bind def
/a {arc} bind def
/ef {eofill} bind def
/ex {exch} bind def
/gr {grestore} bind def
/gs {gsave} bind def
/sa {save} bind def
/rs {restore} bind def
/l {lineto} bind def
/m {moveto} bind def
/rm {rmoveto} bind def
/n {newpath} bind def
/s {stroke} bind def
/sh {show} bind def
/slc {setlinecap} bind def
/slj {setlinejoin} bind def
/slw {setlinewidth} bind def
/srgb {setrgbcolor} bind def
/rot {rotate} bind def
/sc {scale} bind def
/sd {setdash} bind def
/ff {findfont} bind def
/sf {setfont} bind def
/scf {scalefont} bind def
/sw {stringwidth pop} bind def
/tr {translate} bind def

/ellipsedict 8 dict def
ellipsedict /mtrx matrix put
/ellipse
{ ellipsedict begin
   /endangle exch def
   /startangle exch def
   /yrad exch def
   /xrad exch def
   /y exch def
   /x exch def   /savematrix mtrx currentmatrix def
   x y tr xrad yrad sc
   0 0 1 startangle endangle arc
   savematrix setmatrix
   end
} def

/mergeprocs {
dup length
3 -1 roll
dup
length
dup
5 1 roll
3 -1 roll
add
array cvx
dup
3 -1 roll
0 exch
putinterval
dup
4 2 roll
putinterval
} bind def
/dpi_x 300 def
/dpi_y 300 def
/conicto {
    /to_y exch def
    /to_x exch def
    /conic_cntrl_y exch def
    /conic_cntrl_x exch def
    currentpoint
    /p0_y exch def
    /p0_x exch def
    /p1_x p0_x conic_cntrl_x p0_x sub 2 3 div mul add def
    /p1_y p0_y conic_cntrl_y p0_y sub 2 3 div mul add def
    /p2_x p1_x to_x p0_x sub 1 3 div mul add def
    /p2_y p1_y to_y p0_y sub 1 3 div mul add def
    p1_x p1_y p2_x p2_y to_x to_y curveto
} bind def
/start_ol { gsave 1.1 dpi_x div dup scale} bind def
/end_ol { closepath fill grestore } bind def
28.346000 -28.346000 scale
-0.500000 -17.860000 translate
%%EndProlog


0.100000 slw
[] 0 sd
1.000000 1.000000 1.000000 srgb
n 1.600000 1.450000 m 1.600000 2.850000 l 4.650000 2.850000 l 4.650000 1.450000 l f
0.000000 0.000000 0.000000 srgb
n 1.600000 1.450000 m 1.600000 2.850000 l 4.650000 2.850000 l 4.650000 1.450000 l cp s
gsave 1.994700 2.450000 translate 0.035278 -0.035278 scale
start_ol
1216 -1043 moveto
1216 0 lineto
1501 0 1679 0 1839 0 curveto
2770 0 3328 603 3328 1613 curveto
3328 2491 2895 3072 2239 3072 curveto
1860 3072 1553 2899 1216 2490 curveto
1216 3072 lineto
384 3072 lineto
384 -1043 lineto
1216 -1043 lineto
1216 1968 moveto
1457 2282 1667 2421 1908 2421 curveto
2251 2421 2432 2112 2432 1515 curveto
2432 843 2191 513 1710 513 curveto
1601 513 1451 529 1216 561 curveto
1216 1968 lineto
end_ol grestore 
gsave 2.460367 2.450000 translate 0.035278 -0.035278 scale
start_ol
512 0 moveto
1344 0 lineto
1344 1958 lineto
1517 2247 1684 2375 1908 2375 curveto
1983 2375 2064 2358 2173 2314 curveto
2173 3072 lineto
2121 3072 2069 3072 2029 3072 curveto
1724 3072 1517 2893 1344 2490 curveto
1344 3072 lineto
512 3072 lineto
512 0 lineto
end_ol grestore 
gsave 2.756700 2.450000 translate 0.035278 -0.035278 scale
start_ol
2897 752 moveto
2540 619 2275 564 2010 564 curveto
1751 564 1549 625 1400 741 curveto
1215 889 1129 1060 1083 1408 curveto
2897 1408 lineto
2886 2582 2511 3072 1624 3072 curveto
760 3072 207 2497 207 1605 curveto
207 604 835 0 1872 0 curveto
2212 0 2534 52 2897 173 curveto
2897 752 lineto
1077 1856 moveto
1146 2340 1313 2554 1630 2554 curveto
1935 2554 2068 2345 2079 1856 curveto
1077 1856 lineto
end_ol grestore 
gsave 3.180033 2.450000 translate 0.035278 -0.035278 scale
start_ol
2269 1141 moveto
2039 797 1843 648 1613 648 curveto
1284 648 1112 969 1112 1588 curveto
1112 2287 1342 2636 1803 2636 curveto
1907 2636 2045 2619 2269 2579 curveto
2269 1141 lineto
2269 241 moveto
2269 -326 2010 -576 1405 -576 curveto
1100 -576 783 -503 346 -339 curveto
346 -934 lineto
789 -1085 1146 -1152 1521 -1152 curveto
2160 -1152 2644 -942 2892 -557 curveto
3053 -314 3105 15 3105 728 curveto
3105 3072 lineto
2269 3072 lineto
1999 3072 1826 3072 1665 3072 curveto
772 3072 219 2468 219 1490 curveto
219 607 657 0 1296 0 curveto
1659 0 1947 172 2269 579 curveto
2269 241 lineto
end_ol grestore 
gsave 3.645700 2.450000 translate 0.035278 -0.035278 scale
start_ol
end_ol grestore 
gsave 3.857367 2.450000 translate 0.035278 -0.035278 scale
start_ol
509 0 moveto
3005 0 lineto
3005 484 lineto
2176 484 lineto
2176 4160 lineto
509 3757 lineto
509 3270 lineto
1344 3472 lineto
1344 484 lineto
509 484 lineto
509 0 lineto
end_ol grestore 
1.000000 1.000000 1.000000 srgb
n 1.600000 2.850000 m 1.600000 4.650000 l 4.650000 4.650000 l 4.650000 2.850000 l f
0.000000 0.000000 0.000000 srgb
n 1.600000 2.850000 m 1.600000 4.650000 l 4.650000 4.650000 l 4.650000 2.850000 l cp s
gsave 1.750000 3.600000 translate 0.035278 -0.035278 scale
start_ol
1216 221 moveto
1536 221 lineto
1536 1216 lineto
2527 1216 lineto
2527 1536 lineto
1536 1536 lineto
1536 2531 lineto
1216 2531 lineto
1216 1536 lineto
221 1536 lineto
221 1216 lineto
1216 1216 lineto
1216 221 lineto
end_ol grestore 
gsave 2.114067 3.600000 translate 0.035278 -0.035278 scale
start_ol
2330 505 moveto
2058 382 1869 332 1703 332 curveto
1418 332 1344 455 1344 922 curveto
1344 2112 lineto
2302 2112 lineto
2302 2368 lineto
1344 2368 lineto
1344 2976 lineto
896 2976 lineto
896 2368 lineto
269 2368 lineto
269 2112 lineto
896 2112 lineto
896 723 lineto
896 206 1090 0 1571 0 curveto
1840 0 2066 60 2330 194 curveto
2330 505 lineto
end_ol grestore 
gsave 2.478133 3.600000 translate 0.035278 -0.035278 scale
start_ol
1157 0 moveto
1309 0 lineto
1064 -640 lineto
617 -640 lineto
617 -896 lineto
1696 -896 lineto
1696 -640 lineto
1364 -640 lineto
1608 -27 lineto
2474 2151 lineto
2640 2151 lineto
2640 2432 lineto
1816 2432 lineto
1816 2151 lineto
2175 2151 lineto
1475 413 lineto
1470 413 lineto
770 2151 lineto
1129 2151 lineto
1129 2432 lineto
124 2432 lineto
124 2151 lineto
290 2151 lineto
1157 0 lineto
end_ol grestore 
gsave 2.842200 3.600000 translate 0.035278 -0.035278 scale
start_ol
832 -640 moveto
832 0 lineto
1064 0 1217 0 1356 0 curveto
2065 0 2496 496 2496 1313 curveto
2496 1989 2169 2432 1679 2432 curveto
1353 2432 1102 2270 832 1892 curveto
832 2432 lineto
108 2432 lineto
108 2073 lineto
384 2073 lineto
384 -640 lineto
108 -640 lineto
108 -896 lineto
1405 -896 lineto
1405 -640 lineto
832 -640 lineto
832 1577 moveto
1069 1922 1286 2073 1551 2073 curveto
1882 2073 2048 1810 2048 1289 curveto
2048 616 1830 332 1324 332 curveto
1206 332 1064 345 832 379 curveto
832 1577 lineto
end_ol grestore 
gsave 3.206267 3.600000 translate 0.035278 -0.035278 scale
start_ol
2484 1152 moveto
2484 1280 lineto
2484 2045 2147 2432 1484 2432 curveto
756 2432 276 1958 276 1246 curveto
276 497 793 0 1576 0 curveto
1889 0 2147 60 2419 194 curveto
2419 521 lineto
2120 389 1885 332 1636 332 curveto
1387 332 1193 389 1046 507 curveto
871 648 793 814 751 1152 curveto
2484 1152 lineto
756 1408 moveto
802 1895 1046 2156 1452 2156 curveto
1825 2156 2014 1938 2014 1502 curveto
2014 1408 lineto
756 1408 lineto
end_ol grestore 
gsave 3.570333 3.600000 translate 0.035278 -0.035278 scale
start_ol
end_ol grestore 
gsave 3.934400 3.600000 translate 0.035278 -0.035278 scale
start_ol
116 0 moveto
1301 0 lineto
2114 0 2624 672 2624 1745 curveto
2624 2799 2168 3328 1271 3328 curveto
116 3328 lineto
116 3052 lineto
448 3052 lineto
448 276 lineto
116 276 lineto
116 0 lineto
896 276 moveto
896 3052 lineto
1135 3052 lineto
1843 3052 2176 2619 2176 1694 curveto
2176 755 1834 276 1168 276 curveto
896 276 lineto
end_ol grestore 
gsave 1.750000 4.400000 translate 0.035278 -0.035278 scale
start_ol
1216 221 moveto
1536 221 lineto
1536 1216 lineto
2527 1216 lineto
2527 1536 lineto
1536 1536 lineto
1536 2531 lineto
1216 2531 lineto
1216 1536 lineto
221 1536 lineto
221 1216 lineto
1216 1216 lineto
1216 221 lineto
end_ol grestore 
gsave 2.114067 4.400000 translate 0.035278 -0.035278 scale
start_ol
1376 2432 moveto
679 2432 256 1975 256 1216 curveto
256 465 679 0 1358 0 curveto
2073 0 2496 452 2496 1220 curveto
2496 1975 2073 2432 1376 2432 curveto
1376 2156 moveto
1821 2156 2048 1844 2048 1221 curveto
2048 601 1816 281 1376 281 curveto
926 281 704 593 704 1221 curveto
704 1840 931 2156 1376 2156 curveto
end_ol grestore 
gsave 2.478133 4.400000 translate 0.035278 -0.035278 scale
start_ol
1216 1529 moveto
1419 1889 1635 2045 1925 2045 curveto
2022 2045 2100 2023 2188 1965 curveto
2234 1556 lineto
2515 1556 lineto
2515 2292 lineto
2345 2387 2183 2432 1999 2432 curveto
1704 2432 1483 2281 1216 1907 curveto
1216 2432 lineto
187 2432 lineto
187 2045 lineto
768 2045 lineto
768 276 lineto
187 276 lineto
187 0 lineto
2050 0 lineto
2050 276 lineto
1216 276 lineto
1216 1529 lineto
end_ol grestore 
gsave 2.842200 4.400000 translate 0.035278 -0.035278 scale
start_ol
476 -56 moveto
290 -178 192 -319 192 -464 curveto
192 -791 540 -960 1217 -960 curveto
2060 -960 2496 -703 2496 -200 curveto
2496 155 2262 332 1803 332 curveto
998 332 lineto
756 332 640 370 640 445 curveto
640 503 687 562 793 637 curveto
893 704 lineto
1012 704 1105 704 1198 704 curveto
1834 704 2304 1072 2304 1568 curveto
2304 1775 2229 1945 2055 2156 curveto
2492 2156 lineto
2620 2432 lineto
1693 2432 lineto
1535 2432 1393 2432 1214 2432 curveto
597 2432 192 2084 192 1555 curveto
192 1225 354 1007 726 813 curveto
647 742 lineto
467 588 384 456 384 328 curveto
384 209 450 116 602 28 curveto
476 -56 lineto
798 0 moveto
1604 0 lineto
1900 0 2048 -93 2048 -284 curveto
2048 -538 1747 -704 1275 -704 curveto
858 -704 640 -596 640 -391 curveto
640 -274 675 -171 747 -73 curveto
798 0 lineto
1282 2156 moveto
1619 2156 1856 1905 1856 1547 curveto
1856 1202 1619 960 1273 960 curveto
936 960 704 1193 704 1533 curveto
704 1892 946 2156 1282 2156 curveto
end_ol grestore 
0.100000 slw
[] 0 sd
1.000000 1.000000 1.000000 srgb
n 15.630000 3.110000 m 15.630000 4.510000 l 18.680000 4.510000 l 18.680000 3.110000 l f
0.000000 0.000000 0.000000 srgb
n 15.630000 3.110000 m 15.630000 4.510000 l 18.680000 4.510000 l 18.680000 3.110000 l cp s
gsave 16.033167 4.110000 translate 0.035278 -0.035278 scale
start_ol
1216 -1043 moveto
1216 0 lineto
1501 0 1679 0 1839 0 curveto
2770 0 3328 603 3328 1613 curveto
3328 2491 2895 3072 2239 3072 curveto
1860 3072 1553 2899 1216 2490 curveto
1216 3072 lineto
384 3072 lineto
384 -1043 lineto
1216 -1043 lineto
1216 1968 moveto
1457 2282 1667 2421 1908 2421 curveto
2251 2421 2432 2112 2432 1515 curveto
2432 843 2191 513 1710 513 curveto
1601 513 1451 529 1216 561 curveto
1216 1968 lineto
end_ol grestore 
gsave 16.498833 4.110000 translate 0.035278 -0.035278 scale
start_ol
512 0 moveto
1344 0 lineto
1344 1958 lineto
1517 2247 1684 2375 1908 2375 curveto
1983 2375 2064 2358 2173 2314 curveto
2173 3072 lineto
2121 3072 2069 3072 2029 3072 curveto
1724 3072 1517 2893 1344 2490 curveto
1344 3072 lineto
512 3072 lineto
512 0 lineto
end_ol grestore 
gsave 16.795167 4.110000 translate 0.035278 -0.035278 scale
start_ol
2897 752 moveto
2540 619 2275 564 2010 564 curveto
1751 564 1549 625 1400 741 curveto
1215 889 1129 1060 1083 1408 curveto
2897 1408 lineto
2886 2582 2511 3072 1624 3072 curveto
760 3072 207 2497 207 1605 curveto
207 604 835 0 1872 0 curveto
2212 0 2534 52 2897 173 curveto
2897 752 lineto
1077 1856 moveto
1146 2340 1313 2554 1630 2554 curveto
1935 2554 2068 2345 2079 1856 curveto
1077 1856 lineto
end_ol grestore 
gsave 17.218500 4.110000 translate 0.035278 -0.035278 scale
start_ol
2269 1141 moveto
2039 797 1843 648 1613 648 curveto
1284 648 1112 969 1112 1588 curveto
1112 2287 1342 2636 1803 2636 curveto
1907 2636 2045 2619 2269 2579 curveto
2269 1141 lineto
2269 241 moveto
2269 -326 2010 -576 1405 -576 curveto
1100 -576 783 -503 346 -339 curveto
346 -934 lineto
789 -1085 1146 -1152 1521 -1152 curveto
2160 -1152 2644 -942 2892 -557 curveto
3053 -314 3105 15 3105 728 curveto
3105 3072 lineto
2269 3072 lineto
1999 3072 1826 3072 1665 3072 curveto
772 3072 219 2468 219 1490 curveto
219 607 657 0 1296 0 curveto
1659 0 1947 172 2269 579 curveto
2269 241 lineto
end_ol grestore 
gsave 17.684167 4.110000 translate 0.035278 -0.035278 scale
start_ol
end_ol grestore 
gsave 17.895833 4.110000 translate 0.035278 -0.035278 scale
start_ol
250 0 moveto
2880 0 lineto
2880 657 lineto
1195 657 lineto
1230 925 1432 1210 1791 1501 curveto
2069 1730 lineto
2660 2205 2880 2557 2880 3020 curveto
2880 3730 2364 4160 1512 4160 curveto
1161 4160 821 4091 360 3924 curveto
360 3324 lineto
792 3530 1103 3624 1374 3624 curveto
1777 3624 1984 3407 1984 2996 curveto
1984 2624 1875 2418 1431 1985 curveto
1097 1657 lineto
815 1374 lineto
590 1152 423 935 250 657 curveto
250 0 lineto
end_ol grestore 
1.000000 1.000000 1.000000 srgb
n 15.630000 4.510000 m 15.630000 6.310000 l 18.680000 6.310000 l 18.680000 4.510000 l f
0.000000 0.000000 0.000000 srgb
n 15.630000 4.510000 m 15.630000 6.310000 l 18.680000 6.310000 l 18.680000 4.510000 l cp s
gsave 15.780000 5.260000 translate 0.035278 -0.035278 scale
start_ol
1216 221 moveto
1536 221 lineto
1536 1216 lineto
2527 1216 lineto
2527 1536 lineto
1536 1536 lineto
1536 2531 lineto
1216 2531 lineto
1216 1536 lineto
221 1536 lineto
221 1216 lineto
1216 1216 lineto
1216 221 lineto
end_ol grestore 
gsave 16.144067 5.260000 translate 0.035278 -0.035278 scale
start_ol
2330 505 moveto
2058 382 1869 332 1703 332 curveto
1418 332 1344 455 1344 922 curveto
1344 2112 lineto
2302 2112 lineto
2302 2368 lineto
1344 2368 lineto
1344 2976 lineto
896 2976 lineto
896 2368 lineto
269 2368 lineto
269 2112 lineto
896 2112 lineto
896 723 lineto
896 206 1090 0 1571 0 curveto
1840 0 2066 60 2330 194 curveto
2330 505 lineto
end_ol grestore 
gsave 16.508133 5.260000 translate 0.035278 -0.035278 scale
start_ol
1157 0 moveto
1309 0 lineto
1064 -640 lineto
617 -640 lineto
617 -896 lineto
1696 -896 lineto
1696 -640 lineto
1364 -640 lineto
1608 -27 lineto
2474 2151 lineto
2640 2151 lineto
2640 2432 lineto
1816 2432 lineto
1816 2151 lineto
2175 2151 lineto
1475 413 lineto
1470 413 lineto
770 2151 lineto
1129 2151 lineto
1129 2432 lineto
124 2432 lineto
124 2151 lineto
290 2151 lineto
1157 0 lineto
end_ol grestore 
gsave 16.872200 5.260000 translate 0.035278 -0.035278 scale
start_ol
832 -640 moveto
832 0 lineto
1064 0 1217 0 1356 0 curveto
2065 0 2496 496 2496 1313 curveto
2496 1989 2169 2432 1679 2432 curveto
1353 2432 1102 2270 832 1892 curveto
832 2432 lineto
108 2432 lineto
108 2073 lineto
384 2073 lineto
384 -640 lineto
108 -640 lineto
108 -896 lineto
1405 -896 lineto
1405 -640 lineto
832 -640 lineto
832 1577 moveto
1069 1922 1286 2073 1551 2073 curveto
1882 2073 2048 1810 2048 1289 curveto
2048 616 1830 332 1324 332 curveto
1206 332 1064 345 832 379 curveto
832 1577 lineto
end_ol grestore 
gsave 17.236267 5.260000 translate 0.035278 -0.035278 scale
start_ol
2484 1152 moveto
2484 1280 lineto
2484 2045 2147 2432 1484 2432 curveto
756 2432 276 1958 276 1246 curveto
276 497 793 0 1576 0 curveto
1889 0 2147 60 2419 194 curveto
2419 521 lineto
2120 389 1885 332 1636 332 curveto
1387 332 1193 389 1046 507 curveto
871 648 793 814 751 1152 curveto
2484 1152 lineto
756 1408 moveto
802 1895 1046 2156 1452 2156 curveto
1825 2156 2014 1938 2014 1502 curveto
2014 1408 lineto
756 1408 lineto
end_ol grestore 
gsave 17.600333 5.260000 translate 0.035278 -0.035278 scale
start_ol
end_ol grestore 
gsave 17.964400 5.260000 translate 0.035278 -0.035278 scale
start_ol
116 0 moveto
1301 0 lineto
2114 0 2624 672 2624 1745 curveto
2624 2799 2168 3328 1271 3328 curveto
116 3328 lineto
116 3052 lineto
448 3052 lineto
448 276 lineto
116 276 lineto
116 0 lineto
896 276 moveto
896 3052 lineto
1135 3052 lineto
1843 3052 2176 2619 2176 1694 curveto
2176 755 1834 276 1168 276 curveto
896 276 lineto
end_ol grestore 
gsave 15.780000 6.060000 translate 0.035278 -0.035278 scale
start_ol
1216 221 moveto
1536 221 lineto
1536 1216 lineto
2527 1216 lineto
2527 1536 lineto
1536 1536 lineto
1536 2531 lineto
1216 2531 lineto
1216 1536 lineto
221 1536 lineto
221 1216 lineto
1216 1216 lineto
1216 221 lineto
end_ol grestore 
gsave 16.144067 6.060000 translate 0.035278 -0.035278 scale
start_ol
1376 2432 moveto
679 2432 256 1975 256 1216 curveto
256 465 679 0 1358 0 curveto
2073 0 2496 452 2496 1220 curveto
2496 1975 2073 2432 1376 2432 curveto
1376 2156 moveto
1821 2156 2048 1844 2048 1221 curveto
2048 601 1816 281 1376 281 curveto
926 281 704 593 704 1221 curveto
704 1840 931 2156 1376 2156 curveto
end_ol grestore 
gsave 16.508133 6.060000 translate 0.035278 -0.035278 scale
start_ol
1216 1529 moveto
1419 1889 1635 2045 1925 2045 curveto
2022 2045 2100 2023 2188 1965 curveto
2234 1556 lineto
2515 1556 lineto
2515 2292 lineto
2345 2387 2183 2432 1999 2432 curveto
1704 2432 1483 2281 1216 1907 curveto
1216 2432 lineto
187 2432 lineto
187 2045 lineto
768 2045 lineto
768 276 lineto
187 276 lineto
187 0 lineto
2050 0 lineto
2050 276 lineto
1216 276 lineto
1216 1529 lineto
end_ol grestore 
gsave 16.872200 6.060000 translate 0.035278 -0.035278 scale
start_ol
476 -56 moveto
290 -178 192 -319 192 -464 curveto
192 -791 540 -960 1217 -960 curveto
2060 -960 2496 -703 2496 -200 curveto
2496 155 2262 332 1803 332 curveto
998 332 lineto
756 332 640 370 640 445 curveto
640 503 687 562 793 637 curveto
893 704 lineto
1012 704 1105 704 1198 704 curveto
1834 704 2304 1072 2304 1568 curveto
2304 1775 2229 1945 2055 2156 curveto
2492 2156 lineto
2620 2432 lineto
1693 2432 lineto
1535 2432 1393 2432 1214 2432 curveto
597 2432 192 2084 192 1555 curveto
192 1225 354 1007 726 813 curveto
647 742 lineto
467 588 384 456 384 328 curveto
384 209 450 116 602 28 curveto
476 -56 lineto
798 0 moveto
1604 0 lineto
1900 0 2048 -93 2048 -284 curveto
2048 -538 1747 -704 1275 -704 curveto
858 -704 640 -596 640 -391 curveto
640 -274 675 -171 747 -73 curveto
798 0 lineto
1282 2156 moveto
1619 2156 1856 1905 1856 1547 curveto
1856 1202 1619 960 1273 960 curveto
936 960 704 1193 704 1533 curveto
704 1892 946 2156 1282 2156 curveto
end_ol grestore 
0.100000 slw
[] 0 sd
1.000000 1.000000 1.000000 srgb
n 8.130000 3.460000 m 8.130000 4.860000 l 11.180000 4.860000 l 11.180000 3.460000 l f
0.000000 0.000000 0.000000 srgb
n 8.130000 3.460000 m 8.130000 4.860000 l 11.180000 4.860000 l 11.180000 3.460000 l cp s
gsave 9.345967 4.460000 translate 0.035278 -0.035278 scale
start_ol
384 0 moveto
1216 0 lineto
1216 3072 lineto
384 3072 lineto
384 0 lineto
384 3584 moveto
1216 3584 lineto
1216 4288 lineto
384 4288 lineto
384 3584 lineto
end_ol grestore 
gsave 9.557633 4.460000 translate 0.035278 -0.035278 scale
start_ol
2240 0 moveto
3072 0 lineto
3072 4356 lineto
2240 4356 lineto
2240 3072 lineto
1986 3072 1823 3072 1672 3072 curveto
788 3072 256 2469 256 1459 curveto
256 581 670 0 1296 0 curveto
1648 0 1927 170 2240 574 curveto
2240 0 lineto
2240 1104 moveto
2023 790 1839 651 1623 651 curveto
1314 651 1152 960 1152 1557 curveto
1152 2229 1369 2559 1802 2559 curveto
1899 2559 2029 2543 2240 2511 curveto
2240 1104 lineto
end_ol grestore 
1.000000 1.000000 1.000000 srgb
n 8.130000 4.860000 m 8.130000 9.060000 l 11.180000 9.060000 l 11.180000 4.860000 l f
0.000000 0.000000 0.000000 srgb
n 8.130000 4.860000 m 8.130000 9.060000 l 11.180000 9.060000 l 11.180000 4.860000 l cp s
gsave 8.280000 5.610000 translate 0.035278 -0.035278 scale
start_ol
1216 221 moveto
1536 221 lineto
1536 1216 lineto
2527 1216 lineto
2527 1536 lineto
1536 1536 lineto
1536 2531 lineto
1216 2531 lineto
1216 1536 lineto
221 1536 lineto
221 1216 lineto
1216 1216 lineto
1216 221 lineto
end_ol grestore 
gsave 8.644067 5.610000 translate 0.035278 -0.035278 scale
start_ol
2330 505 moveto
2058 382 1869 332 1703 332 curveto
1418 332 1344 455 1344 922 curveto
1344 2112 lineto
2302 2112 lineto
2302 2368 lineto
1344 2368 lineto
1344 2976 lineto
896 2976 lineto
896 2368 lineto
269 2368 lineto
269 2112 lineto
896 2112 lineto
896 723 lineto
896 206 1090 0 1571 0 curveto
1840 0 2066 60 2330 194 curveto
2330 505 lineto
end_ol grestore 
gsave 9.008133 5.610000 translate 0.035278 -0.035278 scale
start_ol
1157 0 moveto
1309 0 lineto
1064 -640 lineto
617 -640 lineto
617 -896 lineto
1696 -896 lineto
1696 -640 lineto
1364 -640 lineto
1608 -27 lineto
2474 2151 lineto
2640 2151 lineto
2640 2432 lineto
1816 2432 lineto
1816 2151 lineto
2175 2151 lineto
1475 413 lineto
1470 413 lineto
770 2151 lineto
1129 2151 lineto
1129 2432 lineto
124 2432 lineto
124 2151 lineto
290 2151 lineto
1157 0 lineto
end_ol grestore 
gsave 9.372200 5.610000 translate 0.035278 -0.035278 scale
start_ol
832 -640 moveto
832 0 lineto
1064 0 1217 0 1356 0 curveto
2065 0 2496 496 2496 1313 curveto
2496 1989 2169 2432 1679 2432 curveto
1353 2432 1102 2270 832 1892 curveto
832 2432 lineto
108 2432 lineto
108 2073 lineto
384 2073 lineto
384 -640 lineto
108 -640 lineto
108 -896 lineto
1405 -896 lineto
1405 -640 lineto
832 -640 lineto
832 1577 moveto
1069 1922 1286 2073 1551 2073 curveto
1882 2073 2048 1810 2048 1289 curveto
2048 616 1830 332 1324 332 curveto
1206 332 1064 345 832 379 curveto
832 1577 lineto
end_ol grestore 
gsave 9.736267 5.610000 translate 0.035278 -0.035278 scale
start_ol
2484 1152 moveto
2484 1280 lineto
2484 2045 2147 2432 1484 2432 curveto
756 2432 276 1958 276 1246 curveto
276 497 793 0 1576 0 curveto
1889 0 2147 60 2419 194 curveto
2419 521 lineto
2120 389 1885 332 1636 332 curveto
1387 332 1193 389 1046 507 curveto
871 648 793 814 751 1152 curveto
2484 1152 lineto
756 1408 moveto
802 1895 1046 2156 1452 2156 curveto
1825 2156 2014 1938 2014 1502 curveto
2014 1408 lineto
756 1408 lineto
end_ol grestore 
gsave 10.100333 5.610000 translate 0.035278 -0.035278 scale
start_ol
end_ol grestore 
gsave 10.464400 5.610000 translate 0.035278 -0.035278 scale
start_ol
116 0 moveto
1301 0 lineto
2114 0 2624 672 2624 1745 curveto
2624 2799 2168 3328 1271 3328 curveto
116 3328 lineto
116 3052 lineto
448 3052 lineto
448 276 lineto
116 276 lineto
116 0 lineto
896 276 moveto
896 3052 lineto
1135 3052 lineto
1843 3052 2176 2619 2176 1694 curveto
2176 755 1834 276 1168 276 curveto
896 276 lineto
end_ol grestore 
gsave 8.280000 6.410000 translate 0.035278 -0.035278 scale
start_ol
1216 221 moveto
1536 221 lineto
1536 1216 lineto
2527 1216 lineto
2527 1536 lineto
1536 1536 lineto
1536 2531 lineto
1216 2531 lineto
1216 1536 lineto
221 1536 lineto
221 1216 lineto
1216 1216 lineto
1216 221 lineto
end_ol grestore 
gsave 8.644067 6.410000 translate 0.035278 -0.035278 scale
start_ol
1920 3264 moveto
1920 2377 lineto
1702 2414 1527 2432 1395 2432 curveto
683 2432 256 1940 256 1119 curveto
256 448 590 0 1090 0 curveto
1410 0 1656 162 1920 541 curveto
1920 0 lineto
2644 0 lineto
2644 364 lineto
2368 364 lineto
2368 3520 lineto
1352 3520 lineto
1352 3264 lineto
1920 3264 lineto
1920 855 moveto
1683 510 1466 364 1201 364 curveto
870 364 704 622 704 1148 curveto
704 1816 922 2100 1428 2100 curveto
1541 2100 1707 2083 1920 2048 curveto
1920 855 lineto
end_ol grestore 
gsave 9.008133 6.410000 translate 0.035278 -0.035278 scale
start_ol
2484 1152 moveto
2484 1280 lineto
2484 2045 2147 2432 1484 2432 curveto
756 2432 276 1958 276 1246 curveto
276 497 793 0 1576 0 curveto
1889 0 2147 60 2419 194 curveto
2419 521 lineto
2120 389 1885 332 1636 332 curveto
1387 332 1193 389 1046 507 curveto
871 648 793 814 751 1152 curveto
2484 1152 lineto
756 1408 moveto
802 1895 1046 2156 1452 2156 curveto
1825 2156 2014 1938 2014 1502 curveto
2014 1408 lineto
756 1408 lineto
end_ol grestore 
gsave 9.372200 6.410000 translate 0.035278 -0.035278 scale
start_ol
384 193 moveto
732 60 1039 0 1387 0 curveto
2043 0 2432 266 2432 720 curveto
2432 1039 2232 1222 1737 1344 curveto
1287 1458 lineto
977 1536 832 1650 832 1811 curveto
832 2034 1021 2156 1368 2156 curveto
1584 2156 1759 2121 1926 2043 curveto
1980 1658 lineto
2259 1658 lineto
2259 2271 lineto
1977 2381 1709 2432 1368 2432 curveto
715 2432 384 2205 384 1756 curveto
384 1428 600 1232 1115 1106 curveto
1575 988 lineto
1878 914 1984 822 1984 639 curveto
1984 403 1803 281 1458 281 curveto
1246 281 1033 324 720 437 curveto
662 827 lineto
384 827 lineto
384 193 lineto
end_ol grestore 
gsave 9.736267 6.410000 translate 0.035278 -0.035278 scale
start_ol
2330 505 moveto
2058 382 1869 332 1703 332 curveto
1418 332 1344 455 1344 922 curveto
1344 2112 lineto
2302 2112 lineto
2302 2368 lineto
1344 2368 lineto
1344 2976 lineto
896 2976 lineto
896 2368 lineto
269 2368 lineto
269 2112 lineto
896 2112 lineto
896 723 lineto
896 206 1090 0 1571 0 curveto
1840 0 2066 60 2330 194 curveto
2330 505 lineto
end_ol grestore 
gsave 8.280000 7.210000 translate 0.035278 -0.035278 scale
start_ol
1216 221 moveto
1536 221 lineto
1536 1216 lineto
2527 1216 lineto
2527 1536 lineto
1536 1536 lineto
1536 2531 lineto
1216 2531 lineto
1216 1536 lineto
221 1536 lineto
221 1216 lineto
1216 1216 lineto
1216 221 lineto
end_ol grestore 
gsave 8.644067 7.210000 translate 0.035278 -0.035278 scale
start_ol
384 193 moveto
732 60 1039 0 1387 0 curveto
2043 0 2432 266 2432 720 curveto
2432 1039 2232 1222 1737 1344 curveto
1287 1458 lineto
977 1536 832 1650 832 1811 curveto
832 2034 1021 2156 1368 2156 curveto
1584 2156 1759 2121 1926 2043 curveto
1980 1658 lineto
2259 1658 lineto
2259 2271 lineto
1977 2381 1709 2432 1368 2432 curveto
715 2432 384 2205 384 1756 curveto
384 1428 600 1232 1115 1106 curveto
1575 988 lineto
1878 914 1984 822 1984 639 curveto
1984 403 1803 281 1458 281 curveto
1246 281 1033 324 720 437 curveto
662 827 lineto
384 827 lineto
384 193 lineto
end_ol grestore 
gsave 9.008133 7.210000 translate 0.035278 -0.035278 scale
start_ol
1216 1529 moveto
1419 1889 1635 2045 1925 2045 curveto
2022 2045 2100 2023 2188 1965 curveto
2234 1556 lineto
2515 1556 lineto
2515 2292 lineto
2345 2387 2183 2432 1999 2432 curveto
1704 2432 1483 2281 1216 1907 curveto
1216 2432 lineto
187 2432 lineto
187 2045 lineto
768 2045 lineto
768 276 lineto
187 276 lineto
187 0 lineto
2050 0 lineto
2050 276 lineto
1216 276 lineto
1216 1529 lineto
end_ol grestore 
gsave 9.372200 7.210000 translate 0.035278 -0.035278 scale
start_ol
2275 496 moveto
2012 379 1810 332 1598 332 curveto
1077 332 768 669 768 1235 curveto
768 1797 1044 2156 1482 2156 curveto
1597 2156 1717 2130 1897 2061 curveto
1966 1572 lineto
2247 1572 lineto
2247 2308 lineto
2003 2395 1773 2432 1510 2432 curveto
760 2432 320 1993 320 1242 curveto
320 478 783 0 1527 0 curveto
1817 0 2048 51 2275 157 curveto
2275 496 lineto
end_ol grestore 
gsave 8.280000 8.010000 translate 0.035278 -0.035278 scale
start_ol
1216 221 moveto
1536 221 lineto
1536 1216 lineto
2527 1216 lineto
2527 1536 lineto
1536 1536 lineto
1536 2531 lineto
1216 2531 lineto
1216 1536 lineto
221 1536 lineto
221 1216 lineto
1216 1216 lineto
1216 221 lineto
end_ol grestore 
gsave 8.644067 8.010000 translate 0.035278 -0.035278 scale
start_ol
832 -640 moveto
832 0 lineto
1064 0 1217 0 1356 0 curveto
2065 0 2496 496 2496 1313 curveto
2496 1989 2169 2432 1679 2432 curveto
1353 2432 1102 2270 832 1892 curveto
832 2432 lineto
108 2432 lineto
108 2073 lineto
384 2073 lineto
384 -640 lineto
108 -640 lineto
108 -896 lineto
1405 -896 lineto
1405 -640 lineto
832 -640 lineto
832 1577 moveto
1069 1922 1286 2073 1551 2073 curveto
1882 2073 2048 1810 2048 1289 curveto
2048 616 1830 332 1324 332 curveto
1206 332 1064 345 832 379 curveto
832 1577 lineto
end_ol grestore 
gsave 9.008133 8.010000 translate 0.035278 -0.035278 scale
start_ol
384 193 moveto
732 60 1039 0 1387 0 curveto
2043 0 2432 266 2432 720 curveto
2432 1039 2232 1222 1737 1344 curveto
1287 1458 lineto
977 1536 832 1650 832 1811 curveto
832 2034 1021 2156 1368 2156 curveto
1584 2156 1759 2121 1926 2043 curveto
1980 1658 lineto
2259 1658 lineto
2259 2271 lineto
1977 2381 1709 2432 1368 2432 curveto
715 2432 384 2205 384 1756 curveto
384 1428 600 1232 1115 1106 curveto
1575 988 lineto
1878 914 1984 822 1984 639 curveto
1984 403 1803 281 1458 281 curveto
1246 281 1033 324 720 437 curveto
662 827 lineto
384 827 lineto
384 193 lineto
end_ol grestore 
gsave 9.372200 8.010000 translate 0.035278 -0.035278 scale
start_ol
832 -640 moveto
832 0 lineto
1064 0 1217 0 1356 0 curveto
2065 0 2496 496 2496 1313 curveto
2496 1989 2169 2432 1679 2432 curveto
1353 2432 1102 2270 832 1892 curveto
832 2432 lineto
108 2432 lineto
108 2073 lineto
384 2073 lineto
384 -640 lineto
108 -640 lineto
108 -896 lineto
1405 -896 lineto
1405 -640 lineto
832 -640 lineto
832 1577 moveto
1069 1922 1286 2073 1551 2073 curveto
1882 2073 2048 1810 2048 1289 curveto
2048 616 1830 332 1324 332 curveto
1206 332 1064 345 832 379 curveto
832 1577 lineto
end_ol grestore 
gsave 9.736267 8.010000 translate 0.035278 -0.035278 scale
start_ol
1024 0 moveto
1664 0 lineto
1664 668 lineto
1024 668 lineto
1024 0 lineto
1024 1764 moveto
1664 1764 lineto
1664 2432 lineto
1024 2432 lineto
1024 1764 lineto
end_ol grestore 
gsave 10.100333 8.010000 translate 0.035278 -0.035278 scale
start_ol
end_ol grestore 
gsave 10.464400 8.010000 translate 0.035278 -0.035278 scale
start_ol
1903 0 moveto
2608 0 lineto
2608 332 lineto
2304 332 lineto
2304 1801 lineto
2304 2263 2099 2432 1534 2432 curveto
1167 2432 845 2368 487 2225 curveto
487 1762 lineto
750 1762 lineto
805 2030 lineto
1057 2116 1225 2151 1389 2151 curveto
1697 2151 1856 2034 1856 1805 curveto
1856 1451 lineto
1668 1451 lineto
723 1451 320 1219 320 679 curveto
320 263 609 0 1072 0 curveto
1352 0 1581 96 1856 321 curveto
1903 0 lineto
1856 660 moveto
1627 431 1431 332 1193 332 curveto
913 332 768 462 768 708 curveto
768 1058 1039 1192 1735 1192 curveto
1856 1192 lineto
1856 660 lineto
end_ol grestore 
gsave 8.280000 8.810000 translate 0.035278 -0.035278 scale
start_ol
1216 221 moveto
1536 221 lineto
1536 1216 lineto
2527 1216 lineto
2527 1536 lineto
1536 1536 lineto
1536 2531 lineto
1216 2531 lineto
1216 1536 lineto
221 1536 lineto
221 1216 lineto
1216 1216 lineto
1216 221 lineto
end_ol grestore 
gsave 8.644067 8.810000 translate 0.035278 -0.035278 scale
start_ol
172 0 moveto
1144 0 lineto
1144 268 lineto
896 268 lineto
896 1537 lineto
1116 1916 1318 2086 1553 2086 curveto
1796 2086 1920 1898 1920 1528 curveto
1920 268 lineto
1700 268 lineto
1700 0 lineto
2649 0 lineto
2649 268 lineto
2368 268 lineto
2368 1572 lineto
2368 2138 2136 2432 1686 2432 curveto
1374 2432 1139 2277 896 1912 curveto
896 2432 lineto
172 2432 lineto
172 2086 lineto
448 2086 lineto
448 268 lineto
172 268 lineto
172 0 lineto
end_ol grestore 
gsave 9.008133 8.810000 translate 0.035278 -0.035278 scale
start_ol
384 193 moveto
732 60 1039 0 1387 0 curveto
2043 0 2432 266 2432 720 curveto
2432 1039 2232 1222 1737 1344 curveto
1287 1458 lineto
977 1536 832 1650 832 1811 curveto
832 2034 1021 2156 1368 2156 curveto
1584 2156 1759 2121 1926 2043 curveto
1980 1658 lineto
2259 1658 lineto
2259 2271 lineto
1977 2381 1709 2432 1368 2432 curveto
715 2432 384 2205 384 1756 curveto
384 1428 600 1232 1115 1106 curveto
1575 988 lineto
1878 914 1984 822 1984 639 curveto
1984 403 1803 281 1458 281 curveto
1246 281 1033 324 720 437 curveto
662 827 lineto
384 827 lineto
384 193 lineto
end_ol grestore 
gsave 9.372200 8.810000 translate 0.035278 -0.035278 scale
start_ol
832 -640 moveto
832 0 lineto
1064 0 1217 0 1356 0 curveto
2065 0 2496 496 2496 1313 curveto
2496 1989 2169 2432 1679 2432 curveto
1353 2432 1102 2270 832 1892 curveto
832 2432 lineto
108 2432 lineto
108 2073 lineto
384 2073 lineto
384 -640 lineto
108 -640 lineto
108 -896 lineto
1405 -896 lineto
1405 -640 lineto
832 -640 lineto
832 1577 moveto
1069 1922 1286 2073 1551 2073 curveto
1882 2073 2048 1810 2048 1289 curveto
2048 616 1830 332 1324 332 curveto
1206 332 1064 345 832 379 curveto
832 1577 lineto
end_ol grestore 
gsave 9.736267 8.810000 translate 0.035278 -0.035278 scale
start_ol
1024 0 moveto
1664 0 lineto
1664 668 lineto
1024 668 lineto
1024 0 lineto
1024 1764 moveto
1664 1764 lineto
1664 2432 lineto
1024 2432 lineto
1024 1764 lineto
end_ol grestore 
gsave 10.100333 8.810000 translate 0.035278 -0.035278 scale
start_ol
end_ol grestore 
gsave 10.464400 8.810000 translate 0.035278 -0.035278 scale
start_ol
832 0 moveto
1064 0 1217 0 1356 0 curveto
2065 0 2496 496 2496 1313 curveto
2496 1989 2169 2432 1679 2432 curveto
1353 2432 1102 2270 832 1892 curveto
832 3487 lineto
108 3487 lineto
108 3211 lineto
384 3211 lineto
384 0 lineto
832 0 lineto
832 1577 moveto
1069 1922 1286 2073 1551 2073 curveto
1882 2073 2048 1810 2048 1289 curveto
2048 616 1835 332 1324 332 curveto
1206 332 1064 345 832 379 curveto
832 1577 lineto
end_ol grestore 
0.100000 slw
[] 0 sd
1.000000 1.000000 1.000000 srgb
n 13.730000 7.810000 m 13.730000 9.210000 l 16.030000 9.210000 l 16.030000 7.810000 l f
0.000000 0.000000 0.000000 srgb
n 13.730000 7.810000 m 13.730000 9.210000 l 16.030000 9.210000 l 16.030000 7.810000 l cp s
gsave 14.016400 8.810000 translate 0.035278 -0.035278 scale
start_ol
384 0 moveto
1216 0 lineto
1216 1948 lineto
1423 2270 1629 2415 1878 2415 curveto
2109 2415 2176 2298 2176 1909 curveto
2176 0 lineto
3008 0 lineto
3008 1948 lineto
3202 2270 3390 2415 3624 2415 curveto
3841 2415 3904 2304 3904 1909 curveto
3904 0 lineto
4736 0 lineto
4736 2125 lineto
4736 2752 4472 3072 3944 3072 curveto
3539 3072 3259 2893 3008 2484 curveto
2870 2888 2623 3072 2216 3072 curveto
1804 3072 1507 2899 1216 2490 curveto
1216 3072 lineto
384 3072 lineto
384 0 lineto
end_ol grestore 
gsave 14.693733 8.810000 translate 0.035278 -0.035278 scale
start_ol
2897 752 moveto
2540 619 2275 564 2010 564 curveto
1751 564 1549 625 1400 741 curveto
1215 889 1129 1060 1083 1408 curveto
2897 1408 lineto
2886 2582 2511 3072 1624 3072 curveto
760 3072 207 2497 207 1605 curveto
207 604 835 0 1872 0 curveto
2212 0 2534 52 2897 173 curveto
2897 752 lineto
1077 1856 moveto
1146 2340 1313 2554 1630 2554 curveto
1935 2554 2068 2345 2079 1856 curveto
1077 1856 lineto
end_ol grestore 
gsave 15.117067 8.810000 translate 0.035278 -0.035278 scale
start_ol
384 0 moveto
1216 0 lineto
1216 1948 lineto
1423 2270 1629 2415 1878 2415 curveto
2109 2415 2176 2298 2176 1909 curveto
2176 0 lineto
3008 0 lineto
3008 1948 lineto
3202 2270 3390 2415 3624 2415 curveto
3841 2415 3904 2304 3904 1909 curveto
3904 0 lineto
4736 0 lineto
4736 2125 lineto
4736 2752 4472 3072 3944 3072 curveto
3539 3072 3259 2893 3008 2484 curveto
2870 2888 2623 3072 2216 3072 curveto
1804 3072 1507 2899 1216 2490 curveto
1216 3072 lineto
384 3072 lineto
384 0 lineto
end_ol grestore 
1.000000 1.000000 1.000000 srgb
n 13.730000 9.210000 m 13.730000 10.210000 l 16.030000 10.210000 l 16.030000 9.210000 l f
0.000000 0.000000 0.000000 srgb
n 13.730000 9.210000 m 13.730000 10.210000 l 16.030000 10.210000 l 16.030000 9.210000 l cp s
gsave 13.880000 9.960000 translate 0.035278 -0.035278 scale
start_ol
1216 221 moveto
1536 221 lineto
1536 1216 lineto
2527 1216 lineto
2527 1536 lineto
1536 1536 lineto
1536 2531 lineto
1216 2531 lineto
1216 1536 lineto
221 1536 lineto
221 1216 lineto
1216 1216 lineto
1216 221 lineto
end_ol grestore 
gsave 14.244067 9.960000 translate 0.035278 -0.035278 scale
start_ol
659 2332 moveto
991 2332 lineto
1106 3553 lineto
548 3553 lineto
659 2332 lineto
1769 2332 moveto
2101 2332 lineto
2212 3553 lineto
1659 3553 lineto
1769 2332 lineto
end_ol grestore 
gsave 14.608133 9.960000 translate 0.035278 -0.035278 scale
start_ol
134 0 moveto
986 0 lineto
986 275 lineto
760 275 lineto
1327 996 lineto
1898 275 lineto
1673 275 lineto
1673 0 lineto
2677 0 lineto
2677 275 lineto
2410 275 lineto
1668 1216 lineto
2415 2152 lineto
2677 2152 lineto
2677 2432 lineto
1862 2432 lineto
1862 2152 lineto
2097 2152 lineto
1511 1413 lineto
922 2152 lineto
1120 2152 lineto
1120 2432 lineto
134 2432 lineto
134 2152 lineto
410 2152 lineto
1157 1216 lineto
410 275 lineto
134 275 lineto
134 0 lineto
end_ol grestore 
gsave 14.972200 9.960000 translate 0.035278 -0.035278 scale
start_ol
659 2332 moveto
991 2332 lineto
1106 3553 lineto
548 3553 lineto
659 2332 lineto
1769 2332 moveto
2101 2332 lineto
2212 3553 lineto
1659 3553 lineto
1769 2332 lineto
end_ol grestore 
0.100000 slw
[] 0 sd
1.000000 1.000000 1.000000 srgb
n 19.130000 7.510000 m 19.130000 8.910000 l 22.180000 8.910000 l 22.180000 7.510000 l f
0.000000 0.000000 0.000000 srgb
n 19.130000 7.510000 m 19.130000 8.910000 l 22.180000 8.910000 l 22.180000 7.510000 l cp s
gsave 20.599967 8.510000 translate 0.035278 -0.035278 scale
start_ol
64 0 moveto
202 0 lineto
202 426 lineto
288 426 lineto
288 512 lineto
202 512 lineto
202 548 lineto
202 610 222 640 263 640 curveto
281 640 303 636 330 627 curveto
330 703 lineto
298 711 272 714 244 714 curveto
125 714 64 657 64 544 curveto
64 512 lineto
10 512 lineto
10 426 lineto
64 426 lineto
64 0 lineto
end_ol grestore 
gsave 20.642300 8.510000 translate 0.035278 -0.035278 scale
start_ol
504 117 moveto
447 100 399 92 362 92 curveto
255 92 192 153 192 259 curveto
192 364 245 419 347 419 curveto
385 419 428 412 500 394 curveto
500 492 lineto
442 506 394 512 339 512 curveto
150 512 54 426 54 258 curveto
54 93 155 0 332 0 curveto
382 0 438 8 504 23 curveto
504 117 lineto
end_ol grestore 
1.000000 1.000000 1.000000 srgb
n 19.130000 8.910000 m 19.130000 13.910000 l 22.180000 13.910000 l 22.180000 8.910000 l f
0.000000 0.000000 0.000000 srgb
n 19.130000 8.910000 m 19.130000 13.910000 l 22.180000 13.910000 l 22.180000 8.910000 l cp s
gsave 19.280000 9.660000 translate 0.035278 -0.035278 scale
start_ol
1216 221 moveto
1536 221 lineto
1536 1216 lineto
2527 1216 lineto
2527 1536 lineto
1536 1536 lineto
1536 2531 lineto
1216 2531 lineto
1216 1536 lineto
221 1536 lineto
221 1216 lineto
1216 1216 lineto
1216 221 lineto
end_ol grestore 
gsave 19.644067 9.660000 translate 0.035278 -0.035278 scale
start_ol
352 0 moveto
2242 0 lineto
2242 276 lineto
1408 276 lineto
1408 2112 lineto
2408 2112 lineto
2408 2368 lineto
1408 2368 lineto
1408 2686 lineto
1408 3164 1528 3328 1887 3328 curveto
2016 3328 2141 3295 2302 3220 curveto
2371 2864 lineto
2648 2864 lineto
2648 3416 lineto
2339 3538 2099 3584 1827 3584 curveto
1218 3584 960 3303 960 2640 curveto
960 2368 lineto
352 2368 lineto
352 2112 lineto
960 2112 lineto
960 276 lineto
352 276 lineto
352 0 lineto
end_ol grestore 
gsave 19.280000 10.460000 translate 0.035278 -0.035278 scale
start_ol
1216 221 moveto
1536 221 lineto
1536 1216 lineto
2527 1216 lineto
2527 1536 lineto
1536 1536 lineto
1536 2531 lineto
1216 2531 lineto
1216 1536 lineto
221 1536 lineto
221 1216 lineto
1216 1216 lineto
1216 221 lineto
end_ol grestore 
gsave 19.644067 10.460000 translate 0.035278 -0.035278 scale
start_ol
2330 505 moveto
2058 382 1869 332 1703 332 curveto
1418 332 1344 455 1344 922 curveto
1344 2112 lineto
2302 2112 lineto
2302 2368 lineto
1344 2368 lineto
1344 2976 lineto
896 2976 lineto
896 2368 lineto
269 2368 lineto
269 2112 lineto
896 2112 lineto
896 723 lineto
896 206 1090 0 1571 0 curveto
1840 0 2066 60 2330 194 curveto
2330 505 lineto
end_ol grestore 
gsave 20.008133 10.460000 translate 0.035278 -0.035278 scale
start_ol
1157 0 moveto
1309 0 lineto
1064 -640 lineto
617 -640 lineto
617 -896 lineto
1696 -896 lineto
1696 -640 lineto
1364 -640 lineto
1608 -27 lineto
2474 2151 lineto
2640 2151 lineto
2640 2432 lineto
1816 2432 lineto
1816 2151 lineto
2175 2151 lineto
1475 413 lineto
1470 413 lineto
770 2151 lineto
1129 2151 lineto
1129 2432 lineto
124 2432 lineto
124 2151 lineto
290 2151 lineto
1157 0 lineto
end_ol grestore 
gsave 20.372200 10.460000 translate 0.035278 -0.035278 scale
start_ol
832 -640 moveto
832 0 lineto
1064 0 1217 0 1356 0 curveto
2065 0 2496 496 2496 1313 curveto
2496 1989 2169 2432 1679 2432 curveto
1353 2432 1102 2270 832 1892 curveto
832 2432 lineto
108 2432 lineto
108 2073 lineto
384 2073 lineto
384 -640 lineto
108 -640 lineto
108 -896 lineto
1405 -896 lineto
1405 -640 lineto
832 -640 lineto
832 1577 moveto
1069 1922 1286 2073 1551 2073 curveto
1882 2073 2048 1810 2048 1289 curveto
2048 616 1830 332 1324 332 curveto
1206 332 1064 345 832 379 curveto
832 1577 lineto
end_ol grestore 
gsave 20.736267 10.460000 translate 0.035278 -0.035278 scale
start_ol
2484 1152 moveto
2484 1280 lineto
2484 2045 2147 2432 1484 2432 curveto
756 2432 276 1958 276 1246 curveto
276 497 793 0 1576 0 curveto
1889 0 2147 60 2419 194 curveto
2419 521 lineto
2120 389 1885 332 1636 332 curveto
1387 332 1193 389 1046 507 curveto
871 648 793 814 751 1152 curveto
2484 1152 lineto
756 1408 moveto
802 1895 1046 2156 1452 2156 curveto
1825 2156 2014 1938 2014 1502 curveto
2014 1408 lineto
756 1408 lineto
end_ol grestore 
gsave 21.100333 10.460000 translate 0.035278 -0.035278 scale
start_ol
end_ol grestore 
gsave 21.464400 10.460000 translate 0.035278 -0.035278 scale
start_ol
116 0 moveto
1301 0 lineto
2114 0 2624 672 2624 1745 curveto
2624 2799 2168 3328 1271 3328 curveto
116 3328 lineto
116 3052 lineto
448 3052 lineto
448 276 lineto
116 276 lineto
116 0 lineto
896 276 moveto
896 3052 lineto
1135 3052 lineto
1843 3052 2176 2619 2176 1694 curveto
2176 755 1834 276 1168 276 curveto
896 276 lineto
end_ol grestore 
gsave 19.280000 11.260000 translate 0.035278 -0.035278 scale
start_ol
1216 221 moveto
1536 221 lineto
1536 1216 lineto
2527 1216 lineto
2527 1536 lineto
1536 1536 lineto
1536 2531 lineto
1216 2531 lineto
1216 1536 lineto
221 1536 lineto
221 1216 lineto
1216 1216 lineto
1216 221 lineto
end_ol grestore 
gsave 19.644067 11.260000 translate 0.035278 -0.035278 scale
start_ol
1903 0 moveto
2608 0 lineto
2608 332 lineto
2304 332 lineto
2304 1801 lineto
2304 2263 2099 2432 1534 2432 curveto
1167 2432 845 2368 487 2225 curveto
487 1762 lineto
750 1762 lineto
805 2030 lineto
1057 2116 1225 2151 1389 2151 curveto
1697 2151 1856 2034 1856 1805 curveto
1856 1451 lineto
1668 1451 lineto
723 1451 320 1219 320 679 curveto
320 263 609 0 1072 0 curveto
1352 0 1581 96 1856 321 curveto
1903 0 lineto
1856 660 moveto
1627 431 1431 332 1193 332 curveto
913 332 768 462 768 708 curveto
768 1058 1039 1192 1735 1192 curveto
1856 1192 lineto
1856 660 lineto
end_ol grestore 
gsave 20.008133 11.260000 translate 0.035278 -0.035278 scale
start_ol
1216 1529 moveto
1419 1889 1635 2045 1925 2045 curveto
2022 2045 2100 2023 2188 1965 curveto
2234 1556 lineto
2515 1556 lineto
2515 2292 lineto
2345 2387 2183 2432 1999 2432 curveto
1704 2432 1483 2281 1216 1907 curveto
1216 2432 lineto
187 2432 lineto
187 2045 lineto
768 2045 lineto
768 276 lineto
187 276 lineto
187 0 lineto
2050 0 lineto
2050 276 lineto
1216 276 lineto
1216 1529 lineto
end_ol grestore 
gsave 20.372200 11.260000 translate 0.035278 -0.035278 scale
start_ol
476 -56 moveto
290 -178 192 -319 192 -464 curveto
192 -791 540 -960 1217 -960 curveto
2060 -960 2496 -703 2496 -200 curveto
2496 155 2262 332 1803 332 curveto
998 332 lineto
756 332 640 370 640 445 curveto
640 503 687 562 793 637 curveto
893 704 lineto
1012 704 1105 704 1198 704 curveto
1834 704 2304 1072 2304 1568 curveto
2304 1775 2229 1945 2055 2156 curveto
2492 2156 lineto
2620 2432 lineto
1693 2432 lineto
1535 2432 1393 2432 1214 2432 curveto
597 2432 192 2084 192 1555 curveto
192 1225 354 1007 726 813 curveto
647 742 lineto
467 588 384 456 384 328 curveto
384 209 450 116 602 28 curveto
476 -56 lineto
798 0 moveto
1604 0 lineto
1900 0 2048 -93 2048 -284 curveto
2048 -538 1747 -704 1275 -704 curveto
858 -704 640 -596 640 -391 curveto
640 -274 675 -171 747 -73 curveto
798 0 lineto
1282 2156 moveto
1619 2156 1856 1905 1856 1547 curveto
1856 1202 1619 960 1273 960 curveto
936 960 704 1193 704 1533 curveto
704 1892 946 2156 1282 2156 curveto
end_ol grestore 
gsave 20.736267 11.260000 translate 0.035278 -0.035278 scale
start_ol
384 193 moveto
732 60 1039 0 1387 0 curveto
2043 0 2432 266 2432 720 curveto
2432 1039 2232 1222 1737 1344 curveto
1287 1458 lineto
977 1536 832 1650 832 1811 curveto
832 2034 1021 2156 1368 2156 curveto
1584 2156 1759 2121 1926 2043 curveto
1980 1658 lineto
2259 1658 lineto
2259 2271 lineto
1977 2381 1709 2432 1368 2432 curveto
715 2432 384 2205 384 1756 curveto
384 1428 600 1232 1115 1106 curveto
1575 988 lineto
1878 914 1984 822 1984 639 curveto
1984 403 1803 281 1458 281 curveto
1246 281 1033 324 720 437 curveto
662 827 lineto
384 827 lineto
384 193 lineto
end_ol grestore 
gsave 19.280000 12.060000 translate 0.035278 -0.035278 scale
start_ol
1216 221 moveto
1536 221 lineto
1536 1216 lineto
2527 1216 lineto
2527 1536 lineto
1536 1536 lineto
1536 2531 lineto
1216 2531 lineto
1216 1536 lineto
221 1536 lineto
221 1216 lineto
1216 1216 lineto
1216 221 lineto
end_ol grestore 
gsave 19.644067 12.060000 translate 0.035278 -0.035278 scale
start_ol
1216 1529 moveto
1419 1889 1635 2045 1925 2045 curveto
2022 2045 2100 2023 2188 1965 curveto
2234 1556 lineto
2515 1556 lineto
2515 2292 lineto
2345 2387 2183 2432 1999 2432 curveto
1704 2432 1483 2281 1216 1907 curveto
1216 2432 lineto
187 2432 lineto
187 2045 lineto
768 2045 lineto
768 276 lineto
187 276 lineto
187 0 lineto
2050 0 lineto
2050 276 lineto
1216 276 lineto
1216 1529 lineto
end_ol grestore 
gsave 20.008133 12.060000 translate 0.035278 -0.035278 scale
start_ol
2484 1152 moveto
2484 1280 lineto
2484 2045 2147 2432 1484 2432 curveto
756 2432 276 1958 276 1246 curveto
276 497 793 0 1576 0 curveto
1889 0 2147 60 2419 194 curveto
2419 521 lineto
2120 389 1885 332 1636 332 curveto
1387 332 1193 389 1046 507 curveto
871 648 793 814 751 1152 curveto
2484 1152 lineto
756 1408 moveto
802 1895 1046 2156 1452 2156 curveto
1825 2156 2014 1938 2014 1502 curveto
2014 1408 lineto
756 1408 lineto
end_ol grestore 
gsave 20.372200 12.060000 translate 0.035278 -0.035278 scale
start_ol
384 193 moveto
732 60 1039 0 1387 0 curveto
2043 0 2432 266 2432 720 curveto
2432 1039 2232 1222 1737 1344 curveto
1287 1458 lineto
977 1536 832 1650 832 1811 curveto
832 2034 1021 2156 1368 2156 curveto
1584 2156 1759 2121 1926 2043 curveto
1980 1658 lineto
2259 1658 lineto
2259 2271 lineto
1977 2381 1709 2432 1368 2432 curveto
715 2432 384 2205 384 1756 curveto
384 1428 600 1232 1115 1106 curveto
1575 988 lineto
1878 914 1984 822 1984 639 curveto
1984 403 1803 281 1458 281 curveto
1246 281 1033 324 720 437 curveto
662 827 lineto
384 827 lineto
384 193 lineto
end_ol grestore 
gsave 20.736267 12.060000 translate 0.035278 -0.035278 scale
start_ol
1671 2432 moveto
1671 2159 lineto
1920 2159 lineto
1920 895 lineto
1694 515 1496 350 1260 350 curveto
1021 350 896 538 896 904 curveto
896 2432 lineto
172 2432 lineto
172 2159 lineto
448 2159 lineto
448 855 lineto
448 294 683 0 1131 0 curveto
1445 0 1675 155 1920 520 curveto
1920 0 lineto
2644 0 lineto
2644 350 lineto
2368 350 lineto
2368 2432 lineto
1671 2432 lineto
end_ol grestore 
gsave 21.100333 12.060000 translate 0.035278 -0.035278 scale
start_ol
340 0 moveto
2498 0 lineto
2498 276 lineto
1664 276 lineto
1664 3520 lineto
340 3520 lineto
340 3264 lineto
1216 3264 lineto
1216 276 lineto
340 276 lineto
340 0 lineto
end_ol grestore 
gsave 21.464400 12.060000 translate 0.035278 -0.035278 scale
start_ol
2330 505 moveto
2058 382 1869 332 1703 332 curveto
1418 332 1344 455 1344 922 curveto
1344 2112 lineto
2302 2112 lineto
2302 2368 lineto
1344 2368 lineto
1344 2976 lineto
896 2976 lineto
896 2368 lineto
269 2368 lineto
269 2112 lineto
896 2112 lineto
896 723 lineto
896 206 1090 0 1571 0 curveto
1840 0 2066 60 2330 194 curveto
2330 505 lineto
end_ol grestore 
gsave 19.280000 12.860000 translate 0.035278 -0.035278 scale
start_ol
1216 221 moveto
1536 221 lineto
1536 1216 lineto
2527 1216 lineto
2527 1536 lineto
1536 1536 lineto
1536 2531 lineto
1216 2531 lineto
1216 1536 lineto
221 1536 lineto
221 1216 lineto
1216 1216 lineto
1216 221 lineto
end_ol grestore 
gsave 19.644067 12.860000 translate 0.035278 -0.035278 scale
start_ol
832 -640 moveto
832 0 lineto
1064 0 1217 0 1356 0 curveto
2065 0 2496 496 2496 1313 curveto
2496 1989 2169 2432 1679 2432 curveto
1353 2432 1102 2270 832 1892 curveto
832 2432 lineto
108 2432 lineto
108 2073 lineto
384 2073 lineto
384 -640 lineto
108 -640 lineto
108 -896 lineto
1405 -896 lineto
1405 -640 lineto
832 -640 lineto
832 1577 moveto
1069 1922 1286 2073 1551 2073 curveto
1882 2073 2048 1810 2048 1289 curveto
2048 616 1830 332 1324 332 curveto
1206 332 1064 345 832 379 curveto
832 1577 lineto
end_ol grestore 
gsave 20.008133 12.860000 translate 0.035278 -0.035278 scale
start_ol
384 193 moveto
732 60 1039 0 1387 0 curveto
2043 0 2432 266 2432 720 curveto
2432 1039 2232 1222 1737 1344 curveto
1287 1458 lineto
977 1536 832 1650 832 1811 curveto
832 2034 1021 2156 1368 2156 curveto
1584 2156 1759 2121 1926 2043 curveto
1980 1658 lineto
2259 1658 lineto
2259 2271 lineto
1977 2381 1709 2432 1368 2432 curveto
715 2432 384 2205 384 1756 curveto
384 1428 600 1232 1115 1106 curveto
1575 988 lineto
1878 914 1984 822 1984 639 curveto
1984 403 1803 281 1458 281 curveto
1246 281 1033 324 720 437 curveto
662 827 lineto
384 827 lineto
384 193 lineto
end_ol grestore 
gsave 20.372200 12.860000 translate 0.035278 -0.035278 scale
start_ol
832 -640 moveto
832 0 lineto
1064 0 1217 0 1356 0 curveto
2065 0 2496 496 2496 1313 curveto
2496 1989 2169 2432 1679 2432 curveto
1353 2432 1102 2270 832 1892 curveto
832 2432 lineto
108 2432 lineto
108 2073 lineto
384 2073 lineto
384 -640 lineto
108 -640 lineto
108 -896 lineto
1405 -896 lineto
1405 -640 lineto
832 -640 lineto
832 1577 moveto
1069 1922 1286 2073 1551 2073 curveto
1882 2073 2048 1810 2048 1289 curveto
2048 616 1830 332 1324 332 curveto
1206 332 1064 345 832 379 curveto
832 1577 lineto
end_ol grestore 
gsave 20.736267 12.860000 translate 0.035278 -0.035278 scale
start_ol
1024 0 moveto
1664 0 lineto
1664 668 lineto
1024 668 lineto
1024 0 lineto
1024 1764 moveto
1664 1764 lineto
1664 2432 lineto
1024 2432 lineto
1024 1764 lineto
end_ol grestore 
gsave 21.100333 12.860000 translate 0.035278 -0.035278 scale
start_ol
end_ol grestore 
gsave 21.464400 12.860000 translate 0.035278 -0.035278 scale
start_ol
832 0 moveto
1064 0 1217 0 1356 0 curveto
2065 0 2496 496 2496 1313 curveto
2496 1989 2169 2432 1679 2432 curveto
1353 2432 1102 2270 832 1892 curveto
832 3487 lineto
108 3487 lineto
108 3211 lineto
384 3211 lineto
384 0 lineto
832 0 lineto
832 1577 moveto
1069 1922 1286 2073 1551 2073 curveto
1882 2073 2048 1810 2048 1289 curveto
2048 616 1835 332 1324 332 curveto
1206 332 1064 345 832 379 curveto
832 1577 lineto
end_ol grestore 
gsave 19.280000 13.660000 translate 0.035278 -0.035278 scale
start_ol
192 26 moveto
256 26 lineto
256 192 lineto
421 192 lineto
421 256 lineto
256 256 lineto
256 422 lineto
192 422 lineto
192 256 lineto
26 256 lineto
26 192 lineto
192 192 lineto
192 26 lineto
end_ol grestore 
gsave 19.339267 13.660000 translate 0.035278 -0.035278 scale
start_ol
18 0 moveto
182 0 lineto
182 42 lineto
138 42 lineto
138 240 lineto
177 299 213 326 255 326 curveto
298 326 320 297 320 239 curveto
320 42 lineto
281 42 lineto
281 0 lineto
441 0 lineto
441 42 lineto
394 42 lineto
394 246 lineto
394 337 355 384 278 384 curveto
223 384 181 359 138 299 curveto
138 384 lineto
18 384 lineto
18 326 lineto
64 326 lineto
64 42 lineto
18 42 lineto
18 0 lineto
end_ol grestore 
gsave 19.398533 13.660000 translate 0.035278 -0.035278 scale
start_ol
64 32 moveto
120 10 170 0 226 0 curveto
331 0 394 42 394 113 curveto
394 163 362 192 283 211 curveto
211 229 lineto
161 241 138 259 138 284 curveto
138 319 168 338 223 338 curveto
257 338 285 333 311 321 curveto
319 261 lineto
365 261 lineto
365 357 lineto
320 376 277 384 223 384 curveto
118 384 64 348 64 278 curveto
64 227 99 196 181 176 curveto
255 158 lineto
303 146 320 132 320 103 curveto
320 66 291 47 237 47 curveto
203 47 169 54 120 71 curveto
110 132 lineto
64 132 lineto
64 32 lineto
end_ol grestore 
gsave 19.457800 13.660000 translate 0.035278 -0.035278 scale
start_ol
138 -64 moveto
138 0 lineto
174 0 197 0 219 0 curveto
328 0 394 78 394 207 curveto
394 314 342 384 265 384 curveto
216 384 178 358 138 296 curveto
138 384 lineto
18 384 lineto
18 324 lineto
64 324 lineto
64 -64 lineto
18 -64 lineto
18 -128 lineto
224 -128 lineto
224 -64 lineto
138 -64 lineto
138 247 moveto
173 301 206 324 246 324 curveto
295 324 320 283 320 203 curveto
320 99 287 55 212 55 curveto
194 55 173 57 138 62 curveto
138 247 lineto
end_ol grestore 
gsave 19.517067 13.660000 translate 0.035278 -0.035278 scale
start_ol
182 0 moveto
256 0 lineto
256 111 lineto
182 111 lineto
182 0 lineto
182 273 moveto
256 273 lineto
256 384 lineto
182 384 lineto
182 273 lineto
end_ol grestore 
gsave 19.576333 13.660000 translate 0.035278 -0.035278 scale
start_ol
end_ol grestore 
gsave 19.635600 13.660000 translate 0.035278 -0.035278 scale
start_ol
379 80 moveto
335 62 301 55 266 55 curveto
179 55 128 107 128 195 curveto
128 282 174 338 247 338 curveto
266 338 286 334 316 323 curveto
328 247 lineto
375 247 lineto
375 363 lineto
334 378 296 384 252 384 curveto
127 384 54 315 54 196 curveto
54 76 131 0 255 0 curveto
303 0 341 8 379 26 curveto
379 80 lineto
end_ol grestore 
0.100000 slw
[] 0 sd
1.000000 1.000000 1.000000 srgb
n 13.330000 13.410000 m 13.330000 14.810000 l 17.280000 14.810000 l 17.280000 13.410000 l f
0.000000 0.000000 0.000000 srgb
n 13.330000 13.410000 m 13.330000 14.810000 l 17.280000 14.810000 l 17.280000 13.410000 l cp s
gsave 13.573567 14.410000 translate 0.035278 -0.035278 scale
start_ol
384 0 moveto
1216 0 lineto
1216 1948 lineto
1423 2270 1629 2415 1878 2415 curveto
2109 2415 2176 2298 2176 1909 curveto
2176 0 lineto
3008 0 lineto
3008 1948 lineto
3202 2270 3390 2415 3624 2415 curveto
3841 2415 3904 2304 3904 1909 curveto
3904 0 lineto
4736 0 lineto
4736 2125 lineto
4736 2752 4472 3072 3944 3072 curveto
3539 3072 3259 2893 3008 2484 curveto
2870 2888 2623 3072 2216 3072 curveto
1804 3072 1507 2899 1216 2490 curveto
1216 3072 lineto
384 3072 lineto
384 0 lineto
end_ol grestore 
gsave 14.250900 14.410000 translate 0.035278 -0.035278 scale
start_ol
2897 752 moveto
2540 619 2275 564 2010 564 curveto
1751 564 1549 625 1400 741 curveto
1215 889 1129 1060 1083 1408 curveto
2897 1408 lineto
2886 2582 2511 3072 1624 3072 curveto
760 3072 207 2497 207 1605 curveto
207 604 835 0 1872 0 curveto
2212 0 2534 52 2897 173 curveto
2897 752 lineto
1077 1856 moveto
1146 2340 1313 2554 1630 2554 curveto
1935 2554 2068 2345 2079 1856 curveto
1077 1856 lineto
end_ol grestore 
gsave 14.674233 14.410000 translate 0.035278 -0.035278 scale
start_ol
384 0 moveto
1216 0 lineto
1216 1948 lineto
1423 2270 1629 2415 1878 2415 curveto
2109 2415 2176 2298 2176 1909 curveto
2176 0 lineto
3008 0 lineto
3008 1948 lineto
3202 2270 3390 2415 3624 2415 curveto
3841 2415 3904 2304 3904 1909 curveto
3904 0 lineto
4736 0 lineto
4736 2125 lineto
4736 2752 4472 3072 3944 3072 curveto
3539 3072 3259 2893 3008 2484 curveto
2870 2888 2623 3072 2216 3072 curveto
1804 3072 1507 2899 1216 2490 curveto
1216 3072 lineto
384 3072 lineto
384 0 lineto
end_ol grestore 
gsave 15.351567 14.410000 translate 0.035278 -0.035278 scale
start_ol
-202 -840 moveto
305 -840 lineto
1803 4160 lineto
1296 4160 lineto
-202 -840 lineto
end_ol grestore 
gsave 15.563233 14.410000 translate 0.035278 -0.035278 scale
start_ol
2240 0 moveto
3072 0 lineto
3072 4356 lineto
2240 4356 lineto
2240 3072 lineto
1986 3072 1823 3072 1672 3072 curveto
788 3072 256 2469 256 1459 curveto
256 581 670 0 1296 0 curveto
1648 0 1927 170 2240 574 curveto
2240 0 lineto
2240 1104 moveto
2023 790 1839 651 1623 651 curveto
1314 651 1152 960 1152 1557 curveto
1152 2229 1369 2559 1802 2559 curveto
1899 2559 2029 2543 2240 2511 curveto
2240 1104 lineto
end_ol grestore 
gsave 16.028900 14.410000 translate 0.035278 -0.035278 scale
start_ol
2897 752 moveto
2540 619 2275 564 2010 564 curveto
1751 564 1549 625 1400 741 curveto
1215 889 1129 1060 1083 1408 curveto
2897 1408 lineto
2886 2582 2511 3072 1624 3072 curveto
760 3072 207 2497 207 1605 curveto
207 604 835 0 1872 0 curveto
2212 0 2534 52 2897 173 curveto
2897 752 lineto
1077 1856 moveto
1146 2340 1313 2554 1630 2554 curveto
1935 2554 2068 2345 2079 1856 curveto
1077 1856 lineto
end_ol grestore 
gsave 16.452233 14.410000 translate 0.035278 -0.035278 scale
start_ol
2960 703 moveto
2620 601 2332 553 2108 553 curveto
1468 553 1088 922 1088 1552 curveto
1088 2182 1405 2513 2021 2513 curveto
2246 2513 2505 2470 2937 2363 curveto
2937 2951 lineto
2591 3037 2297 3072 1969 3072 curveto
788 3072 192 2556 192 1547 curveto
192 560 810 0 1902 0 curveto
2209 0 2555 46 2960 138 curveto
2960 703 lineto
end_ol grestore 
gsave 16.875567 14.410000 translate 0.035278 -0.035278 scale
start_ol
384 0 moveto
1216 0 lineto
1216 4441 lineto
384 4441 lineto
384 0 lineto
end_ol grestore 
0.100000 slw
[] 0 sd
1.000000 1.000000 1.000000 srgb
n 6.230000 10.610000 m 6.230000 12.010000 l 9.280000 12.010000 l 9.280000 10.610000 l f
0.000000 0.000000 0.000000 srgb
n 6.230000 10.610000 m 6.230000 12.010000 l 9.280000 12.010000 l 9.280000 10.610000 l cp s
gsave 7.420567 11.610000 translate 0.035278 -0.035278 scale
start_ol
384 173 moveto
776 52 1123 0 1486 0 curveto
2343 0 2880 348 2880 907 curveto
2880 1337 2676 1527 1883 1826 curveto
1651 1913 lineto
1348 2032 1216 2136 1216 2266 curveto
1216 2451 1414 2554 1755 2554 curveto
1958 2554 2222 2511 2640 2404 curveto
2640 2963 lineto
2247 3038 1954 3072 1667 3072 curveto
812 3072 384 2773 384 2186 curveto
384 1773 553 1610 1287 1328 curveto
1563 1219 lineto
1890 1094 2048 964 2048 828 curveto
2048 627 1835 518 1460 518 curveto
1152 518 838 588 384 759 curveto
384 173 lineto
end_ol grestore 
gsave 7.843900 11.610000 translate 0.035278 -0.035278 scale
start_ol
1856 574 moveto
1752 546 1654 535 1580 535 curveto
1338 535 1280 641 1280 1087 curveto
1280 2554 lineto
1833 2554 lineto
1833 3072 lineto
1280 3072 lineto
1280 3688 lineto
448 3590 lineto
448 3072 lineto
172 3072 lineto
172 2554 lineto
448 2554 lineto
448 981 lineto
448 329 741 0 1327 0 curveto
1471 0 1638 22 1856 67 curveto
1856 574 lineto
end_ol grestore 
1.000000 1.000000 1.000000 srgb
n 6.230000 12.010000 m 6.230000 15.410000 l 9.280000 15.410000 l 9.280000 12.010000 l f
0.000000 0.000000 0.000000 srgb
n 6.230000 12.010000 m 6.230000 15.410000 l 9.280000 15.410000 l 9.280000 12.010000 l cp s
gsave 6.380000 12.760000 translate 0.035278 -0.035278 scale
start_ol
192 26 moveto
256 26 lineto
256 192 lineto
421 192 lineto
421 256 lineto
256 256 lineto
256 422 lineto
192 422 lineto
192 256 lineto
26 256 lineto
26 192 lineto
192 192 lineto
192 26 lineto
end_ol grestore 
gsave 6.439267 12.760000 translate 0.035278 -0.035278 scale
start_ol
320 576 moveto
320 375 lineto
286 381 258 384 237 384 curveto
123 384 54 306 54 177 curveto
54 71 107 0 187 0 curveto
238 0 278 26 320 88 curveto
320 0 lineto
440 0 lineto
440 61 lineto
394 61 lineto
394 640 lineto
230 640 lineto
230 576 lineto
320 576 lineto
320 137 moveto
283 84 248 61 206 61 curveto
154 61 128 101 128 182 curveto
128 285 162 329 242 329 curveto
260 329 286 326 320 321 curveto
320 137 lineto
end_ol grestore 
gsave 6.498533 12.760000 translate 0.035278 -0.035278 scale
start_ol
414 192 moveto
414 224 lineto
414 330 358 384 247 384 curveto
126 384 46 317 46 215 curveto
46 86 132 0 263 0 curveto
315 0 358 10 403 32 curveto
403 87 lineto
353 65 314 55 273 55 curveto
231 55 199 65 174 84 curveto
145 108 132 136 125 192 curveto
414 192 lineto
126 256 moveto
134 309 174 338 242 338 curveto
304 338 336 314 336 266 curveto
336 256 lineto
126 256 lineto
end_ol grestore 
gsave 6.557800 12.760000 translate 0.035278 -0.035278 scale
start_ol
64 32 moveto
120 10 170 0 226 0 curveto
331 0 394 42 394 113 curveto
394 163 362 192 283 211 curveto
211 229 lineto
161 241 138 259 138 284 curveto
138 319 168 338 223 338 curveto
257 338 285 333 311 321 curveto
319 261 lineto
365 261 lineto
365 357 lineto
320 376 277 384 223 384 curveto
118 384 64 348 64 278 curveto
64 227 99 196 181 176 curveto
255 158 lineto
303 146 320 132 320 103 curveto
320 66 291 47 237 47 curveto
203 47 169 54 120 71 curveto
110 132 lineto
64 132 lineto
64 32 lineto
end_ol grestore 
gsave 6.617067 12.760000 translate 0.035278 -0.035278 scale
start_ol
366 81 moveto
321 63 289 55 262 55 curveto
214 55 202 73 202 143 curveto
202 320 lineto
362 320 lineto
362 384 lineto
202 384 lineto
202 485 lineto
128 485 lineto
128 384 lineto
24 384 lineto
24 320 lineto
128 320 lineto
128 113 lineto
128 32 160 0 240 0 curveto
285 0 322 10 366 32 curveto
366 81 lineto
end_ol grestore 
gsave 6.380000 13.560000 translate 0.035278 -0.035278 scale
start_ol
1216 221 moveto
1536 221 lineto
1536 1216 lineto
2527 1216 lineto
2527 1536 lineto
1536 1536 lineto
1536 2531 lineto
1216 2531 lineto
1216 1536 lineto
221 1536 lineto
221 1216 lineto
1216 1216 lineto
1216 221 lineto
end_ol grestore 
gsave 6.744067 13.560000 translate 0.035278 -0.035278 scale
start_ol
384 193 moveto
732 60 1039 0 1387 0 curveto
2043 0 2432 266 2432 720 curveto
2432 1039 2232 1222 1737 1344 curveto
1287 1458 lineto
977 1536 832 1650 832 1811 curveto
832 2034 1021 2156 1368 2156 curveto
1584 2156 1759 2121 1926 2043 curveto
1980 1658 lineto
2259 1658 lineto
2259 2271 lineto
1977 2381 1709 2432 1368 2432 curveto
715 2432 384 2205 384 1756 curveto
384 1428 600 1232 1115 1106 curveto
1575 988 lineto
1878 914 1984 822 1984 639 curveto
1984 403 1803 281 1458 281 curveto
1246 281 1033 324 720 437 curveto
662 827 lineto
384 827 lineto
384 193 lineto
end_ol grestore 
gsave 7.108133 13.560000 translate 0.035278 -0.035278 scale
start_ol
1216 1529 moveto
1419 1889 1635 2045 1925 2045 curveto
2022 2045 2100 2023 2188 1965 curveto
2234 1556 lineto
2515 1556 lineto
2515 2292 lineto
2345 2387 2183 2432 1999 2432 curveto
1704 2432 1483 2281 1216 1907 curveto
1216 2432 lineto
187 2432 lineto
187 2045 lineto
768 2045 lineto
768 276 lineto
187 276 lineto
187 0 lineto
2050 0 lineto
2050 276 lineto
1216 276 lineto
1216 1529 lineto
end_ol grestore 
gsave 7.472200 13.560000 translate 0.035278 -0.035278 scale
start_ol
2275 496 moveto
2012 379 1810 332 1598 332 curveto
1077 332 768 669 768 1235 curveto
768 1797 1044 2156 1482 2156 curveto
1597 2156 1717 2130 1897 2061 curveto
1966 1572 lineto
2247 1572 lineto
2247 2308 lineto
2003 2395 1773 2432 1510 2432 curveto
760 2432 320 1993 320 1242 curveto
320 478 783 0 1527 0 curveto
1817 0 2048 51 2275 157 curveto
2275 496 lineto
end_ol grestore 
gsave 6.380000 14.360000 translate 0.035278 -0.035278 scale
start_ol
1216 221 moveto
1536 221 lineto
1536 1216 lineto
2527 1216 lineto
2527 1536 lineto
1536 1536 lineto
1536 2531 lineto
1216 2531 lineto
1216 1536 lineto
221 1536 lineto
221 1216 lineto
1216 1216 lineto
1216 221 lineto
end_ol grestore 
gsave 6.744067 14.360000 translate 0.035278 -0.035278 scale
start_ol
832 -640 moveto
832 0 lineto
1064 0 1217 0 1356 0 curveto
2065 0 2496 496 2496 1313 curveto
2496 1989 2169 2432 1679 2432 curveto
1353 2432 1102 2270 832 1892 curveto
832 2432 lineto
108 2432 lineto
108 2073 lineto
384 2073 lineto
384 -640 lineto
108 -640 lineto
108 -896 lineto
1405 -896 lineto
1405 -640 lineto
832 -640 lineto
832 1577 moveto
1069 1922 1286 2073 1551 2073 curveto
1882 2073 2048 1810 2048 1289 curveto
2048 616 1830 332 1324 332 curveto
1206 332 1064 345 832 379 curveto
832 1577 lineto
end_ol grestore 
gsave 7.108133 14.360000 translate 0.035278 -0.035278 scale
start_ol
384 193 moveto
732 60 1039 0 1387 0 curveto
2043 0 2432 266 2432 720 curveto
2432 1039 2232 1222 1737 1344 curveto
1287 1458 lineto
977 1536 832 1650 832 1811 curveto
832 2034 1021 2156 1368 2156 curveto
1584 2156 1759 2121 1926 2043 curveto
1980 1658 lineto
2259 1658 lineto
2259 2271 lineto
1977 2381 1709 2432 1368 2432 curveto
715 2432 384 2205 384 1756 curveto
384 1428 600 1232 1115 1106 curveto
1575 988 lineto
1878 914 1984 822 1984 639 curveto
1984 403 1803 281 1458 281 curveto
1246 281 1033 324 720 437 curveto
662 827 lineto
384 827 lineto
384 193 lineto
end_ol grestore 
gsave 7.472200 14.360000 translate 0.035278 -0.035278 scale
start_ol
832 -640 moveto
832 0 lineto
1064 0 1217 0 1356 0 curveto
2065 0 2496 496 2496 1313 curveto
2496 1989 2169 2432 1679 2432 curveto
1353 2432 1102 2270 832 1892 curveto
832 2432 lineto
108 2432 lineto
108 2073 lineto
384 2073 lineto
384 -640 lineto
108 -640 lineto
108 -896 lineto
1405 -896 lineto
1405 -640 lineto
832 -640 lineto
832 1577 moveto
1069 1922 1286 2073 1551 2073 curveto
1882 2073 2048 1810 2048 1289 curveto
2048 616 1830 332 1324 332 curveto
1206 332 1064 345 832 379 curveto
832 1577 lineto
end_ol grestore 
gsave 7.836267 14.360000 translate 0.035278 -0.035278 scale
start_ol
1024 0 moveto
1664 0 lineto
1664 668 lineto
1024 668 lineto
1024 0 lineto
1024 1764 moveto
1664 1764 lineto
1664 2432 lineto
1024 2432 lineto
1024 1764 lineto
end_ol grestore 
gsave 8.200333 14.360000 translate 0.035278 -0.035278 scale
start_ol
end_ol grestore 
gsave 8.564400 14.360000 translate 0.035278 -0.035278 scale
start_ol
1903 0 moveto
2608 0 lineto
2608 332 lineto
2304 332 lineto
2304 1801 lineto
2304 2263 2099 2432 1534 2432 curveto
1167 2432 845 2368 487 2225 curveto
487 1762 lineto
750 1762 lineto
805 2030 lineto
1057 2116 1225 2151 1389 2151 curveto
1697 2151 1856 2034 1856 1805 curveto
1856 1451 lineto
1668 1451 lineto
723 1451 320 1219 320 679 curveto
320 263 609 0 1072 0 curveto
1352 0 1581 96 1856 321 curveto
1903 0 lineto
1856 660 moveto
1627 431 1431 332 1193 332 curveto
913 332 768 462 768 708 curveto
768 1058 1039 1192 1735 1192 curveto
1856 1192 lineto
1856 660 lineto
end_ol grestore 
gsave 6.380000 15.160000 translate 0.035278 -0.035278 scale
start_ol
1216 221 moveto
1536 221 lineto
1536 1216 lineto
2527 1216 lineto
2527 1536 lineto
1536 1536 lineto
1536 2531 lineto
1216 2531 lineto
1216 1536 lineto
221 1536 lineto
221 1216 lineto
1216 1216 lineto
1216 221 lineto
end_ol grestore 
gsave 6.744067 15.160000 translate 0.035278 -0.035278 scale
start_ol
172 0 moveto
1144 0 lineto
1144 268 lineto
896 268 lineto
896 1537 lineto
1116 1916 1318 2086 1553 2086 curveto
1796 2086 1920 1898 1920 1528 curveto
1920 268 lineto
1700 268 lineto
1700 0 lineto
2649 0 lineto
2649 268 lineto
2368 268 lineto
2368 1572 lineto
2368 2138 2136 2432 1686 2432 curveto
1374 2432 1139 2277 896 1912 curveto
896 2432 lineto
172 2432 lineto
172 2086 lineto
448 2086 lineto
448 268 lineto
172 268 lineto
172 0 lineto
end_ol grestore 
gsave 7.108133 15.160000 translate 0.035278 -0.035278 scale
start_ol
384 193 moveto
732 60 1039 0 1387 0 curveto
2043 0 2432 266 2432 720 curveto
2432 1039 2232 1222 1737 1344 curveto
1287 1458 lineto
977 1536 832 1650 832 1811 curveto
832 2034 1021 2156 1368 2156 curveto
1584 2156 1759 2121 1926 2043 curveto
1980 1658 lineto
2259 1658 lineto
2259 2271 lineto
1977 2381 1709 2432 1368 2432 curveto
715 2432 384 2205 384 1756 curveto
384 1428 600 1232 1115 1106 curveto
1575 988 lineto
1878 914 1984 822 1984 639 curveto
1984 403 1803 281 1458 281 curveto
1246 281 1033 324 720 437 curveto
662 827 lineto
384 827 lineto
384 193 lineto
end_ol grestore 
gsave 7.472200 15.160000 translate 0.035278 -0.035278 scale
start_ol
832 -640 moveto
832 0 lineto
1064 0 1217 0 1356 0 curveto
2065 0 2496 496 2496 1313 curveto
2496 1989 2169 2432 1679 2432 curveto
1353 2432 1102 2270 832 1892 curveto
832 2432 lineto
108 2432 lineto
108 2073 lineto
384 2073 lineto
384 -640 lineto
108 -640 lineto
108 -896 lineto
1405 -896 lineto
1405 -640 lineto
832 -640 lineto
832 1577 moveto
1069 1922 1286 2073 1551 2073 curveto
1882 2073 2048 1810 2048 1289 curveto
2048 616 1830 332 1324 332 curveto
1206 332 1064 345 832 379 curveto
832 1577 lineto
end_ol grestore 
gsave 7.836267 15.160000 translate 0.035278 -0.035278 scale
start_ol
1024 0 moveto
1664 0 lineto
1664 668 lineto
1024 668 lineto
1024 0 lineto
1024 1764 moveto
1664 1764 lineto
1664 2432 lineto
1024 2432 lineto
1024 1764 lineto
end_ol grestore 
gsave 8.200333 15.160000 translate 0.035278 -0.035278 scale
start_ol
end_ol grestore 
gsave 8.564400 15.160000 translate 0.035278 -0.035278 scale
start_ol
832 0 moveto
1064 0 1217 0 1356 0 curveto
2065 0 2496 496 2496 1313 curveto
2496 1989 2169 2432 1679 2432 curveto
1353 2432 1102 2270 832 1892 curveto
832 3487 lineto
108 3487 lineto
108 3211 lineto
384 3211 lineto
384 0 lineto
832 0 lineto
832 1577 moveto
1069 1922 1286 2073 1551 2073 curveto
1882 2073 2048 1810 2048 1289 curveto
2048 616 1835 332 1324 332 curveto
1206 332 1064 345 832 379 curveto
832 1577 lineto
end_ol grestore 
0.100000 slw
[] 0 sd
1.000000 1.000000 1.000000 srgb
n 11.130000 15.410000 m 11.130000 16.810000 l 13.430000 16.810000 l 13.430000 15.410000 l f
0.000000 0.000000 0.000000 srgb
n 11.130000 15.410000 m 11.130000 16.810000 l 13.430000 16.810000 l 13.430000 15.410000 l cp s
gsave 11.416400 16.410000 translate 0.035278 -0.035278 scale
start_ol
384 0 moveto
1216 0 lineto
1216 1948 lineto
1423 2270 1629 2415 1878 2415 curveto
2109 2415 2176 2298 2176 1909 curveto
2176 0 lineto
3008 0 lineto
3008 1948 lineto
3202 2270 3390 2415 3624 2415 curveto
3841 2415 3904 2304 3904 1909 curveto
3904 0 lineto
4736 0 lineto
4736 2125 lineto
4736 2752 4472 3072 3944 3072 curveto
3539 3072 3259 2893 3008 2484 curveto
2870 2888 2623 3072 2216 3072 curveto
1804 3072 1507 2899 1216 2490 curveto
1216 3072 lineto
384 3072 lineto
384 0 lineto
end_ol grestore 
gsave 12.093733 16.410000 translate 0.035278 -0.035278 scale
start_ol
2897 752 moveto
2540 619 2275 564 2010 564 curveto
1751 564 1549 625 1400 741 curveto
1215 889 1129 1060 1083 1408 curveto
2897 1408 lineto
2886 2582 2511 3072 1624 3072 curveto
760 3072 207 2497 207 1605 curveto
207 604 835 0 1872 0 curveto
2212 0 2534 52 2897 173 curveto
2897 752 lineto
1077 1856 moveto
1146 2340 1313 2554 1630 2554 curveto
1935 2554 2068 2345 2079 1856 curveto
1077 1856 lineto
end_ol grestore 
gsave 12.517067 16.410000 translate 0.035278 -0.035278 scale
start_ol
384 0 moveto
1216 0 lineto
1216 1948 lineto
1423 2270 1629 2415 1878 2415 curveto
2109 2415 2176 2298 2176 1909 curveto
2176 0 lineto
3008 0 lineto
3008 1948 lineto
3202 2270 3390 2415 3624 2415 curveto
3841 2415 3904 2304 3904 1909 curveto
3904 0 lineto
4736 0 lineto
4736 2125 lineto
4736 2752 4472 3072 3944 3072 curveto
3539 3072 3259 2893 3008 2484 curveto
2870 2888 2623 3072 2216 3072 curveto
1804 3072 1507 2899 1216 2490 curveto
1216 3072 lineto
384 3072 lineto
384 0 lineto
end_ol grestore 
1.000000 1.000000 1.000000 srgb
n 11.130000 16.810000 m 11.130000 17.810000 l 13.430000 17.810000 l 13.430000 16.810000 l f
0.000000 0.000000 0.000000 srgb
n 11.130000 16.810000 m 11.130000 17.810000 l 13.430000 17.810000 l 13.430000 16.810000 l cp s
gsave 11.280000 17.560000 translate 0.035278 -0.035278 scale
start_ol
1216 221 moveto
1536 221 lineto
1536 1216 lineto
2527 1216 lineto
2527 1536 lineto
1536 1536 lineto
1536 2531 lineto
1216 2531 lineto
1216 1536 lineto
221 1536 lineto
221 1216 lineto
1216 1216 lineto
1216 221 lineto
end_ol grestore 
gsave 11.644067 17.560000 translate 0.035278 -0.035278 scale
start_ol
659 2332 moveto
991 2332 lineto
1106 3553 lineto
548 3553 lineto
659 2332 lineto
1769 2332 moveto
2101 2332 lineto
2212 3553 lineto
1659 3553 lineto
1769 2332 lineto
end_ol grestore 
gsave 12.008133 17.560000 translate 0.035278 -0.035278 scale
start_ol
1157 0 moveto
1309 0 lineto
1064 -640 lineto
617 -640 lineto
617 -896 lineto
1696 -896 lineto
1696 -640 lineto
1364 -640 lineto
1608 -27 lineto
2474 2151 lineto
2640 2151 lineto
2640 2432 lineto
1816 2432 lineto
1816 2151 lineto
2175 2151 lineto
1475 413 lineto
1470 413 lineto
770 2151 lineto
1129 2151 lineto
1129 2432 lineto
124 2432 lineto
124 2151 lineto
290 2151 lineto
1157 0 lineto
end_ol grestore 
gsave 12.372200 17.560000 translate 0.035278 -0.035278 scale
start_ol
659 2332 moveto
991 2332 lineto
1106 3553 lineto
548 3553 lineto
659 2332 lineto
1769 2332 moveto
2101 2332 lineto
2212 3553 lineto
1659 3553 lineto
1769 2332 lineto
end_ol grestore 
0.100000 slw
[] 0 sd
1.000000 1.000000 1.000000 srgb
n 2.130000 8.910000 m 2.130000 10.310000 l 4.130000 10.310000 l 4.130000 8.910000 l f
0.000000 0.000000 0.000000 srgb
n 2.130000 8.910000 m 2.130000 10.310000 l 4.130000 10.310000 l 4.130000 8.910000 l cp s
gsave 2.880233 9.910000 translate 0.035278 -0.035278 scale
start_ol
1515 0 moveto
2379 0 lineto
3773 4160 lineto
3133 4160 lineto
2085 1053 lineto
996 4160 lineto
69 4160 lineto
1515 0 lineto
end_ol grestore 
0.100000 slw
[] 0 sd
[] 0 sd
0 slc
n 4.650000 4.150000 m 7.643199 4.158601 l s
[] 0 sd
0 slj
0 slc
n 8.018197 4.159679 m 7.517481 4.408241 l 7.643199 4.158601 l 7.518918 3.908243 l ef
n 8.018197 4.159679 m 7.517481 4.408241 l 7.643199 4.158601 l 7.518918 3.908243 l cp s
0.100000 slw
[] 0 sd
[] 0 sd
0 slj
0 slc
n 8.130000 6.160000 m 0.550000 6.160000 l 0.550000 2.150000 l 1.113197 2.150000 l s
[] 0 sd
0 slj
0 slc
n 1.488197 2.150000 m 0.988197 2.400000 l 1.113197 2.150000 l 0.988197 1.900000 l ef
n 1.488197 2.150000 m 0.988197 2.400000 l 1.113197 2.150000 l 0.988197 1.900000 l cp s
0.100000 slw
[] 0 sd
[] 0 sd
0 slj
0 slc
n 2.130000 9.610000 m 0.550000 9.610000 l 0.550000 2.150000 l 1.113197 2.150000 l s
[] 0 sd
0 slj
0 slc
n 1.488197 2.150000 m 0.988197 2.400000 l 1.113197 2.150000 l 0.988197 1.900000 l ef
n 1.488197 2.150000 m 0.988197 2.400000 l 1.113197 2.150000 l 0.988197 1.900000 l cp s
0.100000 slw
[] 0 sd
[] 0 sd
0 slj
0 slc
n 9.280000 13.310000 m 12.455000 13.310000 l 12.455000 3.810000 l 15.143197 3.810000 l s
[] 0 sd
0 slj
0 slc
n 15.518197 3.810000 m 15.018197 4.060000 l 15.143197 3.810000 l 15.018197 3.560000 l ef
n 15.518197 3.810000 m 15.018197 4.060000 l 15.143197 3.810000 l 15.018197 3.560000 l cp s
0.100000 slw
[] 0 sd
[] 0 sd
0 slj
0 slc
n 9.280000 12.510000 m 10.205000 12.510000 l 10.205000 16.110000 l 10.643197 16.110000 l s
[] 0 sd
0 slj
0 slc
n 11.018197 16.110000 m 10.518197 16.360000 l 10.643197 16.110000 l 10.518197 15.860000 l ef
n 11.018197 16.110000 m 10.518197 16.360000 l 10.643197 16.110000 l 10.518197 15.860000 l cp s
0.100000 slw
[] 0 sd
[] 0 sd
0 slc
n 11.180000 6.960000 m 13.314016 8.257147 l s
[] 0 sd
0 slj
0 slc
n 13.634462 8.451928 m 13.077347 8.405850 l 13.314016 8.257147 l 13.337054 7.978589 l ef
n 13.634462 8.451928 m 13.077347 8.405850 l 13.314016 8.257147 l 13.337054 7.978589 l cp s
0.100000 slw
[] 0 sd
[] 0 sd
0 slj
0 slc
n 19.130000 11.010000 m 11.630000 11.010000 l 11.630000 9.610000 l 4.616803 9.610000 l s
[] 0 sd
0 slj
0 slc
n 4.241803 9.610000 m 4.741803 9.360000 l 4.616803 9.610000 l 4.741803 9.860000 l ef
n 4.241803 9.610000 m 4.741803 9.360000 l 4.616803 9.610000 l 4.741803 9.860000 l cp s
0.100000 slw
[] 0 sd
[] 0 sd
0 slj
0 slc
n 22.180000 11.810000 m 23.180000 11.810000 l 23.180000 3.810000 l 19.166803 3.810000 l s
[] 0 sd
0 slj
0 slc
n 18.791803 3.810000 m 19.291803 3.560000 l 19.166803 3.810000 l 19.291803 4.060000 l ef
n 18.791803 3.810000 m 19.291803 3.560000 l 19.166803 3.810000 l 19.291803 4.060000 l cp s
0.100000 slw
[] 0 sd
[] 0 sd
0 slj
0 slc
n 19.130000 9.410000 m 18.205000 9.410000 l 18.205000 14.110000 l 17.766803 14.110000 l s
[] 0 sd
0 slj
0 slc
n 17.391803 14.110000 m 17.891803 13.860000 l 17.766803 14.110000 l 17.891803 14.360000 l ef
n 17.391803 14.110000 m 17.891803 13.860000 l 17.766803 14.110000 l 17.891803 14.360000 l cp s
showpage
