%!PS-Adobe-2.0 EPSF-2.0
%%Title: ss_uml_declaration.dia
%%Creator: Dia v0.94
%%CreationDate: Thu May 26 14:09:27 2005
%%For: sandp9am
%%Orientation: Portrait
%%Magnification: 1.0000
%%BoundingBox: 0 0 505 277
%%BeginSetup
%%EndSetup
%%EndComments
%%BeginProlog
[ /.notdef /.notdef /.notdef /.notdef /.notdef /.notdef /.notdef /.notdef /.notdef /.notdef
/.notdef /.notdef /.notdef /.notdef /.notdef /.notdef /.notdef /.notdef /.notdef /.notdef
/.notdef /.notdef /.notdef /.notdef /.notdef /.notdef /.notdef /.notdef /.notdef /.notdef
/.notdef /.notdef /space /exclam /quotedbl /numbersign /dollar /percent /ampersand /quoteright
/parenleft /parenright /asterisk /plus /comma /hyphen /period /slash /zero /one
/two /three /four /five /six /seven /eight /nine /colon /semicolon
/less /equal /greater /question /at /A /B /C /D /E
/F /G /H /I /J /K /L /M /N /O
/P /Q /R /S /T /U /V /W /X /Y
/Z /bracketleft /backslash /bracketright /asciicircum /underscore /quoteleft /a /b /c
/d /e /f /g /h /i /j /k /l /m
/n /o /p /q /r /s /t /u /v /w
/x /y /z /braceleft /bar /braceright /asciitilde /.notdef /.notdef /.notdef
/.notdef /.notdef /.notdef /.notdef /.notdef /.notdef /.notdef /.notdef /.notdef /.notdef
/.notdef /.notdef /.notdef /.notdef /.notdef /.notdef /.notdef /.notdef /.notdef /.notdef
/.notdef /.notdef /.notdef /.notdef /.notdef /.notdef /.notdef /.notdef /.notdef /.notdef
/space /exclamdown /cent /sterling /currency /yen /brokenbar /section /dieresis /copyright
/ordfeminine /guillemotleft /logicalnot /hyphen /registered /macron /degree /plusminus /twosuperior /threesuperior
/acute /mu /paragraph /periodcentered /cedilla /onesuperior /ordmasculine /guillemotright /onequarter /onehalf
/threequarters /questiondown /Agrave /Aacute /Acircumflex /Atilde /Adieresis /Aring /AE /Ccedilla
/Egrave /Eacute /Ecircumflex /Edieresis /Igrave /Iacute /Icircumflex /Idieresis /Eth /Ntilde
/Ograve /Oacute /Ocircumflex /Otilde /Odieresis /multiply /Oslash /Ugrave /Uacute /Ucircumflex
/Udieresis /Yacute /Thorn /germandbls /agrave /aacute /acircumflex /atilde /adieresis /aring
/ae /ccedilla /egrave /eacute /ecircumflex /edieresis /igrave /iacute /icircumflex /idieresis
/eth /ntilde /ograve /oacute /ocircumflex /otilde /odieresis /divide /oslash /ugrave
/uacute /ucircumflex /udieresis /yacute /thorn /ydieresis] /isolatin1encoding exch def
/cp {closepath} bind def
/c {curveto} bind def
/f {fill} bind def
/a {arc} bind def
/ef {eofill} bind def
/ex {exch} bind def
/gr {grestore} bind def
/gs {gsave} bind def
/sa {save} bind def
/rs {restore} bind def
/l {lineto} bind def
/m {moveto} bind def
/rm {rmoveto} bind def
/n {newpath} bind def
/s {stroke} bind def
/sh {show} bind def
/slc {setlinecap} bind def
/slj {setlinejoin} bind def
/slw {setlinewidth} bind def
/srgb {setrgbcolor} bind def
/rot {rotate} bind def
/sc {scale} bind def
/sd {setdash} bind def
/ff {findfont} bind def
/sf {setfont} bind def
/scf {scalefont} bind def
/sw {stringwidth pop} bind def
/tr {translate} bind def

/ellipsedict 8 dict def
ellipsedict /mtrx matrix put
/ellipse
{ ellipsedict begin
   /endangle exch def
   /startangle exch def
   /yrad exch def
   /xrad exch def
   /y exch def
   /x exch def   /savematrix mtrx currentmatrix def
   x y tr xrad yrad sc
   0 0 1 startangle endangle arc
   savematrix setmatrix
   end
} def

/mergeprocs {
dup length
3 -1 roll
dup
length
dup
5 1 roll
3 -1 roll
add
array cvx
dup
3 -1 roll
0 exch
putinterval
dup
4 2 roll
putinterval
} bind def
/Times-Roman-latin1
    /Times-Roman findfont
    dup length dict begin
	{1 index /FID ne {def} {pop pop} ifelse} forall
	/Encoding isolatin1encoding def
    currentdict end
definefont pop
/Times-Italic-latin1
    /Times-Italic findfont
    dup length dict begin
	{1 index /FID ne {def} {pop pop} ifelse} forall
	/Encoding isolatin1encoding def
    currentdict end
definefont pop
/Times-Bold-latin1
    /Times-Bold findfont
    dup length dict begin
	{1 index /FID ne {def} {pop pop} ifelse} forall
	/Encoding isolatin1encoding def
    currentdict end
definefont pop
/Times-BoldItalic-latin1
    /Times-BoldItalic findfont
    dup length dict begin
	{1 index /FID ne {def} {pop pop} ifelse} forall
	/Encoding isolatin1encoding def
    currentdict end
definefont pop
/AvantGarde-Book-latin1
    /AvantGarde-Book findfont
    dup length dict begin
	{1 index /FID ne {def} {pop pop} ifelse} forall
	/Encoding isolatin1encoding def
    currentdict end
definefont pop
/AvantGarde-BookOblique-latin1
    /AvantGarde-BookOblique findfont
    dup length dict begin
	{1 index /FID ne {def} {pop pop} ifelse} forall
	/Encoding isolatin1encoding def
    currentdict end
definefont pop
/AvantGarde-Demi-latin1
    /AvantGarde-Demi findfont
    dup length dict begin
	{1 index /FID ne {def} {pop pop} ifelse} forall
	/Encoding isolatin1encoding def
    currentdict end
definefont pop
/AvantGarde-DemiOblique-latin1
    /AvantGarde-DemiOblique findfont
    dup length dict begin
	{1 index /FID ne {def} {pop pop} ifelse} forall
	/Encoding isolatin1encoding def
    currentdict end
definefont pop
/Bookman-Light-latin1
    /Bookman-Light findfont
    dup length dict begin
	{1 index /FID ne {def} {pop pop} ifelse} forall
	/Encoding isolatin1encoding def
    currentdict end
definefont pop
/Bookman-LightItalic-latin1
    /Bookman-LightItalic findfont
    dup length dict begin
	{1 index /FID ne {def} {pop pop} ifelse} forall
	/Encoding isolatin1encoding def
    currentdict end
definefont pop
/Bookman-Demi-latin1
    /Bookman-Demi findfont
    dup length dict begin
	{1 index /FID ne {def} {pop pop} ifelse} forall
	/Encoding isolatin1encoding def
    currentdict end
definefont pop
/Bookman-DemiItalic-latin1
    /Bookman-DemiItalic findfont
    dup length dict begin
	{1 index /FID ne {def} {pop pop} ifelse} forall
	/Encoding isolatin1encoding def
    currentdict end
definefont pop
/Courier-latin1
    /Courier findfont
    dup length dict begin
	{1 index /FID ne {def} {pop pop} ifelse} forall
	/Encoding isolatin1encoding def
    currentdict end
definefont pop
/Courier-Oblique-latin1
    /Courier-Oblique findfont
    dup length dict begin
	{1 index /FID ne {def} {pop pop} ifelse} forall
	/Encoding isolatin1encoding def
    currentdict end
definefont pop
/Courier-Bold-latin1
    /Courier-Bold findfont
    dup length dict begin
	{1 index /FID ne {def} {pop pop} ifelse} forall
	/Encoding isolatin1encoding def
    currentdict end
definefont pop
/Courier-BoldOblique-latin1
    /Courier-BoldOblique findfont
    dup length dict begin
	{1 index /FID ne {def} {pop pop} ifelse} forall
	/Encoding isolatin1encoding def
    currentdict end
definefont pop
/Helvetica-latin1
    /Helvetica findfont
    dup length dict begin
	{1 index /FID ne {def} {pop pop} ifelse} forall
	/Encoding isolatin1encoding def
    currentdict end
definefont pop
/Helvetica-Oblique-latin1
    /Helvetica-Oblique findfont
    dup length dict begin
	{1 index /FID ne {def} {pop pop} ifelse} forall
	/Encoding isolatin1encoding def
    currentdict end
definefont pop
/Helvetica-Bold-latin1
    /Helvetica-Bold findfont
    dup length dict begin
	{1 index /FID ne {def} {pop pop} ifelse} forall
	/Encoding isolatin1encoding def
    currentdict end
definefont pop
/Helvetica-BoldOblique-latin1
    /Helvetica-BoldOblique findfont
    dup length dict begin
	{1 index /FID ne {def} {pop pop} ifelse} forall
	/Encoding isolatin1encoding def
    currentdict end
definefont pop
/Helvetica-Narrow-latin1
    /Helvetica-Narrow findfont
    dup length dict begin
	{1 index /FID ne {def} {pop pop} ifelse} forall
	/Encoding isolatin1encoding def
    currentdict end
definefont pop
/Helvetica-Narrow-Oblique-latin1
    /Helvetica-Narrow-Oblique findfont
    dup length dict begin
	{1 index /FID ne {def} {pop pop} ifelse} forall
	/Encoding isolatin1encoding def
    currentdict end
definefont pop
/Helvetica-Narrow-Bold-latin1
    /Helvetica-Narrow-Bold findfont
    dup length dict begin
	{1 index /FID ne {def} {pop pop} ifelse} forall
	/Encoding isolatin1encoding def
    currentdict end
definefont pop
/Helvetica-Narrow-BoldOblique-latin1
    /Helvetica-Narrow-BoldOblique findfont
    dup length dict begin
	{1 index /FID ne {def} {pop pop} ifelse} forall
	/Encoding isolatin1encoding def
    currentdict end
definefont pop
/NewCenturySchoolbook-Roman-latin1
    /NewCenturySchoolbook-Roman findfont
    dup length dict begin
	{1 index /FID ne {def} {pop pop} ifelse} forall
	/Encoding isolatin1encoding def
    currentdict end
definefont pop
/NewCenturySchoolbook-Italic-latin1
    /NewCenturySchoolbook-Italic findfont
    dup length dict begin
	{1 index /FID ne {def} {pop pop} ifelse} forall
	/Encoding isolatin1encoding def
    currentdict end
definefont pop
/NewCenturySchoolbook-Bold-latin1
    /NewCenturySchoolbook-Bold findfont
    dup length dict begin
	{1 index /FID ne {def} {pop pop} ifelse} forall
	/Encoding isolatin1encoding def
    currentdict end
definefont pop
/NewCenturySchoolbook-BoldItalic-latin1
    /NewCenturySchoolbook-BoldItalic findfont
    dup length dict begin
	{1 index /FID ne {def} {pop pop} ifelse} forall
	/Encoding isolatin1encoding def
    currentdict end
definefont pop
/Palatino-Roman-latin1
    /Palatino-Roman findfont
    dup length dict begin
	{1 index /FID ne {def} {pop pop} ifelse} forall
	/Encoding isolatin1encoding def
    currentdict end
definefont pop
/Palatino-Italic-latin1
    /Palatino-Italic findfont
    dup length dict begin
	{1 index /FID ne {def} {pop pop} ifelse} forall
	/Encoding isolatin1encoding def
    currentdict end
definefont pop
/Palatino-Bold-latin1
    /Palatino-Bold findfont
    dup length dict begin
	{1 index /FID ne {def} {pop pop} ifelse} forall
	/Encoding isolatin1encoding def
    currentdict end
definefont pop
/Palatino-BoldItalic-latin1
    /Palatino-BoldItalic findfont
    dup length dict begin
	{1 index /FID ne {def} {pop pop} ifelse} forall
	/Encoding isolatin1encoding def
    currentdict end
definefont pop
/Symbol-latin1
    /Symbol findfont
definefont pop
/ZapfChancery-MediumItalic-latin1
    /ZapfChancery-MediumItalic findfont
    dup length dict begin
	{1 index /FID ne {def} {pop pop} ifelse} forall
	/Encoding isolatin1encoding def
    currentdict end
definefont pop
/ZapfDingbats-latin1
    /ZapfDingbats findfont
    dup length dict begin
	{1 index /FID ne {def} {pop pop} ifelse} forall
	/Encoding isolatin1encoding def
    currentdict end
definefont pop
5.669200 -5.669200 scale
111.456000 10.771100 translate
%%EndProlog


0.100000 slw
[] 0 sd
1.000000 1.000000 1.000000 srgb
n -71.012100 -58.508500 m -71.012100 -56.908500 l -58.887100 -56.908500 l -58.887100 -58.508500 l f
0.000000 0.000000 0.000000 srgb
n -71.012100 -58.508500 m -71.012100 -56.908500 l -58.887100 -56.908500 l -58.887100 -58.508500 l cp s
/Helvetica-latin1 ff 0.840000 scf sf
(declaration) dup sw 2 div -64.949600 ex sub -57.308500 m gs 1 -1 sc sh gr
1.000000 1.000000 1.000000 srgb
n -71.012100 -56.908500 m -71.012100 -51.908500 l -58.887100 -51.908500 l -58.887100 -56.908500 l f
0.000000 0.000000 0.000000 srgb
n -71.012100 -56.908500 m -71.012100 -51.908500 l -58.887100 -51.908500 l -58.887100 -56.908500 l cp s
/Courier-latin1 ff 0.560000 scf sf
(+visible_since: declaration_time) -70.862100 -56.278812 m gs 1 -1 sc sh gr
/Courier-latin1 ff 0.560000 scf sf
(+decl_time: declaration_time) -70.862100 -55.478812 m gs 1 -1 sc sh gr
/Courier-latin1 ff 0.560000 scf sf
(+name: decl_name) -70.862100 -54.678812 m gs 1 -1 sc sh gr
/Courier-latin1 ff 0.560000 scf sf
(+contained_in: decl_seq) -70.862100 -53.878812 m gs 1 -1 sc sh gr
/Courier-latin1 ff 0.560000 scf sf
(+type: type) -70.862100 -53.078812 m gs 1 -1 sc sh gr
/Courier-latin1 ff 0.560000 scf sf
(+linkage: ???) -70.862100 -52.278812 m gs 1 -1 sc sh gr
1.000000 1.000000 1.000000 srgb
n -71.012100 -51.908500 m -71.012100 -51.508500 l -58.887100 -51.508500 l -58.887100 -51.908500 l f
0.000000 0.000000 0.000000 srgb
n -71.012100 -51.908500 m -71.012100 -51.508500 l -58.887100 -51.508500 l -58.887100 -51.908500 l cp s
0.100000 slw
[] 0 sd
1.000000 1.000000 1.000000 srgb
n -108.468000 -54.518000 m -108.468000 -52.918000 l -93.461750 -52.918000 l -93.461750 -54.518000 l f
0.000000 0.000000 0.000000 srgb
n -108.468000 -54.518000 m -108.468000 -52.918000 l -93.461750 -52.918000 l -93.461750 -54.518000 l cp s
/Helvetica-latin1 ff 0.840000 scf sf
(decl_seq) dup sw 2 div -100.964875 ex sub -53.318000 m gs 1 -1 sc sh gr
1.000000 1.000000 1.000000 srgb
n -108.468000 -52.918000 m -108.468000 -48.718000 l -93.461750 -48.718000 l -93.461750 -52.918000 l f
0.000000 0.000000 0.000000 srgb
n -108.468000 -52.918000 m -108.468000 -48.718000 l -93.461750 -48.718000 l -93.461750 -52.918000 l cp s
/Courier-latin1 ff 0.560000 scf sf
(+contents: LIST<declaration>) -108.318000 -52.288312 m gs 1 -1 sc sh gr
/Courier-latin1 ff 0.560000 scf sf
(+parent: decl_seq) -108.318000 -51.488312 m gs 1 -1 sc sh gr
/Courier-latin1 ff 0.560000 scf sf
(+using_directives: LIST<using_directive>) -108.318000 -50.688312 m gs 1 -1 sc sh gr
/Courier-latin1 ff 0.560000 scf sf
(+compound_stmt: compound_stmt) -108.318000 -49.888312 m gs 1 -1 sc sh gr
/Courier-latin1 ff 0.560000 scf sf
(+declared_by: declaration) -108.318000 -49.088312 m gs 1 -1 sc sh gr
1.000000 1.000000 1.000000 srgb
n -108.468000 -48.718000 m -108.468000 -48.318000 l -93.461750 -48.318000 l -93.461750 -48.718000 l f
0.000000 0.000000 0.000000 srgb
n -108.468000 -48.718000 m -108.468000 -48.318000 l -93.461750 -48.318000 l -93.461750 -48.718000 l cp s
0.100000 slw
[] 0 sd
1.000000 1.000000 1.000000 srgb
n -37.456500 -59.431100 m -37.456500 -57.831100 l -31.358844 -57.831100 l -31.358844 -59.431100 l f
0.000000 0.000000 0.000000 srgb
n -37.456500 -59.431100 m -37.456500 -57.831100 l -31.358844 -57.831100 l -31.358844 -59.431100 l cp s
/Helvetica-latin1 ff 0.840000 scf sf
(decl_name) dup sw 2 div -34.407672 ex sub -58.231100 m gs 1 -1 sc sh gr
1.000000 1.000000 1.000000 srgb
n -37.456500 -57.831100 m -37.456500 -57.431100 l -31.358844 -57.431100 l -31.358844 -57.831100 l f
0.000000 0.000000 0.000000 srgb
n -37.456500 -57.831100 m -37.456500 -57.431100 l -31.358844 -57.431100 l -31.358844 -57.831100 l cp s
1.000000 1.000000 1.000000 srgb
n -37.456500 -57.431100 m -37.456500 -57.031100 l -31.358844 -57.031100 l -31.358844 -57.431100 l f
0.000000 0.000000 0.000000 srgb
n -37.456500 -57.431100 m -37.456500 -57.031100 l -31.358844 -57.031100 l -31.358844 -57.431100 l cp s
0.100000 slw
[] 0 sd
1.000000 1.000000 1.000000 srgb
n -48.256500 -52.431100 m -48.256500 -50.831100 l -39.944000 -50.831100 l -39.944000 -52.431100 l f
0.000000 0.000000 0.000000 srgb
n -48.256500 -52.431100 m -48.256500 -50.831100 l -39.944000 -50.831100 l -39.944000 -52.431100 l cp s
/Helvetica-latin1 ff 0.840000 scf sf
(ordinary_name) dup sw 2 div -44.100250 ex sub -51.231100 m gs 1 -1 sc sh gr
1.000000 1.000000 1.000000 srgb
n -48.256500 -50.831100 m -48.256500 -49.831100 l -39.944000 -49.831100 l -39.944000 -50.831100 l f
0.000000 0.000000 0.000000 srgb
n -48.256500 -50.831100 m -48.256500 -49.831100 l -39.944000 -49.831100 l -39.944000 -50.831100 l cp s
/Courier-latin1 ff 0.560000 scf sf
(+name: String) -48.106500 -50.201412 m gs 1 -1 sc sh gr
1.000000 1.000000 1.000000 srgb
n -48.256500 -49.831100 m -48.256500 -49.431100 l -39.944000 -49.431100 l -39.944000 -49.831100 l f
0.000000 0.000000 0.000000 srgb
n -48.256500 -49.831100 m -48.256500 -49.431100 l -39.944000 -49.431100 l -39.944000 -49.831100 l cp s
0.100000 slw
[] 0 sd
1.000000 1.000000 1.000000 srgb
n -39.156500 -52.431100 m -39.156500 -50.831100 l -29.603375 -50.831100 l -29.603375 -52.431100 l f
0.000000 0.000000 0.000000 srgb
n -39.156500 -52.431100 m -39.156500 -50.831100 l -29.603375 -50.831100 l -29.603375 -52.431100 l cp s
/Helvetica-latin1 ff 0.840000 scf sf
(conversion_name) dup sw 2 div -34.379938 ex sub -51.231100 m gs 1 -1 sc sh gr
1.000000 1.000000 1.000000 srgb
n -39.156500 -50.831100 m -39.156500 -49.831100 l -29.603375 -49.831100 l -29.603375 -50.831100 l f
0.000000 0.000000 0.000000 srgb
n -39.156500 -50.831100 m -39.156500 -49.831100 l -29.603375 -49.831100 l -29.603375 -50.831100 l cp s
/Courier-latin1 ff 0.560000 scf sf
(+type: type) -39.006500 -50.201412 m gs 1 -1 sc sh gr
1.000000 1.000000 1.000000 srgb
n -39.156500 -49.831100 m -39.156500 -49.431100 l -29.603375 -49.431100 l -29.603375 -49.831100 l f
0.000000 0.000000 0.000000 srgb
n -39.156500 -49.831100 m -39.156500 -49.431100 l -29.603375 -49.431100 l -29.603375 -49.831100 l cp s
0.100000 slw
[] 0 sd
1.000000 1.000000 1.000000 srgb
n -28.456500 -52.481100 m -28.456500 -50.881100 l -23.486187 -50.881100 l -23.486187 -52.481100 l f
0.000000 0.000000 0.000000 srgb
n -28.456500 -52.481100 m -28.456500 -50.881100 l -23.486187 -50.881100 l -23.486187 -52.481100 l cp s
/Helvetica-latin1 ff 0.840000 scf sf
(operator) dup sw 2 div -25.971344 ex sub -51.281100 m gs 1 -1 sc sh gr
1.000000 1.000000 1.000000 srgb
n -28.456500 -50.881100 m -28.456500 -50.481100 l -23.486187 -50.481100 l -23.486187 -50.881100 l f
0.000000 0.000000 0.000000 srgb
n -28.456500 -50.881100 m -28.456500 -50.481100 l -23.486187 -50.481100 l -23.486187 -50.881100 l cp s
1.000000 1.000000 1.000000 srgb
n -28.456500 -50.481100 m -28.456500 -50.081100 l -23.486187 -50.081100 l -23.486187 -50.481100 l f
0.000000 0.000000 0.000000 srgb
n -28.456500 -50.481100 m -28.456500 -50.081100 l -23.486187 -50.081100 l -23.486187 -50.481100 l cp s
0.100000 slw
[] 0 sd
0 slj
0 slc
n -34.381500 -56.119297 m -34.381500 -54.731100 l -34.356500 -54.731100 l -34.356500 -52.431100 l s
0 slj
1.000000 1.000000 1.000000 srgb
n -33.981500 -56.119297 m -34.381500 -56.919297 l -34.781500 -56.119297 l ef
0.100000 slw
[] 0 sd
0 slj
0.000000 0.000000 0.000000 srgb
n -33.981500 -56.119297 m -34.381500 -56.919297 l -34.781500 -56.119297 l cp s
/Courier-latin1 ff 0.560000 scf sf
0.100000 slw
[] 0 sd
0 slj
0 slc
n -34.381500 -56.119297 m -34.381500 -54.731100 l -44.081500 -54.731100 l -44.081500 -52.431100 l s
0 slj
1.000000 1.000000 1.000000 srgb
n -33.981500 -56.119297 m -34.381500 -56.919297 l -34.781500 -56.119297 l ef
0.100000 slw
[] 0 sd
0 slj
0.000000 0.000000 0.000000 srgb
n -33.981500 -56.119297 m -34.381500 -56.919297 l -34.781500 -56.119297 l cp s
/Courier-latin1 ff 0.560000 scf sf
0.100000 slw
[] 0 sd
0 slj
0 slc
n -34.381500 -56.119297 m -34.381500 -54.756100 l -25.971344 -54.756100 l -25.971344 -52.481100 l s
0 slj
1.000000 1.000000 1.000000 srgb
n -33.981500 -56.119297 m -34.381500 -56.919297 l -34.781500 -56.119297 l ef
0.100000 slw
[] 0 sd
0 slj
0.000000 0.000000 0.000000 srgb
n -33.981500 -56.119297 m -34.381500 -56.919297 l -34.781500 -56.119297 l cp s
/Courier-latin1 ff 0.560000 scf sf
0.100000 slw
[] 0 sd
1.000000 1.000000 1.000000 srgb
n -37.239800 -24.960300 m -37.239800 -23.360300 l -25.114800 -23.360300 l -25.114800 -24.960300 l f
0.000000 0.000000 0.000000 srgb
n -37.239800 -24.960300 m -37.239800 -23.360300 l -25.114800 -23.360300 l -25.114800 -24.960300 l cp s
/Helvetica-latin1 ff 0.840000 scf sf
(using_directive) dup sw 2 div -31.177300 ex sub -23.760300 m gs 1 -1 sc sh gr
1.000000 1.000000 1.000000 srgb
n -37.239800 -23.360300 m -37.239800 -21.560300 l -25.114800 -21.560300 l -25.114800 -23.360300 l f
0.000000 0.000000 0.000000 srgb
n -37.239800 -23.360300 m -37.239800 -21.560300 l -25.114800 -21.560300 l -25.114800 -23.360300 l cp s
/Courier-latin1 ff 0.560000 scf sf
(+decl_time: ss_declaration_time) -37.089800 -22.730612 m gs 1 -1 sc sh gr
/Courier-latin1 ff 0.560000 scf sf
(+nspace: ss_namespace_definition) -37.089800 -21.930612 m gs 1 -1 sc sh gr
1.000000 1.000000 1.000000 srgb
n -37.239800 -21.560300 m -37.239800 -21.160300 l -25.114800 -21.160300 l -25.114800 -21.560300 l f
0.000000 0.000000 0.000000 srgb
n -37.239800 -21.560300 m -37.239800 -21.160300 l -25.114800 -21.160300 l -25.114800 -21.560300 l cp s
0.100000 slw
[] 0 sd
1.000000 1.000000 1.000000 srgb
n -60.531000 -45.084200 m -60.531000 -43.484200 l -48.763813 -43.484200 l -48.763813 -45.084200 l f
0.000000 0.000000 0.000000 srgb
n -60.531000 -45.084200 m -60.531000 -43.484200 l -48.763813 -43.484200 l -48.763813 -45.084200 l cp s
/Helvetica-latin1 ff 0.840000 scf sf
(namespace_definition) dup sw 2 div -54.647406 ex sub -43.884200 m gs 1 -1 sc sh gr
1.000000 1.000000 1.000000 srgb
n -60.531000 -43.484200 m -60.531000 -42.484200 l -48.763813 -42.484200 l -48.763813 -43.484200 l f
0.000000 0.000000 0.000000 srgb
n -60.531000 -43.484200 m -60.531000 -42.484200 l -48.763813 -42.484200 l -48.763813 -43.484200 l cp s
/Courier-latin1 ff 0.560000 scf sf
(+body: decl_seq) -60.381000 -42.854512 m gs 1 -1 sc sh gr
1.000000 1.000000 1.000000 srgb
n -60.531000 -42.484200 m -60.531000 -42.084200 l -48.763813 -42.084200 l -48.763813 -42.484200 l f
0.000000 0.000000 0.000000 srgb
n -60.531000 -42.484200 m -60.531000 -42.084200 l -48.763813 -42.084200 l -48.763813 -42.484200 l cp s
0.100000 slw
[] 0 sd
1.000000 1.000000 1.000000 srgb
n -87.513500 -45.184200 m -87.513500 -43.584200 l -69.402562 -43.584200 l -69.402562 -45.184200 l f
0.000000 0.000000 0.000000 srgb
n -87.513500 -45.184200 m -87.513500 -43.584200 l -69.402562 -43.584200 l -69.402562 -45.184200 l cp s
/Helvetica-latin1 ff 0.840000 scf sf
(declaration_with_access_specifier) dup sw 2 div -78.458031 ex sub -43.984200 m gs 1 -1 sc sh gr
1.000000 1.000000 1.000000 srgb
n -87.513500 -43.584200 m -87.513500 -41.784200 l -69.402562 -41.784200 l -69.402562 -43.584200 l f
0.000000 0.000000 0.000000 srgb
n -87.513500 -43.584200 m -87.513500 -41.784200 l -69.402562 -41.784200 l -69.402562 -43.584200 l cp s
/Courier-latin1 ff 0.560000 scf sf
(+access_specifier: access_specifier_enum) -87.363500 -42.954512 m gs 1 -1 sc sh gr
/Helvetica-latin1 ff 0.560000 scf sf
(public,private,protected) -87.363500 -42.154512 m gs 1 -1 sc sh gr
1.000000 1.000000 1.000000 srgb
n -87.513500 -41.784200 m -87.513500 -41.384200 l -69.402562 -41.384200 l -69.402562 -41.784200 l f
0.000000 0.000000 0.000000 srgb
n -87.513500 -41.784200 m -87.513500 -41.384200 l -69.402562 -41.384200 l -69.402562 -41.784200 l cp s
0.100000 slw
[] 0 sd
1.000000 1.000000 1.000000 srgb
n -62.175100 -34.550000 m -62.175100 -32.950000 l -50.770412 -32.950000 l -50.770412 -34.550000 l f
0.000000 0.000000 0.000000 srgb
n -62.175100 -34.550000 m -62.175100 -32.950000 l -50.770412 -32.950000 l -50.770412 -34.550000 l cp s
/Helvetica-latin1 ff 0.840000 scf sf
(object_declaration) dup sw 2 div -56.472756 ex sub -33.350000 m gs 1 -1 sc sh gr
1.000000 1.000000 1.000000 srgb
n -62.175100 -32.950000 m -62.175100 -31.950000 l -50.770412 -31.950000 l -50.770412 -32.950000 l f
0.000000 0.000000 0.000000 srgb
n -62.175100 -32.950000 m -62.175100 -31.950000 l -50.770412 -31.950000 l -50.770412 -32.950000 l cp s
/Courier-latin1 ff 0.560000 scf sf
(+initializer: or_or_functional) -62.025100 -32.320312 m gs 1 -1 sc sh gr
1.000000 1.000000 1.000000 srgb
n -62.175100 -31.950000 m -62.175100 -31.550000 l -50.770412 -31.550000 l -50.770412 -31.950000 l f
0.000000 0.000000 0.000000 srgb
n -62.175100 -31.950000 m -62.175100 -31.550000 l -50.770412 -31.550000 l -50.770412 -31.950000 l cp s
0.100000 slw
[] 0 sd
0 slj
0 slc
n -78.363500 -40.472397 m -78.363500 -37.967100 l -56.625100 -37.967100 l -56.625100 -34.550000 l s
0 slj
1.000000 1.000000 1.000000 srgb
n -77.963500 -40.472397 m -78.363500 -41.272397 l -78.763500 -40.472397 l ef
0.100000 slw
[] 0 sd
0 slj
0.000000 0.000000 0.000000 srgb
n -77.963500 -40.472397 m -78.363500 -41.272397 l -78.763500 -40.472397 l cp s
/Courier-latin1 ff 0.560000 scf sf
0.100000 slw
[] 0 sd
0 slj
0 slc
n -65.112100 -50.596697 m -65.112100 -48.346400 l -78.363500 -48.346400 l -78.363500 -45.184200 l s
0 slj
1.000000 1.000000 1.000000 srgb
n -64.712100 -50.596697 m -65.112100 -51.396697 l -65.512100 -50.596697 l ef
0.100000 slw
[] 0 sd
0 slj
0.000000 0.000000 0.000000 srgb
n -64.712100 -50.596697 m -65.112100 -51.396697 l -65.512100 -50.596697 l cp s
/Courier-latin1 ff 0.560000 scf sf
0.100000 slw
[] 0 sd
0 slj
0 slc
n -65.112100 -50.596697 m -65.112100 -48.355400 l -54.606000 -48.355400 l -54.606000 -45.084200 l s
0 slj
1.000000 1.000000 1.000000 srgb
n -64.712100 -50.596697 m -65.112100 -51.396697 l -65.512100 -50.596697 l ef
0.100000 slw
[] 0 sd
0 slj
0.000000 0.000000 0.000000 srgb
n -64.712100 -50.596697 m -65.112100 -51.396697 l -65.512100 -50.596697 l cp s
/Courier-latin1 ff 0.560000 scf sf
0.100000 slw
[] 0 sd
1.000000 1.000000 1.000000 srgb
n -70.275100 -25.550000 m -70.275100 -23.950000 l -59.771194 -23.950000 l -59.771194 -25.550000 l f
0.000000 0.000000 0.000000 srgb
n -70.275100 -25.550000 m -70.275100 -23.950000 l -59.771194 -23.950000 l -59.771194 -25.550000 l cp s
/Helvetica-latin1 ff 0.840000 scf sf
(bitfield_declaration) dup sw 2 div -65.023147 ex sub -24.350000 m gs 1 -1 sc sh gr
1.000000 1.000000 1.000000 srgb
n -70.275100 -23.950000 m -70.275100 -22.950000 l -59.771194 -22.950000 l -59.771194 -23.950000 l f
0.000000 0.000000 0.000000 srgb
n -70.275100 -23.950000 m -70.275100 -22.950000 l -59.771194 -22.950000 l -59.771194 -23.950000 l cp s
/Courier-latin1 ff 0.560000 scf sf
(+width: t_size) -70.125100 -23.320312 m gs 1 -1 sc sh gr
1.000000 1.000000 1.000000 srgb
n -70.275100 -22.950000 m -70.275100 -22.550000 l -59.771194 -22.550000 l -59.771194 -22.950000 l f
0.000000 0.000000 0.000000 srgb
n -70.275100 -22.950000 m -70.275100 -22.550000 l -59.771194 -22.550000 l -59.771194 -22.950000 l cp s
0.100000 slw
[] 0 sd
0 slj
0 slc
n -56.625100 -30.638197 m -56.625100 -28.550000 l -65.000100 -28.550000 l -65.000100 -25.550000 l s
0 slj
1.000000 1.000000 1.000000 srgb
n -56.225100 -30.638197 m -56.625100 -31.438197 l -57.025100 -30.638197 l ef
0.100000 slw
[] 0 sd
0 slj
0.000000 0.000000 0.000000 srgb
n -56.225100 -30.638197 m -56.625100 -31.438197 l -57.025100 -30.638197 l cp s
/Courier-latin1 ff 0.560000 scf sf
0.100000 slw
[] 0 sd
1.000000 1.000000 1.000000 srgb
n -57.375100 -25.550000 m -57.375100 -23.950000 l -45.156350 -23.950000 l -45.156350 -25.550000 l f
0.000000 0.000000 0.000000 srgb
n -57.375100 -25.550000 m -57.375100 -23.950000 l -45.156350 -23.950000 l -45.156350 -25.550000 l cp s
/Helvetica-latin1 ff 0.840000 scf sf
(parameter_declaration) dup sw 2 div -51.265725 ex sub -24.350000 m gs 1 -1 sc sh gr
1.000000 1.000000 1.000000 srgb
n -57.375100 -23.950000 m -57.375100 -22.950000 l -45.156350 -22.950000 l -45.156350 -23.950000 l f
0.000000 0.000000 0.000000 srgb
n -57.375100 -23.950000 m -57.375100 -22.950000 l -45.156350 -22.950000 l -45.156350 -23.950000 l cp s
/Courier-latin1 ff 0.560000 scf sf
(+position: ulint) -57.225100 -23.320312 m gs 1 -1 sc sh gr
1.000000 1.000000 1.000000 srgb
n -57.375100 -22.950000 m -57.375100 -22.550000 l -45.156350 -22.550000 l -45.156350 -22.950000 l f
0.000000 0.000000 0.000000 srgb
n -57.375100 -22.950000 m -57.375100 -22.550000 l -45.156350 -22.550000 l -45.156350 -22.950000 l cp s
0.100000 slw
[] 0 sd
0 slj
0 slc
n -56.625100 -30.638197 m -56.625100 -28.550000 l -51.250100 -28.550000 l -51.250100 -25.550000 l s
0 slj
1.000000 1.000000 1.000000 srgb
n -56.225100 -30.638197 m -56.625100 -31.438197 l -57.025100 -30.638197 l ef
0.100000 slw
[] 0 sd
0 slj
0.000000 0.000000 0.000000 srgb
n -56.225100 -30.638197 m -56.625100 -31.438197 l -57.025100 -30.638197 l cp s
/Courier-latin1 ff 0.560000 scf sf
0.100000 slw
[] 0 sd
1.000000 1.000000 1.000000 srgb
n -85.389000 -34.650000 m -85.389000 -33.050000 l -75.475719 -33.050000 l -75.475719 -34.650000 l f
0.000000 0.000000 0.000000 srgb
n -85.389000 -34.650000 m -85.389000 -33.050000 l -75.475719 -33.050000 l -75.475719 -34.650000 l cp s
/Helvetica-latin1 ff 0.840000 scf sf
(typedef_definition) dup sw 2 div -80.432359 ex sub -33.450000 m gs 1 -1 sc sh gr
1.000000 1.000000 1.000000 srgb
n -85.389000 -33.050000 m -85.389000 -32.650000 l -75.475719 -32.650000 l -75.475719 -33.050000 l f
0.000000 0.000000 0.000000 srgb
n -85.389000 -33.050000 m -85.389000 -32.650000 l -75.475719 -32.650000 l -75.475719 -33.050000 l cp s
1.000000 1.000000 1.000000 srgb
n -85.389000 -32.650000 m -85.389000 -32.250000 l -75.475719 -32.250000 l -75.475719 -32.650000 l f
0.000000 0.000000 0.000000 srgb
n -85.389000 -32.650000 m -85.389000 -32.250000 l -75.475719 -32.250000 l -75.475719 -32.650000 l cp s
0.100000 slw
[] 0 sd
0 slj
0 slc
n -78.363500 -40.472397 m -78.363500 -37.955400 l -80.389000 -37.955400 l -80.389000 -34.650000 l s
0 slj
1.000000 1.000000 1.000000 srgb
n -77.963500 -40.472397 m -78.363500 -41.272397 l -78.763500 -40.472397 l ef
0.100000 slw
[] 0 sd
0 slj
0.000000 0.000000 0.000000 srgb
n -77.963500 -40.472397 m -78.363500 -41.272397 l -78.763500 -40.472397 l cp s
/Courier-latin1 ff 0.560000 scf sf
0.100000 slw
[] 0 sd
1.000000 1.000000 1.000000 srgb
n -107.402000 -27.485000 m -107.402000 -25.885000 l -95.277000 -25.885000 l -95.277000 -27.485000 l f
0.000000 0.000000 0.000000 srgb
n -107.402000 -27.485000 m -107.402000 -25.885000 l -95.277000 -25.885000 l -95.277000 -27.485000 l cp s
/Helvetica-latin1 ff 0.840000 scf sf
(function_declaration) dup sw 2 div -101.339500 ex sub -26.285000 m gs 1 -1 sc sh gr
1.000000 1.000000 1.000000 srgb
n -107.402000 -25.885000 m -107.402000 -23.285000 l -95.277000 -23.285000 l -95.277000 -25.885000 l f
0.000000 0.000000 0.000000 srgb
n -107.402000 -25.885000 m -107.402000 -23.285000 l -95.277000 -23.285000 l -95.277000 -25.885000 l cp s
/Courier-latin1 ff 0.560000 scf sf
(+parameters: decl_seq) -107.252000 -25.255312 m gs 1 -1 sc sh gr
/Courier-latin1 ff 0.560000 scf sf
(+body: compound_stmt) -107.252000 -24.455312 m gs 1 -1 sc sh gr
/Courier-latin1 ff 0.560000 scf sf
(+function_labels: LIST<id_label>) -107.252000 -23.655312 m gs 1 -1 sc sh gr
1.000000 1.000000 1.000000 srgb
n -107.402000 -23.285000 m -107.402000 -22.285000 l -95.277000 -22.285000 l -95.277000 -23.285000 l f
0.000000 0.000000 0.000000 srgb
n -107.402000 -23.285000 m -107.402000 -22.285000 l -95.277000 -22.285000 l -95.277000 -23.285000 l cp s
/Courier-latin1 ff 0.560000 scf sf
(+is_entry_point\(\): bool) -107.252000 -22.655312 m gs 1 -1 sc sh gr
0.100000 slw
[] 0 sd
0 slj
0 slc
n -92.980000 -30.724097 m -92.980000 -29.560400 l -101.502000 -29.560400 l -101.502000 -27.485000 l s
0 slj
1.000000 1.000000 1.000000 srgb
n -92.580000 -30.724097 m -92.980000 -31.524097 l -93.380000 -30.724097 l ef
0.100000 slw
[] 0 sd
0 slj
0.000000 0.000000 0.000000 srgb
n -92.580000 -30.724097 m -92.980000 -31.524097 l -93.380000 -30.724097 l cp s
/Courier-latin1 ff 0.560000 scf sf
0.100000 slw
[] 0 sd
1.000000 1.000000 1.000000 srgb
n -105.805000 -59.505400 m -105.805000 -57.905400 l -96.921406 -57.905400 l -96.921406 -59.505400 l f
0.000000 0.000000 0.000000 srgb
n -105.805000 -59.505400 m -105.805000 -57.905400 l -96.921406 -57.905400 l -96.921406 -59.505400 l cp s
/Helvetica-latin1 ff 0.840000 scf sf
(translation_unit) dup sw 2 div -101.363203 ex sub -58.305400 m gs 1 -1 sc sh gr
1.000000 1.000000 1.000000 srgb
n -105.805000 -57.905400 m -105.805000 -56.905400 l -96.921406 -56.905400 l -96.921406 -57.905400 l f
0.000000 0.000000 0.000000 srgb
n -105.805000 -57.905400 m -105.805000 -56.905400 l -96.921406 -56.905400 l -96.921406 -57.905400 l cp s
/Courier-latin1 ff 0.560000 scf sf
(+global_scope: decl_seq) -105.655000 -57.275712 m gs 1 -1 sc sh gr
1.000000 1.000000 1.000000 srgb
n -105.805000 -56.905400 m -105.805000 -56.505400 l -96.921406 -56.505400 l -96.921406 -56.905400 l f
0.000000 0.000000 0.000000 srgb
n -105.805000 -56.905400 m -105.805000 -56.505400 l -96.921406 -56.505400 l -96.921406 -56.905400 l cp s
0.100000 slw
[] 0 sd
1.000000 1.000000 1.000000 srgb
n -50.517500 -34.550200 m -50.517500 -32.950200 l -37.629219 -32.950200 l -37.629219 -34.550200 l f
0.000000 0.000000 0.000000 srgb
n -50.517500 -34.550200 m -50.517500 -32.950200 l -37.629219 -32.950200 l -37.629219 -34.550200 l cp s
/Helvetica-latin1 ff 0.840000 scf sf
(enumerator_declaration) dup sw 2 div -44.073359 ex sub -33.350200 m gs 1 -1 sc sh gr
1.000000 1.000000 1.000000 srgb
n -50.517500 -32.950200 m -50.517500 -31.950200 l -37.629219 -31.950200 l -37.629219 -32.950200 l f
0.000000 0.000000 0.000000 srgb
n -50.517500 -32.950200 m -50.517500 -31.950200 l -37.629219 -31.950200 l -37.629219 -32.950200 l cp s
/Courier-latin1 ff 0.560000 scf sf
(+specifier: ss_enum) -50.367500 -32.320512 m gs 1 -1 sc sh gr
1.000000 1.000000 1.000000 srgb
n -50.517500 -31.950200 m -50.517500 -31.550200 l -37.629219 -31.550200 l -37.629219 -31.950200 l f
0.000000 0.000000 0.000000 srgb
n -50.517500 -31.950200 m -50.517500 -31.550200 l -37.629219 -31.550200 l -37.629219 -31.950200 l cp s
0.100000 slw
[] 0 sd
0 slj
0 slc
n -78.363500 -40.472397 m -78.363500 -37.967200 l -44.073359 -37.967200 l -44.073359 -34.550200 l s
0 slj
1.000000 1.000000 1.000000 srgb
n -77.963500 -40.472397 m -78.363500 -41.272397 l -78.763500 -40.472397 l ef
0.100000 slw
[] 0 sd
0 slj
0.000000 0.000000 0.000000 srgb
n -77.963500 -40.472397 m -78.363500 -41.272397 l -78.763500 -40.472397 l cp s
/Courier-latin1 ff 0.560000 scf sf
0.100000 slw
[] 0 sd
1.000000 1.000000 1.000000 srgb
n -37.463600 -20.176500 m -37.463600 -18.576500 l -24.978444 -18.576500 l -24.978444 -20.176500 l f
0.000000 0.000000 0.000000 srgb
n -37.463600 -20.176500 m -37.463600 -18.576500 l -24.978444 -18.576500 l -24.978444 -20.176500 l cp s
/Helvetica-latin1 ff 0.840000 scf sf
(base_specifier) dup sw 2 div -31.221022 ex sub -18.976500 m gs 1 -1 sc sh gr
1.000000 1.000000 1.000000 srgb
n -37.463600 -18.576500 m -37.463600 -15.976500 l -24.978444 -15.976500 l -24.978444 -18.576500 l f
0.000000 0.000000 0.000000 srgb
n -37.463600 -18.576500 m -37.463600 -15.976500 l -24.978444 -15.976500 l -24.978444 -18.576500 l cp s
/Courier-latin1 ff 0.560000 scf sf
(+specifier: access_specifier_enum) -37.313600 -17.946812 m gs 1 -1 sc sh gr
/Courier-latin1 ff 0.560000 scf sf
(+base_class: class) -37.313600 -17.146812 m gs 1 -1 sc sh gr
/Courier-latin1 ff 0.560000 scf sf
(+virtual_base: bool) -37.313600 -16.346812 m gs 1 -1 sc sh gr
1.000000 1.000000 1.000000 srgb
n -37.463600 -15.976500 m -37.463600 -15.576500 l -24.978444 -15.576500 l -24.978444 -15.976500 l f
0.000000 0.000000 0.000000 srgb
n -37.463600 -15.976500 m -37.463600 -15.576500 l -24.978444 -15.576500 l -24.978444 -15.976500 l cp s
0.100000 slw
[] 0 sd
1.000000 1.000000 1.000000 srgb
n -74.343800 -34.650700 m -74.343800 -33.050700 l -62.950050 -33.050700 l -62.950050 -34.650700 l f
0.000000 0.000000 0.000000 srgb
n -74.343800 -34.650700 m -74.343800 -33.050700 l -62.950050 -33.050700 l -62.950050 -34.650700 l cp s
/Helvetica-latin1 ff 0.840000 scf sf
(ss_using_declaration) dup sw 2 div -68.646925 ex sub -33.450700 m gs 1 -1 sc sh gr
1.000000 1.000000 1.000000 srgb
n -74.343800 -33.050700 m -74.343800 -31.250700 l -62.950050 -31.250700 l -62.950050 -33.050700 l f
0.000000 0.000000 0.000000 srgb
n -74.343800 -33.050700 m -74.343800 -31.250700 l -62.950050 -31.250700 l -62.950050 -33.050700 l cp s
/Courier-latin1 ff 0.560000 scf sf
(+target: declaration) -74.193800 -32.421012 m gs 1 -1 sc sh gr
/Courier-latin1 ff 0.560000 scf sf
(+real_target: declaration) -74.193800 -31.621012 m gs 1 -1 sc sh gr
1.000000 1.000000 1.000000 srgb
n -74.343800 -31.250700 m -74.343800 -30.850700 l -62.950050 -30.850700 l -62.950050 -31.250700 l f
0.000000 0.000000 0.000000 srgb
n -74.343800 -31.250700 m -74.343800 -30.850700 l -62.950050 -30.850700 l -62.950050 -31.250700 l cp s
0.100000 slw
[] 0 sd
0 slj
0 slc
n -78.363500 -40.472397 m -78.363500 -37.955400 l -68.593800 -37.955400 l -68.593800 -34.650700 l s
0 slj
1.000000 1.000000 1.000000 srgb
n -77.963500 -40.472397 m -78.363500 -41.272397 l -78.763500 -40.472397 l ef
0.100000 slw
[] 0 sd
0 slj
0.000000 0.000000 0.000000 srgb
n -77.963500 -40.472397 m -78.363500 -41.272397 l -78.763500 -40.472397 l cp s
/Courier-latin1 ff 0.560000 scf sf
0.100000 slw
[] 0 sd
1.000000 1.000000 1.000000 srgb
n -38.632300 -14.421100 m -38.632300 -12.821100 l -22.545581 -12.821100 l -22.545581 -14.421100 l f
0.000000 0.000000 0.000000 srgb
n -38.632300 -14.421100 m -38.632300 -12.821100 l -22.545581 -12.821100 l -22.545581 -14.421100 l cp s
/Helvetica-latin1 ff 0.840000 scf sf
(declaration_time) dup sw 2 div -30.588941 ex sub -13.221100 m gs 1 -1 sc sh gr
1.000000 1.000000 1.000000 srgb
n -38.632300 -12.821100 m -38.632300 -11.821100 l -22.545581 -11.821100 l -22.545581 -12.821100 l f
0.000000 0.000000 0.000000 srgb
n -38.632300 -12.821100 m -38.632300 -11.821100 l -22.545581 -11.821100 l -22.545581 -12.821100 l cp s
/Courier-latin1 ff 0.560000 scf sf
(+time: ulint) -38.482300 -12.191413 m gs 1 -1 sc sh gr
1.000000 1.000000 1.000000 srgb
n -38.632300 -11.821100 m -38.632300 -10.821100 l -22.545581 -10.821100 l -22.545581 -11.821100 l f
0.000000 0.000000 0.000000 srgb
n -38.632300 -11.821100 m -38.632300 -10.821100 l -22.545581 -10.821100 l -22.545581 -11.821100 l cp s
/Courier-latin1 ff 0.560000 scf sf
(+is_before\(other:ss_declaration_time\): bool) -38.482300 -11.191413 m gs 1 -1 sc sh gr
0.100000 slw
[] 0 sd
1.000000 1.000000 1.000000 srgb
n -111.406000 -34.683800 m -111.406000 -33.083800 l -100.001313 -33.083800 l -100.001313 -34.683800 l f
0.000000 0.000000 0.000000 srgb
n -111.406000 -34.683800 m -111.406000 -33.083800 l -100.001313 -33.083800 l -100.001313 -34.683800 l cp s
/Helvetica-latin1 ff 0.840000 scf sf
(fake_declaration) dup sw 2 div -105.703656 ex sub -33.483800 m gs 1 -1 sc sh gr
1.000000 1.000000 1.000000 srgb
n -111.406000 -33.083800 m -111.406000 -32.083800 l -100.001313 -32.083800 l -100.001313 -33.083800 l f
0.000000 0.000000 0.000000 srgb
n -111.406000 -33.083800 m -111.406000 -32.083800 l -100.001313 -32.083800 l -100.001313 -33.083800 l cp s
/Courier-latin1 ff 0.560000 scf sf
(+real_decl: object_declaration) -111.256000 -32.454112 m gs 1 -1 sc sh gr
1.000000 1.000000 1.000000 srgb
n -111.406000 -32.083800 m -111.406000 -31.683800 l -100.001313 -31.683800 l -100.001313 -32.083800 l f
0.000000 0.000000 0.000000 srgb
n -111.406000 -32.083800 m -111.406000 -31.683800 l -100.001313 -31.683800 l -100.001313 -32.083800 l cp s
0.100000 slw
[] 0 sd
0 slj
0 slc
n -78.363500 -40.472397 m -78.363500 -37.955400 l -105.856000 -37.955400 l -105.856000 -34.683800 l s
0 slj
1.000000 1.000000 1.000000 srgb
n -77.963500 -40.472397 m -78.363500 -41.272397 l -78.763500 -40.472397 l ef
0.100000 slw
[] 0 sd
0 slj
0.000000 0.000000 0.000000 srgb
n -77.963500 -40.472397 m -78.363500 -41.272397 l -78.763500 -40.472397 l cp s
/Courier-latin1 ff 0.560000 scf sf
0.100000 slw
[] 0 sd
0 slj
0 slc
n -101.502000 -21.373197 m -101.502000 -20.190350 l -101.526422 -20.190350 l -101.526422 -18.095700 l s
0 slj
1.000000 1.000000 1.000000 srgb
n -101.102000 -21.373197 m -101.502000 -22.173197 l -101.902000 -21.373197 l ef
0.100000 slw
[] 0 sd
0 slj
0.000000 0.000000 0.000000 srgb
n -101.102000 -21.373197 m -101.502000 -22.173197 l -101.902000 -21.373197 l cp s
/Courier-latin1 ff 0.560000 scf sf
0.100000 slw
[] 0 sd
1.000000 1.000000 1.000000 srgb
n -107.769000 -18.095700 m -107.769000 -16.495700 l -95.283844 -16.495700 l -95.283844 -18.095700 l f
0.000000 0.000000 0.000000 srgb
n -107.769000 -18.095700 m -107.769000 -16.495700 l -95.283844 -16.495700 l -95.283844 -18.095700 l cp s
/Helvetica-latin1 ff 0.840000 scf sf
(method_declaration) dup sw 2 div -101.526422 ex sub -16.895700 m gs 1 -1 sc sh gr
1.000000 1.000000 1.000000 srgb
n -107.769000 -16.495700 m -107.769000 -13.895700 l -95.283844 -13.895700 l -95.283844 -16.495700 l f
0.000000 0.000000 0.000000 srgb
n -107.769000 -16.495700 m -107.769000 -13.895700 l -95.283844 -13.895700 l -95.283844 -16.495700 l cp s
/Courier-latin1 ff 0.560000 scf sf
(+virtuality: bool) -107.619000 -15.866012 m gs 1 -1 sc sh gr
/Courier-latin1 ff 0.560000 scf sf
(+pure_virtual: bool) -107.619000 -15.066012 m gs 1 -1 sc sh gr
/Courier-latin1 ff 0.560000 scf sf
(+reimplements: method_declaration) -107.619000 -14.266013 m gs 1 -1 sc sh gr
1.000000 1.000000 1.000000 srgb
n -107.769000 -13.895700 m -107.769000 -13.495700 l -95.283844 -13.495700 l -95.283844 -13.895700 l f
0.000000 0.000000 0.000000 srgb
n -107.769000 -13.895700 m -107.769000 -13.495700 l -95.283844 -13.495700 l -95.283844 -13.895700 l cp s
0.100000 slw
[] 0 sd
1.000000 1.000000 1.000000 srgb
n -99.680000 -34.635900 m -99.680000 -33.035900 l -86.378438 -33.035900 l -86.378438 -34.635900 l f
0.000000 0.000000 0.000000 srgb
n -99.680000 -34.635900 m -99.680000 -33.035900 l -86.378438 -33.035900 l -86.378438 -34.635900 l cp s
/Helvetica-latin1 ff 0.840000 scf sf
(befriendable_declaration) dup sw 2 div -93.029219 ex sub -33.435900 m gs 1 -1 sc sh gr
1.000000 1.000000 1.000000 srgb
n -99.680000 -33.035900 m -99.680000 -32.035900 l -86.378438 -32.035900 l -86.378438 -33.035900 l f
0.000000 0.000000 0.000000 srgb
n -99.680000 -33.035900 m -99.680000 -32.035900 l -86.378438 -32.035900 l -86.378438 -33.035900 l cp s
/Courier-latin1 ff 0.560000 scf sf
(+friend_of: SET<ss_struct_base>) -99.530000 -32.406212 m gs 1 -1 sc sh gr
1.000000 1.000000 1.000000 srgb
n -99.680000 -32.035900 m -99.680000 -31.635900 l -86.378438 -31.635900 l -86.378438 -32.035900 l f
0.000000 0.000000 0.000000 srgb
n -99.680000 -32.035900 m -99.680000 -31.635900 l -86.378438 -31.635900 l -86.378438 -32.035900 l cp s
0.100000 slw
[] 0 sd
0 slj
0 slc
n -78.363500 -40.472397 m -78.363500 -37.955400 l -92.980000 -37.955400 l -92.980000 -34.635900 l s
0 slj
1.000000 1.000000 1.000000 srgb
n -77.963500 -40.472397 m -78.363500 -41.272397 l -78.763500 -40.472397 l ef
0.100000 slw
[] 0 sd
0 slj
0.000000 0.000000 0.000000 srgb
n -77.963500 -40.472397 m -78.363500 -41.272397 l -78.763500 -40.472397 l cp s
/Courier-latin1 ff 0.560000 scf sf
0.100000 slw
[] 0 sd
1.000000 1.000000 1.000000 srgb
n -91.504500 -27.471000 m -91.504500 -25.871000 l -79.912313 -25.871000 l -79.912313 -27.471000 l f
0.000000 0.000000 0.000000 srgb
n -91.504500 -27.471000 m -91.504500 -25.871000 l -79.912313 -25.871000 l -79.912313 -27.471000 l cp s
/Helvetica-latin1 ff 0.840000 scf sf
(structure_declaration) dup sw 2 div -85.708406 ex sub -26.271000 m gs 1 -1 sc sh gr
1.000000 1.000000 1.000000 srgb
n -91.504500 -25.871000 m -91.504500 -24.871000 l -79.912313 -24.871000 l -79.912313 -25.871000 l f
0.000000 0.000000 0.000000 srgb
n -91.504500 -25.871000 m -91.504500 -24.871000 l -79.912313 -24.871000 l -79.912313 -25.871000 l cp s
/Courier-latin1 ff 0.560000 scf sf
(+body: decl_seq) -91.354500 -25.241312 m gs 1 -1 sc sh gr
1.000000 1.000000 1.000000 srgb
n -91.504500 -24.871000 m -91.504500 -24.471000 l -79.912313 -24.471000 l -79.912313 -24.871000 l f
0.000000 0.000000 0.000000 srgb
n -91.504500 -24.871000 m -91.504500 -24.471000 l -79.912313 -24.471000 l -79.912313 -24.871000 l cp s
0.100000 slw
[] 0 sd
0 slj
0 slc
n -92.980000 -30.724097 m -92.980000 -29.553450 l -85.708406 -29.553450 l -85.708406 -27.471000 l s
0 slj
1.000000 1.000000 1.000000 srgb
n -92.580000 -30.724097 m -92.980000 -31.524097 l -93.380000 -30.724097 l ef
0.100000 slw
[] 0 sd
0 slj
0.000000 0.000000 0.000000 srgb
n -92.580000 -30.724097 m -92.980000 -31.524097 l -93.380000 -30.724097 l cp s
/Courier-latin1 ff 0.560000 scf sf
0.100000 slw
[] 0 sd
1.000000 1.000000 1.000000 srgb
n -37.322900 -34.565200 m -37.322900 -32.965200 l -23.167431 -32.965200 l -23.167431 -34.565200 l f
0.000000 0.000000 0.000000 srgb
n -37.322900 -34.565200 m -37.322900 -32.965200 l -23.167431 -32.965200 l -23.167431 -34.565200 l cp s
/Helvetica-latin1 ff 0.840000 scf sf
(injected_class_declaration) dup sw 2 div -30.245166 ex sub -33.365200 m gs 1 -1 sc sh gr
1.000000 1.000000 1.000000 srgb
n -37.322900 -32.965200 m -37.322900 -31.965200 l -23.167431 -31.965200 l -23.167431 -32.965200 l f
0.000000 0.000000 0.000000 srgb
n -37.322900 -32.965200 m -37.322900 -31.965200 l -23.167431 -31.965200 l -23.167431 -32.965200 l cp s
/Courier-latin1 ff 0.560000 scf sf
(+real_decl: structure_declaration) -37.172900 -32.335512 m gs 1 -1 sc sh gr
1.000000 1.000000 1.000000 srgb
n -37.322900 -31.965200 m -37.322900 -31.565200 l -23.167431 -31.565200 l -23.167431 -31.965200 l f
0.000000 0.000000 0.000000 srgb
n -37.322900 -31.965200 m -37.322900 -31.565200 l -23.167431 -31.565200 l -23.167431 -31.965200 l cp s
0.100000 slw
[] 0 sd
0 slj
0 slc
n -78.363500 -40.472397 m -78.363500 -37.974700 l -30.197900 -37.974700 l -30.197900 -34.565200 l s
0 slj
1.000000 1.000000 1.000000 srgb
n -77.963500 -40.472397 m -78.363500 -41.272397 l -78.763500 -40.472397 l ef
0.100000 slw
[] 0 sd
0 slj
0.000000 0.000000 0.000000 srgb
n -77.963500 -40.472397 m -78.363500 -41.272397 l -78.763500 -40.472397 l cp s
/Courier-latin1 ff 0.560000 scf sf
showpage
