%!PS-Adobe-2.0 EPSF-2.0
%%Title: /home/jikos/lestes_doc/papers/page047.dia
%%Creator: Dia v0.94
%%CreationDate: Sun Mar 20 19:22:36 2005
%%For: jikos
%%Orientation: Portrait
%%Magnification: 1.0000
%%BoundingBox: 0 0 385 189
%%BeginSetup
%%EndSetup
%%EndComments
%%BeginProlog
[ /.notdef /.notdef /.notdef /.notdef /.notdef /.notdef /.notdef /.notdef /.notdef /.notdef
/.notdef /.notdef /.notdef /.notdef /.notdef /.notdef /.notdef /.notdef /.notdef /.notdef
/.notdef /.notdef /.notdef /.notdef /.notdef /.notdef /.notdef /.notdef /.notdef /.notdef
/.notdef /.notdef /space /exclam /quotedbl /numbersign /dollar /percent /ampersand /quoteright
/parenleft /parenright /asterisk /plus /comma /hyphen /period /slash /zero /one
/two /three /four /five /six /seven /eight /nine /colon /semicolon
/less /equal /greater /question /at /A /B /C /D /E
/F /G /H /I /J /K /L /M /N /O
/P /Q /R /S /T /U /V /W /X /Y
/Z /bracketleft /backslash /bracketright /asciicircum /underscore /quoteleft /a /b /c
/d /e /f /g /h /i /j /k /l /m
/n /o /p /q /r /s /t /u /v /w
/x /y /z /braceleft /bar /braceright /asciitilde /.notdef /.notdef /.notdef
/.notdef /.notdef /.notdef /.notdef /.notdef /.notdef /.notdef /.notdef /.notdef /.notdef
/.notdef /.notdef /.notdef /.notdef /.notdef /.notdef /.notdef /.notdef /.notdef /.notdef
/.notdef /.notdef /.notdef /.notdef /.notdef /.notdef /.notdef /.notdef /.notdef /.notdef
/space /exclamdown /cent /sterling /currency /yen /brokenbar /section /dieresis /copyright
/ordfeminine /guillemotleft /logicalnot /hyphen /registered /macron /degree /plusminus /twosuperior /threesuperior
/acute /mu /paragraph /periodcentered /cedilla /onesuperior /ordmasculine /guillemotright /onequarter /onehalf
/threequarters /questiondown /Agrave /Aacute /Acircumflex /Atilde /Adieresis /Aring /AE /Ccedilla
/Egrave /Eacute /Ecircumflex /Edieresis /Igrave /Iacute /Icircumflex /Idieresis /Eth /Ntilde
/Ograve /Oacute /Ocircumflex /Otilde /Odieresis /multiply /Oslash /Ugrave /Uacute /Ucircumflex
/Udieresis /Yacute /Thorn /germandbls /agrave /aacute /acircumflex /atilde /adieresis /aring
/ae /ccedilla /egrave /eacute /ecircumflex /edieresis /igrave /iacute /icircumflex /idieresis
/eth /ntilde /ograve /oacute /ocircumflex /otilde /odieresis /divide /oslash /ugrave
/uacute /ucircumflex /udieresis /yacute /thorn /ydieresis] /isolatin1encoding exch def
/cp {closepath} bind def
/c {curveto} bind def
/f {fill} bind def
/a {arc} bind def
/ef {eofill} bind def
/ex {exch} bind def
/gr {grestore} bind def
/gs {gsave} bind def
/sa {save} bind def
/rs {restore} bind def
/l {lineto} bind def
/m {moveto} bind def
/rm {rmoveto} bind def
/n {newpath} bind def
/s {stroke} bind def
/sh {show} bind def
/slc {setlinecap} bind def
/slj {setlinejoin} bind def
/slw {setlinewidth} bind def
/srgb {setrgbcolor} bind def
/rot {rotate} bind def
/sc {scale} bind def
/sd {setdash} bind def
/ff {findfont} bind def
/sf {setfont} bind def
/scf {scalefont} bind def
/sw {stringwidth pop} bind def
/tr {translate} bind def

/ellipsedict 8 dict def
ellipsedict /mtrx matrix put
/ellipse
{ ellipsedict begin
   /endangle exch def
   /startangle exch def
   /yrad exch def
   /xrad exch def
   /y exch def
   /x exch def   /savematrix mtrx currentmatrix def
   x y tr xrad yrad sc
   0 0 1 startangle endangle arc
   savematrix setmatrix
   end
} def

/mergeprocs {
dup length
3 -1 roll
dup
length
dup
5 1 roll
3 -1 roll
add
array cvx
dup
3 -1 roll
0 exch
putinterval
dup
4 2 roll
putinterval
} bind def
/dpi_x 300 def
/dpi_y 300 def
/conicto {
    /to_y exch def
    /to_x exch def
    /conic_cntrl_y exch def
    /conic_cntrl_x exch def
    currentpoint
    /p0_y exch def
    /p0_x exch def
    /p1_x p0_x conic_cntrl_x p0_x sub 2 3 div mul add def
    /p1_y p0_y conic_cntrl_y p0_y sub 2 3 div mul add def
    /p2_x p1_x to_x p0_x sub 1 3 div mul add def
    /p2_y p1_y to_y p0_y sub 1 3 div mul add def
    p1_x p1_y p2_x p2_y to_x to_y curveto
} bind def
/start_ol { gsave 1.1 dpi_x div dup scale} bind def
/end_ol { closepath fill grestore } bind def
28.346000 -28.346000 scale
-2.500000 -8.542500 translate
%%EndProlog


0.100000 slw
[] 0 sd
1.000000 1.000000 1.000000 srgb
n 2.550000 4.500000 m 2.550000 6.900000 l 5.550000 6.900000 l 5.550000 4.500000 l f
0.000000 0.000000 0.000000 srgb
n 2.550000 4.500000 m 2.550000 6.900000 l 5.550000 6.900000 l 5.550000 4.500000 l cp s
gsave 2.813867 5.500000 translate 0.035278 -0.035278 scale
start_ol
384 0 moveto
1216 0 lineto
1216 4441 lineto
384 4441 lineto
384 0 lineto
end_ol grestore 
gsave 3.025533 5.500000 translate 0.035278 -0.035278 scale
start_ol
1757 3072 moveto
803 3072 192 2474 192 1536 curveto
192 609 803 0 1745 0 curveto
2717 0 3328 592 3328 1541 curveto
3328 2474 2711 3072 1757 3072 curveto
1757 2554 moveto
2172 2554 2432 2163 2432 1541 curveto
2432 909 2172 518 1757 518 curveto
1348 518 1088 914 1088 1536 curveto
1088 2163 1348 2554 1757 2554 curveto
end_ol grestore 
gsave 3.491200 5.500000 translate 0.035278 -0.035278 scale
start_ol
1757 3072 moveto
803 3072 192 2474 192 1536 curveto
192 609 803 0 1745 0 curveto
2717 0 3328 592 3328 1541 curveto
3328 2474 2711 3072 1757 3072 curveto
1757 2554 moveto
2172 2554 2432 2163 2432 1541 curveto
2432 909 2172 518 1757 518 curveto
1348 518 1088 914 1088 1536 curveto
1088 2163 1348 2554 1757 2554 curveto
end_ol grestore 
gsave 3.956867 5.500000 translate 0.035278 -0.035278 scale
start_ol
384 0 moveto
1216 0 lineto
1216 1536 lineto
1268 1536 lineto
2259 0 lineto
3146 0 lineto
2028 1737 lineto
2927 3072 lineto
2241 3072 lineto
1268 1639 lineto
1216 1639 lineto
1216 4426 lineto
384 4426 lineto
384 0 lineto
end_ol grestore 
gsave 4.380200 5.500000 translate 0.035278 -0.035278 scale
start_ol
2240 0 moveto
3072 0 lineto
3072 3072 lineto
2240 3072 lineto
2240 1124 lineto
1966 796 1759 657 1535 657 curveto
1294 657 1216 785 1216 1163 curveto
1216 3072 lineto
384 3072 lineto
384 963 lineto
384 325 661 0 1199 0 curveto
1589 0 1895 170 2240 573 curveto
2240 0 lineto
end_ol grestore 
gsave 4.845867 5.500000 translate 0.035278 -0.035278 scale
start_ol
1216 -1043 moveto
1216 0 lineto
1501 0 1679 0 1839 0 curveto
2770 0 3328 603 3328 1613 curveto
3328 2491 2895 3072 2239 3072 curveto
1860 3072 1553 2899 1216 2490 curveto
1216 3072 lineto
384 3072 lineto
384 -1043 lineto
1216 -1043 lineto
1216 1968 moveto
1457 2282 1667 2421 1908 2421 curveto
2251 2421 2432 2112 2432 1515 curveto
2432 843 2191 513 1710 513 curveto
1601 513 1451 529 1216 561 curveto
1216 1968 lineto
end_ol grestore 
gsave 3.216033 6.500000 translate 0.035278 -0.035278 scale
start_ol
336 179 moveto
708 52 1004 0 1318 0 curveto
2154 0 2752 435 2752 1036 curveto
2752 1378 2531 1621 2083 1764 curveto
1670 1902 lineto
1449 1979 1344 2078 1344 2227 curveto
1344 2508 1577 2657 2018 2657 curveto
2303 2657 2565 2657 2844 2657 curveto
2936 2980 lineto
2611 3043 2373 3072 2135 3072 curveto
1292 3072 768 2703 768 2102 curveto
768 1777 948 1567 1332 1435 curveto
1798 1280 lineto
2071 1192 2176 1088 2176 917 curveto
2176 597 1903 415 1421 415 curveto
1090 415 794 496 440 688 curveto
336 179 lineto
end_ol grestore 
gsave 3.597033 6.500000 translate 0.035278 -0.035278 scale
start_ol
1596 435 moveto
1538 418 1481 407 1406 407 curveto
1233 407 1152 480 1152 639 curveto
1152 701 1169 842 1204 995 curveto
1544 2657 lineto
2137 2657 lineto
2218 3072 lineto
1624 3072 lineto
1751 3677 lineto
1187 3625 lineto
1070 3072 lineto
678 3072 lineto
576 2657 lineto
982 2657 lineto
617 893 lineto
594 763 576 628 576 531 curveto
576 181 786 0 1183 0 curveto
1293 0 1387 11 1521 51 curveto
1596 435 lineto
end_ol grestore 
gsave 3.808700 6.500000 translate 0.035278 -0.035278 scale
start_ol
3136 397 moveto
3101 426 3044 455 3026 455 curveto
2876 455 2795 509 2795 608 curveto
2795 652 2812 762 2823 840 curveto
3097 2162 lineto
3119 2289 3136 2411 3136 2493 curveto
3136 2879 2837 3072 2240 3072 curveto
1873 3072 1517 3003 1073 2841 curveto
978 2400 lineto
1393 2580 1719 2657 2050 2657 curveto
2388 2657 2560 2553 2560 2345 curveto
2560 2296 2548 2225 2536 2149 curveto
2453 1799 lineto
2325 1799 lineto
1110 1799 384 1367 384 637 curveto
384 249 674 0 1138 0 curveto
1486 0 1811 132 2246 455 curveto
2258 138 2386 0 2679 0 curveto
2831 0 2984 34 3136 102 curveto
3136 397 lineto
2228 745 moveto
1896 537 1653 455 1393 455 curveto
1108 455 960 575 960 810 curveto
960 1215 1446 1499 2157 1499 curveto
2198 1499 lineto
2388 1493 lineto
2228 745 lineto
end_ol grestore 
gsave 4.232033 6.500000 translate 0.035278 -0.035278 scale
start_ol
1596 435 moveto
1538 418 1481 407 1406 407 curveto
1233 407 1152 480 1152 639 curveto
1152 701 1169 842 1204 995 curveto
1544 2657 lineto
2137 2657 lineto
2218 3072 lineto
1624 3072 lineto
1751 3677 lineto
1187 3625 lineto
1070 3072 lineto
678 3072 lineto
576 2657 lineto
982 2657 lineto
617 893 lineto
594 763 576 628 576 531 curveto
576 181 786 0 1183 0 curveto
1293 0 1387 11 1521 51 curveto
1596 435 lineto
end_ol grestore 
gsave 4.443700 6.500000 translate 0.035278 -0.035278 scale
start_ol
1267 1859 moveto
1446 2427 1734 2675 2212 2675 curveto
2581 2675 2771 2504 2771 2184 curveto
2771 2107 2759 2024 2736 1859 curveto
1267 1859 lineto
3018 596 moveto
2638 475 2344 420 2050 420 curveto
1457 420 1152 685 1152 1197 curveto
1152 1252 1152 1291 1175 1462 curveto
3214 1462 lineto
3277 1754 3306 1958 3306 2129 curveto
3306 2752 2966 3072 2310 3072 curveto
1331 3072 576 2257 576 1198 curveto
576 427 1031 0 1849 0 curveto
2177 0 2523 52 2932 167 curveto
3018 596 lineto
end_ol grestore 
0.100000 slw
[] 0 sd
1.000000 1.000000 1.000000 srgb
n 9.250000 4.550000 m 9.250000 6.950000 l 12.400000 6.950000 l 12.400000 4.550000 l f
0.000000 0.000000 0.000000 srgb
n 9.250000 4.550000 m 9.250000 6.950000 l 12.400000 6.950000 l 12.400000 4.550000 l cp s
gsave 9.516900 5.550000 translate 0.035278 -0.035278 scale
start_ol
512 0 moveto
2644 0 lineto
3492 0 3968 368 3968 1022 curveto
3968 1608 3626 1947 2823 2165 curveto
3536 2407 3840 2724 3840 3243 curveto
3840 3849 3403 4160 2541 4160 curveto
512 4160 lineto
512 0 lineto
1344 2432 moveto
1344 3590 lineto
2115 3590 lineto
2748 3590 2944 3475 2944 3103 curveto
2944 2690 2639 2432 2150 2432 curveto
1344 2432 lineto
1344 593 moveto
1344 1856 lineto
2102 1856 lineto
2667 1856 3072 1549 3072 1116 curveto
3072 724 2832 593 2120 593 curveto
1344 593 lineto
end_ol grestore 
gsave 10.067233 5.550000 translate 0.035278 -0.035278 scale
start_ol
2240 0 moveto
3072 0 lineto
3072 3072 lineto
2240 3072 lineto
2240 1124 lineto
1966 796 1759 657 1535 657 curveto
1294 657 1216 785 1216 1163 curveto
1216 3072 lineto
384 3072 lineto
384 963 lineto
384 325 661 0 1199 0 curveto
1589 0 1895 170 2240 573 curveto
2240 0 lineto
end_ol grestore 
gsave 10.532900 5.550000 translate 0.035278 -0.035278 scale
start_ol
384 0 moveto
1216 0 lineto
1216 3072 lineto
384 3072 lineto
384 0 lineto
384 3584 moveto
1216 3584 lineto
1216 4288 lineto
384 4288 lineto
384 3584 lineto
end_ol grestore 
gsave 10.744567 5.550000 translate 0.035278 -0.035278 scale
start_ol
384 0 moveto
1216 0 lineto
1216 4441 lineto
384 4441 lineto
384 0 lineto
end_ol grestore 
gsave 10.956233 5.550000 translate 0.035278 -0.035278 scale
start_ol
2240 0 moveto
3072 0 lineto
3072 4356 lineto
2240 4356 lineto
2240 3072 lineto
1986 3072 1823 3072 1672 3072 curveto
788 3072 256 2469 256 1459 curveto
256 581 670 0 1296 0 curveto
1648 0 1927 170 2240 574 curveto
2240 0 lineto
2240 1104 moveto
2023 790 1839 651 1623 651 curveto
1314 651 1152 960 1152 1557 curveto
1152 2229 1369 2559 1802 2559 curveto
1899 2559 2029 2543 2240 2511 curveto
2240 1104 lineto
end_ol grestore 
gsave 11.421900 5.550000 translate 0.035278 -0.035278 scale
start_ol
2897 752 moveto
2540 619 2275 564 2010 564 curveto
1751 564 1549 625 1400 741 curveto
1215 889 1129 1060 1083 1408 curveto
2897 1408 lineto
2886 2582 2511 3072 1624 3072 curveto
760 3072 207 2497 207 1605 curveto
207 604 835 0 1872 0 curveto
2212 0 2534 52 2897 173 curveto
2897 752 lineto
1077 1856 moveto
1146 2340 1313 2554 1630 2554 curveto
1935 2554 2068 2345 2079 1856 curveto
1077 1856 lineto
end_ol grestore 
gsave 11.845233 5.550000 translate 0.035278 -0.035278 scale
start_ol
512 0 moveto
1344 0 lineto
1344 1958 lineto
1517 2247 1684 2375 1908 2375 curveto
1983 2375 2064 2358 2173 2314 curveto
2173 3072 lineto
2121 3072 2069 3072 2029 3072 curveto
1724 3072 1517 2893 1344 2490 curveto
1344 3072 lineto
512 3072 lineto
512 0 lineto
end_ol grestore 
gsave 9.991033 6.550000 translate 0.035278 -0.035278 scale
start_ol
336 179 moveto
708 52 1004 0 1318 0 curveto
2154 0 2752 435 2752 1036 curveto
2752 1378 2531 1621 2083 1764 curveto
1670 1902 lineto
1449 1979 1344 2078 1344 2227 curveto
1344 2508 1577 2657 2018 2657 curveto
2303 2657 2565 2657 2844 2657 curveto
2936 2980 lineto
2611 3043 2373 3072 2135 3072 curveto
1292 3072 768 2703 768 2102 curveto
768 1777 948 1567 1332 1435 curveto
1798 1280 lineto
2071 1192 2176 1088 2176 917 curveto
2176 597 1903 415 1421 415 curveto
1090 415 794 496 440 688 curveto
336 179 lineto
end_ol grestore 
gsave 10.372033 6.550000 translate 0.035278 -0.035278 scale
start_ol
1596 435 moveto
1538 418 1481 407 1406 407 curveto
1233 407 1152 480 1152 639 curveto
1152 701 1169 842 1204 995 curveto
1544 2657 lineto
2137 2657 lineto
2218 3072 lineto
1624 3072 lineto
1751 3677 lineto
1187 3625 lineto
1070 3072 lineto
678 3072 lineto
576 2657 lineto
982 2657 lineto
617 893 lineto
594 763 576 628 576 531 curveto
576 181 786 0 1183 0 curveto
1293 0 1387 11 1521 51 curveto
1596 435 lineto
end_ol grestore 
gsave 10.583700 6.550000 translate 0.035278 -0.035278 scale
start_ol
3136 397 moveto
3101 426 3044 455 3026 455 curveto
2876 455 2795 509 2795 608 curveto
2795 652 2812 762 2823 840 curveto
3097 2162 lineto
3119 2289 3136 2411 3136 2493 curveto
3136 2879 2837 3072 2240 3072 curveto
1873 3072 1517 3003 1073 2841 curveto
978 2400 lineto
1393 2580 1719 2657 2050 2657 curveto
2388 2657 2560 2553 2560 2345 curveto
2560 2296 2548 2225 2536 2149 curveto
2453 1799 lineto
2325 1799 lineto
1110 1799 384 1367 384 637 curveto
384 249 674 0 1138 0 curveto
1486 0 1811 132 2246 455 curveto
2258 138 2386 0 2679 0 curveto
2831 0 2984 34 3136 102 curveto
3136 397 lineto
2228 745 moveto
1896 537 1653 455 1393 455 curveto
1108 455 960 575 960 810 curveto
960 1215 1446 1499 2157 1499 curveto
2198 1499 lineto
2388 1493 lineto
2228 745 lineto
end_ol grestore 
gsave 11.007033 6.550000 translate 0.035278 -0.035278 scale
start_ol
1596 435 moveto
1538 418 1481 407 1406 407 curveto
1233 407 1152 480 1152 639 curveto
1152 701 1169 842 1204 995 curveto
1544 2657 lineto
2137 2657 lineto
2218 3072 lineto
1624 3072 lineto
1751 3677 lineto
1187 3625 lineto
1070 3072 lineto
678 3072 lineto
576 2657 lineto
982 2657 lineto
617 893 lineto
594 763 576 628 576 531 curveto
576 181 786 0 1183 0 curveto
1293 0 1387 11 1521 51 curveto
1596 435 lineto
end_ol grestore 
gsave 11.218700 6.550000 translate 0.035278 -0.035278 scale
start_ol
1267 1859 moveto
1446 2427 1734 2675 2212 2675 curveto
2581 2675 2771 2504 2771 2184 curveto
2771 2107 2759 2024 2736 1859 curveto
1267 1859 lineto
3018 596 moveto
2638 475 2344 420 2050 420 curveto
1457 420 1152 685 1152 1197 curveto
1152 1252 1152 1291 1175 1462 curveto
3214 1462 lineto
3277 1754 3306 1958 3306 2129 curveto
3306 2752 2966 3072 2310 3072 curveto
1331 3072 576 2257 576 1198 curveto
576 427 1031 0 1849 0 curveto
2177 0 2523 52 2932 167 curveto
3018 596 lineto
end_ol grestore 
0.100000 slw
[] 0 sd
[] 0 sd
0 slc
n 5.550000 5.700000 m 8.700050 5.742568 l s
0 slj
n 8.696672 5.992545 m 9.200005 5.749324 l 8.703428 5.492591 l ef
gsave 6.050000 6.550000 translate 0.035278 -0.035278 scale
start_ol
613 0 moveto
1060 0 lineto
1645 1881 lineto
2161 0 lineto
2608 0 lineto
3295 2432 lineto
2912 2432 lineto
2401 592 lineto
1903 2432 lineto
1461 2432 lineto
899 601 lineto
456 2432 lineto
23 2432 lineto
613 0 lineto
end_ol grestore 
gsave 6.490267 6.550000 translate 0.035278 -0.035278 scale
start_ol
320 0 moveto
768 0 lineto
768 1532 lineto
1016 1893 1236 2054 1493 2054 curveto
1722 2054 1792 1938 1792 1558 curveto
1792 0 lineto
2240 0 lineto
2240 1710 lineto
2240 2185 2027 2432 1614 2432 curveto
1282 2432 1030 2281 768 1920 curveto
768 3487 lineto
320 3487 lineto
320 0 lineto
end_ol grestore 
gsave 6.828933 6.550000 translate 0.035278 -0.035278 scale
start_ol
1280 2432 moveto
607 2432 192 1971 192 1216 curveto
192 470 607 0 1266 0 curveto
1958 0 2368 457 2368 1220 curveto
2368 1971 1953 2432 1280 2432 curveto
1280 2100 moveto
1707 2100 1920 1807 1920 1225 curveto
1920 638 1702 332 1280 332 curveto
848 332 640 625 640 1220 curveto
640 1802 853 2100 1280 2100 curveto
end_ol grestore 
gsave 7.167600 6.550000 translate 0.035278 -0.035278 scale
start_ol
320 0 moveto
768 0 lineto
768 1585 lineto
989 1920 1176 2063 1387 2063 curveto
1608 2063 1728 1920 1728 1652 curveto
1728 0 lineto
2176 0 lineto
2176 1585 lineto
2388 1920 2568 2063 2766 2063 curveto
2978 2063 3093 1920 3093 1652 curveto
3093 0 lineto
3535 0 lineto
3535 1724 lineto
3535 2191 3314 2432 2881 2432 curveto
2581 2432 2457 2341 2176 1920 curveto
2040 2277 1839 2432 1507 2432 curveto
1195 2432 1056 2336 768 1920 curveto
768 2432 lineto
320 2432 lineto
320 0 lineto
end_ol grestore 
gsave 7.675600 6.550000 translate 0.035278 -0.035278 scale
start_ol
end_ol grestore 
gsave 7.844933 6.550000 translate 0.035278 -0.035278 scale
start_ol
1178 354 moveto
1132 341 1086 332 1026 332 curveto
819 332 768 421 768 794 curveto
768 2100 lineto
1243 2100 lineto
1243 2432 lineto
768 2432 lineto
768 2916 lineto
320 2874 lineto
320 2432 lineto
44 2432 lineto
44 2100 lineto
320 2100 lineto
320 714 lineto
320 244 524 0 918 0 curveto
1006 0 1076 9 1178 42 curveto
1178 354 lineto
end_ol grestore 
gsave 8.014267 6.550000 translate 0.035278 -0.035278 scale
start_ol
1280 2432 moveto
607 2432 192 1971 192 1216 curveto
192 470 607 0 1266 0 curveto
1958 0 2368 457 2368 1220 curveto
2368 1971 1953 2432 1280 2432 curveto
1280 2100 moveto
1707 2100 1920 1807 1920 1225 curveto
1920 638 1702 332 1280 332 curveto
848 332 640 625 640 1220 curveto
640 1802 853 2100 1280 2100 curveto
end_ol grestore 
gsave 8.352933 6.550000 translate 0.035278 -0.035278 scale
start_ol
end_ol grestore 
gsave 6.050000 7.350000 translate 0.035278 -0.035278 scale
start_ol
1178 354 moveto
1132 341 1086 332 1026 332 curveto
819 332 768 421 768 794 curveto
768 2100 lineto
1243 2100 lineto
1243 2432 lineto
768 2432 lineto
768 2916 lineto
320 2874 lineto
320 2432 lineto
44 2432 lineto
44 2100 lineto
320 2100 lineto
320 714 lineto
320 244 524 0 918 0 curveto
1006 0 1076 9 1178 42 curveto
1178 354 lineto
end_ol grestore 
gsave 6.219333 7.350000 translate 0.035278 -0.035278 scale
start_ol
668 1473 moveto
719 1922 908 2118 1290 2118 curveto
1659 2118 1825 1922 1839 1473 curveto
668 1473 lineto
2281 475 moveto
2000 379 1769 336 1539 336 curveto
1290 336 1097 393 954 506 curveto
774 650 696 820 659 1160 curveto
2290 1160 lineto
2295 1290 lineto
2295 1321 lineto
2295 2049 1949 2432 1299 2432 curveto
617 2432 194 1979 194 1255 curveto
194 482 673 0 1442 0 curveto
1705 0 1977 41 2281 133 curveto
2281 475 lineto
end_ol grestore 
gsave 6.558000 7.350000 translate 0.035278 -0.035278 scale
start_ol
320 0 moveto
768 0 lineto
768 3553 lineto
320 3553 lineto
320 0 lineto
end_ol grestore 
gsave 6.693467 7.350000 translate 0.035278 -0.035278 scale
start_ol
320 0 moveto
768 0 lineto
768 3553 lineto
320 3553 lineto
320 0 lineto
end_ol grestore 
gsave 6.828933 7.350000 translate 0.035278 -0.035278 scale
start_ol
end_ol grestore 
gsave 6.998267 7.350000 translate 0.035278 -0.035278 scale
start_ol
613 0 moveto
1060 0 lineto
1645 1881 lineto
2161 0 lineto
2608 0 lineto
3295 2432 lineto
2912 2432 lineto
2401 592 lineto
1903 2432 lineto
1461 2432 lineto
899 601 lineto
456 2432 lineto
23 2432 lineto
613 0 lineto
end_ol grestore 
gsave 7.438533 7.350000 translate 0.035278 -0.035278 scale
start_ol
320 0 moveto
768 0 lineto
768 1532 lineto
1016 1893 1236 2054 1493 2054 curveto
1722 2054 1792 1938 1792 1558 curveto
1792 0 lineto
2240 0 lineto
2240 1710 lineto
2240 2185 2027 2432 1614 2432 curveto
1282 2432 1030 2281 768 1920 curveto
768 3487 lineto
320 3487 lineto
320 0 lineto
end_ol grestore 
gsave 7.777200 7.350000 translate 0.035278 -0.035278 scale
start_ol
2430 364 moveto
2402 364 2393 364 2347 364 curveto
2195 364 2112 472 2112 666 curveto
2112 1699 lineto
2112 2205 1854 2432 1269 2432 curveto
986 2432 722 2377 398 2248 curveto
398 1898 lineto
691 2036 933 2100 1189 2100 curveto
1506 2100 1664 1967 1664 1700 curveto
1664 1424 lineto
1558 1424 lineto
646 1424 192 1161 192 635 curveto
192 263 488 0 914 0 curveto
1192 0 1433 106 1729 364 curveto
1799 111 1919 0 2133 0 curveto
2244 0 2355 28 2462 84 curveto
2430 364 lineto
1664 592 moveto
1439 429 1260 364 1053 364 curveto
786 364 640 489 640 713 curveto
640 1023 927 1187 1462 1187 curveto
1514 1187 lineto
1664 1182 lineto
1664 592 lineto
end_ol grestore 
gsave 8.115867 7.350000 translate 0.035278 -0.035278 scale
start_ol
1178 354 moveto
1132 341 1086 332 1026 332 curveto
819 332 768 421 768 794 curveto
768 2100 lineto
1243 2100 lineto
1243 2432 lineto
768 2432 lineto
768 2916 lineto
320 2874 lineto
320 2432 lineto
44 2432 lineto
44 2100 lineto
320 2100 lineto
320 714 lineto
320 244 524 0 918 0 curveto
1006 0 1076 9 1178 42 curveto
1178 354 lineto
end_ol grestore 
gsave 8.285200 7.350000 translate 0.035278 -0.035278 scale
start_ol
end_ol grestore 
gsave 6.050000 8.150000 translate 0.035278 -0.035278 scale
start_ol
613 0 moveto
1060 0 lineto
1645 1881 lineto
2161 0 lineto
2608 0 lineto
3295 2432 lineto
2912 2432 lineto
2401 592 lineto
1903 2432 lineto
1461 2432 lineto
899 601 lineto
456 2432 lineto
23 2432 lineto
613 0 lineto
end_ol grestore 
gsave 6.490267 8.150000 translate 0.035278 -0.035278 scale
start_ol
2430 364 moveto
2402 364 2393 364 2347 364 curveto
2195 364 2112 472 2112 666 curveto
2112 1699 lineto
2112 2205 1854 2432 1269 2432 curveto
986 2432 722 2377 398 2248 curveto
398 1898 lineto
691 2036 933 2100 1189 2100 curveto
1506 2100 1664 1967 1664 1700 curveto
1664 1424 lineto
1558 1424 lineto
646 1424 192 1161 192 635 curveto
192 263 488 0 914 0 curveto
1192 0 1433 106 1729 364 curveto
1799 111 1919 0 2133 0 curveto
2244 0 2355 28 2462 84 curveto
2430 364 lineto
1664 592 moveto
1439 429 1260 364 1053 364 curveto
786 364 640 489 640 713 curveto
640 1023 927 1187 1462 1187 curveto
1514 1187 lineto
1664 1182 lineto
1664 592 lineto
end_ol grestore 
gsave 6.828933 8.150000 translate 0.035278 -0.035278 scale
start_ol
256 143 moveto
571 42 821 0 1071 0 curveto
1673 0 2048 266 2048 697 curveto
2048 1024 1825 1263 1383 1394 curveto
1025 1503 lineto
811 1568 704 1673 704 1812 curveto
704 2004 862 2100 1174 2100 curveto
1407 2100 1621 2066 1859 1997 curveto
1859 2358 lineto
1589 2409 1394 2432 1203 2432 curveto
579 2432 256 2214 256 1787 curveto
256 1473 448 1260 832 1138 curveto
1235 1016 lineto
1483 942 1600 829 1600 672 curveto
1600 450 1419 332 1086 332 curveto
821 332 571 392 256 535 curveto
256 143 lineto
end_ol grestore 
gsave 7.133733 8.150000 translate 0.035278 -0.035278 scale
start_ol
end_ol grestore 
gsave 7.303067 8.150000 translate 0.035278 -0.035278 scale
start_ol
384 0 moveto
832 0 lineto
832 2100 lineto
1270 2100 lineto
1270 2432 lineto
832 2432 lineto
832 2770 lineto
832 3131 910 3264 1127 3264 curveto
1205 3264 1288 3241 1408 3182 curveto
1408 3526 lineto
1274 3566 1182 3584 1081 3584 curveto
619 3584 384 3295 384 2725 curveto
384 2432 lineto
61 2432 lineto
61 2100 lineto
384 2100 lineto
384 0 lineto
end_ol grestore 
gsave 7.472400 8.150000 translate 0.035278 -0.035278 scale
start_ol
1280 2432 moveto
607 2432 192 1971 192 1216 curveto
192 470 607 0 1266 0 curveto
1958 0 2368 457 2368 1220 curveto
2368 1971 1953 2432 1280 2432 curveto
1280 2100 moveto
1707 2100 1920 1807 1920 1225 curveto
1920 638 1702 332 1280 332 curveto
848 332 640 625 640 1220 curveto
640 1802 853 2100 1280 2100 curveto
end_ol grestore 
gsave 7.811067 8.150000 translate 0.035278 -0.035278 scale
start_ol
1792 0 moveto
2240 0 lineto
2240 2432 lineto
1792 2432 lineto
1792 896 lineto
1544 538 1324 382 1067 382 curveto
838 382 768 498 768 873 curveto
768 2432 lineto
320 2432 lineto
320 730 lineto
320 249 530 0 946 0 curveto
1278 0 1530 151 1792 507 curveto
1792 0 lineto
end_ol grestore 
gsave 8.149733 8.150000 translate 0.035278 -0.035278 scale
start_ol
320 0 moveto
768 0 lineto
768 1532 lineto
1016 1893 1236 2054 1493 2054 curveto
1722 2054 1792 1938 1792 1558 curveto
1792 0 lineto
2240 0 lineto
2240 1710 lineto
2240 2185 2027 2432 1614 2432 curveto
1282 2432 1030 2281 768 1920 curveto
768 2432 lineto
320 2432 lineto
320 0 lineto
end_ol grestore 
gsave 8.488400 8.150000 translate 0.035278 -0.035278 scale
start_ol
1792 858 moveto
1543 486 1354 330 1156 330 curveto
870 330 695 661 695 1193 curveto
695 1831 912 2157 1331 2157 curveto
1432 2157 1548 2143 1792 2102 curveto
1792 858 lineto
1792 0 moveto
2240 0 lineto
2240 3487 lineto
1792 3487 lineto
1792 2432 lineto
1645 2432 1511 2432 1368 2432 curveto
635 2432 216 1966 216 1152 curveto
216 456 552 0 1059 0 curveto
1377 0 1594 135 1792 454 curveto
1792 0 lineto
end_ol grestore 
0.100000 slw
[] 0 sd
1.000000 1.000000 1.000000 srgb
n 13.350000 1.950000 m 13.350000 3.350000 l 16.000000 3.350000 l 16.000000 1.950000 l f
0.000000 0.000000 0.000000 srgb
n 13.350000 1.950000 m 13.350000 3.350000 l 16.000000 3.350000 l 16.000000 1.950000 l cp s
gsave 13.620900 2.950000 translate 0.035278 -0.035278 scale
start_ol
3957 889 moveto
3519 690 3116 599 2673 599 curveto
1659 599 1152 1099 1152 2100 curveto
1152 3090 1636 3590 2592 3590 curveto
2972 3590 3364 3515 3923 3337 curveto
3923 3999 lineto
3439 4108 3007 4160 2540 4160 curveto
1036 4160 256 3453 256 2083 curveto
256 734 1045 0 2487 0 curveto
3065 0 3528 86 3957 271 curveto
3957 889 lineto
end_ol grestore 
gsave 14.171233 2.950000 translate 0.035278 -0.035278 scale
start_ol
384 0 moveto
1216 0 lineto
1216 4441 lineto
384 4441 lineto
384 0 lineto
end_ol grestore 
gsave 14.382900 2.950000 translate 0.035278 -0.035278 scale
start_ol
384 0 moveto
1216 0 lineto
1216 3072 lineto
384 3072 lineto
384 0 lineto
384 3584 moveto
1216 3584 lineto
1216 4288 lineto
384 4288 lineto
384 3584 lineto
end_ol grestore 
gsave 14.594567 2.950000 translate 0.035278 -0.035278 scale
start_ol
2897 752 moveto
2540 619 2275 564 2010 564 curveto
1751 564 1549 625 1400 741 curveto
1215 889 1129 1060 1083 1408 curveto
2897 1408 lineto
2886 2582 2511 3072 1624 3072 curveto
760 3072 207 2497 207 1605 curveto
207 604 835 0 1872 0 curveto
2212 0 2534 52 2897 173 curveto
2897 752 lineto
1077 1856 moveto
1146 2340 1313 2554 1630 2554 curveto
1935 2554 2068 2345 2079 1856 curveto
1077 1856 lineto
end_ol grestore 
gsave 15.017900 2.950000 translate 0.035278 -0.035278 scale
start_ol
384 0 moveto
1216 0 lineto
1216 1948 lineto
1501 2270 1727 2415 1965 2415 curveto
2221 2415 2304 2287 2304 1909 curveto
2304 0 lineto
3136 0 lineto
3136 2125 lineto
3136 2752 2855 3072 2304 3072 curveto
1900 3072 1579 2899 1216 2490 curveto
1216 3072 lineto
384 3072 lineto
384 0 lineto
end_ol grestore 
gsave 15.483567 2.950000 translate 0.035278 -0.035278 scale
start_ol
1856 574 moveto
1752 546 1654 535 1580 535 curveto
1338 535 1280 641 1280 1087 curveto
1280 2554 lineto
1833 2554 lineto
1833 3072 lineto
1280 3072 lineto
1280 3688 lineto
448 3590 lineto
448 3072 lineto
172 3072 lineto
172 2554 lineto
448 2554 lineto
448 981 lineto
448 329 741 0 1327 0 curveto
1471 0 1638 22 1856 67 curveto
1856 574 lineto
end_ol grestore 
0.100000 slw
[] 0 sd
[] 0 sd
0 slc
n 13.350000 3.350000 m 12.602427 5.238606 l s
0 slj
n 12.369975 5.146594 m 12.418402 5.703510 l 12.834878 5.330618 l ef
0.100000 slw
[] 0 sd
[] 0 sd
0 slc
n 13.350000 3.350000 m 6.094118 4.419777 l s
0 slj
n 6.057653 4.172451 m 5.599465 4.492707 l 6.130583 4.667104 l ef
showpage
