%!PS-Adobe-2.0 EPSF-2.0
%%Title: ss_uml_expressions.dia
%%Creator: Dia v0.94
%%CreationDate: Thu May 26 14:06:59 2005
%%For: sandp9am
%%Orientation: Portrait
%%Magnification: 1.0000
%%BoundingBox: 0 0 683 313
%%BeginSetup
%%EndSetup
%%EndComments
%%BeginProlog
[ /.notdef /.notdef /.notdef /.notdef /.notdef /.notdef /.notdef /.notdef /.notdef /.notdef
/.notdef /.notdef /.notdef /.notdef /.notdef /.notdef /.notdef /.notdef /.notdef /.notdef
/.notdef /.notdef /.notdef /.notdef /.notdef /.notdef /.notdef /.notdef /.notdef /.notdef
/.notdef /.notdef /space /exclam /quotedbl /numbersign /dollar /percent /ampersand /quoteright
/parenleft /parenright /asterisk /plus /comma /hyphen /period /slash /zero /one
/two /three /four /five /six /seven /eight /nine /colon /semicolon
/less /equal /greater /question /at /A /B /C /D /E
/F /G /H /I /J /K /L /M /N /O
/P /Q /R /S /T /U /V /W /X /Y
/Z /bracketleft /backslash /bracketright /asciicircum /underscore /quoteleft /a /b /c
/d /e /f /g /h /i /j /k /l /m
/n /o /p /q /r /s /t /u /v /w
/x /y /z /braceleft /bar /braceright /asciitilde /.notdef /.notdef /.notdef
/.notdef /.notdef /.notdef /.notdef /.notdef /.notdef /.notdef /.notdef /.notdef /.notdef
/.notdef /.notdef /.notdef /.notdef /.notdef /.notdef /.notdef /.notdef /.notdef /.notdef
/.notdef /.notdef /.notdef /.notdef /.notdef /.notdef /.notdef /.notdef /.notdef /.notdef
/space /exclamdown /cent /sterling /currency /yen /brokenbar /section /dieresis /copyright
/ordfeminine /guillemotleft /logicalnot /hyphen /registered /macron /degree /plusminus /twosuperior /threesuperior
/acute /mu /paragraph /periodcentered /cedilla /onesuperior /ordmasculine /guillemotright /onequarter /onehalf
/threequarters /questiondown /Agrave /Aacute /Acircumflex /Atilde /Adieresis /Aring /AE /Ccedilla
/Egrave /Eacute /Ecircumflex /Edieresis /Igrave /Iacute /Icircumflex /Idieresis /Eth /Ntilde
/Ograve /Oacute /Ocircumflex /Otilde /Odieresis /multiply /Oslash /Ugrave /Uacute /Ucircumflex
/Udieresis /Yacute /Thorn /germandbls /agrave /aacute /acircumflex /atilde /adieresis /aring
/ae /ccedilla /egrave /eacute /ecircumflex /edieresis /igrave /iacute /icircumflex /idieresis
/eth /ntilde /ograve /oacute /ocircumflex /otilde /odieresis /divide /oslash /ugrave
/uacute /ucircumflex /udieresis /yacute /thorn /ydieresis] /isolatin1encoding exch def
/cp {closepath} bind def
/c {curveto} bind def
/f {fill} bind def
/a {arc} bind def
/ef {eofill} bind def
/ex {exch} bind def
/gr {grestore} bind def
/gs {gsave} bind def
/sa {save} bind def
/rs {restore} bind def
/l {lineto} bind def
/m {moveto} bind def
/rm {rmoveto} bind def
/n {newpath} bind def
/s {stroke} bind def
/sh {show} bind def
/slc {setlinecap} bind def
/slj {setlinejoin} bind def
/slw {setlinewidth} bind def
/srgb {setrgbcolor} bind def
/rot {rotate} bind def
/sc {scale} bind def
/sd {setdash} bind def
/ff {findfont} bind def
/sf {setfont} bind def
/scf {scalefont} bind def
/sw {stringwidth pop} bind def
/tr {translate} bind def

/ellipsedict 8 dict def
ellipsedict /mtrx matrix put
/ellipse
{ ellipsedict begin
   /endangle exch def
   /startangle exch def
   /yrad exch def
   /xrad exch def
   /y exch def
   /x exch def   /savematrix mtrx currentmatrix def
   x y tr xrad yrad sc
   0 0 1 startangle endangle arc
   savematrix setmatrix
   end
} def

/mergeprocs {
dup length
3 -1 roll
dup
length
dup
5 1 roll
3 -1 roll
add
array cvx
dup
3 -1 roll
0 exch
putinterval
dup
4 2 roll
putinterval
} bind def
/Times-Roman-latin1
    /Times-Roman findfont
    dup length dict begin
	{1 index /FID ne {def} {pop pop} ifelse} forall
	/Encoding isolatin1encoding def
    currentdict end
definefont pop
/Times-Italic-latin1
    /Times-Italic findfont
    dup length dict begin
	{1 index /FID ne {def} {pop pop} ifelse} forall
	/Encoding isolatin1encoding def
    currentdict end
definefont pop
/Times-Bold-latin1
    /Times-Bold findfont
    dup length dict begin
	{1 index /FID ne {def} {pop pop} ifelse} forall
	/Encoding isolatin1encoding def
    currentdict end
definefont pop
/Times-BoldItalic-latin1
    /Times-BoldItalic findfont
    dup length dict begin
	{1 index /FID ne {def} {pop pop} ifelse} forall
	/Encoding isolatin1encoding def
    currentdict end
definefont pop
/AvantGarde-Book-latin1
    /AvantGarde-Book findfont
    dup length dict begin
	{1 index /FID ne {def} {pop pop} ifelse} forall
	/Encoding isolatin1encoding def
    currentdict end
definefont pop
/AvantGarde-BookOblique-latin1
    /AvantGarde-BookOblique findfont
    dup length dict begin
	{1 index /FID ne {def} {pop pop} ifelse} forall
	/Encoding isolatin1encoding def
    currentdict end
definefont pop
/AvantGarde-Demi-latin1
    /AvantGarde-Demi findfont
    dup length dict begin
	{1 index /FID ne {def} {pop pop} ifelse} forall
	/Encoding isolatin1encoding def
    currentdict end
definefont pop
/AvantGarde-DemiOblique-latin1
    /AvantGarde-DemiOblique findfont
    dup length dict begin
	{1 index /FID ne {def} {pop pop} ifelse} forall
	/Encoding isolatin1encoding def
    currentdict end
definefont pop
/Bookman-Light-latin1
    /Bookman-Light findfont
    dup length dict begin
	{1 index /FID ne {def} {pop pop} ifelse} forall
	/Encoding isolatin1encoding def
    currentdict end
definefont pop
/Bookman-LightItalic-latin1
    /Bookman-LightItalic findfont
    dup length dict begin
	{1 index /FID ne {def} {pop pop} ifelse} forall
	/Encoding isolatin1encoding def
    currentdict end
definefont pop
/Bookman-Demi-latin1
    /Bookman-Demi findfont
    dup length dict begin
	{1 index /FID ne {def} {pop pop} ifelse} forall
	/Encoding isolatin1encoding def
    currentdict end
definefont pop
/Bookman-DemiItalic-latin1
    /Bookman-DemiItalic findfont
    dup length dict begin
	{1 index /FID ne {def} {pop pop} ifelse} forall
	/Encoding isolatin1encoding def
    currentdict end
definefont pop
/Courier-latin1
    /Courier findfont
    dup length dict begin
	{1 index /FID ne {def} {pop pop} ifelse} forall
	/Encoding isolatin1encoding def
    currentdict end
definefont pop
/Courier-Oblique-latin1
    /Courier-Oblique findfont
    dup length dict begin
	{1 index /FID ne {def} {pop pop} ifelse} forall
	/Encoding isolatin1encoding def
    currentdict end
definefont pop
/Courier-Bold-latin1
    /Courier-Bold findfont
    dup length dict begin
	{1 index /FID ne {def} {pop pop} ifelse} forall
	/Encoding isolatin1encoding def
    currentdict end
definefont pop
/Courier-BoldOblique-latin1
    /Courier-BoldOblique findfont
    dup length dict begin
	{1 index /FID ne {def} {pop pop} ifelse} forall
	/Encoding isolatin1encoding def
    currentdict end
definefont pop
/Helvetica-latin1
    /Helvetica findfont
    dup length dict begin
	{1 index /FID ne {def} {pop pop} ifelse} forall
	/Encoding isolatin1encoding def
    currentdict end
definefont pop
/Helvetica-Oblique-latin1
    /Helvetica-Oblique findfont
    dup length dict begin
	{1 index /FID ne {def} {pop pop} ifelse} forall
	/Encoding isolatin1encoding def
    currentdict end
definefont pop
/Helvetica-Bold-latin1
    /Helvetica-Bold findfont
    dup length dict begin
	{1 index /FID ne {def} {pop pop} ifelse} forall
	/Encoding isolatin1encoding def
    currentdict end
definefont pop
/Helvetica-BoldOblique-latin1
    /Helvetica-BoldOblique findfont
    dup length dict begin
	{1 index /FID ne {def} {pop pop} ifelse} forall
	/Encoding isolatin1encoding def
    currentdict end
definefont pop
/Helvetica-Narrow-latin1
    /Helvetica-Narrow findfont
    dup length dict begin
	{1 index /FID ne {def} {pop pop} ifelse} forall
	/Encoding isolatin1encoding def
    currentdict end
definefont pop
/Helvetica-Narrow-Oblique-latin1
    /Helvetica-Narrow-Oblique findfont
    dup length dict begin
	{1 index /FID ne {def} {pop pop} ifelse} forall
	/Encoding isolatin1encoding def
    currentdict end
definefont pop
/Helvetica-Narrow-Bold-latin1
    /Helvetica-Narrow-Bold findfont
    dup length dict begin
	{1 index /FID ne {def} {pop pop} ifelse} forall
	/Encoding isolatin1encoding def
    currentdict end
definefont pop
/Helvetica-Narrow-BoldOblique-latin1
    /Helvetica-Narrow-BoldOblique findfont
    dup length dict begin
	{1 index /FID ne {def} {pop pop} ifelse} forall
	/Encoding isolatin1encoding def
    currentdict end
definefont pop
/NewCenturySchoolbook-Roman-latin1
    /NewCenturySchoolbook-Roman findfont
    dup length dict begin
	{1 index /FID ne {def} {pop pop} ifelse} forall
	/Encoding isolatin1encoding def
    currentdict end
definefont pop
/NewCenturySchoolbook-Italic-latin1
    /NewCenturySchoolbook-Italic findfont
    dup length dict begin
	{1 index /FID ne {def} {pop pop} ifelse} forall
	/Encoding isolatin1encoding def
    currentdict end
definefont pop
/NewCenturySchoolbook-Bold-latin1
    /NewCenturySchoolbook-Bold findfont
    dup length dict begin
	{1 index /FID ne {def} {pop pop} ifelse} forall
	/Encoding isolatin1encoding def
    currentdict end
definefont pop
/NewCenturySchoolbook-BoldItalic-latin1
    /NewCenturySchoolbook-BoldItalic findfont
    dup length dict begin
	{1 index /FID ne {def} {pop pop} ifelse} forall
	/Encoding isolatin1encoding def
    currentdict end
definefont pop
/Palatino-Roman-latin1
    /Palatino-Roman findfont
    dup length dict begin
	{1 index /FID ne {def} {pop pop} ifelse} forall
	/Encoding isolatin1encoding def
    currentdict end
definefont pop
/Palatino-Italic-latin1
    /Palatino-Italic findfont
    dup length dict begin
	{1 index /FID ne {def} {pop pop} ifelse} forall
	/Encoding isolatin1encoding def
    currentdict end
definefont pop
/Palatino-Bold-latin1
    /Palatino-Bold findfont
    dup length dict begin
	{1 index /FID ne {def} {pop pop} ifelse} forall
	/Encoding isolatin1encoding def
    currentdict end
definefont pop
/Palatino-BoldItalic-latin1
    /Palatino-BoldItalic findfont
    dup length dict begin
	{1 index /FID ne {def} {pop pop} ifelse} forall
	/Encoding isolatin1encoding def
    currentdict end
definefont pop
/Symbol-latin1
    /Symbol findfont
definefont pop
/ZapfChancery-MediumItalic-latin1
    /ZapfChancery-MediumItalic findfont
    dup length dict begin
	{1 index /FID ne {def} {pop pop} ifelse} forall
	/Encoding isolatin1encoding def
    currentdict end
definefont pop
/ZapfDingbats-latin1
    /ZapfDingbats findfont
    dup length dict begin
	{1 index /FID ne {def} {pop pop} ifelse} forall
	/Encoding isolatin1encoding def
    currentdict end
definefont pop
5.669200 -5.669200 scale
119.450000 -70.629300 translate
%%EndProlog


0.100000 slw
[] 0 sd
1.000000 1.000000 1.000000 srgb
n -61.000000 15.500000 m -61.000000 17.100000 l -48.514844 17.100000 l -48.514844 15.500000 l f
0.000000 0.000000 0.000000 srgb
n -61.000000 15.500000 m -61.000000 17.100000 l -48.514844 17.100000 l -48.514844 15.500000 l cp s
/Helvetica-latin1 ff 0.840000 scf sf
(expression) dup sw 2 div -54.757422 ex sub 16.700000 m gs 1 -1 sc sh gr
1.000000 1.000000 1.000000 srgb
n -61.000000 17.100000 m -61.000000 20.500000 l -48.514844 20.500000 l -48.514844 17.100000 l f
0.000000 0.000000 0.000000 srgb
n -61.000000 17.100000 m -61.000000 20.500000 l -48.514844 20.500000 l -48.514844 17.100000 l cp s
/Courier-latin1 ff 0.560000 scf sf
(+type: type) -60.850000 17.729688 m gs 1 -1 sc sh gr
/Courier-latin1 ff 0.560000 scf sf
(+psp: sp) -60.850000 18.529688 m gs 1 -1 sc sh gr
/Courier-latin1 ff 0.560000 scf sf
(+nsp: sp) -60.850000 19.329688 m gs 1 -1 sc sh gr
/Courier-latin1 ff 0.560000 scf sf
(+expr_time: declaration_time) -60.850000 20.129688 m gs 1 -1 sc sh gr
1.000000 1.000000 1.000000 srgb
n -61.000000 20.500000 m -61.000000 23.900000 l -48.514844 23.900000 l -48.514844 20.500000 l f
0.000000 0.000000 0.000000 srgb
n -61.000000 20.500000 m -61.000000 23.900000 l -48.514844 23.900000 l -48.514844 20.500000 l cp s
/Courier-latin1 ff 0.560000 scf sf
(+<<virtual>> is_lvalue\(\): bool) -60.850000 21.129688 m gs 1 -1 sc sh gr
/Helvetica-latin1 ff 0.560000 scf sf
(return false) -60.850000 21.929688 m gs 1 -1 sc sh gr
/Courier-latin1 ff 0.560000 scf sf
(+<<virtual>> get_value\(\): ss_base) -60.850000 22.729688 m gs 1 -1 sc sh gr
/Helvetica-latin1 ff 0.560000 scf sf
(For const expression only) -60.850000 23.529688 m gs 1 -1 sc sh gr
0.100000 slw
[] 0 sd
1.000000 1.000000 1.000000 srgb
n -106.598000 35.670300 m -106.598000 37.270300 l -98.074562 37.270300 l -98.074562 35.670300 l f
0.000000 0.000000 0.000000 srgb
n -106.598000 35.670300 m -106.598000 37.270300 l -98.074562 37.270300 l -98.074562 35.670300 l cp s
/Helvetica-latin1 ff 0.840000 scf sf
(var_ref) dup sw 2 div -102.336281 ex sub 36.870300 m gs 1 -1 sc sh gr
1.000000 1.000000 1.000000 srgb
n -106.598000 37.270300 m -106.598000 39.070300 l -98.074562 39.070300 l -98.074562 37.270300 l f
0.000000 0.000000 0.000000 srgb
n -106.598000 37.270300 m -106.598000 39.070300 l -98.074562 39.070300 l -98.074562 37.270300 l cp s
/Courier-latin1 ff 0.560000 scf sf
(+var_decl: declaration) -106.448000 37.899988 m gs 1 -1 sc sh gr
/Helvetica-latin1 ff 0.560000 scf sf
(the variable declaration) -106.448000 38.699988 m gs 1 -1 sc sh gr
1.000000 1.000000 1.000000 srgb
n -106.598000 39.070300 m -106.598000 39.470300 l -98.074562 39.470300 l -98.074562 39.070300 l f
0.000000 0.000000 0.000000 srgb
n -106.598000 39.070300 m -106.598000 39.470300 l -98.074562 39.470300 l -98.074562 39.070300 l cp s
0.100000 slw
[] 0 sd
1.000000 1.000000 1.000000 srgb
n -35.650000 37.700000 m -35.650000 39.300000 l -27.059375 39.300000 l -27.059375 37.700000 l f
0.000000 0.000000 0.000000 srgb
n -35.650000 37.700000 m -35.650000 39.300000 l -27.059375 39.300000 l -27.059375 37.700000 l cp s
/Helvetica-latin1 ff 0.840000 scf sf
(dereference \(*\)) dup sw 2 div -31.354687 ex sub 38.900000 m gs 1 -1 sc sh gr
1.000000 1.000000 1.000000 srgb
n -35.650000 39.300000 m -35.650000 39.700000 l -27.059375 39.700000 l -27.059375 39.300000 l f
0.000000 0.000000 0.000000 srgb
n -35.650000 39.300000 m -35.650000 39.700000 l -27.059375 39.700000 l -27.059375 39.300000 l cp s
1.000000 1.000000 1.000000 srgb
n -35.650000 39.700000 m -35.650000 41.500000 l -27.059375 41.500000 l -27.059375 39.700000 l f
0.000000 0.000000 0.000000 srgb
n -35.650000 39.700000 m -35.650000 41.500000 l -27.059375 41.500000 l -27.059375 39.700000 l cp s
/Courier-latin1 ff 0.560000 scf sf
(+is_lvalue\(\): bool) -35.500000 40.329688 m gs 1 -1 sc sh gr
/Helvetica-latin1 ff 0.560000 scf sf
(return true) -35.500000 41.129688 m gs 1 -1 sc sh gr
0.100000 slw
[] 0 sd
1.000000 1.000000 1.000000 srgb
n -70.900000 66.700000 m -70.900000 69.100000 l -63.185156 69.100000 l -63.185156 66.700000 l f
0.000000 0.000000 0.000000 srgb
n -70.900000 66.700000 m -70.900000 69.100000 l -63.185156 69.100000 l -63.185156 66.700000 l cp s
/Helvetica-latin1 ff 0.840000 scf sf
([ ]) dup sw 2 div -67.042578 ex sub 67.900000 m gs 1 -1 sc sh gr
/Helvetica-latin1 ff 0.560000 scf sf
(Transform to pointer ??) dup sw 2 div -67.042578 ex sub 68.700000 m gs 1 -1 sc sh gr
1.000000 1.000000 1.000000 srgb
n -70.900000 69.100000 m -70.900000 69.500000 l -63.185156 69.500000 l -63.185156 69.100000 l f
0.000000 0.000000 0.000000 srgb
n -70.900000 69.100000 m -70.900000 69.500000 l -63.185156 69.500000 l -63.185156 69.100000 l cp s
1.000000 1.000000 1.000000 srgb
n -70.900000 69.500000 m -70.900000 69.900000 l -63.185156 69.900000 l -63.185156 69.500000 l f
0.000000 0.000000 0.000000 srgb
n -70.900000 69.500000 m -70.900000 69.900000 l -63.185156 69.900000 l -63.185156 69.500000 l cp s
0.100000 slw
[] 0 sd
1.000000 1.000000 1.000000 srgb
n -59.350000 29.800000 m -59.350000 31.400000 l -50.466406 31.400000 l -50.466406 29.800000 l f
0.000000 0.000000 0.000000 srgb
n -59.350000 29.800000 m -59.350000 31.400000 l -50.466406 31.400000 l -50.466406 29.800000 l cp s
/Helvetica-latin1 ff 0.840000 scf sf
(ternary\( ? : \)) dup sw 2 div -54.908203 ex sub 31.000000 m gs 1 -1 sc sh gr
1.000000 1.000000 1.000000 srgb
n -59.350000 31.400000 m -59.350000 34.000000 l -50.466406 34.000000 l -50.466406 31.400000 l f
0.000000 0.000000 0.000000 srgb
n -59.350000 31.400000 m -59.350000 34.000000 l -50.466406 34.000000 l -50.466406 31.400000 l cp s
/Courier-latin1 ff 0.560000 scf sf
(+condition: expression) -59.200000 32.029688 m gs 1 -1 sc sh gr
/Courier-latin1 ff 0.560000 scf sf
(+true_expr: expression) -59.200000 32.829688 m gs 1 -1 sc sh gr
/Courier-latin1 ff 0.560000 scf sf
(+false_expr: expression) -59.200000 33.629688 m gs 1 -1 sc sh gr
1.000000 1.000000 1.000000 srgb
n -59.350000 34.000000 m -59.350000 34.400000 l -50.466406 34.400000 l -50.466406 34.000000 l f
0.000000 0.000000 0.000000 srgb
n -59.350000 34.000000 m -59.350000 34.400000 l -50.466406 34.400000 l -50.466406 34.000000 l cp s
0.100000 slw
[] 0 sd
0 slj
0 slc
n -54.925000 24.811803 m -54.925000 26.850000 l -54.908203 26.850000 l -54.908203 29.800000 l s
0 slj
1.000000 1.000000 1.000000 srgb
n -54.525000 24.811803 m -54.925000 24.011803 l -55.325000 24.811803 l ef
0.100000 slw
[] 0 sd
0 slj
0.000000 0.000000 0.000000 srgb
n -54.525000 24.811803 m -54.925000 24.011803 l -55.325000 24.811803 l cp s
/Courier-latin1 ff 0.560000 scf sf
0.100000 slw
[] 0 sd
1.000000 1.000000 1.000000 srgb
n -46.400000 55.800000 m -46.400000 57.400000 l -38.596875 57.400000 l -38.596875 55.800000 l f
0.000000 0.000000 0.000000 srgb
n -46.400000 55.800000 m -46.400000 57.400000 l -38.596875 57.400000 l -38.596875 55.800000 l cp s
/Helvetica-latin1 ff 0.840000 scf sf
(access \(.\)) dup sw 2 div -42.498438 ex sub 57.000000 m gs 1 -1 sc sh gr
1.000000 1.000000 1.000000 srgb
n -46.400000 57.400000 m -46.400000 59.200000 l -38.596875 59.200000 l -38.596875 57.400000 l f
0.000000 0.000000 0.000000 srgb
n -46.400000 57.400000 m -46.400000 59.200000 l -38.596875 59.200000 l -38.596875 57.400000 l cp s
/Courier-latin1 ff 0.560000 scf sf
(+object: expression) -46.250000 58.029688 m gs 1 -1 sc sh gr
/Courier-latin1 ff 0.560000 scf sf
(+member: declaration) -46.250000 58.829688 m gs 1 -1 sc sh gr
1.000000 1.000000 1.000000 srgb
n -46.400000 59.200000 m -46.400000 59.600000 l -38.596875 59.600000 l -38.596875 59.200000 l f
0.000000 0.000000 0.000000 srgb
n -46.400000 59.200000 m -46.400000 59.600000 l -38.596875 59.600000 l -38.596875 59.200000 l cp s
0.100000 slw
[] 0 sd
1.000000 1.000000 1.000000 srgb
n -58.400000 55.800000 m -58.400000 57.400000 l -49.516406 57.400000 l -49.516406 55.800000 l f
0.000000 0.000000 0.000000 srgb
n -58.400000 55.800000 m -58.400000 57.400000 l -49.516406 57.400000 l -49.516406 55.800000 l cp s
/Helvetica-latin1 ff 0.840000 scf sf
(ptr_access \(->\)) dup sw 2 div -53.958203 ex sub 57.000000 m gs 1 -1 sc sh gr
1.000000 1.000000 1.000000 srgb
n -58.400000 57.400000 m -58.400000 59.200000 l -49.516406 59.200000 l -49.516406 57.400000 l f
0.000000 0.000000 0.000000 srgb
n -58.400000 57.400000 m -58.400000 59.200000 l -49.516406 59.200000 l -49.516406 57.400000 l cp s
/Courier-latin1 ff 0.560000 scf sf
(+object_ptr: expression) -58.250000 58.029688 m gs 1 -1 sc sh gr
/Courier-latin1 ff 0.560000 scf sf
(+member: declaration) -58.250000 58.829688 m gs 1 -1 sc sh gr
1.000000 1.000000 1.000000 srgb
n -58.400000 59.200000 m -58.400000 59.600000 l -49.516406 59.600000 l -49.516406 59.200000 l f
0.000000 0.000000 0.000000 srgb
n -58.400000 59.200000 m -58.400000 59.600000 l -49.516406 59.600000 l -49.516406 59.200000 l cp s
0.100000 slw
[] 0 sd
1.000000 1.000000 1.000000 srgb
n -35.400000 55.800000 m -35.400000 57.400000 l -23.537500 57.400000 l -23.537500 55.800000 l f
0.000000 0.000000 0.000000 srgb
n -35.400000 55.800000 m -35.400000 57.400000 l -23.537500 57.400000 l -23.537500 55.800000 l cp s
/Helvetica-latin1 ff 0.840000 scf sf
(ptr_member_ptr\(->*\)) dup sw 2 div -29.468750 ex sub 57.000000 m gs 1 -1 sc sh gr
1.000000 1.000000 1.000000 srgb
n -35.400000 57.400000 m -35.400000 59.200000 l -23.537500 59.200000 l -23.537500 57.400000 l f
0.000000 0.000000 0.000000 srgb
n -35.400000 57.400000 m -35.400000 59.200000 l -23.537500 59.200000 l -23.537500 57.400000 l cp s
/Courier-latin1 ff 0.560000 scf sf
(+object_ptr: expression) -35.250000 58.029688 m gs 1 -1 sc sh gr
/Courier-latin1 ff 0.560000 scf sf
(+member_ptr: expression) -35.250000 58.829688 m gs 1 -1 sc sh gr
1.000000 1.000000 1.000000 srgb
n -35.400000 59.200000 m -35.400000 59.600000 l -23.537500 59.600000 l -23.537500 59.200000 l f
0.000000 0.000000 0.000000 srgb
n -35.400000 59.200000 m -35.400000 59.600000 l -23.537500 59.600000 l -23.537500 59.200000 l cp s
0.100000 slw
[] 0 sd
1.000000 1.000000 1.000000 srgb
n -22.300000 55.850000 m -22.300000 57.450000 l -13.416406 57.450000 l -13.416406 55.850000 l f
0.000000 0.000000 0.000000 srgb
n -22.300000 55.850000 m -22.300000 57.450000 l -13.416406 57.450000 l -13.416406 55.850000 l cp s
/Helvetica-latin1 ff 0.840000 scf sf
(member_ptr\(.*\)) dup sw 2 div -17.858203 ex sub 57.050000 m gs 1 -1 sc sh gr
1.000000 1.000000 1.000000 srgb
n -22.300000 57.450000 m -22.300000 59.250000 l -13.416406 59.250000 l -13.416406 57.450000 l f
0.000000 0.000000 0.000000 srgb
n -22.300000 57.450000 m -22.300000 59.250000 l -13.416406 59.250000 l -13.416406 57.450000 l cp s
/Courier-latin1 ff 0.560000 scf sf
(+object: expression) -22.150000 58.079688 m gs 1 -1 sc sh gr
/Courier-latin1 ff 0.560000 scf sf
(+member_ptr: expression) -22.150000 58.879688 m gs 1 -1 sc sh gr
1.000000 1.000000 1.000000 srgb
n -22.300000 59.250000 m -22.300000 59.650000 l -13.416406 59.650000 l -13.416406 59.250000 l f
0.000000 0.000000 0.000000 srgb
n -22.300000 59.250000 m -22.300000 59.650000 l -13.416406 59.650000 l -13.416406 59.250000 l cp s
0.100000 slw
[] 0 sd
1.000000 1.000000 1.000000 srgb
n -79.192400 36.050000 m -79.192400 37.650000 l -70.308806 37.650000 l -70.308806 36.050000 l f
0.000000 0.000000 0.000000 srgb
n -79.192400 36.050000 m -79.192400 37.650000 l -70.308806 37.650000 l -70.308806 36.050000 l cp s
/Helvetica-latin1 ff 0.840000 scf sf
(funcall_abstr) dup sw 2 div -74.750603 ex sub 37.250000 m gs 1 -1 sc sh gr
1.000000 1.000000 1.000000 srgb
n -79.192400 37.650000 m -79.192400 38.650000 l -70.308806 38.650000 l -70.308806 37.650000 l f
0.000000 0.000000 0.000000 srgb
n -79.192400 37.650000 m -79.192400 38.650000 l -70.308806 38.650000 l -70.308806 37.650000 l cp s
/Courier-latin1 ff 0.560000 scf sf
(+args: LIST<expression>) -79.042400 38.279688 m gs 1 -1 sc sh gr
1.000000 1.000000 1.000000 srgb
n -79.192400 38.650000 m -79.192400 39.050000 l -70.308806 39.050000 l -70.308806 38.650000 l f
0.000000 0.000000 0.000000 srgb
n -79.192400 38.650000 m -79.192400 39.050000 l -70.308806 39.050000 l -70.308806 38.650000 l cp s
0.100000 slw
[] 0 sd
1.000000 1.000000 1.000000 srgb
n -105.400000 44.800000 m -105.400000 47.200000 l -93.635156 47.200000 l -93.635156 44.800000 l f
0.000000 0.000000 0.000000 srgb
n -105.400000 44.800000 m -105.400000 47.200000 l -93.635156 47.200000 l -93.635156 44.800000 l cp s
/Helvetica-latin1 ff 0.840000 scf sf
(funcall) dup sw 2 div -99.517578 ex sub 46.000000 m gs 1 -1 sc sh gr
/Helvetica-latin1 ff 0.560000 scf sf
(ordinary global) dup sw 2 div -99.517578 ex sub 46.800000 m gs 1 -1 sc sh gr
1.000000 1.000000 1.000000 srgb
n -105.400000 47.200000 m -105.400000 48.200000 l -93.635156 48.200000 l -93.635156 47.200000 l f
0.000000 0.000000 0.000000 srgb
n -105.400000 47.200000 m -105.400000 48.200000 l -93.635156 48.200000 l -93.635156 47.200000 l cp s
/Courier-latin1 ff 0.560000 scf sf
(+function: function_declaration) -105.250000 47.829687 m gs 1 -1 sc sh gr
1.000000 1.000000 1.000000 srgb
n -105.400000 48.200000 m -105.400000 48.600000 l -93.635156 48.600000 l -93.635156 48.200000 l f
0.000000 0.000000 0.000000 srgb
n -105.400000 48.200000 m -105.400000 48.600000 l -93.635156 48.600000 l -93.635156 48.200000 l cp s
0.100000 slw
[] 0 sd
1.000000 1.000000 1.000000 srgb
n -91.400000 44.800000 m -91.400000 47.200000 l -83.596875 47.200000 l -83.596875 44.800000 l f
0.000000 0.000000 0.000000 srgb
n -91.400000 44.800000 m -91.400000 47.200000 l -83.596875 47.200000 l -83.596875 44.800000 l cp s
/Helvetica-latin1 ff 0.840000 scf sf
(ifuncall) dup sw 2 div -87.498438 ex sub 46.000000 m gs 1 -1 sc sh gr
/Helvetica-latin1 ff 0.560000 scf sf
(indirect ordinary global) dup sw 2 div -87.498438 ex sub 46.800000 m gs 1 -1 sc sh gr
1.000000 1.000000 1.000000 srgb
n -91.400000 47.200000 m -91.400000 48.200000 l -83.596875 48.200000 l -83.596875 47.200000 l f
0.000000 0.000000 0.000000 srgb
n -91.400000 47.200000 m -91.400000 48.200000 l -83.596875 48.200000 l -83.596875 47.200000 l cp s
/Courier-latin1 ff 0.560000 scf sf
(+fun_ptr: expression) -91.250000 47.829687 m gs 1 -1 sc sh gr
1.000000 1.000000 1.000000 srgb
n -91.400000 48.200000 m -91.400000 48.600000 l -83.596875 48.600000 l -83.596875 48.200000 l f
0.000000 0.000000 0.000000 srgb
n -91.400000 48.200000 m -91.400000 48.600000 l -83.596875 48.600000 l -83.596875 48.200000 l cp s
0.100000 slw
[] 0 sd
1.000000 1.000000 1.000000 srgb
n -77.400000 44.800000 m -77.400000 47.200000 l -64.302344 47.200000 l -64.302344 44.800000 l f
0.000000 0.000000 0.000000 srgb
n -77.400000 44.800000 m -77.400000 47.200000 l -64.302344 47.200000 l -64.302344 44.800000 l cp s
/Helvetica-latin1 ff 0.840000 scf sf
(mfuncall) dup sw 2 div -70.851172 ex sub 46.000000 m gs 1 -1 sc sh gr
/Helvetica-latin1 ff 0.560000 scf sf
(method call) dup sw 2 div -70.851172 ex sub 46.800000 m gs 1 -1 sc sh gr
1.000000 1.000000 1.000000 srgb
n -77.400000 47.200000 m -77.400000 49.800000 l -64.302344 49.800000 l -64.302344 47.200000 l f
0.000000 0.000000 0.000000 srgb
n -77.400000 47.200000 m -77.400000 49.800000 l -64.302344 49.800000 l -64.302344 47.200000 l cp s
/Courier-latin1 ff 0.560000 scf sf
(+function: function_declaration) -77.250000 47.829687 m gs 1 -1 sc sh gr
/Courier-latin1 ff 0.560000 scf sf
(+object: expression) -77.250000 48.629688 m gs 1 -1 sc sh gr
/Helvetica-latin1 ff 0.560000 scf sf
(??? pointer insufficies, temporaries causa) -77.250000 49.429688 m gs 1 -1 sc sh gr
1.000000 1.000000 1.000000 srgb
n -77.400000 49.800000 m -77.400000 50.200000 l -64.302344 50.200000 l -64.302344 49.800000 l f
0.000000 0.000000 0.000000 srgb
n -77.400000 49.800000 m -77.400000 50.200000 l -64.302344 50.200000 l -64.302344 49.800000 l cp s
0.100000 slw
[] 0 sd
1.000000 1.000000 1.000000 srgb
n -63.400000 44.800000 m -63.400000 47.200000 l -51.635156 47.200000 l -51.635156 44.800000 l f
0.000000 0.000000 0.000000 srgb
n -63.400000 44.800000 m -63.400000 47.200000 l -51.635156 47.200000 l -51.635156 44.800000 l cp s
/Helvetica-latin1 ff 0.840000 scf sf
(vfuncall) dup sw 2 div -57.517578 ex sub 46.000000 m gs 1 -1 sc sh gr
/Helvetica-latin1 ff 0.560000 scf sf
(virtual method call) dup sw 2 div -57.517578 ex sub 46.800000 m gs 1 -1 sc sh gr
1.000000 1.000000 1.000000 srgb
n -63.400000 47.200000 m -63.400000 49.000000 l -51.635156 49.000000 l -51.635156 47.200000 l f
0.000000 0.000000 0.000000 srgb
n -63.400000 47.200000 m -63.400000 49.000000 l -51.635156 49.000000 l -51.635156 47.200000 l cp s
/Courier-latin1 ff 0.560000 scf sf
(+function: function_declaration) -63.250000 47.829687 m gs 1 -1 sc sh gr
/Courier-latin1 ff 0.560000 scf sf
(+object_ptr: expression) -63.250000 48.629688 m gs 1 -1 sc sh gr
1.000000 1.000000 1.000000 srgb
n -63.400000 49.000000 m -63.400000 49.400000 l -51.635156 49.400000 l -51.635156 49.000000 l f
0.000000 0.000000 0.000000 srgb
n -63.400000 49.000000 m -63.400000 49.400000 l -51.635156 49.400000 l -51.635156 49.000000 l cp s
0.100000 slw
[] 0 sd
1.000000 1.000000 1.000000 srgb
n -119.400000 44.800000 m -119.400000 47.200000 l -111.596875 47.200000 l -111.596875 44.800000 l f
0.000000 0.000000 0.000000 srgb
n -119.400000 44.800000 m -119.400000 47.200000 l -111.596875 47.200000 l -111.596875 44.800000 l cp s
/Helvetica-latin1 ff 0.840000 scf sf
(pfuncall) dup sw 2 div -115.498438 ex sub 46.000000 m gs 1 -1 sc sh gr
/Helvetica-latin1 ff 0.560000 scf sf
(member pointer call) dup sw 2 div -115.498438 ex sub 46.800000 m gs 1 -1 sc sh gr
1.000000 1.000000 1.000000 srgb
n -119.400000 47.200000 m -119.400000 49.000000 l -111.596875 49.000000 l -111.596875 47.200000 l f
0.000000 0.000000 0.000000 srgb
n -119.400000 47.200000 m -119.400000 49.000000 l -111.596875 49.000000 l -111.596875 47.200000 l cp s
/Courier-latin1 ff 0.560000 scf sf
(+fun_ptr: expression) -119.250000 47.829687 m gs 1 -1 sc sh gr
/Courier-latin1 ff 0.560000 scf sf
(+object: expression) -119.250000 48.629688 m gs 1 -1 sc sh gr
1.000000 1.000000 1.000000 srgb
n -119.400000 49.000000 m -119.400000 49.400000 l -111.596875 49.400000 l -111.596875 49.000000 l f
0.000000 0.000000 0.000000 srgb
n -119.400000 49.000000 m -119.400000 49.400000 l -111.596875 49.400000 l -111.596875 49.000000 l cp s
0.100000 slw
[] 0 sd
1.000000 1.000000 1.000000 srgb
n -11.900000 55.800000 m -11.900000 58.200000 l -3.880469 58.200000 l -3.880469 55.800000 l f
0.000000 0.000000 0.000000 srgb
n -11.900000 55.800000 m -11.900000 58.200000 l -3.880469 58.200000 l -3.880469 55.800000 l cp s
/Helvetica-latin1 ff 0.840000 scf sf
(throw) dup sw 2 div -7.890234 ex sub 57.000000 m gs 1 -1 sc sh gr
/Helvetica-latin1 ff 0.560000 scf sf
(see throw-expr, chap.15) dup sw 2 div -7.890234 ex sub 57.800000 m gs 1 -1 sc sh gr
1.000000 1.000000 1.000000 srgb
n -11.900000 58.200000 m -11.900000 60.000000 l -3.880469 60.000000 l -3.880469 58.200000 l f
0.000000 0.000000 0.000000 srgb
n -11.900000 58.200000 m -11.900000 60.000000 l -3.880469 60.000000 l -3.880469 58.200000 l cp s
/Courier-latin1 ff 0.560000 scf sf
(+type: type = void) -11.750000 58.829687 m gs 1 -1 sc sh gr
/Courier-latin1 ff 0.560000 scf sf
(+value: expression) -11.750000 59.629688 m gs 1 -1 sc sh gr
1.000000 1.000000 1.000000 srgb
n -11.900000 60.000000 m -11.900000 60.400000 l -3.880469 60.400000 l -3.880469 60.000000 l f
0.000000 0.000000 0.000000 srgb
n -11.900000 60.000000 m -11.900000 60.400000 l -3.880469 60.400000 l -3.880469 60.000000 l cp s
0.100000 slw
[] 0 sd
1.000000 1.000000 1.000000 srgb
n -26.500000 37.700000 m -26.500000 39.300000 l -20.379687 39.300000 l -20.379687 37.700000 l f
0.000000 0.000000 0.000000 srgb
n -26.500000 37.700000 m -26.500000 39.300000 l -20.379687 39.300000 l -20.379687 37.700000 l cp s
/Helvetica-latin1 ff 0.840000 scf sf
(conversion) dup sw 2 div -23.439844 ex sub 38.900000 m gs 1 -1 sc sh gr
1.000000 1.000000 1.000000 srgb
n -26.500000 39.300000 m -26.500000 40.300000 l -20.379687 40.300000 l -20.379687 39.300000 l f
0.000000 0.000000 0.000000 srgb
n -26.500000 39.300000 m -26.500000 40.300000 l -20.379687 40.300000 l -20.379687 39.300000 l cp s
/Courier-latin1 ff 0.560000 scf sf
(+src_type: type) -26.350000 39.929688 m gs 1 -1 sc sh gr
1.000000 1.000000 1.000000 srgb
n -26.500000 40.300000 m -26.500000 40.700000 l -20.379687 40.700000 l -20.379687 40.300000 l f
0.000000 0.000000 0.000000 srgb
n -26.500000 40.300000 m -26.500000 40.700000 l -20.379687 40.700000 l -20.379687 40.300000 l cp s
0.100000 slw
[] 0 sd
1.000000 1.000000 1.000000 srgb
n -38.400000 28.900000 m -38.400000 30.500000 l -31.677344 30.500000 l -31.677344 28.900000 l f
0.000000 0.000000 0.000000 srgb
n -38.400000 28.900000 m -38.400000 30.500000 l -31.677344 30.500000 l -31.677344 28.900000 l cp s
/Helvetica-latin1 ff 0.840000 scf sf
(unary_expr) dup sw 2 div -35.038672 ex sub 30.100000 m gs 1 -1 sc sh gr
1.000000 1.000000 1.000000 srgb
n -38.400000 30.500000 m -38.400000 31.500000 l -31.677344 31.500000 l -31.677344 30.500000 l f
0.000000 0.000000 0.000000 srgb
n -38.400000 30.500000 m -38.400000 31.500000 l -31.677344 31.500000 l -31.677344 30.500000 l cp s
/Courier-latin1 ff 0.560000 scf sf
(+expr: expression) -38.250000 31.129688 m gs 1 -1 sc sh gr
1.000000 1.000000 1.000000 srgb
n -38.400000 31.500000 m -38.400000 31.900000 l -31.677344 31.900000 l -31.677344 31.500000 l f
0.000000 0.000000 0.000000 srgb
n -38.400000 31.500000 m -38.400000 31.900000 l -31.677344 31.900000 l -31.677344 31.500000 l cp s
0.100000 slw
[] 0 sd
1.000000 1.000000 1.000000 srgb
n -48.150000 37.650000 m -48.150000 39.250000 l -45.912500 39.250000 l -45.912500 37.650000 l f
0.000000 0.000000 0.000000 srgb
n -48.150000 37.650000 m -48.150000 39.250000 l -45.912500 39.250000 l -45.912500 37.650000 l cp s
/Helvetica-latin1 ff 0.840000 scf sf
(get) dup sw 2 div -47.031250 ex sub 38.850000 m gs 1 -1 sc sh gr
1.000000 1.000000 1.000000 srgb
n -48.150000 39.250000 m -48.150000 39.650000 l -45.912500 39.650000 l -45.912500 39.250000 l f
0.000000 0.000000 0.000000 srgb
n -48.150000 39.250000 m -48.150000 39.650000 l -45.912500 39.650000 l -45.912500 39.250000 l cp s
1.000000 1.000000 1.000000 srgb
n -48.150000 39.650000 m -48.150000 40.050000 l -45.912500 40.050000 l -45.912500 39.650000 l f
0.000000 0.000000 0.000000 srgb
n -48.150000 39.650000 m -48.150000 40.050000 l -45.912500 40.050000 l -45.912500 39.650000 l cp s
0.100000 slw
[] 0 sd
0 slj
0 slc
n -35.125000 32.811803 m -35.125000 34.775000 l -47.025000 34.775000 l -47.025000 37.650000 l s
0 slj
1.000000 1.000000 1.000000 srgb
n -34.725000 32.811803 m -35.125000 32.011803 l -35.525000 32.811803 l ef
0.100000 slw
[] 0 sd
0 slj
0.000000 0.000000 0.000000 srgb
n -34.725000 32.811803 m -35.125000 32.011803 l -35.525000 32.811803 l cp s
/Courier-latin1 ff 0.560000 scf sf
0.100000 slw
[] 0 sd
1.000000 1.000000 1.000000 srgb
n -49.300000 42.600000 m -49.300000 44.200000 l -44.911719 44.200000 l -44.911719 42.600000 l f
0.000000 0.000000 0.000000 srgb
n -49.300000 42.600000 m -49.300000 44.200000 l -44.911719 44.200000 l -44.911719 42.600000 l cp s
/Helvetica-latin1 ff 0.840000 scf sf
(vol_get) dup sw 2 div -47.105859 ex sub 43.800000 m gs 1 -1 sc sh gr
1.000000 1.000000 1.000000 srgb
n -49.300000 44.200000 m -49.300000 44.600000 l -44.911719 44.600000 l -44.911719 44.200000 l f
0.000000 0.000000 0.000000 srgb
n -49.300000 44.200000 m -49.300000 44.600000 l -44.911719 44.600000 l -44.911719 44.200000 l cp s
1.000000 1.000000 1.000000 srgb
n -49.300000 44.600000 m -49.300000 45.000000 l -44.911719 45.000000 l -44.911719 44.600000 l f
0.000000 0.000000 0.000000 srgb
n -49.300000 44.600000 m -49.300000 45.000000 l -44.911719 45.000000 l -44.911719 44.600000 l cp s
0.100000 slw
[] 0 sd
0 slj
0 slc
n -47.025000 40.961803 m -47.025000 41.325000 l -47.100000 41.325000 l -47.100000 42.600000 l s
0 slj
1.000000 1.000000 1.000000 srgb
n -46.625000 40.961803 m -47.025000 40.161803 l -47.425000 40.961803 l ef
0.100000 slw
[] 0 sd
0 slj
0.000000 0.000000 0.000000 srgb
n -46.625000 40.961803 m -47.025000 40.161803 l -47.425000 40.961803 l cp s
/Courier-latin1 ff 0.560000 scf sf
0.100000 slw
[] 0 sd
1.000000 1.000000 1.000000 srgb
n -98.172000 59.656500 m -98.172000 61.256500 l -91.449344 61.256500 l -91.449344 59.656500 l f
0.000000 0.000000 0.000000 srgb
n -98.172000 59.656500 m -98.172000 61.256500 l -91.449344 61.256500 l -91.449344 59.656500 l cp s
/Helvetica-latin1 ff 0.840000 scf sf
(se) dup sw 2 div -94.810672 ex sub 60.856500 m gs 1 -1 sc sh gr
1.000000 1.000000 1.000000 srgb
n -98.172000 61.256500 m -98.172000 63.856500 l -91.449344 63.856500 l -91.449344 61.256500 l f
0.000000 0.000000 0.000000 srgb
n -98.172000 61.256500 m -98.172000 63.856500 l -91.449344 63.856500 l -91.449344 61.256500 l cp s
/Courier-latin1 ff 0.560000 scf sf
(+from: expression) -98.022000 61.886188 m gs 1 -1 sc sh gr
/Courier-latin1 ff 0.560000 scf sf
(+psp: sp) -98.022000 62.686188 m gs 1 -1 sc sh gr
/Courier-latin1 ff 0.560000 scf sf
(+nsp: sp) -98.022000 63.486188 m gs 1 -1 sc sh gr
1.000000 1.000000 1.000000 srgb
n -98.172000 63.856500 m -98.172000 64.256500 l -91.449344 64.256500 l -91.449344 63.856500 l f
0.000000 0.000000 0.000000 srgb
n -98.172000 63.856500 m -98.172000 64.256500 l -91.449344 64.256500 l -91.449344 63.856500 l cp s
0.100000 slw
[] 0 sd
1.000000 1.000000 1.000000 srgb
n -109.624000 59.751400 m -109.624000 61.351400 l -102.430250 61.351400 l -102.430250 59.751400 l f
0.000000 0.000000 0.000000 srgb
n -109.624000 59.751400 m -109.624000 61.351400 l -102.430250 61.351400 l -102.430250 59.751400 l cp s
/Helvetica-latin1 ff 0.840000 scf sf
(sp) dup sw 2 div -106.027125 ex sub 60.951400 m gs 1 -1 sc sh gr
1.000000 1.000000 1.000000 srgb
n -109.624000 61.351400 m -109.624000 67.151400 l -102.430250 67.151400 l -102.430250 61.351400 l f
0.000000 0.000000 0.000000 srgb
n -109.624000 61.351400 m -109.624000 67.151400 l -102.430250 67.151400 l -102.430250 61.351400 l cp s
/Courier-latin1 ff 0.560000 scf sf
(+psp: sp) -109.474000 61.981088 m gs 1 -1 sc sh gr
/Courier-latin1 ff 0.560000 scf sf
(+nsp: sp) -109.474000 62.781088 m gs 1 -1 sc sh gr
/Courier-latin1 ff 0.560000 scf sf
(+nse: LIST <se>) -109.474000 63.581088 m gs 1 -1 sc sh gr
/Courier-latin1 ff 0.560000 scf sf
(+pse: LIST <se>) -109.474000 64.381088 m gs 1 -1 sc sh gr
/Courier-latin1 ff 0.560000 scf sf
(+pi_spe: pi_sp) -109.474000 65.181088 m gs 1 -1 sc sh gr
/Helvetica-latin1 ff 0.560000 scf sf
(pi ekvivalent,spec.get) -109.474000 65.981088 m gs 1 -1 sc sh gr
/Courier-latin1 ff 0.560000 scf sf
(+level: ulint) -109.474000 66.781087 m gs 1 -1 sc sh gr
1.000000 1.000000 1.000000 srgb
n -109.624000 67.151400 m -109.624000 67.551400 l -102.430250 67.551400 l -102.430250 67.151400 l f
0.000000 0.000000 0.000000 srgb
n -109.624000 67.151400 m -109.624000 67.551400 l -102.430250 67.551400 l -102.430250 67.151400 l cp s
0.100000 slw
[] 0 sd
0 slj
0 slc
n -95.410700 33.649803 m -95.410700 34.204100 l -102.448000 34.204100 l -102.448000 35.670300 l s
0 slj
1.000000 1.000000 1.000000 srgb
n -95.010700 33.649803 m -95.410700 32.849803 l -95.810700 33.649803 l ef
0.100000 slw
[] 0 sd
0 slj
0.000000 0.000000 0.000000 srgb
n -95.010700 33.649803 m -95.410700 32.849803 l -95.810700 33.649803 l cp s
/Courier-latin1 ff 0.560000 scf sf
0.100000 slw
[] 0 sd
1.000000 1.000000 1.000000 srgb
n -59.300000 66.800000 m -59.300000 69.200000 l -56.281250 69.200000 l -56.281250 66.800000 l f
0.000000 0.000000 0.000000 srgb
n -59.300000 66.800000 m -59.300000 69.200000 l -56.281250 69.200000 l -56.281250 66.800000 l cp s
/Helvetica-latin1 ff 0.840000 scf sf
(+) dup sw 2 div -57.790625 ex sub 68.000000 m gs 1 -1 sc sh gr
/Helvetica-latin1 ff 0.560000 scf sf
(addition) dup sw 2 div -57.790625 ex sub 68.800000 m gs 1 -1 sc sh gr
1.000000 1.000000 1.000000 srgb
n -59.300000 69.200000 m -59.300000 69.600000 l -56.281250 69.600000 l -56.281250 69.200000 l f
0.000000 0.000000 0.000000 srgb
n -59.300000 69.200000 m -59.300000 69.600000 l -56.281250 69.600000 l -56.281250 69.200000 l cp s
1.000000 1.000000 1.000000 srgb
n -59.300000 69.600000 m -59.300000 70.000000 l -56.281250 70.000000 l -56.281250 69.600000 l f
0.000000 0.000000 0.000000 srgb
n -59.300000 69.600000 m -59.300000 70.000000 l -56.281250 70.000000 l -56.281250 69.600000 l cp s
0.100000 slw
[] 0 sd
1.000000 1.000000 1.000000 srgb
n -71.400000 55.800000 m -71.400000 57.400000 l -62.660156 57.400000 l -62.660156 55.800000 l f
0.000000 0.000000 0.000000 srgb
n -71.400000 55.800000 m -71.400000 57.400000 l -62.660156 57.400000 l -62.660156 55.800000 l cp s
/Helvetica-latin1 ff 0.840000 scf sf
(binary_expr) dup sw 2 div -67.030078 ex sub 57.000000 m gs 1 -1 sc sh gr
1.000000 1.000000 1.000000 srgb
n -71.400000 57.400000 m -71.400000 59.200000 l -62.660156 59.200000 l -62.660156 57.400000 l f
0.000000 0.000000 0.000000 srgb
n -71.400000 57.400000 m -71.400000 59.200000 l -62.660156 59.200000 l -62.660156 57.400000 l cp s
/Courier-latin1 ff 0.560000 scf sf
(+left: expression) -71.250000 58.029688 m gs 1 -1 sc sh gr
/Courier-latin1 ff 0.560000 scf sf
(+right: expression) -71.250000 58.829688 m gs 1 -1 sc sh gr
1.000000 1.000000 1.000000 srgb
n -71.400000 59.200000 m -71.400000 61.000000 l -62.660156 61.000000 l -62.660156 59.200000 l f
0.000000 0.000000 0.000000 srgb
n -71.400000 59.200000 m -71.400000 61.000000 l -62.660156 61.000000 l -62.660156 59.200000 l cp s
/Courier-latin1 ff 0.560000 scf sf
(+is_lvalue\(\): bool) -71.250000 59.829687 m gs 1 -1 sc sh gr
/Helvetica-latin1 ff 0.560000 scf sf
(TODO return false ?\(array\)) -71.250000 60.629688 m gs 1 -1 sc sh gr
0.100000 slw
[] 0 sd
0 slj
0 slc
n -67.100000 61.911803 m -67.100000 63.900000 l -57.825000 63.900000 l -57.825000 66.800000 l s
0 slj
1.000000 1.000000 1.000000 srgb
n -66.700000 61.911803 m -67.100000 61.111803 l -67.500000 61.911803 l ef
0.100000 slw
[] 0 sd
0 slj
0.000000 0.000000 0.000000 srgb
n -66.700000 61.911803 m -67.100000 61.111803 l -67.500000 61.911803 l cp s
/Courier-latin1 ff 0.560000 scf sf
0.100000 slw
[] 0 sd
0 slj
0 slc
n -0.058700 52.911803 m -0.058700 53.900000 l -67.100000 53.900000 l -67.100000 55.800000 l s
0 slj
1.000000 1.000000 1.000000 srgb
n 0.341300 52.911803 m -0.058700 52.111803 l -0.458700 52.911803 l ef
0.100000 slw
[] 0 sd
0 slj
0.000000 0.000000 0.000000 srgb
n 0.341300 52.911803 m -0.058700 52.111803 l -0.458700 52.911803 l cp s
/Courier-latin1 ff 0.560000 scf sf
0.100000 slw
[] 0 sd
0 slj
0 slc
n -35.125000 32.811803 m -35.125000 34.800000 l -31.300000 34.800000 l -31.300000 37.700000 l s
0 slj
1.000000 1.000000 1.000000 srgb
n -34.725000 32.811803 m -35.125000 32.011803 l -35.525000 32.811803 l ef
0.100000 slw
[] 0 sd
0 slj
0.000000 0.000000 0.000000 srgb
n -34.725000 32.811803 m -35.125000 32.011803 l -35.525000 32.811803 l cp s
/Courier-latin1 ff 0.560000 scf sf
0.100000 slw
[] 0 sd
0 slj
0 slc
n -74.750603 39.961803 m -74.750603 41.925000 l -99.675000 41.925000 l -99.675000 44.800000 l s
0 slj
1.000000 1.000000 1.000000 srgb
n -74.350603 39.961803 m -74.750603 39.161803 l -75.150603 39.961803 l ef
0.100000 slw
[] 0 sd
0 slj
0.000000 0.000000 0.000000 srgb
n -74.350603 39.961803 m -74.750603 39.161803 l -75.150603 39.961803 l cp s
/Courier-latin1 ff 0.560000 scf sf
0.100000 slw
[] 0 sd
0 slj
0 slc
n -74.750603 39.961803 m -74.750603 41.925000 l -87.600000 41.925000 l -87.600000 44.800000 l s
0 slj
1.000000 1.000000 1.000000 srgb
n -74.350603 39.961803 m -74.750603 39.161803 l -75.150603 39.961803 l ef
0.100000 slw
[] 0 sd
0 slj
0.000000 0.000000 0.000000 srgb
n -74.350603 39.961803 m -74.750603 39.161803 l -75.150603 39.961803 l cp s
/Courier-latin1 ff 0.560000 scf sf
0.100000 slw
[] 0 sd
0 slj
0 slc
n -74.750603 39.961803 m -74.750603 41.925000 l -70.850000 41.925000 l -70.850000 44.800000 l s
0 slj
1.000000 1.000000 1.000000 srgb
n -74.350603 39.961803 m -74.750603 39.161803 l -75.150603 39.961803 l ef
0.100000 slw
[] 0 sd
0 slj
0.000000 0.000000 0.000000 srgb
n -74.350603 39.961803 m -74.750603 39.161803 l -75.150603 39.961803 l cp s
/Courier-latin1 ff 0.560000 scf sf
0.100000 slw
[] 0 sd
0 slj
0 slc
n -74.750603 39.961803 m -74.750603 41.925000 l -57.675000 41.925000 l -57.675000 44.800000 l s
0 slj
1.000000 1.000000 1.000000 srgb
n -74.350603 39.961803 m -74.750603 39.161803 l -75.150603 39.961803 l ef
0.100000 slw
[] 0 sd
0 slj
0.000000 0.000000 0.000000 srgb
n -74.350603 39.961803 m -74.750603 39.161803 l -75.150603 39.961803 l cp s
/Courier-latin1 ff 0.560000 scf sf
0.100000 slw
[] 0 sd
0 slj
0 slc
n -54.925000 24.811803 m -54.925000 26.400000 l -35.125000 26.400000 l -35.125000 28.900000 l s
0 slj
1.000000 1.000000 1.000000 srgb
n -54.525000 24.811803 m -54.925000 24.011803 l -55.325000 24.811803 l ef
0.100000 slw
[] 0 sd
0 slj
0.000000 0.000000 0.000000 srgb
n -54.525000 24.811803 m -54.925000 24.011803 l -55.325000 24.811803 l cp s
/Courier-latin1 ff 0.560000 scf sf
0.100000 slw
[] 0 sd
0 slj
0 slc
n -54.925000 24.811803 m -54.925000 26.400000 l -74.750603 26.400000 l -74.750603 36.050000 l s
0 slj
1.000000 1.000000 1.000000 srgb
n -54.525000 24.811803 m -54.925000 24.011803 l -55.325000 24.811803 l ef
0.100000 slw
[] 0 sd
0 slj
0.000000 0.000000 0.000000 srgb
n -54.525000 24.811803 m -54.925000 24.011803 l -55.325000 24.811803 l cp s
/Courier-latin1 ff 0.560000 scf sf
0.100000 slw
[] 0 sd
0 slj
0 slc
n -0.058700 52.911803 m -0.058700 53.900000 l -54.050000 53.900000 l -54.050000 55.800000 l s
0 slj
1.000000 1.000000 1.000000 srgb
n 0.341300 52.911803 m -0.058700 52.111803 l -0.458700 52.911803 l ef
0.100000 slw
[] 0 sd
0 slj
0.000000 0.000000 0.000000 srgb
n 0.341300 52.911803 m -0.058700 52.111803 l -0.458700 52.911803 l cp s
/Courier-latin1 ff 0.560000 scf sf
0.100000 slw
[] 0 sd
0 slj
0 slc
n -0.058700 52.911803 m -0.058700 53.900000 l -42.600000 53.900000 l -42.600000 55.800000 l s
0 slj
1.000000 1.000000 1.000000 srgb
n 0.341300 52.911803 m -0.058700 52.111803 l -0.458700 52.911803 l ef
0.100000 slw
[] 0 sd
0 slj
0.000000 0.000000 0.000000 srgb
n 0.341300 52.911803 m -0.058700 52.111803 l -0.458700 52.911803 l cp s
/Courier-latin1 ff 0.560000 scf sf
0.100000 slw
[] 0 sd
0 slj
0 slc
n -0.058700 52.911803 m -0.058700 53.900000 l -29.400000 53.900000 l -29.400000 55.800000 l s
0 slj
1.000000 1.000000 1.000000 srgb
n 0.341300 52.911803 m -0.058700 52.111803 l -0.458700 52.911803 l ef
0.100000 slw
[] 0 sd
0 slj
0.000000 0.000000 0.000000 srgb
n 0.341300 52.911803 m -0.058700 52.111803 l -0.458700 52.911803 l cp s
/Courier-latin1 ff 0.560000 scf sf
0.100000 slw
[] 0 sd
0 slj
0 slc
n -0.058700 52.911803 m -0.058700 53.887500 l -17.825000 53.887500 l -17.825000 55.850000 l s
0 slj
1.000000 1.000000 1.000000 srgb
n 0.341300 52.911803 m -0.058700 52.111803 l -0.458700 52.911803 l ef
0.100000 slw
[] 0 sd
0 slj
0.000000 0.000000 0.000000 srgb
n 0.341300 52.911803 m -0.058700 52.111803 l -0.458700 52.911803 l cp s
/Courier-latin1 ff 0.560000 scf sf
0.100000 slw
[] 0 sd
0 slj
0 slc
n -0.058700 52.911803 m -0.058700 53.900000 l -7.925000 53.900000 l -7.925000 55.800000 l s
0 slj
1.000000 1.000000 1.000000 srgb
n 0.341300 52.911803 m -0.058700 52.111803 l -0.458700 52.911803 l ef
0.100000 slw
[] 0 sd
0 slj
0.000000 0.000000 0.000000 srgb
n 0.341300 52.911803 m -0.058700 52.111803 l -0.458700 52.911803 l cp s
/Courier-latin1 ff 0.560000 scf sf
0.100000 slw
[] 0 sd
0 slj
0 slc
n -35.125000 32.811803 m -35.125000 34.800000 l -23.425000 34.800000 l -23.425000 37.700000 l s
0 slj
1.000000 1.000000 1.000000 srgb
n -34.725000 32.811803 m -35.125000 32.011803 l -35.525000 32.811803 l ef
0.100000 slw
[] 0 sd
0 slj
0.000000 0.000000 0.000000 srgb
n -34.725000 32.811803 m -35.125000 32.011803 l -35.525000 32.811803 l cp s
/Courier-latin1 ff 0.560000 scf sf
1.000000 1.000000 1.000000 srgb
n -0.058700 51.000000 1.000000 1.000000 0 360 ellipse f
0.100000 slw
[] 0 sd
[] 0 sd
0.000000 0.000000 0.000000 srgb
n -0.058700 51.000000 1.000000 1.000000 0 360 ellipse cp s
0.100000 slw
[] 0 sd
0 slj
0 slc
n -67.100000 61.911803 m -67.100000 63.850000 l -67.050000 63.850000 l -67.050000 66.700000 l s
0 slj
1.000000 1.000000 1.000000 srgb
n -66.700000 61.911803 m -67.100000 61.111803 l -67.500000 61.911803 l ef
0.100000 slw
[] 0 sd
0 slj
0.000000 0.000000 0.000000 srgb
n -66.700000 61.911803 m -67.100000 61.111803 l -67.500000 61.911803 l cp s
/Courier-latin1 ff 0.560000 scf sf
1.000000 1.000000 1.000000 srgb
n -0.100000 30.150000 1.000000 1.000000 0 360 ellipse f
0.100000 slw
[] 0 sd
[] 0 sd
0.000000 0.000000 0.000000 srgb
n -0.100000 30.150000 1.000000 1.000000 0 360 ellipse cp s
0.100000 slw
[] 0 sd
0 slj
0 slc
n -54.925000 24.811803 m -54.925000 26.387500 l -0.100000 26.387500 l -0.100000 29.150000 l s
0 slj
1.000000 1.000000 1.000000 srgb
n -54.525000 24.811803 m -54.925000 24.011803 l -55.325000 24.811803 l ef
0.100000 slw
[] 0 sd
0 slj
0.000000 0.000000 0.000000 srgb
n -54.525000 24.811803 m -54.925000 24.011803 l -55.325000 24.811803 l cp s
/Courier-latin1 ff 0.560000 scf sf
0.100000 slw
[] 0 sd
1.000000 1.000000 1.000000 srgb
n -69.400000 29.000000 m -69.400000 30.600000 l -61.596875 30.600000 l -61.596875 29.000000 l f
0.000000 0.000000 0.000000 srgb
n -69.400000 29.000000 m -69.400000 30.600000 l -61.596875 30.600000 l -61.596875 29.000000 l cp s
/Helvetica-latin1 ff 0.840000 scf sf
(literal) dup sw 2 div -65.498438 ex sub 30.200000 m gs 1 -1 sc sh gr
1.000000 1.000000 1.000000 srgb
n -69.400000 30.600000 m -69.400000 31.600000 l -61.596875 31.600000 l -61.596875 30.600000 l f
0.000000 0.000000 0.000000 srgb
n -69.400000 30.600000 m -69.400000 31.600000 l -61.596875 31.600000 l -61.596875 30.600000 l cp s
/Courier-latin1 ff 0.560000 scf sf
(+value: literal_info) -69.250000 31.229688 m gs 1 -1 sc sh gr
1.000000 1.000000 1.000000 srgb
n -69.400000 31.600000 m -69.400000 32.000000 l -61.596875 32.000000 l -61.596875 31.600000 l f
0.000000 0.000000 0.000000 srgb
n -69.400000 31.600000 m -69.400000 32.000000 l -61.596875 32.000000 l -61.596875 31.600000 l cp s
0.100000 slw
[] 0 sd
0 slj
0 slc
n -54.925000 24.811803 m -54.925000 26.387500 l -65.600000 26.387500 l -65.600000 29.000000 l s
0 slj
1.000000 1.000000 1.000000 srgb
n -54.525000 24.811803 m -54.925000 24.011803 l -55.325000 24.811803 l ef
0.100000 slw
[] 0 sd
0 slj
0.000000 0.000000 0.000000 srgb
n -54.525000 24.811803 m -54.925000 24.011803 l -55.325000 24.811803 l cp s
/Courier-latin1 ff 0.560000 scf sf
0.100000 slw
[] 0 sd
1.000000 1.000000 1.000000 srgb
n -44.879900 37.790000 m -44.879900 39.390000 l -36.606462 39.390000 l -36.606462 37.790000 l f
0.000000 0.000000 0.000000 srgb
n -44.879900 37.790000 m -44.879900 39.390000 l -36.606462 39.390000 l -36.606462 37.790000 l cp s
/Helvetica-latin1 ff 0.840000 scf sf
(address_of \(&\)) dup sw 2 div -40.743181 ex sub 38.990000 m gs 1 -1 sc sh gr
1.000000 1.000000 1.000000 srgb
n -44.879900 39.390000 m -44.879900 39.790000 l -36.606462 39.790000 l -36.606462 39.390000 l f
0.000000 0.000000 0.000000 srgb
n -44.879900 39.390000 m -44.879900 39.790000 l -36.606462 39.790000 l -36.606462 39.390000 l cp s
1.000000 1.000000 1.000000 srgb
n -44.879900 39.790000 m -44.879900 41.590000 l -36.606462 41.590000 l -36.606462 39.790000 l f
0.000000 0.000000 0.000000 srgb
n -44.879900 39.790000 m -44.879900 41.590000 l -36.606462 41.590000 l -36.606462 39.790000 l cp s
/Courier-latin1 ff 0.560000 scf sf
(+is_lvalue\(\): bool) -44.729900 40.419688 m gs 1 -1 sc sh gr
/Helvetica-latin1 ff 0.560000 scf sf
(return true) -44.729900 41.219688 m gs 1 -1 sc sh gr
0.100000 slw
[] 0 sd
0 slj
0 slc
n -35.125000 32.811803 m -35.125000 34.787500 l -40.679900 34.787500 l -40.679900 37.790000 l s
0 slj
1.000000 1.000000 1.000000 srgb
n -34.725000 32.811803 m -35.125000 32.011803 l -35.525000 32.811803 l ef
0.100000 slw
[] 0 sd
0 slj
0.000000 0.000000 0.000000 srgb
n -34.725000 32.811803 m -35.125000 32.011803 l -35.525000 32.811803 l cp s
/Courier-latin1 ff 0.560000 scf sf
0.100000 slw
[] 0 sd
1.000000 1.000000 1.000000 srgb
n -81.078100 66.779300 m -81.078100 68.379300 l -73.995288 68.379300 l -73.995288 66.779300 l f
0.000000 0.000000 0.000000 srgb
n -81.078100 66.779300 m -81.078100 68.379300 l -73.995288 68.379300 l -73.995288 66.779300 l cp s
/Helvetica-latin1 ff 0.840000 scf sf
(assign \(=\)) dup sw 2 div -77.536694 ex sub 67.979300 m gs 1 -1 sc sh gr
1.000000 1.000000 1.000000 srgb
n -81.078100 68.379300 m -81.078100 68.779300 l -73.995288 68.779300 l -73.995288 68.379300 l f
0.000000 0.000000 0.000000 srgb
n -81.078100 68.379300 m -81.078100 68.779300 l -73.995288 68.779300 l -73.995288 68.379300 l cp s
1.000000 1.000000 1.000000 srgb
n -81.078100 68.779300 m -81.078100 70.579300 l -73.995288 70.579300 l -73.995288 68.779300 l f
0.000000 0.000000 0.000000 srgb
n -81.078100 68.779300 m -81.078100 70.579300 l -73.995288 70.579300 l -73.995288 68.779300 l cp s
/Courier-latin1 ff 0.560000 scf sf
(+is_lvalue\(\): bool) -80.928100 69.408987 m gs 1 -1 sc sh gr
/Helvetica-latin1 ff 0.560000 scf sf
(return true) -80.928100 70.208987 m gs 1 -1 sc sh gr
0.100000 slw
[] 0 sd
0 slj
0 slc
n -67.100000 61.911803 m -67.100000 63.889700 l -77.628100 63.889700 l -77.628100 66.779300 l s
0 slj
1.000000 1.000000 1.000000 srgb
n -66.700000 61.911803 m -67.100000 61.111803 l -67.500000 61.911803 l ef
0.100000 slw
[] 0 sd
0 slj
0.000000 0.000000 0.000000 srgb
n -66.700000 61.911803 m -67.100000 61.111803 l -67.500000 61.911803 l cp s
/Courier-latin1 ff 0.560000 scf sf
0.100000 slw
[] 0 sd
0 slj
0 slc
n -74.750603 39.961803 m -74.750603 41.925000 l -115.600000 41.925000 l -115.600000 44.800000 l s
0 slj
1.000000 1.000000 1.000000 srgb
n -74.350603 39.961803 m -74.750603 39.161803 l -75.150603 39.961803 l ef
0.100000 slw
[] 0 sd
0 slj
0.000000 0.000000 0.000000 srgb
n -74.350603 39.961803 m -74.750603 39.161803 l -75.150603 39.961803 l cp s
/Courier-latin1 ff 0.560000 scf sf
0.100000 slw
[] 0 sd
1.000000 1.000000 1.000000 srgb
n -93.001700 35.646600 m -93.001700 37.246600 l -82.317325 37.246600 l -82.317325 35.646600 l f
0.000000 0.000000 0.000000 srgb
n -93.001700 35.646600 m -93.001700 37.246600 l -82.317325 37.246600 l -82.317325 35.646600 l cp s
/Helvetica-latin1 ff 0.840000 scf sf
(var_ref_by_qname) dup sw 2 div -87.659513 ex sub 36.846600 m gs 1 -1 sc sh gr
1.000000 1.000000 1.000000 srgb
n -93.001700 37.246600 m -93.001700 39.846600 l -82.317325 39.846600 l -82.317325 37.246600 l f
0.000000 0.000000 0.000000 srgb
n -93.001700 37.246600 m -93.001700 39.846600 l -82.317325 39.846600 l -82.317325 37.246600 l cp s
/Courier-latin1 ff 0.560000 scf sf
(+contained_in: decl_seq) -92.851700 37.876288 m gs 1 -1 sc sh gr
/Courier-latin1 ff 0.560000 scf sf
(+decl_time: declaration_time) -92.851700 38.676288 m gs 1 -1 sc sh gr
/Courier-latin1 ff 0.560000 scf sf
(+qualified_name: as_name) -92.851700 39.476288 m gs 1 -1 sc sh gr
1.000000 1.000000 1.000000 srgb
n -93.001700 39.846600 m -93.001700 40.246600 l -82.317325 40.246600 l -82.317325 39.846600 l f
0.000000 0.000000 0.000000 srgb
n -93.001700 39.846600 m -93.001700 40.246600 l -82.317325 40.246600 l -82.317325 39.846600 l cp s
0.100000 slw
[] 0 sd
1.000000 1.000000 1.000000 srgb
n -100.011000 28.938000 m -100.011000 30.538000 l -90.907094 30.538000 l -90.907094 28.938000 l f
0.000000 0.000000 0.000000 srgb
n -100.011000 28.938000 m -100.011000 30.538000 l -90.907094 30.538000 l -90.907094 28.938000 l cp s
/Helvetica-latin1 ff 0.840000 scf sf
(var_ref_abstract) dup sw 2 div -95.459047 ex sub 30.138000 m gs 1 -1 sc sh gr
1.000000 1.000000 1.000000 srgb
n -100.011000 30.538000 m -100.011000 30.938000 l -90.907094 30.938000 l -90.907094 30.538000 l f
0.000000 0.000000 0.000000 srgb
n -100.011000 30.538000 m -100.011000 30.938000 l -90.907094 30.938000 l -90.907094 30.538000 l cp s
1.000000 1.000000 1.000000 srgb
n -100.011000 30.938000 m -100.011000 32.738000 l -90.907094 32.738000 l -90.907094 30.938000 l f
0.000000 0.000000 0.000000 srgb
n -100.011000 30.938000 m -100.011000 32.738000 l -90.907094 32.738000 l -90.907094 30.938000 l cp s
/Courier-latin1 ff 0.560000 scf sf
(+is_lvalue\(\): bool) -99.861000 31.567688 m gs 1 -1 sc sh gr
/Helvetica-latin1 ff 0.560000 scf sf
(return true) -99.861000 32.367688 m gs 1 -1 sc sh gr
0.100000 slw
[] 0 sd
0 slj
0 slc
n -54.925000 24.811803 m -54.925000 26.387500 l -95.410700 26.387500 l -95.410700 28.938000 l s
0 slj
1.000000 1.000000 1.000000 srgb
n -54.525000 24.811803 m -54.925000 24.011803 l -55.325000 24.811803 l ef
0.100000 slw
[] 0 sd
0 slj
0.000000 0.000000 0.000000 srgb
n -54.525000 24.811803 m -54.925000 24.011803 l -55.325000 24.811803 l cp s
/Courier-latin1 ff 0.560000 scf sf
0.100000 slw
[] 0 sd
0 slj
0 slc
n -95.410700 33.649803 m -95.410700 34.192300 l -87.801700 34.192300 l -87.801700 35.646600 l s
0 slj
1.000000 1.000000 1.000000 srgb
n -95.010700 33.649803 m -95.410700 32.849803 l -95.810700 33.649803 l ef
0.100000 slw
[] 0 sd
0 slj
0.000000 0.000000 0.000000 srgb
n -95.010700 33.649803 m -95.410700 32.849803 l -95.810700 33.649803 l cp s
/Courier-latin1 ff 0.560000 scf sf
0.100000 slw
[] 0 sd
1.000000 1.000000 1.000000 srgb
n -19.908800 37.645000 m -19.908800 39.245000 l -11.622863 39.245000 l -11.622863 37.645000 l f
0.000000 0.000000 0.000000 srgb
n -19.908800 37.645000 m -19.908800 39.245000 l -11.622863 39.245000 l -11.622863 37.645000 l cp s
/Helvetica-latin1 ff 0.840000 scf sf
(bind_reference) dup sw 2 div -15.765831 ex sub 38.845000 m gs 1 -1 sc sh gr
1.000000 1.000000 1.000000 srgb
n -19.908800 39.245000 m -19.908800 40.245000 l -11.622863 40.245000 l -11.622863 39.245000 l f
0.000000 0.000000 0.000000 srgb
n -19.908800 39.245000 m -19.908800 40.245000 l -11.622863 40.245000 l -11.622863 39.245000 l cp s
/Courier-latin1 ff 0.560000 scf sf
(+src_type: type) -19.758800 39.874688 m gs 1 -1 sc sh gr
1.000000 1.000000 1.000000 srgb
n -19.908800 40.245000 m -19.908800 40.645000 l -11.622863 40.645000 l -11.622863 40.245000 l f
0.000000 0.000000 0.000000 srgb
n -19.908800 40.245000 m -19.908800 40.645000 l -11.622863 40.645000 l -11.622863 40.245000 l cp s
0.100000 slw
[] 0 sd
1.000000 1.000000 1.000000 srgb
n -11.158800 37.695000 m -11.158800 39.295000 l -0.751769 39.295000 l -0.751769 37.695000 l f
0.000000 0.000000 0.000000 srgb
n -11.158800 37.695000 m -11.158800 39.295000 l -0.751769 39.295000 l -0.751769 37.695000 l cp s
/Helvetica-latin1 ff 0.840000 scf sf
(bind_to_temporary) dup sw 2 div -5.955284 ex sub 38.895000 m gs 1 -1 sc sh gr
1.000000 1.000000 1.000000 srgb
n -11.158800 39.295000 m -11.158800 40.295000 l -0.751769 40.295000 l -0.751769 39.295000 l f
0.000000 0.000000 0.000000 srgb
n -11.158800 39.295000 m -11.158800 40.295000 l -0.751769 40.295000 l -0.751769 39.295000 l cp s
/Courier-latin1 ff 0.560000 scf sf
(+src_type: type) -11.008800 39.924688 m gs 1 -1 sc sh gr
1.000000 1.000000 1.000000 srgb
n -11.158800 40.295000 m -11.158800 40.695000 l -0.751769 40.695000 l -0.751769 40.295000 l f
0.000000 0.000000 0.000000 srgb
n -11.158800 40.295000 m -11.158800 40.695000 l -0.751769 40.695000 l -0.751769 40.295000 l cp s
0.100000 slw
[] 0 sd
[] 0 sd
0 slc
n -0.058700 50.000000 m -0.098002 32.061801 l s
0 slj
1.000000 1.000000 1.000000 srgb
n 0.301997 32.060925 m -0.099755 31.261803 l -0.498001 32.062678 l ef
0.100000 slw
[] 0 sd
0 slj
0.000000 0.000000 0.000000 srgb
n 0.301997 32.060925 m -0.099755 31.261803 l -0.498001 32.062678 l cp s
0.100000 slw
[] 0 sd
0 slj
0 slc
n -35.125000 32.811803 m -35.125000 34.772500 l -15.708800 34.772500 l -15.708800 37.645000 l s
0 slj
1.000000 1.000000 1.000000 srgb
n -34.725000 32.811803 m -35.125000 32.011803 l -35.525000 32.811803 l ef
0.100000 slw
[] 0 sd
0 slj
0.000000 0.000000 0.000000 srgb
n -34.725000 32.811803 m -35.125000 32.011803 l -35.525000 32.811803 l cp s
/Courier-latin1 ff 0.560000 scf sf
0.100000 slw
[] 0 sd
0 slj
0 slc
n -35.125000 32.811803 m -35.125000 34.797500 l -5.933800 34.797500 l -5.933800 37.695000 l s
0 slj
1.000000 1.000000 1.000000 srgb
n -34.725000 32.811803 m -35.125000 32.011803 l -35.525000 32.811803 l ef
0.100000 slw
[] 0 sd
0 slj
0.000000 0.000000 0.000000 srgb
n -34.725000 32.811803 m -35.125000 32.011803 l -35.525000 32.811803 l cp s
/Courier-latin1 ff 0.560000 scf sf
0.100000 slw
[] 0 sd
0 slj
0 slc
n -67.100000 61.911803 m -67.100000 63.900000 l -51.158700 63.900000 l -51.158700 66.800000 l s
0 slj
1.000000 1.000000 1.000000 srgb
n -66.700000 61.911803 m -67.100000 61.111803 l -67.500000 61.911803 l ef
0.100000 slw
[] 0 sd
0 slj
0.000000 0.000000 0.000000 srgb
n -66.700000 61.911803 m -67.100000 61.111803 l -67.500000 61.911803 l cp s
/Courier-latin1 ff 0.560000 scf sf
/Helvetica-latin1 ff 2.100000 scf sf
(...) -52.058700 68.200000 m gs 1 -1 sc sh gr
showpage
