%!PS-Adobe-2.0 EPSF-2.0
%%Title: ss_for.dia
%%Creator: Dia v0.94
%%CreationDate: Wed May 25 23:28:47 2005
%%For: sandp9am
%%Orientation: Portrait
%%Magnification: 1.0000
%%BoundingBox: 0 0 1681 1105
%%BeginSetup
%%EndSetup
%%EndComments
%%BeginProlog
[ /.notdef /.notdef /.notdef /.notdef /.notdef /.notdef /.notdef /.notdef /.notdef /.notdef
/.notdef /.notdef /.notdef /.notdef /.notdef /.notdef /.notdef /.notdef /.notdef /.notdef
/.notdef /.notdef /.notdef /.notdef /.notdef /.notdef /.notdef /.notdef /.notdef /.notdef
/.notdef /.notdef /space /exclam /quotedbl /numbersign /dollar /percent /ampersand /quoteright
/parenleft /parenright /asterisk /plus /comma /hyphen /period /slash /zero /one
/two /three /four /five /six /seven /eight /nine /colon /semicolon
/less /equal /greater /question /at /A /B /C /D /E
/F /G /H /I /J /K /L /M /N /O
/P /Q /R /S /T /U /V /W /X /Y
/Z /bracketleft /backslash /bracketright /asciicircum /underscore /quoteleft /a /b /c
/d /e /f /g /h /i /j /k /l /m
/n /o /p /q /r /s /t /u /v /w
/x /y /z /braceleft /bar /braceright /asciitilde /.notdef /.notdef /.notdef
/.notdef /.notdef /.notdef /.notdef /.notdef /.notdef /.notdef /.notdef /.notdef /.notdef
/.notdef /.notdef /.notdef /.notdef /.notdef /.notdef /.notdef /.notdef /.notdef /.notdef
/.notdef /.notdef /.notdef /.notdef /.notdef /.notdef /.notdef /.notdef /.notdef /.notdef
/space /exclamdown /cent /sterling /currency /yen /brokenbar /section /dieresis /copyright
/ordfeminine /guillemotleft /logicalnot /hyphen /registered /macron /degree /plusminus /twosuperior /threesuperior
/acute /mu /paragraph /periodcentered /cedilla /onesuperior /ordmasculine /guillemotright /onequarter /onehalf
/threequarters /questiondown /Agrave /Aacute /Acircumflex /Atilde /Adieresis /Aring /AE /Ccedilla
/Egrave /Eacute /Ecircumflex /Edieresis /Igrave /Iacute /Icircumflex /Idieresis /Eth /Ntilde
/Ograve /Oacute /Ocircumflex /Otilde /Odieresis /multiply /Oslash /Ugrave /Uacute /Ucircumflex
/Udieresis /Yacute /Thorn /germandbls /agrave /aacute /acircumflex /atilde /adieresis /aring
/ae /ccedilla /egrave /eacute /ecircumflex /edieresis /igrave /iacute /icircumflex /idieresis
/eth /ntilde /ograve /oacute /ocircumflex /otilde /odieresis /divide /oslash /ugrave
/uacute /ucircumflex /udieresis /yacute /thorn /ydieresis] /isolatin1encoding exch def
/cp {closepath} bind def
/c {curveto} bind def
/f {fill} bind def
/a {arc} bind def
/ef {eofill} bind def
/ex {exch} bind def
/gr {grestore} bind def
/gs {gsave} bind def
/sa {save} bind def
/rs {restore} bind def
/l {lineto} bind def
/m {moveto} bind def
/rm {rmoveto} bind def
/n {newpath} bind def
/s {stroke} bind def
/sh {show} bind def
/slc {setlinecap} bind def
/slj {setlinejoin} bind def
/slw {setlinewidth} bind def
/srgb {setrgbcolor} bind def
/rot {rotate} bind def
/sc {scale} bind def
/sd {setdash} bind def
/ff {findfont} bind def
/sf {setfont} bind def
/scf {scalefont} bind def
/sw {stringwidth pop} bind def
/tr {translate} bind def

/ellipsedict 8 dict def
ellipsedict /mtrx matrix put
/ellipse
{ ellipsedict begin
   /endangle exch def
   /startangle exch def
   /yrad exch def
   /xrad exch def
   /y exch def
   /x exch def   /savematrix mtrx currentmatrix def
   x y tr xrad yrad sc
   0 0 1 startangle endangle arc
   savematrix setmatrix
   end
} def

/mergeprocs {
dup length
3 -1 roll
dup
length
dup
5 1 roll
3 -1 roll
add
array cvx
dup
3 -1 roll
0 exch
putinterval
dup
4 2 roll
putinterval
} bind def
/Times-Roman-latin1
    /Times-Roman findfont
    dup length dict begin
	{1 index /FID ne {def} {pop pop} ifelse} forall
	/Encoding isolatin1encoding def
    currentdict end
definefont pop
/Times-Italic-latin1
    /Times-Italic findfont
    dup length dict begin
	{1 index /FID ne {def} {pop pop} ifelse} forall
	/Encoding isolatin1encoding def
    currentdict end
definefont pop
/Times-Bold-latin1
    /Times-Bold findfont
    dup length dict begin
	{1 index /FID ne {def} {pop pop} ifelse} forall
	/Encoding isolatin1encoding def
    currentdict end
definefont pop
/Times-BoldItalic-latin1
    /Times-BoldItalic findfont
    dup length dict begin
	{1 index /FID ne {def} {pop pop} ifelse} forall
	/Encoding isolatin1encoding def
    currentdict end
definefont pop
/AvantGarde-Book-latin1
    /AvantGarde-Book findfont
    dup length dict begin
	{1 index /FID ne {def} {pop pop} ifelse} forall
	/Encoding isolatin1encoding def
    currentdict end
definefont pop
/AvantGarde-BookOblique-latin1
    /AvantGarde-BookOblique findfont
    dup length dict begin
	{1 index /FID ne {def} {pop pop} ifelse} forall
	/Encoding isolatin1encoding def
    currentdict end
definefont pop
/AvantGarde-Demi-latin1
    /AvantGarde-Demi findfont
    dup length dict begin
	{1 index /FID ne {def} {pop pop} ifelse} forall
	/Encoding isolatin1encoding def
    currentdict end
definefont pop
/AvantGarde-DemiOblique-latin1
    /AvantGarde-DemiOblique findfont
    dup length dict begin
	{1 index /FID ne {def} {pop pop} ifelse} forall
	/Encoding isolatin1encoding def
    currentdict end
definefont pop
/Bookman-Light-latin1
    /Bookman-Light findfont
    dup length dict begin
	{1 index /FID ne {def} {pop pop} ifelse} forall
	/Encoding isolatin1encoding def
    currentdict end
definefont pop
/Bookman-LightItalic-latin1
    /Bookman-LightItalic findfont
    dup length dict begin
	{1 index /FID ne {def} {pop pop} ifelse} forall
	/Encoding isolatin1encoding def
    currentdict end
definefont pop
/Bookman-Demi-latin1
    /Bookman-Demi findfont
    dup length dict begin
	{1 index /FID ne {def} {pop pop} ifelse} forall
	/Encoding isolatin1encoding def
    currentdict end
definefont pop
/Bookman-DemiItalic-latin1
    /Bookman-DemiItalic findfont
    dup length dict begin
	{1 index /FID ne {def} {pop pop} ifelse} forall
	/Encoding isolatin1encoding def
    currentdict end
definefont pop
/Courier-latin1
    /Courier findfont
    dup length dict begin
	{1 index /FID ne {def} {pop pop} ifelse} forall
	/Encoding isolatin1encoding def
    currentdict end
definefont pop
/Courier-Oblique-latin1
    /Courier-Oblique findfont
    dup length dict begin
	{1 index /FID ne {def} {pop pop} ifelse} forall
	/Encoding isolatin1encoding def
    currentdict end
definefont pop
/Courier-Bold-latin1
    /Courier-Bold findfont
    dup length dict begin
	{1 index /FID ne {def} {pop pop} ifelse} forall
	/Encoding isolatin1encoding def
    currentdict end
definefont pop
/Courier-BoldOblique-latin1
    /Courier-BoldOblique findfont
    dup length dict begin
	{1 index /FID ne {def} {pop pop} ifelse} forall
	/Encoding isolatin1encoding def
    currentdict end
definefont pop
/Helvetica-latin1
    /Helvetica findfont
    dup length dict begin
	{1 index /FID ne {def} {pop pop} ifelse} forall
	/Encoding isolatin1encoding def
    currentdict end
definefont pop
/Helvetica-Oblique-latin1
    /Helvetica-Oblique findfont
    dup length dict begin
	{1 index /FID ne {def} {pop pop} ifelse} forall
	/Encoding isolatin1encoding def
    currentdict end
definefont pop
/Helvetica-Bold-latin1
    /Helvetica-Bold findfont
    dup length dict begin
	{1 index /FID ne {def} {pop pop} ifelse} forall
	/Encoding isolatin1encoding def
    currentdict end
definefont pop
/Helvetica-BoldOblique-latin1
    /Helvetica-BoldOblique findfont
    dup length dict begin
	{1 index /FID ne {def} {pop pop} ifelse} forall
	/Encoding isolatin1encoding def
    currentdict end
definefont pop
/Helvetica-Narrow-latin1
    /Helvetica-Narrow findfont
    dup length dict begin
	{1 index /FID ne {def} {pop pop} ifelse} forall
	/Encoding isolatin1encoding def
    currentdict end
definefont pop
/Helvetica-Narrow-Oblique-latin1
    /Helvetica-Narrow-Oblique findfont
    dup length dict begin
	{1 index /FID ne {def} {pop pop} ifelse} forall
	/Encoding isolatin1encoding def
    currentdict end
definefont pop
/Helvetica-Narrow-Bold-latin1
    /Helvetica-Narrow-Bold findfont
    dup length dict begin
	{1 index /FID ne {def} {pop pop} ifelse} forall
	/Encoding isolatin1encoding def
    currentdict end
definefont pop
/Helvetica-Narrow-BoldOblique-latin1
    /Helvetica-Narrow-BoldOblique findfont
    dup length dict begin
	{1 index /FID ne {def} {pop pop} ifelse} forall
	/Encoding isolatin1encoding def
    currentdict end
definefont pop
/NewCenturySchoolbook-Roman-latin1
    /NewCenturySchoolbook-Roman findfont
    dup length dict begin
	{1 index /FID ne {def} {pop pop} ifelse} forall
	/Encoding isolatin1encoding def
    currentdict end
definefont pop
/NewCenturySchoolbook-Italic-latin1
    /NewCenturySchoolbook-Italic findfont
    dup length dict begin
	{1 index /FID ne {def} {pop pop} ifelse} forall
	/Encoding isolatin1encoding def
    currentdict end
definefont pop
/NewCenturySchoolbook-Bold-latin1
    /NewCenturySchoolbook-Bold findfont
    dup length dict begin
	{1 index /FID ne {def} {pop pop} ifelse} forall
	/Encoding isolatin1encoding def
    currentdict end
definefont pop
/NewCenturySchoolbook-BoldItalic-latin1
    /NewCenturySchoolbook-BoldItalic findfont
    dup length dict begin
	{1 index /FID ne {def} {pop pop} ifelse} forall
	/Encoding isolatin1encoding def
    currentdict end
definefont pop
/Palatino-Roman-latin1
    /Palatino-Roman findfont
    dup length dict begin
	{1 index /FID ne {def} {pop pop} ifelse} forall
	/Encoding isolatin1encoding def
    currentdict end
definefont pop
/Palatino-Italic-latin1
    /Palatino-Italic findfont
    dup length dict begin
	{1 index /FID ne {def} {pop pop} ifelse} forall
	/Encoding isolatin1encoding def
    currentdict end
definefont pop
/Palatino-Bold-latin1
    /Palatino-Bold findfont
    dup length dict begin
	{1 index /FID ne {def} {pop pop} ifelse} forall
	/Encoding isolatin1encoding def
    currentdict end
definefont pop
/Palatino-BoldItalic-latin1
    /Palatino-BoldItalic findfont
    dup length dict begin
	{1 index /FID ne {def} {pop pop} ifelse} forall
	/Encoding isolatin1encoding def
    currentdict end
definefont pop
/Symbol-latin1
    /Symbol findfont
definefont pop
/ZapfChancery-MediumItalic-latin1
    /ZapfChancery-MediumItalic findfont
    dup length dict begin
	{1 index /FID ne {def} {pop pop} ifelse} forall
	/Encoding isolatin1encoding def
    currentdict end
definefont pop
/ZapfDingbats-latin1
    /ZapfDingbats findfont
    dup length dict begin
	{1 index /FID ne {def} {pop pop} ifelse} forall
	/Encoding isolatin1encoding def
    currentdict end
definefont pop
28.346000 -28.346000 scale
3.001730 -32.252000 translate
%%EndProlog


0.100000 slw
[] 0 sd
1.000000 1.000000 1.000000 srgb
n -2.951730 11.879200 m -2.951730 14.279200 l 2.389676 14.279200 l 2.389676 11.879200 l f
0.000000 0.000000 0.000000 srgb
n -2.951730 11.879200 m -2.951730 14.279200 l 2.389676 14.279200 l 2.389676 11.879200 l cp s
/Helvetica-latin1 ff 0.700000 scf sf
(declaration) dup sw 2 div -0.281027 ex sub 12.879200 m gs 1 -1 sc sh gr
/Helvetica-latin1 ff 0.700000 scf sf
(int i) dup sw 2 div -0.281027 ex sub 13.879200 m gs 1 -1 sc sh gr
1.000000 1.000000 1.000000 srgb
n -2.951730 14.279200 m -2.951730 14.679200 l 2.389676 14.679200 l 2.389676 14.279200 l f
0.000000 0.000000 0.000000 srgb
n -2.951730 14.279200 m -2.951730 14.679200 l 2.389676 14.679200 l 2.389676 14.279200 l cp s
1.000000 1.000000 1.000000 srgb
n -2.951730 14.679200 m -2.951730 15.079200 l 2.389676 15.079200 l 2.389676 14.679200 l f
0.000000 0.000000 0.000000 srgb
n -2.951730 14.679200 m -2.951730 15.079200 l 2.389676 15.079200 l 2.389676 14.679200 l cp s
0.100000 slw
[] 0 sd
1.000000 1.000000 1.000000 srgb
n 14.549400 -6.653010 m 14.549400 -4.253010 l 24.873619 -4.253010 l 24.873619 -6.653010 l f
0.000000 0.000000 0.000000 srgb
n 14.549400 -6.653010 m 14.549400 -4.253010 l 24.873619 -4.253010 l 24.873619 -6.653010 l cp s
/Helvetica-latin1 ff 0.700000 scf sf
(compound_stmt \(cs1\)) dup sw 2 div 19.711509 ex sub -5.653010 m gs 1 -1 sc sh gr
/Helvetica-latin1 ff 0.700000 scf sf
(Outer scope) dup sw 2 div 19.711509 ex sub -4.653010 m gs 1 -1 sc sh gr
1.000000 1.000000 1.000000 srgb
n 14.549400 -4.253010 m 14.549400 1.546990 l 24.873619 1.546990 l 24.873619 -4.253010 l f
0.000000 0.000000 0.000000 srgb
n 14.549400 -4.253010 m 14.549400 1.546990 l 24.873619 1.546990 l 24.873619 -4.253010 l cp s
/Courier-latin1 ff 0.560000 scf sf
(+psp: sp = SP1) 14.699400 -3.623323 m gs 1 -1 sc sh gr
/Courier-latin1 ff 0.560000 scf sf
(+nsp: sp = SP19) 14.699400 -2.823322 m gs 1 -1 sc sh gr
/Courier-latin1 ff 0.560000 scf sf
(+sps: list sp) 14.699400 -2.023322 m gs 1 -1 sc sh gr
/Courier-latin1 ff 0.560000 scf sf
(+dsp: sp = SP18) 14.699400 -1.223322 m gs 1 -1 sc sh gr
/Courier-latin1 ff 0.560000 scf sf
(+statements: list statement) 14.699400 -0.423322 m gs 1 -1 sc sh gr
/Courier-latin1 ff 0.560000 scf sf
(+decl_seq: decl_seq) 14.699400 0.376678 m gs 1 -1 sc sh gr
/Courier-latin1 ff 0.560000 scf sf
(+parent: compound = ...) 14.699400 1.176678 m gs 1 -1 sc sh gr
1.000000 1.000000 1.000000 srgb
n 14.549400 1.546990 m 14.549400 1.946990 l 24.873619 1.946990 l 24.873619 1.546990 l f
0.000000 0.000000 0.000000 srgb
n 14.549400 1.546990 m 14.549400 1.946990 l 24.873619 1.946990 l 24.873619 1.546990 l cp s
0.100000 slw
[] 0 sd
[] 0 sd
0 slj
0 slc
n 14.549400 -2.153010 m 13.542100 -2.153010 l 13.542100 -2.173530 l 13.021603 -2.173530 l s
[] 0 sd
0 slj
0 slc
n 12.646603 -2.173530 m 13.146603 -2.423530 l 13.021603 -2.173530 l 13.146603 -1.923530 l ef
n 12.646603 -2.173530 m 13.146603 -2.423530 l 13.021603 -2.173530 l 13.146603 -1.923530 l cp s
1.000000 1.000000 1.000000 srgb
n 12.305000 5.255110 m 12.305000 6.255110 l 14.305000 6.255110 l 14.305000 5.255110 l f
0.100000 slw
[] 0 sd
[] 0 sd
0 slj
0.000000 0.000000 0.000000 srgb
n 12.305000 5.255110 m 12.305000 6.255110 l 14.305000 6.255110 l 14.305000 5.255110 l cp s
1.000000 1.000000 1.000000 srgb
n 14.305000 5.255110 m 14.305000 6.255110 l 16.305000 6.255110 l 16.305000 5.255110 l f
0.100000 slw
[] 0 sd
[] 0 sd
0 slj
0.000000 0.000000 0.000000 srgb
n 14.305000 5.255110 m 14.305000 6.255110 l 16.305000 6.255110 l 16.305000 5.255110 l cp s
1.000000 1.000000 1.000000 srgb
n 16.305000 5.255110 m 16.305000 6.255110 l 18.305000 6.255110 l 18.305000 5.255110 l f
0.100000 slw
[] 0 sd
[] 0 sd
0 slj
0.000000 0.000000 0.000000 srgb
n 16.305000 5.255110 m 16.305000 6.255110 l 18.305000 6.255110 l 18.305000 5.255110 l cp s
0.100000 slw
[] 0 sd
[] 0 sd
0 slc
n 16.305000 6.255110 m 18.305000 5.255110 l s
0.100000 slw
[] 0 sd
[] 0 sd
0 slj
0 slc
n 14.549400 -0.553012 m 13.305000 -0.553012 l 13.305000 4.768307 l s
[] 0 sd
0 slj
0 slc
n 13.305000 5.143307 m 13.055000 4.643307 l 13.305000 4.768307 l 13.555000 4.643307 l ef
n 13.305000 5.143307 m 13.055000 4.643307 l 13.305000 4.768307 l 13.555000 4.643307 l cp s
0.100000 slw
[] 0 sd
[] 0 sd
0 slj
0 slc
n 13.305000 6.255110 m 13.305000 8.141200 l 12.782637 8.141200 l s
[] 0 sd
0 slj
0 slc
n 12.407637 8.141200 m 12.907637 7.891200 l 12.782637 8.141200 l 12.907637 8.391200 l ef
n 12.407637 8.141200 m 12.907637 7.891200 l 12.782637 8.141200 l 12.907637 8.391200 l cp s
0.100000 slw
[] 0 sd
[] 0 sd
0 slj
0 slc
n 15.305000 5.255110 m 15.305000 3.909810 l 20.828897 3.909810 l s
[] 0 sd
0 slj
0 slc
n 21.203897 3.909810 m 20.703897 4.159810 l 20.828897 3.909810 l 20.703897 3.659810 l ef
n 21.203897 3.909810 m 20.703897 4.159810 l 20.828897 3.909810 l 20.703897 3.659810 l cp s
1.000000 1.000000 1.000000 srgb
n 4.534810 -2.673530 m 4.534810 -1.673530 l 6.534810 -1.673530 l 6.534810 -2.673530 l f
0.100000 slw
[] 0 sd
[] 0 sd
0 slj
0.000000 0.000000 0.000000 srgb
n 4.534810 -2.673530 m 4.534810 -1.673530 l 6.534810 -1.673530 l 6.534810 -2.673530 l cp s
1.000000 1.000000 1.000000 srgb
n 6.534810 -2.673530 m 6.534810 -1.673530 l 8.534810 -1.673530 l 8.534810 -2.673530 l f
0.100000 slw
[] 0 sd
[] 0 sd
0 slj
0.000000 0.000000 0.000000 srgb
n 6.534810 -2.673530 m 6.534810 -1.673530 l 8.534810 -1.673530 l 8.534810 -2.673530 l cp s
1.000000 1.000000 1.000000 srgb
n 8.534810 -2.673530 m 8.534810 -1.673530 l 10.534810 -1.673530 l 10.534810 -2.673530 l f
0.100000 slw
[] 0 sd
[] 0 sd
0 slj
0.000000 0.000000 0.000000 srgb
n 8.534810 -2.673530 m 8.534810 -1.673530 l 10.534810 -1.673530 l 10.534810 -2.673530 l cp s
1.000000 1.000000 1.000000 srgb
n 10.534800 -2.673530 m 10.534800 -1.673530 l 12.534800 -1.673530 l 12.534800 -2.673530 l f
0.100000 slw
[] 0 sd
[] 0 sd
0 slj
0.000000 0.000000 0.000000 srgb
n 10.534800 -2.673530 m 10.534800 -1.673530 l 12.534800 -1.673530 l 12.534800 -2.673530 l cp s
0.100000 slw
[] 0 sd
[] 0 sd
0 slc
n 10.534800 -1.673530 m 12.534800 -2.673530 l s
/Helvetica-latin1 ff 0.560000 scf sf
(SP1) 4.969810 -1.915610 m gs 1 -1 sc sh gr
/Helvetica-latin1 ff 0.560000 scf sf
(SP19) 6.769810 -1.915610 m gs 1 -1 sc sh gr
/Helvetica-latin1 ff 0.560000 scf sf
(SP18) 8.719810 -1.915610 m gs 1 -1 sc sh gr
0.100000 slw
[] 0 sd
1.000000 1.000000 1.000000 srgb
n 3.412240 6.941200 m 3.412240 9.341200 l 12.295834 9.341200 l 12.295834 6.941200 l f
0.000000 0.000000 0.000000 srgb
n 3.412240 6.941200 m 3.412240 9.341200 l 12.295834 9.341200 l 12.295834 6.941200 l cp s
/Helvetica-latin1 ff 0.700000 scf sf
(decl_stmt) dup sw 2 div 7.854037 ex sub 7.941200 m gs 1 -1 sc sh gr
/Helvetica-latin1 ff 0.700000 scf sf
(int i=3;) dup sw 2 div 7.854037 ex sub 8.941200 m gs 1 -1 sc sh gr
1.000000 1.000000 1.000000 srgb
n 3.412240 9.341200 m 3.412240 14.341200 l 12.295834 14.341200 l 12.295834 9.341200 l f
0.000000 0.000000 0.000000 srgb
n 3.412240 9.341200 m 3.412240 14.341200 l 12.295834 14.341200 l 12.295834 9.341200 l cp s
/Courier-latin1 ff 0.560000 scf sf
(+psp: sp = SP2) 3.562240 9.970887 m gs 1 -1 sc sh gr
/Courier-latin1 ff 0.560000 scf sf
(+nsp: sp = SP3) 3.562240 10.770887 m gs 1 -1 sc sh gr
/Courier-latin1 ff 0.560000 scf sf
(+sps: list sp) 3.562240 11.570887 m gs 1 -1 sc sh gr
/Courier-latin1 ff 0.560000 scf sf
(+parent: compound = cs1) 3.562240 12.370887 m gs 1 -1 sc sh gr
/Courier-latin1 ff 0.560000 scf sf
(+decl: declaration) 3.562240 13.170887 m gs 1 -1 sc sh gr
/Courier-latin1 ff 0.560000 scf sf
(+args: list expression) 3.562240 13.970887 m gs 1 -1 sc sh gr
1.000000 1.000000 1.000000 srgb
n 3.412240 14.341200 m 3.412240 14.741200 l 12.295834 14.741200 l 12.295834 14.341200 l f
0.000000 0.000000 0.000000 srgb
n 3.412240 14.341200 m 3.412240 14.741200 l 12.295834 14.741200 l 12.295834 14.341200 l cp s
0.100000 slw
[] 0 sd
[] 0 sd
0 slj
0 slc
n 3.412240 11.441200 m 2.412240 11.441200 l 2.412240 5.345600 l 3.335067 5.345600 l s
[] 0 sd
0 slj
0 slc
n 3.710067 5.345600 m 3.210067 5.595600 l 3.335067 5.345600 l 3.210067 5.095600 l ef
n 3.710067 5.345600 m 3.210067 5.595600 l 3.335067 5.345600 l 3.210067 5.095600 l cp s
1.000000 1.000000 1.000000 srgb
n 3.821870 4.845600 m 3.821870 5.845600 l 5.821870 5.845600 l 5.821870 4.845600 l f
0.100000 slw
[] 0 sd
[] 0 sd
0 slj
0.000000 0.000000 0.000000 srgb
n 3.821870 4.845600 m 3.821870 5.845600 l 5.821870 5.845600 l 5.821870 4.845600 l cp s
1.000000 1.000000 1.000000 srgb
n 5.821870 4.845600 m 5.821870 5.845600 l 7.821870 5.845600 l 7.821870 4.845600 l f
0.100000 slw
[] 0 sd
[] 0 sd
0 slj
0.000000 0.000000 0.000000 srgb
n 5.821870 4.845600 m 5.821870 5.845600 l 7.821870 5.845600 l 7.821870 4.845600 l cp s
1.000000 1.000000 1.000000 srgb
n 7.821870 4.845600 m 7.821870 5.845600 l 9.821870 5.845600 l 9.821870 4.845600 l f
0.100000 slw
[] 0 sd
[] 0 sd
0 slj
0.000000 0.000000 0.000000 srgb
n 7.821870 4.845600 m 7.821870 5.845600 l 9.821870 5.845600 l 9.821870 4.845600 l cp s
0.100000 slw
[] 0 sd
[] 0 sd
0 slc
n 7.821870 5.845600 m 9.821870 4.845600 l s
/Helvetica-latin1 ff 0.560000 scf sf
(SP2) 4.156870 5.603520 m gs 1 -1 sc sh gr
/Helvetica-latin1 ff 0.560000 scf sf
(SP3) 6.156870 5.553520 m gs 1 -1 sc sh gr
0.100000 slw
[] 0 sd
[] 0 sd
0 slj
0 slc
n 3.412240 13.041200 m 2.900958 13.041200 l 2.900958 13.079200 l 2.876480 13.079200 l s
[] 0 sd
0 slj
0 slc
n 2.501480 13.079200 m 3.001480 12.829200 l 2.876480 13.079200 l 3.001480 13.329200 l ef
n 2.501480 13.079200 m 3.001480 12.829200 l 2.876480 13.079200 l 3.001480 13.329200 l cp s
0.100000 slw
[] 0 sd
[] 0 sd
0 slj
0 slc
n 12.295834 13.841200 m 13.098270 13.841200 l 13.098270 13.838500 l 13.111497 13.838500 l s
[] 0 sd
0 slj
0 slc
n 13.486497 13.838500 m 12.986497 14.088500 l 13.111497 13.838500 l 12.986497 13.588500 l ef
n 13.486497 13.838500 m 12.986497 14.088500 l 13.111497 13.838500 l 12.986497 13.588500 l cp s
0.100000 slw
[] 0 sd
1.000000 1.000000 1.000000 srgb
n 0.904562 -0.470775 m 0.904562 0.929225 l 11.228781 0.929225 l 11.228781 -0.470775 l f
0.000000 0.000000 0.000000 srgb
n 0.904562 -0.470775 m 0.904562 0.929225 l 11.228781 0.929225 l 11.228781 -0.470775 l cp s
/Helvetica-latin1 ff 0.700000 scf sf
(decl_seq) dup sw 2 div 6.066671 ex sub 0.529225 m gs 1 -1 sc sh gr
1.000000 1.000000 1.000000 srgb
n 0.904562 0.929225 m 0.904562 1.929225 l 11.228781 1.929225 l 11.228781 0.929225 l f
0.000000 0.000000 0.000000 srgb
n 0.904562 0.929225 m 0.904562 1.929225 l 11.228781 1.929225 l 11.228781 0.929225 l cp s
/Courier-latin1 ff 0.560000 scf sf
(+contents: list declaration) 1.054562 1.558912 m gs 1 -1 sc sh gr
1.000000 1.000000 1.000000 srgb
n 0.904562 1.929225 m 0.904562 2.329225 l 11.228781 2.329225 l 11.228781 1.929225 l f
0.000000 0.000000 0.000000 srgb
n 0.904562 1.929225 m 0.904562 2.329225 l 11.228781 2.329225 l 11.228781 1.929225 l cp s
0.100000 slw
[] 0 sd
[] 0 sd
0 slj
0 slc
n 14.549400 0.246988 m 12.889090 0.246988 l 12.889090 0.229225 l 11.715584 0.229225 l s
[] 0 sd
0 slj
0 slc
n 11.340584 0.229225 m 11.840584 -0.020775 l 11.715584 0.229225 l 11.840584 0.479225 l ef
n 11.340584 0.229225 m 11.840584 -0.020775 l 11.715584 0.229225 l 11.840584 0.479225 l cp s
1.000000 1.000000 1.000000 srgb
n -1.325130 3.440210 m -1.325130 4.440210 l 0.674870 4.440210 l 0.674870 3.440210 l f
0.100000 slw
[] 0 sd
[] 0 sd
0 slj
0.000000 0.000000 0.000000 srgb
n -1.325130 3.440210 m -1.325130 4.440210 l 0.674870 4.440210 l 0.674870 3.440210 l cp s
1.000000 1.000000 1.000000 srgb
n 0.674866 3.440210 m 0.674866 4.440210 l 2.674866 4.440210 l 2.674866 3.440210 l f
0.100000 slw
[] 0 sd
[] 0 sd
0 slj
0.000000 0.000000 0.000000 srgb
n 0.674866 3.440210 m 0.674866 4.440210 l 2.674866 4.440210 l 2.674866 3.440210 l cp s
0.100000 slw
[] 0 sd
[] 0 sd
0 slc
n 0.674866 4.440210 m 2.674866 3.440210 l s
0.100000 slw
[] 0 sd
[] 0 sd
0 slj
0 slc
n 0.904562 1.429230 m -0.325130 1.429230 l -0.325130 2.953407 l s
[] 0 sd
0 slj
0 slc
n -0.325130 3.328407 m -0.575130 2.828407 l -0.325130 2.953407 l -0.075130 2.828407 l ef
n -0.325130 3.328407 m -0.575130 2.828407 l -0.325130 2.953407 l -0.075130 2.828407 l cp s
0.100000 slw
[] 0 sd
[] 0 sd
0 slj
0 slc
n -0.325130 4.440210 m -0.325130 8.159705 l -0.281027 8.159705 l -0.281027 11.392397 l s
[] 0 sd
0 slj
0 slc
n -0.281027 11.767397 m -0.531027 11.267397 l -0.281027 11.392397 l -0.031027 11.267397 l ef
n -0.281027 11.767397 m -0.531027 11.267397 l -0.281027 11.392397 l -0.031027 11.267397 l cp s
0.100000 slw
[] 0 sd
1.000000 1.000000 1.000000 srgb
n 21.315700 2.709810 m 21.315700 5.109810 l 31.639919 5.109810 l 31.639919 2.709810 l f
0.000000 0.000000 0.000000 srgb
n 21.315700 2.709810 m 21.315700 5.109810 l 31.639919 5.109810 l 31.639919 2.709810 l cp s
/Helvetica-latin1 ff 0.700000 scf sf
(compound_stmt \(cs2\)) dup sw 2 div 26.477809 ex sub 3.709810 m gs 1 -1 sc sh gr
/Helvetica-latin1 ff 0.700000 scf sf
(Inner scope) dup sw 2 div 26.477809 ex sub 4.709810 m gs 1 -1 sc sh gr
1.000000 1.000000 1.000000 srgb
n 21.315700 5.109810 m 21.315700 10.909810 l 31.639919 10.909810 l 31.639919 5.109810 l f
0.000000 0.000000 0.000000 srgb
n 21.315700 5.109810 m 21.315700 10.909810 l 31.639919 10.909810 l 31.639919 5.109810 l cp s
/Courier-latin1 ff 0.560000 scf sf
(+psp: sp = SP4) 21.465700 5.739497 m gs 1 -1 sc sh gr
/Courier-latin1 ff 0.560000 scf sf
(+nsp: sp = SP17) 21.465700 6.539497 m gs 1 -1 sc sh gr
/Courier-latin1 ff 0.560000 scf sf
(+sps: list sp) 21.465700 7.339497 m gs 1 -1 sc sh gr
/Courier-latin1 ff 0.560000 scf sf
(+dsp: sp = SP16) 21.465700 8.139497 m gs 1 -1 sc sh gr
/Courier-latin1 ff 0.560000 scf sf
(+statements: list statement) 21.465700 8.939497 m gs 1 -1 sc sh gr
/Courier-latin1 ff 0.560000 scf sf
(+decl_seq: decl_seq) 21.465700 9.739497 m gs 1 -1 sc sh gr
/Courier-latin1 ff 0.560000 scf sf
(+parent: compound = cs1) 21.465700 10.539497 m gs 1 -1 sc sh gr
1.000000 1.000000 1.000000 srgb
n 21.315700 10.909810 m 21.315700 11.309810 l 31.639919 11.309810 l 31.639919 10.909810 l f
0.000000 0.000000 0.000000 srgb
n 21.315700 10.909810 m 21.315700 11.309810 l 31.639919 11.309810 l 31.639919 10.909810 l cp s
0.100000 slw
[] 0 sd
[] 0 sd
0 slj
0 slc
n 31.365700 7.209810 m 34.044600 7.209810 l 34.044600 4.546580 l 36.236697 4.546580 l s
[] 0 sd
0 slj
0 slc
n 36.611697 4.546580 m 36.111697 4.796580 l 36.236697 4.546580 l 36.111697 4.296580 l ef
n 36.611697 4.546580 m 36.111697 4.796580 l 36.236697 4.546580 l 36.111697 4.296580 l cp s
0.100000 slw
[] 0 sd
[] 0 sd
0 slj
0 slc
n 21.315700 8.809810 m 16.919600 8.809810 l 16.919600 14.638200 l 17.432797 14.638200 l s
[] 0 sd
0 slj
0 slc
n 17.807797 14.638200 m 17.307797 14.888200 l 17.432797 14.638200 l 17.307797 14.388200 l ef
n 17.807797 14.638200 m 17.307797 14.888200 l 17.432797 14.638200 l 17.307797 14.388200 l cp s
0.100000 slw
[] 0 sd
[] 0 sd
0 slj
0 slc
n 31.639919 9.609810 m 32.369094 9.609810 l 32.369094 9.496990 l 32.611467 9.496990 l s
[] 0 sd
0 slj
0 slc
n 32.986467 9.496990 m 32.486467 9.746990 l 32.611467 9.496990 l 32.486467 9.246990 l ef
n 32.986467 9.496990 m 32.486467 9.746990 l 32.611467 9.496990 l 32.486467 9.246990 l cp s
0.100000 slw
[] 0 sd
1.000000 1.000000 1.000000 srgb
n 4.371330 22.590700 m 4.371330 24.990700 l 9.712736 24.990700 l 9.712736 22.590700 l f
0.000000 0.000000 0.000000 srgb
n 4.371330 22.590700 m 4.371330 24.990700 l 9.712736 24.990700 l 9.712736 22.590700 l cp s
/Helvetica-latin1 ff 0.700000 scf sf
(declaration) dup sw 2 div 7.042033 ex sub 23.590700 m gs 1 -1 sc sh gr
/Helvetica-latin1 ff 0.700000 scf sf
(int b) dup sw 2 div 7.042033 ex sub 24.590700 m gs 1 -1 sc sh gr
1.000000 1.000000 1.000000 srgb
n 4.371330 24.990700 m 4.371330 25.390700 l 9.712736 25.390700 l 9.712736 24.990700 l f
0.000000 0.000000 0.000000 srgb
n 4.371330 24.990700 m 4.371330 25.390700 l 9.712736 25.390700 l 9.712736 24.990700 l cp s
1.000000 1.000000 1.000000 srgb
n 4.371330 25.390700 m 4.371330 25.790700 l 9.712736 25.790700 l 9.712736 25.390700 l f
0.000000 0.000000 0.000000 srgb
n 4.371330 25.390700 m 4.371330 25.790700 l 9.712736 25.790700 l 9.712736 25.390700 l cp s
1.000000 1.000000 1.000000 srgb
n 36.723500 4.046580 m 36.723500 5.046580 l 38.723500 5.046580 l 38.723500 4.046580 l f
0.100000 slw
[] 0 sd
[] 0 sd
0 slj
0.000000 0.000000 0.000000 srgb
n 36.723500 4.046580 m 36.723500 5.046580 l 38.723500 5.046580 l 38.723500 4.046580 l cp s
1.000000 1.000000 1.000000 srgb
n 38.723500 4.046580 m 38.723500 5.046580 l 40.723500 5.046580 l 40.723500 4.046580 l f
0.100000 slw
[] 0 sd
[] 0 sd
0 slj
0.000000 0.000000 0.000000 srgb
n 38.723500 4.046580 m 38.723500 5.046580 l 40.723500 5.046580 l 40.723500 4.046580 l cp s
1.000000 1.000000 1.000000 srgb
n 40.723500 4.046580 m 40.723500 5.046580 l 42.723500 5.046580 l 42.723500 4.046580 l f
0.100000 slw
[] 0 sd
[] 0 sd
0 slj
0.000000 0.000000 0.000000 srgb
n 40.723500 4.046580 m 40.723500 5.046580 l 42.723500 5.046580 l 42.723500 4.046580 l cp s
1.000000 1.000000 1.000000 srgb
n 42.723500 4.046580 m 42.723500 5.046580 l 44.723500 5.046580 l 44.723500 4.046580 l f
0.100000 slw
[] 0 sd
[] 0 sd
0 slj
0.000000 0.000000 0.000000 srgb
n 42.723500 4.046580 m 42.723500 5.046580 l 44.723500 5.046580 l 44.723500 4.046580 l cp s
0.100000 slw
[] 0 sd
[] 0 sd
0 slc
n 42.723500 5.046580 m 44.723500 4.046580 l s
/Helvetica-latin1 ff 0.560000 scf sf
(SP4) 37.158500 4.804480 m gs 1 -1 sc sh gr
/Helvetica-latin1 ff 0.560000 scf sf
(SP17) 38.958500 4.804480 m gs 1 -1 sc sh gr
/Helvetica-latin1 ff 0.560000 scf sf
(SP16) 40.908500 4.804480 m gs 1 -1 sc sh gr
0.100000 slw
[] 0 sd
1.000000 1.000000 1.000000 srgb
n 14.565000 16.262300 m 14.565000 18.662300 l 23.448594 18.662300 l 23.448594 16.262300 l f
0.000000 0.000000 0.000000 srgb
n 14.565000 16.262300 m 14.565000 18.662300 l 23.448594 18.662300 l 23.448594 16.262300 l cp s
/Helvetica-latin1 ff 0.700000 scf sf
(decl_stmt) dup sw 2 div 19.006797 ex sub 17.262300 m gs 1 -1 sc sh gr
/Helvetica-latin1 ff 0.700000 scf sf
(int b = i<10;) dup sw 2 div 19.006797 ex sub 18.262300 m gs 1 -1 sc sh gr
1.000000 1.000000 1.000000 srgb
n 14.565000 18.662300 m 14.565000 23.662300 l 23.448594 23.662300 l 23.448594 18.662300 l f
0.000000 0.000000 0.000000 srgb
n 14.565000 18.662300 m 14.565000 23.662300 l 23.448594 23.662300 l 23.448594 18.662300 l cp s
/Courier-latin1 ff 0.560000 scf sf
(+psp: sp = SP5) 14.715000 19.291988 m gs 1 -1 sc sh gr
/Courier-latin1 ff 0.560000 scf sf
(+nsp: sp = SP6) 14.715000 20.091988 m gs 1 -1 sc sh gr
/Courier-latin1 ff 0.560000 scf sf
(+sps: list sp) 14.715000 20.891988 m gs 1 -1 sc sh gr
/Courier-latin1 ff 0.560000 scf sf
(+parent: compound = cs2) 14.715000 21.691988 m gs 1 -1 sc sh gr
/Courier-latin1 ff 0.560000 scf sf
(+decl: declaration) 14.715000 22.491988 m gs 1 -1 sc sh gr
/Courier-latin1 ff 0.560000 scf sf
(+args: list expression) 14.715000 23.291988 m gs 1 -1 sc sh gr
1.000000 1.000000 1.000000 srgb
n 14.565000 23.662300 m 14.565000 24.062300 l 23.448594 24.062300 l 23.448594 23.662300 l f
0.000000 0.000000 0.000000 srgb
n 14.565000 23.662300 m 14.565000 24.062300 l 23.448594 24.062300 l 23.448594 23.662300 l cp s
0.100000 slw
[] 0 sd
[] 0 sd
0 slj
0 slc
n 18.919600 15.138200 m 18.919600 15.700200 l 18.890000 15.700200 l 18.890000 15.775497 l s
[] 0 sd
0 slj
0 slc
n 18.890000 16.150497 m 18.640000 15.650497 l 18.890000 15.775497 l 19.140000 15.650497 l ef
n 18.890000 16.150497 m 18.640000 15.650497 l 18.890000 15.775497 l 19.140000 15.650497 l cp s
0.100000 slw
[] 0 sd
[] 0 sd
0 slj
0 slc
n 14.565000 22.362300 m 12.043100 22.362300 l 12.043100 23.790700 l 10.008133 23.790700 l s
[] 0 sd
0 slj
0 slc
n 9.633133 23.790700 m 10.133133 23.540700 l 10.008133 23.790700 l 10.133133 24.040700 l ef
n 9.633133 23.790700 m 10.133133 23.540700 l 10.008133 23.790700 l 10.133133 24.040700 l cp s
1.000000 1.000000 1.000000 srgb
n 6.760730 20.247400 m 6.760730 21.247400 l 8.760730 21.247400 l 8.760730 20.247400 l f
0.100000 slw
[] 0 sd
[] 0 sd
0 slj
0.000000 0.000000 0.000000 srgb
n 6.760730 20.247400 m 6.760730 21.247400 l 8.760730 21.247400 l 8.760730 20.247400 l cp s
1.000000 1.000000 1.000000 srgb
n 8.760730 20.247400 m 8.760730 21.247400 l 10.760730 21.247400 l 10.760730 20.247400 l f
0.100000 slw
[] 0 sd
[] 0 sd
0 slj
0.000000 0.000000 0.000000 srgb
n 8.760730 20.247400 m 8.760730 21.247400 l 10.760730 21.247400 l 10.760730 20.247400 l cp s
1.000000 1.000000 1.000000 srgb
n 10.760700 20.247400 m 10.760700 21.247400 l 12.760700 21.247400 l 12.760700 20.247400 l f
0.100000 slw
[] 0 sd
[] 0 sd
0 slj
0.000000 0.000000 0.000000 srgb
n 10.760700 20.247400 m 10.760700 21.247400 l 12.760700 21.247400 l 12.760700 20.247400 l cp s
0.100000 slw
[] 0 sd
[] 0 sd
0 slc
n 10.760700 21.247400 m 12.760700 20.247400 l s
/Helvetica-latin1 ff 0.560000 scf sf
(SP5) 7.095730 21.005300 m gs 1 -1 sc sh gr
/Helvetica-latin1 ff 0.560000 scf sf
(SP6) 9.095730 20.955300 m gs 1 -1 sc sh gr
0.100000 slw
[] 0 sd
[] 0 sd
0 slj
0 slc
n 14.565000 20.762300 m 13.662800 20.762300 l 13.662800 20.747400 l 13.247503 20.747400 l s
[] 0 sd
0 slj
0 slc
n 12.872503 20.747400 m 13.372503 20.497400 l 13.247503 20.747400 l 13.372503 20.997400 l ef
n 12.872503 20.747400 m 13.372503 20.497400 l 13.247503 20.747400 l 13.372503 20.997400 l cp s
1.000000 1.000000 1.000000 srgb
n 10.492000 25.692900 m 10.492000 26.692900 l 12.492000 26.692900 l 12.492000 25.692900 l f
0.100000 slw
[] 0 sd
[] 0 sd
0 slj
0.000000 0.000000 0.000000 srgb
n 10.492000 25.692900 m 10.492000 26.692900 l 12.492000 26.692900 l 12.492000 25.692900 l cp s
1.000000 1.000000 1.000000 srgb
n 12.492000 25.692900 m 12.492000 26.692900 l 14.492000 26.692900 l 14.492000 25.692900 l f
0.100000 slw
[] 0 sd
[] 0 sd
0 slj
0.000000 0.000000 0.000000 srgb
n 12.492000 25.692900 m 12.492000 26.692900 l 14.492000 26.692900 l 14.492000 25.692900 l cp s
0.100000 slw
[] 0 sd
[] 0 sd
0 slc
n 12.492000 26.692900 m 14.492000 25.692900 l s
/Helvetica-latin1 ff 0.560000 scf sf
(i<10) 10.827000 26.450800 m gs 1 -1 sc sh gr
0.100000 slw
[] 0 sd
[] 0 sd
0 slj
0 slc
n 14.565000 23.162300 m 13.492000 23.162300 l 13.492000 25.206097 l s
[] 0 sd
0 slj
0 slc
n 13.492000 25.581097 m 13.242000 25.081097 l 13.492000 25.206097 l 13.742000 25.081097 l ef
n 13.492000 25.581097 m 13.242000 25.081097 l 13.492000 25.206097 l 13.742000 25.081097 l cp s
0.100000 slw
[] 0 sd
1.000000 1.000000 1.000000 srgb
n 34.954200 11.704200 m 34.954200 13.104200 l 47.079200 13.104200 l 47.079200 11.704200 l f
0.000000 0.000000 0.000000 srgb
n 34.954200 11.704200 m 34.954200 13.104200 l 47.079200 13.104200 l 47.079200 11.704200 l cp s
/Helvetica-latin1 ff 0.700000 scf sf
(for) dup sw 2 div 41.016700 ex sub 12.704200 m gs 1 -1 sc sh gr
1.000000 1.000000 1.000000 srgb
n 34.954200 13.104200 m 34.954200 18.904200 l 47.079200 18.904200 l 47.079200 13.104200 l f
0.000000 0.000000 0.000000 srgb
n 34.954200 13.104200 m 34.954200 18.904200 l 47.079200 18.904200 l 47.079200 13.104200 l cp s
/Courier-latin1 ff 0.560000 scf sf
(+psp: sp = SP7) 35.104200 13.733888 m gs 1 -1 sc sh gr
/Courier-latin1 ff 0.560000 scf sf
(+nsp: sp = SP8) 35.104200 14.533888 m gs 1 -1 sc sh gr
/Courier-latin1 ff 0.560000 scf sf
(+sps: list sp) 35.104200 15.333887 m gs 1 -1 sc sh gr
/Courier-latin1 ff 0.560000 scf sf
(+parent: compound = cs2) 35.104200 16.133888 m gs 1 -1 sc sh gr
/Courier-latin1 ff 0.560000 scf sf
(+body: compound stmt) 35.104200 16.933888 m gs 1 -1 sc sh gr
/Courier-latin1 ff 0.560000 scf sf
(+condition: expression = bool\(b\)) 35.104200 17.733888 m gs 1 -1 sc sh gr
/Courier-latin1 ff 0.560000 scf sf
(+iteration: expr_stmt) 35.104200 18.533888 m gs 1 -1 sc sh gr
1.000000 1.000000 1.000000 srgb
n 34.954200 18.904200 m 34.954200 19.304200 l 47.079200 19.304200 l 47.079200 18.904200 l f
0.000000 0.000000 0.000000 srgb
n 34.954200 18.904200 m 34.954200 19.304200 l 47.079200 19.304200 l 47.079200 18.904200 l cp s
1.000000 1.000000 1.000000 srgb
n 39.719200 8.749130 m 39.719200 9.749130 l 41.719200 9.749130 l 41.719200 8.749130 l f
0.100000 slw
[] 0 sd
[] 0 sd
0 slj
0.000000 0.000000 0.000000 srgb
n 39.719200 8.749130 m 39.719200 9.749130 l 41.719200 9.749130 l 41.719200 8.749130 l cp s
1.000000 1.000000 1.000000 srgb
n 41.719200 8.749130 m 41.719200 9.749130 l 43.719200 9.749130 l 43.719200 8.749130 l f
0.100000 slw
[] 0 sd
[] 0 sd
0 slj
0.000000 0.000000 0.000000 srgb
n 41.719200 8.749130 m 41.719200 9.749130 l 43.719200 9.749130 l 43.719200 8.749130 l cp s
1.000000 1.000000 1.000000 srgb
n 43.719200 8.749130 m 43.719200 9.749130 l 45.719200 9.749130 l 45.719200 8.749130 l f
0.100000 slw
[] 0 sd
[] 0 sd
0 slj
0.000000 0.000000 0.000000 srgb
n 43.719200 8.749130 m 43.719200 9.749130 l 45.719200 9.749130 l 45.719200 8.749130 l cp s
0.100000 slw
[] 0 sd
[] 0 sd
0 slc
n 43.719200 9.749130 m 45.719200 8.749130 l s
/Helvetica-latin1 ff 0.560000 scf sf
(SP7) 40.054200 9.507050 m gs 1 -1 sc sh gr
/Helvetica-latin1 ff 0.560000 scf sf
(SP8) 42.054200 9.457050 m gs 1 -1 sc sh gr
0.100000 slw
[] 0 sd
[] 0 sd
0 slj
0 slc
n 47.079200 15.204200 m 47.548300 15.204200 l 47.548300 9.249130 l 46.206003 9.249130 l s
[] 0 sd
0 slj
0 slc
n 45.831003 9.249130 m 46.331003 8.999130 l 46.206003 9.249130 l 46.331003 9.499130 l ef
n 45.831003 9.249130 m 46.331003 8.999130 l 46.206003 9.249130 l 46.331003 9.499130 l cp s
0.100000 slw
[] 0 sd
1.000000 1.000000 1.000000 srgb
n 24.353100 17.255900 m 24.353100 19.655900 l 33.236694 19.655900 l 33.236694 17.255900 l f
0.000000 0.000000 0.000000 srgb
n 24.353100 17.255900 m 24.353100 19.655900 l 33.236694 19.655900 l 33.236694 17.255900 l cp s
/Helvetica-latin1 ff 0.700000 scf sf
(expr_stmt) dup sw 2 div 28.794897 ex sub 18.255900 m gs 1 -1 sc sh gr
/Helvetica-latin1 ff 0.700000 scf sf
(i++) dup sw 2 div 28.794897 ex sub 19.255900 m gs 1 -1 sc sh gr
1.000000 1.000000 1.000000 srgb
n 24.353100 19.655900 m 24.353100 23.855900 l 33.236694 23.855900 l 33.236694 19.655900 l f
0.000000 0.000000 0.000000 srgb
n 24.353100 19.655900 m 24.353100 23.855900 l 33.236694 23.855900 l 33.236694 19.655900 l cp s
/Courier-latin1 ff 0.560000 scf sf
(+psp: sp = SP9) 24.503100 20.285588 m gs 1 -1 sc sh gr
/Courier-latin1 ff 0.560000 scf sf
(+nsp: sp = SP10) 24.503100 21.085588 m gs 1 -1 sc sh gr
/Courier-latin1 ff 0.560000 scf sf
(+sps: list sp) 24.503100 21.885588 m gs 1 -1 sc sh gr
/Courier-latin1 ff 0.560000 scf sf
(+parent: compound = cs2) 24.503100 22.685588 m gs 1 -1 sc sh gr
/Courier-latin1 ff 0.560000 scf sf
(+expr: expression = i++) 24.503100 23.485588 m gs 1 -1 sc sh gr
1.000000 1.000000 1.000000 srgb
n 24.353100 23.855900 m 24.353100 24.255900 l 33.236694 24.255900 l 33.236694 23.855900 l f
0.000000 0.000000 0.000000 srgb
n 24.353100 23.855900 m 24.353100 24.255900 l 33.236694 24.255900 l 33.236694 23.855900 l cp s
0.100000 slw
[] 0 sd
[] 0 sd
0 slj
0 slc
n 34.954200 18.404200 m 34.095447 18.404200 l 34.095447 18.455900 l 33.723497 18.455900 l s
[] 0 sd
0 slj
0 slc
n 33.348497 18.455900 m 33.848497 18.205900 l 33.723497 18.455900 l 33.848497 18.705900 l ef
n 33.348497 18.455900 m 33.848497 18.205900 l 33.723497 18.455900 l 33.848497 18.705900 l cp s
1.000000 1.000000 1.000000 srgb
n 25.002400 25.317000 m 25.002400 26.317000 l 27.002400 26.317000 l 27.002400 25.317000 l f
0.100000 slw
[] 0 sd
[] 0 sd
0 slj
0.000000 0.000000 0.000000 srgb
n 25.002400 25.317000 m 25.002400 26.317000 l 27.002400 26.317000 l 27.002400 25.317000 l cp s
1.000000 1.000000 1.000000 srgb
n 27.002400 25.317000 m 27.002400 26.317000 l 29.002400 26.317000 l 29.002400 25.317000 l f
0.100000 slw
[] 0 sd
[] 0 sd
0 slj
0.000000 0.000000 0.000000 srgb
n 27.002400 25.317000 m 27.002400 26.317000 l 29.002400 26.317000 l 29.002400 25.317000 l cp s
1.000000 1.000000 1.000000 srgb
n 29.002400 25.317000 m 29.002400 26.317000 l 31.002400 26.317000 l 31.002400 25.317000 l f
0.100000 slw
[] 0 sd
[] 0 sd
0 slj
0.000000 0.000000 0.000000 srgb
n 29.002400 25.317000 m 29.002400 26.317000 l 31.002400 26.317000 l 31.002400 25.317000 l cp s
0.100000 slw
[] 0 sd
[] 0 sd
0 slc
n 29.002400 26.317000 m 31.002400 25.317000 l s
/Helvetica-latin1 ff 0.560000 scf sf
(SP9) 25.337400 26.074900 m gs 1 -1 sc sh gr
/Helvetica-latin1 ff 0.560000 scf sf
(SP10) 27.337400 26.024900 m gs 1 -1 sc sh gr
0.100000 slw
[] 0 sd
[] 0 sd
0 slj
0 slc
n 24.353100 21.755900 m 23.848270 21.755900 l 23.848270 25.817000 l 24.515597 25.817000 l s
[] 0 sd
0 slj
0 slc
n 24.890597 25.817000 m 24.390597 26.067000 l 24.515597 25.817000 l 24.390597 25.567000 l ef
n 24.890597 25.817000 m 24.390597 26.067000 l 24.515597 25.817000 l 24.390597 25.567000 l cp s
0.100000 slw
[] 0 sd
1.000000 1.000000 1.000000 srgb
n 34.835100 23.182700 m 34.835100 25.582700 l 47.320256 25.582700 l 47.320256 23.182700 l f
0.000000 0.000000 0.000000 srgb
n 34.835100 23.182700 m 34.835100 25.582700 l 47.320256 25.582700 l 47.320256 23.182700 l cp s
/Helvetica-latin1 ff 0.700000 scf sf
(compound_stmt \(cs3\)) dup sw 2 div 41.077678 ex sub 24.182700 m gs 1 -1 sc sh gr
/Helvetica-latin1 ff 0.700000 scf sf
(Body) dup sw 2 div 41.077678 ex sub 25.182700 m gs 1 -1 sc sh gr
1.000000 1.000000 1.000000 srgb
n 34.835100 25.582700 m 34.835100 31.382700 l 47.320256 31.382700 l 47.320256 25.582700 l f
0.000000 0.000000 0.000000 srgb
n 34.835100 25.582700 m 34.835100 31.382700 l 47.320256 31.382700 l 47.320256 25.582700 l cp s
/Courier-latin1 ff 0.560000 scf sf
(+psp: sp = SP11) 34.985100 26.212388 m gs 1 -1 sc sh gr
/Courier-latin1 ff 0.560000 scf sf
(+nsp: sp = SP15) 34.985100 27.012388 m gs 1 -1 sc sh gr
/Courier-latin1 ff 0.560000 scf sf
(+sps: list sp) 34.985100 27.812388 m gs 1 -1 sc sh gr
/Courier-latin1 ff 0.560000 scf sf
(+dsp: sp = SP14) 34.985100 28.612388 m gs 1 -1 sc sh gr
/Courier-latin1 ff 0.560000 scf sf
(+statements: list statement = ...) 34.985100 29.412388 m gs 1 -1 sc sh gr
/Courier-latin1 ff 0.560000 scf sf
(+decl_seq: decl_seq) 34.985100 30.212388 m gs 1 -1 sc sh gr
/Courier-latin1 ff 0.560000 scf sf
(+parent: compound = cs2) 34.985100 31.012388 m gs 1 -1 sc sh gr
1.000000 1.000000 1.000000 srgb
n 34.835100 31.382700 m 34.835100 31.782700 l 47.320256 31.782700 l 47.320256 31.382700 l f
0.000000 0.000000 0.000000 srgb
n 34.835100 31.382700 m 34.835100 31.782700 l 47.320256 31.782700 l 47.320256 31.382700 l cp s
0.100000 slw
[] 0 sd
[] 0 sd
0 slj
0 slc
n 34.954200 16.804200 m 34.098270 16.804200 l 34.098270 24.382700 l 34.348297 24.382700 l s
[] 0 sd
0 slj
0 slc
n 34.723297 24.382700 m 34.223297 24.632700 l 34.348297 24.382700 l 34.223297 24.132700 l ef
n 34.723297 24.382700 m 34.223297 24.632700 l 34.348297 24.382700 l 34.223297 24.132700 l cp s
0.100000 slw
[] 0 sd
1.000000 1.000000 1.000000 srgb
n 22.020200 29.402000 m 22.020200 30.802000 l 32.344419 30.802000 l 32.344419 29.402000 l f
0.000000 0.000000 0.000000 srgb
n 22.020200 29.402000 m 22.020200 30.802000 l 32.344419 30.802000 l 32.344419 29.402000 l cp s
/Helvetica-latin1 ff 0.700000 scf sf
(decl_seq) dup sw 2 div 27.182309 ex sub 30.402000 m gs 1 -1 sc sh gr
1.000000 1.000000 1.000000 srgb
n 22.020200 30.802000 m 22.020200 31.802000 l 32.344419 31.802000 l 32.344419 30.802000 l f
0.000000 0.000000 0.000000 srgb
n 22.020200 30.802000 m 22.020200 31.802000 l 32.344419 31.802000 l 32.344419 30.802000 l cp s
/Courier-latin1 ff 0.560000 scf sf
(+contents: list declaration) 22.170200 31.431688 m gs 1 -1 sc sh gr
1.000000 1.000000 1.000000 srgb
n 22.020200 31.802000 m 22.020200 32.202000 l 32.344419 32.202000 l 32.344419 31.802000 l f
0.000000 0.000000 0.000000 srgb
n 22.020200 31.802000 m 22.020200 32.202000 l 32.344419 32.202000 l 32.344419 31.802000 l cp s
0.100000 slw
[] 0 sd
[] 0 sd
0 slj
0 slc
n 34.835100 30.082700 m 33.589759 30.082700 l 33.589759 30.102000 l 32.831222 30.102000 l s
[] 0 sd
0 slj
0 slc
n 32.456222 30.102000 m 32.956222 29.852000 l 32.831222 30.102000 l 32.956222 30.352000 l ef
n 32.456222 30.102000 m 32.956222 29.852000 l 32.831222 30.102000 l 32.956222 30.352000 l cp s
1.000000 1.000000 1.000000 srgb
n 14.660200 30.812800 m 14.660200 31.812800 l 16.660200 31.812800 l 16.660200 30.812800 l f
0.100000 slw
[] 0 sd
[] 0 sd
0 slj
0.000000 0.000000 0.000000 srgb
n 14.660200 30.812800 m 14.660200 31.812800 l 16.660200 31.812800 l 16.660200 30.812800 l cp s
1.000000 1.000000 1.000000 srgb
n 16.660200 30.812800 m 16.660200 31.812800 l 18.660200 31.812800 l 18.660200 30.812800 l f
0.100000 slw
[] 0 sd
[] 0 sd
0 slj
0.000000 0.000000 0.000000 srgb
n 16.660200 30.812800 m 16.660200 31.812800 l 18.660200 31.812800 l 18.660200 30.812800 l cp s
1.000000 1.000000 1.000000 srgb
n 18.660200 30.812800 m 18.660200 31.812800 l 20.660200 31.812800 l 20.660200 30.812800 l f
0.100000 slw
[] 0 sd
[] 0 sd
0 slj
0.000000 0.000000 0.000000 srgb
n 18.660200 30.812800 m 18.660200 31.812800 l 20.660200 31.812800 l 20.660200 30.812800 l cp s
0.100000 slw
[] 0 sd
[] 0 sd
0 slc
n 18.660200 31.812800 m 20.660200 30.812800 l s
0.100000 slw
[] 0 sd
[] 0 sd
0 slj
0 slc
n 22.020200 31.302000 m 21.340200 31.302000 l 21.340200 31.312800 l 21.147003 31.312800 l s
[] 0 sd
0 slj
0 slc
n 20.772003 31.312800 m 21.272003 31.062800 l 21.147003 31.312800 l 21.272003 31.562800 l ef
n 20.772003 31.312800 m 21.272003 31.062800 l 21.147003 31.312800 l 21.272003 31.562800 l cp s
0.100000 slw
[] 0 sd
1.000000 1.000000 1.000000 srgb
n 2.233670 29.132500 m 2.233670 30.532500 l 11.117264 30.532500 l 11.117264 29.132500 l f
0.000000 0.000000 0.000000 srgb
n 2.233670 29.132500 m 2.233670 30.532500 l 11.117264 30.532500 l 11.117264 29.132500 l cp s
/Helvetica-latin1 ff 0.700000 scf sf
(fake declaration) dup sw 2 div 6.675467 ex sub 30.132500 m gs 1 -1 sc sh gr
1.000000 1.000000 1.000000 srgb
n 2.233670 30.532500 m 2.233670 31.532500 l 11.117264 31.532500 l 11.117264 30.532500 l f
0.000000 0.000000 0.000000 srgb
n 2.233670 30.532500 m 2.233670 31.532500 l 11.117264 31.532500 l 11.117264 30.532500 l cp s
/Courier-latin1 ff 0.560000 scf sf
(+real decl: declaration) 2.383670 31.162188 m gs 1 -1 sc sh gr
1.000000 1.000000 1.000000 srgb
n 2.233670 31.532500 m 2.233670 31.932500 l 11.117264 31.932500 l 11.117264 31.532500 l f
0.000000 0.000000 0.000000 srgb
n 2.233670 31.532500 m 2.233670 31.932500 l 11.117264 31.932500 l 11.117264 31.532500 l cp s
0.100000 slw
[] 0 sd
[] 0 sd
0 slj
0 slc
n 14.660200 31.312800 m 12.888732 31.312800 l 12.888732 29.832500 l 11.604067 29.832500 l s
[] 0 sd
0 slj
0 slc
n 11.229067 29.832500 m 11.729067 29.582500 l 11.604067 29.832500 l 11.729067 30.082500 l ef
n 11.229067 29.832500 m 11.729067 29.582500 l 11.604067 29.832500 l 11.729067 30.082500 l cp s
0.100000 slw
[] 0 sd
[] 0 sd
0 slj
0 slc
n 17.660200 30.812800 m 17.660200 30.057400 l 17.648300 30.057400 l 17.648300 29.788803 l s
[] 0 sd
0 slj
0 slc
n 17.648300 29.413803 m 17.898300 29.913803 l 17.648300 29.788803 l 17.398300 29.913803 l ef
n 17.648300 29.413803 m 17.898300 29.913803 l 17.648300 29.788803 l 17.398300 29.913803 l cp s
0.100000 slw
[] 0 sd
[] 0 sd
0 slj
0 slc
n 2.233670 31.032500 m -0.281027 31.032500 l -0.281027 15.566003 l s
[] 0 sd
0 slj
0 slc
n -0.281027 15.191003 m -0.031027 15.691003 l -0.281027 15.566003 l -0.531027 15.691003 l ef
n -0.281027 15.191003 m -0.031027 15.691003 l -0.281027 15.566003 l -0.531027 15.691003 l cp s
1.000000 1.000000 1.000000 srgb
n 38.071300 20.568400 m 38.071300 21.568400 l 40.071300 21.568400 l 40.071300 20.568400 l f
0.100000 slw
[] 0 sd
[] 0 sd
0 slj
0.000000 0.000000 0.000000 srgb
n 38.071300 20.568400 m 38.071300 21.568400 l 40.071300 21.568400 l 40.071300 20.568400 l cp s
1.000000 1.000000 1.000000 srgb
n 40.071300 20.568400 m 40.071300 21.568400 l 42.071300 21.568400 l 42.071300 20.568400 l f
0.100000 slw
[] 0 sd
[] 0 sd
0 slj
0.000000 0.000000 0.000000 srgb
n 40.071300 20.568400 m 40.071300 21.568400 l 42.071300 21.568400 l 42.071300 20.568400 l cp s
1.000000 1.000000 1.000000 srgb
n 42.071300 20.568400 m 42.071300 21.568400 l 44.071300 21.568400 l 44.071300 20.568400 l f
0.100000 slw
[] 0 sd
[] 0 sd
0 slj
0.000000 0.000000 0.000000 srgb
n 42.071300 20.568400 m 42.071300 21.568400 l 44.071300 21.568400 l 44.071300 20.568400 l cp s
1.000000 1.000000 1.000000 srgb
n 44.071300 20.568400 m 44.071300 21.568400 l 46.071300 21.568400 l 46.071300 20.568400 l f
0.100000 slw
[] 0 sd
[] 0 sd
0 slj
0.000000 0.000000 0.000000 srgb
n 44.071300 20.568400 m 44.071300 21.568400 l 46.071300 21.568400 l 46.071300 20.568400 l cp s
0.100000 slw
[] 0 sd
[] 0 sd
0 slc
n 44.071300 21.568400 m 46.071300 20.568400 l s
/Helvetica-latin1 ff 0.560000 scf sf
(SP11) 38.506300 21.326300 m gs 1 -1 sc sh gr
/Helvetica-latin1 ff 0.560000 scf sf
(SP15) 40.306300 21.326300 m gs 1 -1 sc sh gr
/Helvetica-latin1 ff 0.560000 scf sf
(SP14) 42.256300 21.326300 m gs 1 -1 sc sh gr
0.100000 slw
[] 0 sd
[] 0 sd
0 slj
0 slc
n 47.320256 27.682700 m 47.598300 27.682700 l 47.598300 21.068400 l 46.558103 21.068400 l s
[] 0 sd
0 slj
0 slc
n 46.183103 21.068400 m 46.683103 20.818400 l 46.558103 21.068400 l 46.683103 21.318400 l ef
n 46.183103 21.068400 m 46.683103 20.818400 l 46.558103 21.068400 l 46.683103 21.318400 l cp s
/Helvetica-latin1 ff 0.910000 scf sf
(for\(int i=3; int b = i<10; i++\) stmt;) 32.028800 -5.484050 m gs 1 -1 sc sh gr
0.100000 slw
[] 0 sd
[] 0 sd
0 slc
n 38.759100 -5.072990 m 38.751106 -4.446024 l s
[] 0 sd
0 slj
0 slc
n 38.746325 -4.071054 m 38.502720 -4.574201 l 38.751106 -4.446024 l 39.002680 -4.567826 l ef
n 38.746325 -4.071054 m 38.502720 -4.574201 l 38.751106 -4.446024 l 39.002680 -4.567826 l cp s
/Helvetica-latin1 ff 0.560000 scf sf
(...) dup sw 2 div 17.613400 ex sub 28.135900 m gs 1 -1 sc sh gr
(fake b) dup sw 2 div 17.613400 ex sub 28.935900 m gs 1 -1 sc sh gr
/Helvetica-latin1 ff 0.560000 scf sf
(...) dup sw 2 div 14.398300 ex sub 13.747000 m gs 1 -1 sc sh gr
("3") dup sw 2 div 14.398300 ex sub 14.547000 m gs 1 -1 sc sh gr
/Helvetica-latin1 ff 0.560000 scf sf
(...) dup sw 2 div 34.127400 ex sub 8.837710 m gs 1 -1 sc sh gr
(fake i) dup sw 2 div 34.127400 ex sub 9.637710 m gs 1 -1 sc sh gr
(decl b) dup sw 2 div 34.127400 ex sub 10.437710 m gs 1 -1 sc sh gr
/Helvetica-latin1 ff 0.910000 scf sf
({   int i=3;  { int b=i<10; for\(; b; i++\)  {   stmt;   }   }   }) 27.655200 -2.398760 m gs 1 -1 sc sh gr
/Helvetica-latin1 ff 0.700000 scf sf
(cs1) 27.428300 -3.438010 m gs 1 -1 sc sh gr
/Helvetica-latin1 ff 0.700000 scf sf
(cs2) 31.528300 -3.388010 m gs 1 -1 sc sh gr
/Helvetica-latin1 ff 0.700000 scf sf
(cs3) 41.778300 -3.338010 m gs 1 -1 sc sh gr
/Helvetica-latin1 ff 0.700000 scf sf
(1) 27.653300 -1.450510 m gs 1 -1 sc sh gr
/Helvetica-latin1 ff 0.700000 scf sf
(...) 43.578300 -1.450510 m gs 1 -1 sc sh gr
/Helvetica-latin1 ff 0.700000 scf sf
(2) 28.598300 -1.453010 m gs 1 -1 sc sh gr
/Helvetica-latin1 ff 0.700000 scf sf
(3) 30.928300 -1.463010 m gs 1 -1 sc sh gr
/Helvetica-latin1 ff 0.700000 scf sf
(4) 31.835800 -1.465510 m gs 1 -1 sc sh gr
/Helvetica-latin1 ff 0.700000 scf sf
(5) 32.353300 -1.463010 m gs 1 -1 sc sh gr
/Helvetica-latin1 ff 0.700000 scf sf
(6) 36.176100 -1.453010 m gs 1 -1 sc sh gr
/Helvetica-latin1 ff 0.700000 scf sf
(7) 36.851100 -1.465510 m gs 1 -1 sc sh gr
/Helvetica-latin1 ff 0.700000 scf sf
(8) 39.181100 -1.463010 m gs 1 -1 sc sh gr
/Helvetica-latin1 ff 0.700000 scf sf
(9) 39.631100 -1.463010 m gs 1 -1 sc sh gr
/Helvetica-latin1 ff 0.700000 scf sf
(10) 40.751100 -1.453010 m gs 1 -1 sc sh gr
/Helvetica-latin1 ff 0.700000 scf sf
(11) 41.743600 -1.450510 m gs 1 -1 sc sh gr
/Helvetica-latin1 ff 0.700000 scf sf
(14) 44.806100 -0.613010 m gs 1 -1 sc sh gr
/Helvetica-latin1 ff 0.700000 scf sf
(15) 45.293600 -1.450510 m gs 1 -1 sc sh gr
/Helvetica-latin1 ff 0.700000 scf sf
(17) 46.506100 -1.450510 m gs 1 -1 sc sh gr
/Helvetica-latin1 ff 0.700000 scf sf
(16) 46.081100 -0.613010 m gs 1 -1 sc sh gr
/Helvetica-latin1 ff 0.700000 scf sf
(18) 47.206100 -0.613010 m gs 1 -1 sc sh gr
/Helvetica-latin1 ff 0.700000 scf sf
(19) 47.531100 -1.450510 m gs 1 -1 sc sh gr
1.000000 1.000000 1.000000 srgb
n 23.909600 14.138200 m 23.909600 15.138200 l 25.909600 15.138200 l 25.909600 14.138200 l f
0.100000 slw
[] 0 sd
[] 0 sd
0 slj
0.000000 0.000000 0.000000 srgb
n 23.909600 14.138200 m 23.909600 15.138200 l 25.909600 15.138200 l 25.909600 14.138200 l cp s
0.100000 slw
[] 0 sd
[] 0 sd
0 slc
n 23.909600 15.138200 m 25.909600 14.138200 l s
1.000000 1.000000 1.000000 srgb
n 17.919600 14.138200 m 17.919600 15.138200 l 19.919600 15.138200 l 19.919600 14.138200 l f
0.100000 slw
[] 0 sd
[] 0 sd
0 slj
0.000000 0.000000 0.000000 srgb
n 17.919600 14.138200 m 17.919600 15.138200 l 19.919600 15.138200 l 19.919600 14.138200 l cp s
1.000000 1.000000 1.000000 srgb
n 19.919600 14.138200 m 19.919600 15.138200 l 21.919600 15.138200 l 21.919600 14.138200 l f
0.100000 slw
[] 0 sd
[] 0 sd
0 slj
0.000000 0.000000 0.000000 srgb
n 19.919600 14.138200 m 19.919600 15.138200 l 21.919600 15.138200 l 21.919600 14.138200 l cp s
1.000000 1.000000 1.000000 srgb
n 21.918300 14.137000 m 21.918300 15.137000 l 23.918300 15.137000 l 23.918300 14.137000 l f
0.100000 slw
[] 0 sd
[] 0 sd
0 slj
0.000000 0.000000 0.000000 srgb
n 21.918300 14.137000 m 21.918300 15.137000 l 23.918300 15.137000 l 23.918300 14.137000 l cp s
0.100000 slw
[] 0 sd
[] 0 sd
0 slj
0 slc
n 20.919600 14.138200 m 20.919600 12.404200 l 34.467397 12.404200 l s
[] 0 sd
0 slj
0 slc
n 34.842397 12.404200 m 34.342397 12.654200 l 34.467397 12.404200 l 34.342397 12.154200 l ef
n 34.842397 12.404200 m 34.342397 12.654200 l 34.467397 12.404200 l 34.342397 12.154200 l cp s
0.100000 slw
[] 0 sd
[] 0 sd
0 slj
0 slc
n 22.918300 15.137000 m 22.918300 15.864500 l 28.728300 15.864500 l 28.728300 16.717697 l s
[] 0 sd
0 slj
0 slc
n 28.728300 17.092697 m 28.478300 16.592697 l 28.728300 16.717697 l 28.978300 16.592697 l ef
n 28.728300 17.092697 m 28.478300 16.592697 l 28.728300 16.717697 l 28.978300 16.592697 l cp s
showpage
