%!PS-Adobe-2.0 EPSF-2.0
%%Title: d008.dia
%%Creator: Dia v0.94
%%CreationDate: Thu May 26 13:51:11 2005
%%For: sandp9am
%%Orientation: Portrait
%%Magnification: 1.0000
%%BoundingBox: 0 0 894 223
%%BeginSetup
%%EndSetup
%%EndComments
%%BeginProlog
[ /.notdef /.notdef /.notdef /.notdef /.notdef /.notdef /.notdef /.notdef /.notdef /.notdef
/.notdef /.notdef /.notdef /.notdef /.notdef /.notdef /.notdef /.notdef /.notdef /.notdef
/.notdef /.notdef /.notdef /.notdef /.notdef /.notdef /.notdef /.notdef /.notdef /.notdef
/.notdef /.notdef /space /exclam /quotedbl /numbersign /dollar /percent /ampersand /quoteright
/parenleft /parenright /asterisk /plus /comma /hyphen /period /slash /zero /one
/two /three /four /five /six /seven /eight /nine /colon /semicolon
/less /equal /greater /question /at /A /B /C /D /E
/F /G /H /I /J /K /L /M /N /O
/P /Q /R /S /T /U /V /W /X /Y
/Z /bracketleft /backslash /bracketright /asciicircum /underscore /quoteleft /a /b /c
/d /e /f /g /h /i /j /k /l /m
/n /o /p /q /r /s /t /u /v /w
/x /y /z /braceleft /bar /braceright /asciitilde /.notdef /.notdef /.notdef
/.notdef /.notdef /.notdef /.notdef /.notdef /.notdef /.notdef /.notdef /.notdef /.notdef
/.notdef /.notdef /.notdef /.notdef /.notdef /.notdef /.notdef /.notdef /.notdef /.notdef
/.notdef /.notdef /.notdef /.notdef /.notdef /.notdef /.notdef /.notdef /.notdef /.notdef
/space /exclamdown /cent /sterling /currency /yen /brokenbar /section /dieresis /copyright
/ordfeminine /guillemotleft /logicalnot /hyphen /registered /macron /degree /plusminus /twosuperior /threesuperior
/acute /mu /paragraph /periodcentered /cedilla /onesuperior /ordmasculine /guillemotright /onequarter /onehalf
/threequarters /questiondown /Agrave /Aacute /Acircumflex /Atilde /Adieresis /Aring /AE /Ccedilla
/Egrave /Eacute /Ecircumflex /Edieresis /Igrave /Iacute /Icircumflex /Idieresis /Eth /Ntilde
/Ograve /Oacute /Ocircumflex /Otilde /Odieresis /multiply /Oslash /Ugrave /Uacute /Ucircumflex
/Udieresis /Yacute /Thorn /germandbls /agrave /aacute /acircumflex /atilde /adieresis /aring
/ae /ccedilla /egrave /eacute /ecircumflex /edieresis /igrave /iacute /icircumflex /idieresis
/eth /ntilde /ograve /oacute /ocircumflex /otilde /odieresis /divide /oslash /ugrave
/uacute /ucircumflex /udieresis /yacute /thorn /ydieresis] /isolatin1encoding exch def
/cp {closepath} bind def
/c {curveto} bind def
/f {fill} bind def
/a {arc} bind def
/ef {eofill} bind def
/ex {exch} bind def
/gr {grestore} bind def
/gs {gsave} bind def
/sa {save} bind def
/rs {restore} bind def
/l {lineto} bind def
/m {moveto} bind def
/rm {rmoveto} bind def
/n {newpath} bind def
/s {stroke} bind def
/sh {show} bind def
/slc {setlinecap} bind def
/slj {setlinejoin} bind def
/slw {setlinewidth} bind def
/srgb {setrgbcolor} bind def
/rot {rotate} bind def
/sc {scale} bind def
/sd {setdash} bind def
/ff {findfont} bind def
/sf {setfont} bind def
/scf {scalefont} bind def
/sw {stringwidth pop} bind def
/tr {translate} bind def

/ellipsedict 8 dict def
ellipsedict /mtrx matrix put
/ellipse
{ ellipsedict begin
   /endangle exch def
   /startangle exch def
   /yrad exch def
   /xrad exch def
   /y exch def
   /x exch def   /savematrix mtrx currentmatrix def
   x y tr xrad yrad sc
   0 0 1 startangle endangle arc
   savematrix setmatrix
   end
} def

/mergeprocs {
dup length
3 -1 roll
dup
length
dup
5 1 roll
3 -1 roll
add
array cvx
dup
3 -1 roll
0 exch
putinterval
dup
4 2 roll
putinterval
} bind def
/Times-Roman-latin1
    /Times-Roman findfont
    dup length dict begin
	{1 index /FID ne {def} {pop pop} ifelse} forall
	/Encoding isolatin1encoding def
    currentdict end
definefont pop
/Times-Italic-latin1
    /Times-Italic findfont
    dup length dict begin
	{1 index /FID ne {def} {pop pop} ifelse} forall
	/Encoding isolatin1encoding def
    currentdict end
definefont pop
/Times-Bold-latin1
    /Times-Bold findfont
    dup length dict begin
	{1 index /FID ne {def} {pop pop} ifelse} forall
	/Encoding isolatin1encoding def
    currentdict end
definefont pop
/Times-BoldItalic-latin1
    /Times-BoldItalic findfont
    dup length dict begin
	{1 index /FID ne {def} {pop pop} ifelse} forall
	/Encoding isolatin1encoding def
    currentdict end
definefont pop
/AvantGarde-Book-latin1
    /AvantGarde-Book findfont
    dup length dict begin
	{1 index /FID ne {def} {pop pop} ifelse} forall
	/Encoding isolatin1encoding def
    currentdict end
definefont pop
/AvantGarde-BookOblique-latin1
    /AvantGarde-BookOblique findfont
    dup length dict begin
	{1 index /FID ne {def} {pop pop} ifelse} forall
	/Encoding isolatin1encoding def
    currentdict end
definefont pop
/AvantGarde-Demi-latin1
    /AvantGarde-Demi findfont
    dup length dict begin
	{1 index /FID ne {def} {pop pop} ifelse} forall
	/Encoding isolatin1encoding def
    currentdict end
definefont pop
/AvantGarde-DemiOblique-latin1
    /AvantGarde-DemiOblique findfont
    dup length dict begin
	{1 index /FID ne {def} {pop pop} ifelse} forall
	/Encoding isolatin1encoding def
    currentdict end
definefont pop
/Bookman-Light-latin1
    /Bookman-Light findfont
    dup length dict begin
	{1 index /FID ne {def} {pop pop} ifelse} forall
	/Encoding isolatin1encoding def
    currentdict end
definefont pop
/Bookman-LightItalic-latin1
    /Bookman-LightItalic findfont
    dup length dict begin
	{1 index /FID ne {def} {pop pop} ifelse} forall
	/Encoding isolatin1encoding def
    currentdict end
definefont pop
/Bookman-Demi-latin1
    /Bookman-Demi findfont
    dup length dict begin
	{1 index /FID ne {def} {pop pop} ifelse} forall
	/Encoding isolatin1encoding def
    currentdict end
definefont pop
/Bookman-DemiItalic-latin1
    /Bookman-DemiItalic findfont
    dup length dict begin
	{1 index /FID ne {def} {pop pop} ifelse} forall
	/Encoding isolatin1encoding def
    currentdict end
definefont pop
/Courier-latin1
    /Courier findfont
    dup length dict begin
	{1 index /FID ne {def} {pop pop} ifelse} forall
	/Encoding isolatin1encoding def
    currentdict end
definefont pop
/Courier-Oblique-latin1
    /Courier-Oblique findfont
    dup length dict begin
	{1 index /FID ne {def} {pop pop} ifelse} forall
	/Encoding isolatin1encoding def
    currentdict end
definefont pop
/Courier-Bold-latin1
    /Courier-Bold findfont
    dup length dict begin
	{1 index /FID ne {def} {pop pop} ifelse} forall
	/Encoding isolatin1encoding def
    currentdict end
definefont pop
/Courier-BoldOblique-latin1
    /Courier-BoldOblique findfont
    dup length dict begin
	{1 index /FID ne {def} {pop pop} ifelse} forall
	/Encoding isolatin1encoding def
    currentdict end
definefont pop
/Helvetica-latin1
    /Helvetica findfont
    dup length dict begin
	{1 index /FID ne {def} {pop pop} ifelse} forall
	/Encoding isolatin1encoding def
    currentdict end
definefont pop
/Helvetica-Oblique-latin1
    /Helvetica-Oblique findfont
    dup length dict begin
	{1 index /FID ne {def} {pop pop} ifelse} forall
	/Encoding isolatin1encoding def
    currentdict end
definefont pop
/Helvetica-Bold-latin1
    /Helvetica-Bold findfont
    dup length dict begin
	{1 index /FID ne {def} {pop pop} ifelse} forall
	/Encoding isolatin1encoding def
    currentdict end
definefont pop
/Helvetica-BoldOblique-latin1
    /Helvetica-BoldOblique findfont
    dup length dict begin
	{1 index /FID ne {def} {pop pop} ifelse} forall
	/Encoding isolatin1encoding def
    currentdict end
definefont pop
/Helvetica-Narrow-latin1
    /Helvetica-Narrow findfont
    dup length dict begin
	{1 index /FID ne {def} {pop pop} ifelse} forall
	/Encoding isolatin1encoding def
    currentdict end
definefont pop
/Helvetica-Narrow-Oblique-latin1
    /Helvetica-Narrow-Oblique findfont
    dup length dict begin
	{1 index /FID ne {def} {pop pop} ifelse} forall
	/Encoding isolatin1encoding def
    currentdict end
definefont pop
/Helvetica-Narrow-Bold-latin1
    /Helvetica-Narrow-Bold findfont
    dup length dict begin
	{1 index /FID ne {def} {pop pop} ifelse} forall
	/Encoding isolatin1encoding def
    currentdict end
definefont pop
/Helvetica-Narrow-BoldOblique-latin1
    /Helvetica-Narrow-BoldOblique findfont
    dup length dict begin
	{1 index /FID ne {def} {pop pop} ifelse} forall
	/Encoding isolatin1encoding def
    currentdict end
definefont pop
/NewCenturySchoolbook-Roman-latin1
    /NewCenturySchoolbook-Roman findfont
    dup length dict begin
	{1 index /FID ne {def} {pop pop} ifelse} forall
	/Encoding isolatin1encoding def
    currentdict end
definefont pop
/NewCenturySchoolbook-Italic-latin1
    /NewCenturySchoolbook-Italic findfont
    dup length dict begin
	{1 index /FID ne {def} {pop pop} ifelse} forall
	/Encoding isolatin1encoding def
    currentdict end
definefont pop
/NewCenturySchoolbook-Bold-latin1
    /NewCenturySchoolbook-Bold findfont
    dup length dict begin
	{1 index /FID ne {def} {pop pop} ifelse} forall
	/Encoding isolatin1encoding def
    currentdict end
definefont pop
/NewCenturySchoolbook-BoldItalic-latin1
    /NewCenturySchoolbook-BoldItalic findfont
    dup length dict begin
	{1 index /FID ne {def} {pop pop} ifelse} forall
	/Encoding isolatin1encoding def
    currentdict end
definefont pop
/Palatino-Roman-latin1
    /Palatino-Roman findfont
    dup length dict begin
	{1 index /FID ne {def} {pop pop} ifelse} forall
	/Encoding isolatin1encoding def
    currentdict end
definefont pop
/Palatino-Italic-latin1
    /Palatino-Italic findfont
    dup length dict begin
	{1 index /FID ne {def} {pop pop} ifelse} forall
	/Encoding isolatin1encoding def
    currentdict end
definefont pop
/Palatino-Bold-latin1
    /Palatino-Bold findfont
    dup length dict begin
	{1 index /FID ne {def} {pop pop} ifelse} forall
	/Encoding isolatin1encoding def
    currentdict end
definefont pop
/Palatino-BoldItalic-latin1
    /Palatino-BoldItalic findfont
    dup length dict begin
	{1 index /FID ne {def} {pop pop} ifelse} forall
	/Encoding isolatin1encoding def
    currentdict end
definefont pop
/Symbol-latin1
    /Symbol findfont
definefont pop
/ZapfChancery-MediumItalic-latin1
    /ZapfChancery-MediumItalic findfont
    dup length dict begin
	{1 index /FID ne {def} {pop pop} ifelse} forall
	/Encoding isolatin1encoding def
    currentdict end
definefont pop
/ZapfDingbats-latin1
    /ZapfDingbats findfont
    dup length dict begin
	{1 index /FID ne {def} {pop pop} ifelse} forall
	/Encoding isolatin1encoding def
    currentdict end
definefont pop
28.346000 -28.346000 scale
-0.329235 -9.750000 translate
%%EndProlog


0.100000 slw
[] 0 sd
1.000000 1.000000 1.000000 srgb
n 1.850000 4.200000 m 1.850000 5.600000 l 7.062500 5.600000 l 7.062500 4.200000 l f
0.000000 0.000000 0.000000 srgb
n 1.850000 4.200000 m 1.850000 5.600000 l 7.062500 5.600000 l 7.062500 4.200000 l cp s
/Helvetica-latin1 ff 0.700000 scf sf
(ss_declseq) dup sw 2 div 4.456250 ex sub 5.200000 m gs 1 -1 sc sh gr
1.000000 1.000000 1.000000 srgb
n 1.850000 5.600000 m 1.850000 8.200000 l 7.062500 8.200000 l 7.062500 5.600000 l f
0.000000 0.000000 0.000000 srgb
n 1.850000 5.600000 m 1.850000 8.200000 l 7.062500 8.200000 l 7.062500 5.600000 l cp s
/Courier-latin1 ff 0.560000 scf sf
(+comp) 2.000000 6.229687 m gs 1 -1 sc sh gr
/Courier-latin1 ff 0.560000 scf sf
(+parent) 2.000000 7.029687 m gs 1 -1 sc sh gr
/Courier-latin1 ff 0.560000 scf sf
(+declaration) 2.000000 7.829687 m gs 1 -1 sc sh gr
0.100000 slw
[] 0 sd
1.000000 1.000000 1.000000 srgb
n 9.600000 4.100000 m 9.600000 5.500000 l 16.006250 5.500000 l 16.006250 4.100000 l f
0.000000 0.000000 0.000000 srgb
n 9.600000 4.100000 m 9.600000 5.500000 l 16.006250 5.500000 l 16.006250 4.100000 l cp s
/Helvetica-latin1 ff 0.700000 scf sf
(ss_compound) dup sw 2 div 12.803125 ex sub 5.100000 m gs 1 -1 sc sh gr
1.000000 1.000000 1.000000 srgb
n 9.600000 5.500000 m 9.600000 7.300000 l 16.006250 7.300000 l 16.006250 5.500000 l f
0.000000 0.000000 0.000000 srgb
n 9.600000 5.500000 m 9.600000 7.300000 l 16.006250 7.300000 l 16.006250 5.500000 l cp s
/Courier-latin1 ff 0.560000 scf sf
(+declseq) 9.750000 6.129687 m gs 1 -1 sc sh gr
/Courier-latin1 ff 0.560000 scf sf
(+parent) 9.750000 6.929687 m gs 1 -1 sc sh gr
0.100000 slw
[] 0 sd
1.000000 1.000000 1.000000 srgb
n 17.200000 4.100000 m 17.200000 5.500000 l 23.567188 5.500000 l 23.567188 4.100000 l f
0.000000 0.000000 0.000000 srgb
n 17.200000 4.100000 m 17.200000 5.500000 l 23.567188 5.500000 l 23.567188 4.100000 l cp s
/Helvetica-latin1 ff 0.700000 scf sf
(ss_class_decl) dup sw 2 div 20.383594 ex sub 5.100000 m gs 1 -1 sc sh gr
1.000000 1.000000 1.000000 srgb
n 17.200000 5.500000 m 17.200000 8.100000 l 23.567188 8.100000 l 23.567188 5.500000 l f
0.000000 0.000000 0.000000 srgb
n 17.200000 5.500000 m 17.200000 8.100000 l 23.567188 8.100000 l 23.567188 5.500000 l cp s
/Courier-latin1 ff 0.560000 scf sf
(+type) 17.350000 6.129687 m gs 1 -1 sc sh gr
/Courier-latin1 ff 0.560000 scf sf
(+declseq) 17.350000 6.929687 m gs 1 -1 sc sh gr
/Courier-latin1 ff 0.560000 scf sf
(+bases) 17.350000 7.729687 m gs 1 -1 sc sh gr
0.100000 slw
[] 0 sd
1.000000 1.000000 1.000000 srgb
n 25.650000 4.050000 m 25.650000 5.450000 l 30.211719 5.450000 l 30.211719 4.050000 l f
0.000000 0.000000 0.000000 srgb
n 25.650000 4.050000 m 25.650000 5.450000 l 30.211719 5.450000 l 30.211719 4.050000 l cp s
/Helvetica-latin1 ff 0.700000 scf sf
(ss_class) dup sw 2 div 27.930859 ex sub 5.050000 m gs 1 -1 sc sh gr
1.000000 1.000000 1.000000 srgb
n 25.650000 5.450000 m 25.650000 8.050000 l 30.211719 8.050000 l 30.211719 5.450000 l f
0.000000 0.000000 0.000000 srgb
n 25.650000 5.450000 m 25.650000 8.050000 l 30.211719 8.050000 l 30.211719 5.450000 l cp s
/Courier-latin1 ff 0.560000 scf sf
(+completion) 25.800000 6.079687 m gs 1 -1 sc sh gr
/Courier-latin1 ff 0.560000 scf sf
(+declseq) 25.800000 6.879687 m gs 1 -1 sc sh gr
/Courier-latin1 ff 0.560000 scf sf
(+bases) 25.800000 7.679687 m gs 1 -1 sc sh gr
0.100000 slw
[] 0 sd
[] 0 sd
0 slc
n 1.850000 6.900000 m 0.866038 6.900000 l s
[] 0 sd
0 slj
0 slc
n 0.491038 6.900000 m 0.991038 6.650000 l 0.866038 6.900000 l 0.991038 7.150000 l ef
n 0.491038 6.900000 m 0.991038 6.650000 l 0.866038 6.900000 l 0.991038 7.150000 l cp s
0.100000 slw
[] 0 sd
[] 0 sd
0 slc
n 9.600000 6.000000 m 7.509142 5.093618 l s
[] 0 sd
0 slj
0 slc
n 7.165080 4.944468 m 7.723264 4.913960 l 7.509142 5.093618 l 7.524396 5.372710 l ef
n 7.165080 4.944468 m 7.723264 4.913960 l 7.509142 5.093618 l 7.524396 5.372710 l cp s
0.100000 slw
[] 0 sd
[] 0 sd
0 slj
0 slc
n 17.200000 6.800000 m 16.529235 6.800000 l 16.529235 1.950000 l 4.456250 1.950000 l 4.456250 3.713197 l s
[] 0 sd
0 slj
0 slc
n 4.456250 4.088197 m 4.206250 3.588197 l 4.456250 3.713197 l 4.706250 3.588197 l ef
n 4.456250 4.088197 m 4.206250 3.588197 l 4.456250 3.713197 l 4.706250 3.588197 l cp s
0.100000 slw
[] 0 sd
[] 0 sd
0 slj
0 slc
n 25.650000 6.750000 m 24.150000 6.750000 l 24.150000 1.950000 l 4.456250 1.950000 l 4.456250 3.713197 l s
[] 0 sd
0 slj
0 slc
n 4.456250 4.088197 m 4.206250 3.588197 l 4.456250 3.713197 l 4.706250 3.588197 l ef
n 4.456250 4.088197 m 4.206250 3.588197 l 4.456250 3.713197 l 4.706250 3.588197 l cp s
0.100000 slw
[] 0 sd
[] 0 sd
0 slc
n 30.211719 7.550000 m 31.292679 7.515520 l s
[] 0 sd
0 slj
0 slc
n 31.667488 7.503564 m 31.175713 7.769378 l 31.292679 7.515520 l 31.159772 7.269632 l ef
n 31.667488 7.503564 m 31.175713 7.769378 l 31.292679 7.515520 l 31.159772 7.269632 l cp s
0.100000 slw
[] 0 sd
[] 0 sd
0 slj
0 slc
n 7.062500 6.100000 m 8.550000 6.100000 l 8.550000 4.800000 l 9.113197 4.800000 l s
[] 0 sd
0 slj
0 slc
n 9.488197 4.800000 m 8.988197 5.050000 l 9.113197 4.800000 l 8.988197 4.550000 l ef
n 9.488197 4.800000 m 8.988197 5.050000 l 9.113197 4.800000 l 8.988197 4.550000 l cp s
0.100000 slw
[] 0 sd
[] 0 sd
0 slj
0 slc
n 23.567188 6.000000 m 24.608594 6.000000 l 24.608594 4.750000 l 25.163197 4.750000 l s
[] 0 sd
0 slj
0 slc
n 25.538197 4.750000 m 25.038197 5.000000 l 25.163197 4.750000 l 25.038197 4.500000 l ef
n 25.538197 4.750000 m 25.038197 5.000000 l 25.163197 4.750000 l 25.038197 4.500000 l cp s
0.100000 slw
[] 0 sd
[] 0 sd
0 slj
0 slc
n 9.600000 6.800000 m 8.550000 6.800000 l 8.550000 9.250000 l 0.916038 9.250000 l s
[] 0 sd
0 slj
0 slc
n 0.541038 9.250000 m 1.041038 9.000000 l 0.916038 9.250000 l 1.041038 9.500000 l ef
n 0.541038 9.250000 m 1.041038 9.000000 l 0.916038 9.250000 l 1.041038 9.500000 l cp s
showpage
