%!PS-Adobe-2.0 EPSF-2.0
%%Title: simple_declaration.dia
%%Creator: Dia v0.94
%%CreationDate: Thu May 26 13:25:37 2005
%%For: tichm9am
%%Orientation: Portrait
%%Magnification: 1.0000
%%BoundingBox: 0 0 1421 684
%%BeginSetup
%%EndSetup
%%EndComments
%%BeginProlog
[ /.notdef /.notdef /.notdef /.notdef /.notdef /.notdef /.notdef /.notdef /.notdef /.notdef
/.notdef /.notdef /.notdef /.notdef /.notdef /.notdef /.notdef /.notdef /.notdef /.notdef
/.notdef /.notdef /.notdef /.notdef /.notdef /.notdef /.notdef /.notdef /.notdef /.notdef
/.notdef /.notdef /space /exclam /quotedbl /numbersign /dollar /percent /ampersand /quoteright
/parenleft /parenright /asterisk /plus /comma /hyphen /period /slash /zero /one
/two /three /four /five /six /seven /eight /nine /colon /semicolon
/less /equal /greater /question /at /A /B /C /D /E
/F /G /H /I /J /K /L /M /N /O
/P /Q /R /S /T /U /V /W /X /Y
/Z /bracketleft /backslash /bracketright /asciicircum /underscore /quoteleft /a /b /c
/d /e /f /g /h /i /j /k /l /m
/n /o /p /q /r /s /t /u /v /w
/x /y /z /braceleft /bar /braceright /asciitilde /.notdef /.notdef /.notdef
/.notdef /.notdef /.notdef /.notdef /.notdef /.notdef /.notdef /.notdef /.notdef /.notdef
/.notdef /.notdef /.notdef /.notdef /.notdef /.notdef /.notdef /.notdef /.notdef /.notdef
/.notdef /.notdef /.notdef /.notdef /.notdef /.notdef /.notdef /.notdef /.notdef /.notdef
/space /exclamdown /cent /sterling /currency /yen /brokenbar /section /dieresis /copyright
/ordfeminine /guillemotleft /logicalnot /hyphen /registered /macron /degree /plusminus /twosuperior /threesuperior
/acute /mu /paragraph /periodcentered /cedilla /onesuperior /ordmasculine /guillemotright /onequarter /onehalf
/threequarters /questiondown /Agrave /Aacute /Acircumflex /Atilde /Adieresis /Aring /AE /Ccedilla
/Egrave /Eacute /Ecircumflex /Edieresis /Igrave /Iacute /Icircumflex /Idieresis /Eth /Ntilde
/Ograve /Oacute /Ocircumflex /Otilde /Odieresis /multiply /Oslash /Ugrave /Uacute /Ucircumflex
/Udieresis /Yacute /Thorn /germandbls /agrave /aacute /acircumflex /atilde /adieresis /aring
/ae /ccedilla /egrave /eacute /ecircumflex /edieresis /igrave /iacute /icircumflex /idieresis
/eth /ntilde /ograve /oacute /ocircumflex /otilde /odieresis /divide /oslash /ugrave
/uacute /ucircumflex /udieresis /yacute /thorn /ydieresis] /isolatin1encoding exch def
/cp {closepath} bind def
/c {curveto} bind def
/f {fill} bind def
/a {arc} bind def
/ef {eofill} bind def
/ex {exch} bind def
/gr {grestore} bind def
/gs {gsave} bind def
/sa {save} bind def
/rs {restore} bind def
/l {lineto} bind def
/m {moveto} bind def
/rm {rmoveto} bind def
/n {newpath} bind def
/s {stroke} bind def
/sh {show} bind def
/slc {setlinecap} bind def
/slj {setlinejoin} bind def
/slw {setlinewidth} bind def
/srgb {setrgbcolor} bind def
/rot {rotate} bind def
/sc {scale} bind def
/sd {setdash} bind def
/ff {findfont} bind def
/sf {setfont} bind def
/scf {scalefont} bind def
/sw {stringwidth pop} bind def
/tr {translate} bind def

/ellipsedict 8 dict def
ellipsedict /mtrx matrix put
/ellipse
{ ellipsedict begin
   /endangle exch def
   /startangle exch def
   /yrad exch def
   /xrad exch def
   /y exch def
   /x exch def   /savematrix mtrx currentmatrix def
   x y tr xrad yrad sc
   0 0 1 startangle endangle arc
   savematrix setmatrix
   end
} def

/mergeprocs {
dup length
3 -1 roll
dup
length
dup
5 1 roll
3 -1 roll
add
array cvx
dup
3 -1 roll
0 exch
putinterval
dup
4 2 roll
putinterval
} bind def
/Times-Roman-latin1
    /Times-Roman findfont
    dup length dict begin
	{1 index /FID ne {def} {pop pop} ifelse} forall
	/Encoding isolatin1encoding def
    currentdict end
definefont pop
/Times-Italic-latin1
    /Times-Italic findfont
    dup length dict begin
	{1 index /FID ne {def} {pop pop} ifelse} forall
	/Encoding isolatin1encoding def
    currentdict end
definefont pop
/Times-Bold-latin1
    /Times-Bold findfont
    dup length dict begin
	{1 index /FID ne {def} {pop pop} ifelse} forall
	/Encoding isolatin1encoding def
    currentdict end
definefont pop
/Times-BoldItalic-latin1
    /Times-BoldItalic findfont
    dup length dict begin
	{1 index /FID ne {def} {pop pop} ifelse} forall
	/Encoding isolatin1encoding def
    currentdict end
definefont pop
/AvantGarde-Book-latin1
    /AvantGarde-Book findfont
    dup length dict begin
	{1 index /FID ne {def} {pop pop} ifelse} forall
	/Encoding isolatin1encoding def
    currentdict end
definefont pop
/AvantGarde-BookOblique-latin1
    /AvantGarde-BookOblique findfont
    dup length dict begin
	{1 index /FID ne {def} {pop pop} ifelse} forall
	/Encoding isolatin1encoding def
    currentdict end
definefont pop
/AvantGarde-Demi-latin1
    /AvantGarde-Demi findfont
    dup length dict begin
	{1 index /FID ne {def} {pop pop} ifelse} forall
	/Encoding isolatin1encoding def
    currentdict end
definefont pop
/AvantGarde-DemiOblique-latin1
    /AvantGarde-DemiOblique findfont
    dup length dict begin
	{1 index /FID ne {def} {pop pop} ifelse} forall
	/Encoding isolatin1encoding def
    currentdict end
definefont pop
/Bookman-Light-latin1
    /Bookman-Light findfont
    dup length dict begin
	{1 index /FID ne {def} {pop pop} ifelse} forall
	/Encoding isolatin1encoding def
    currentdict end
definefont pop
/Bookman-LightItalic-latin1
    /Bookman-LightItalic findfont
    dup length dict begin
	{1 index /FID ne {def} {pop pop} ifelse} forall
	/Encoding isolatin1encoding def
    currentdict end
definefont pop
/Bookman-Demi-latin1
    /Bookman-Demi findfont
    dup length dict begin
	{1 index /FID ne {def} {pop pop} ifelse} forall
	/Encoding isolatin1encoding def
    currentdict end
definefont pop
/Bookman-DemiItalic-latin1
    /Bookman-DemiItalic findfont
    dup length dict begin
	{1 index /FID ne {def} {pop pop} ifelse} forall
	/Encoding isolatin1encoding def
    currentdict end
definefont pop
/Courier-latin1
    /Courier findfont
    dup length dict begin
	{1 index /FID ne {def} {pop pop} ifelse} forall
	/Encoding isolatin1encoding def
    currentdict end
definefont pop
/Courier-Oblique-latin1
    /Courier-Oblique findfont
    dup length dict begin
	{1 index /FID ne {def} {pop pop} ifelse} forall
	/Encoding isolatin1encoding def
    currentdict end
definefont pop
/Courier-Bold-latin1
    /Courier-Bold findfont
    dup length dict begin
	{1 index /FID ne {def} {pop pop} ifelse} forall
	/Encoding isolatin1encoding def
    currentdict end
definefont pop
/Courier-BoldOblique-latin1
    /Courier-BoldOblique findfont
    dup length dict begin
	{1 index /FID ne {def} {pop pop} ifelse} forall
	/Encoding isolatin1encoding def
    currentdict end
definefont pop
/Helvetica-latin1
    /Helvetica findfont
    dup length dict begin
	{1 index /FID ne {def} {pop pop} ifelse} forall
	/Encoding isolatin1encoding def
    currentdict end
definefont pop
/Helvetica-Oblique-latin1
    /Helvetica-Oblique findfont
    dup length dict begin
	{1 index /FID ne {def} {pop pop} ifelse} forall
	/Encoding isolatin1encoding def
    currentdict end
definefont pop
/Helvetica-Bold-latin1
    /Helvetica-Bold findfont
    dup length dict begin
	{1 index /FID ne {def} {pop pop} ifelse} forall
	/Encoding isolatin1encoding def
    currentdict end
definefont pop
/Helvetica-BoldOblique-latin1
    /Helvetica-BoldOblique findfont
    dup length dict begin
	{1 index /FID ne {def} {pop pop} ifelse} forall
	/Encoding isolatin1encoding def
    currentdict end
definefont pop
/Helvetica-Narrow-latin1
    /Helvetica-Narrow findfont
    dup length dict begin
	{1 index /FID ne {def} {pop pop} ifelse} forall
	/Encoding isolatin1encoding def
    currentdict end
definefont pop
/Helvetica-Narrow-Oblique-latin1
    /Helvetica-Narrow-Oblique findfont
    dup length dict begin
	{1 index /FID ne {def} {pop pop} ifelse} forall
	/Encoding isolatin1encoding def
    currentdict end
definefont pop
/Helvetica-Narrow-Bold-latin1
    /Helvetica-Narrow-Bold findfont
    dup length dict begin
	{1 index /FID ne {def} {pop pop} ifelse} forall
	/Encoding isolatin1encoding def
    currentdict end
definefont pop
/Helvetica-Narrow-BoldOblique-latin1
    /Helvetica-Narrow-BoldOblique findfont
    dup length dict begin
	{1 index /FID ne {def} {pop pop} ifelse} forall
	/Encoding isolatin1encoding def
    currentdict end
definefont pop
/NewCenturySchoolbook-Roman-latin1
    /NewCenturySchoolbook-Roman findfont
    dup length dict begin
	{1 index /FID ne {def} {pop pop} ifelse} forall
	/Encoding isolatin1encoding def
    currentdict end
definefont pop
/NewCenturySchoolbook-Italic-latin1
    /NewCenturySchoolbook-Italic findfont
    dup length dict begin
	{1 index /FID ne {def} {pop pop} ifelse} forall
	/Encoding isolatin1encoding def
    currentdict end
definefont pop
/NewCenturySchoolbook-Bold-latin1
    /NewCenturySchoolbook-Bold findfont
    dup length dict begin
	{1 index /FID ne {def} {pop pop} ifelse} forall
	/Encoding isolatin1encoding def
    currentdict end
definefont pop
/NewCenturySchoolbook-BoldItalic-latin1
    /NewCenturySchoolbook-BoldItalic findfont
    dup length dict begin
	{1 index /FID ne {def} {pop pop} ifelse} forall
	/Encoding isolatin1encoding def
    currentdict end
definefont pop
/Palatino-Roman-latin1
    /Palatino-Roman findfont
    dup length dict begin
	{1 index /FID ne {def} {pop pop} ifelse} forall
	/Encoding isolatin1encoding def
    currentdict end
definefont pop
/Palatino-Italic-latin1
    /Palatino-Italic findfont
    dup length dict begin
	{1 index /FID ne {def} {pop pop} ifelse} forall
	/Encoding isolatin1encoding def
    currentdict end
definefont pop
/Palatino-Bold-latin1
    /Palatino-Bold findfont
    dup length dict begin
	{1 index /FID ne {def} {pop pop} ifelse} forall
	/Encoding isolatin1encoding def
    currentdict end
definefont pop
/Palatino-BoldItalic-latin1
    /Palatino-BoldItalic findfont
    dup length dict begin
	{1 index /FID ne {def} {pop pop} ifelse} forall
	/Encoding isolatin1encoding def
    currentdict end
definefont pop
/Symbol-latin1
    /Symbol findfont
definefont pop
/ZapfChancery-MediumItalic-latin1
    /ZapfChancery-MediumItalic findfont
    dup length dict begin
	{1 index /FID ne {def} {pop pop} ifelse} forall
	/Encoding isolatin1encoding def
    currentdict end
definefont pop
/ZapfDingbats-latin1
    /ZapfDingbats findfont
    dup length dict begin
	{1 index /FID ne {def} {pop pop} ifelse} forall
	/Encoding isolatin1encoding def
    currentdict end
definefont pop
28.346000 -28.346000 scale
-0.950000 -24.050000 translate
%%EndProlog


0.100000 slw
[] 0 sd
[] 0 sd
0 slc
0 slj
0 slc
0 slj
[] 0 sd
1.000000 1.000000 1.000000 srgb
n 1.000000 2.000000 m 7.000000 2.000000 l 7.000000 5.428571 l 5.800000 4.857143 5.200000 4.857143 4.000000 5.428571 c 2.800000 6.000000 2.200000 6.000000 1.000000 5.428571 c 1.000000 2.000000 l ef
0.000000 0.000000 0.000000 srgb
n 1.000000 2.000000 m 7.000000 2.000000 l 7.000000 5.428571 l 5.800000 4.857143 5.200000 4.857143 4.000000 5.428571 c 2.800000 6.000000 2.200000 6.000000 1.000000 5.428571 c 1.000000 2.000000 l s
/Helvetica-latin1 ff 0.560000 scf sf
/Helvetica-latin1 ff 0.560000 scf sf
(SOURCE PROGRAM) dup sw 2 div 4.000000 ex sub 1.000000 m gs 1 -1 sc sh gr
0.100000 slw
[] 0 sd
[] 0 sd
0 slj
n 1.000000 9.000000 m 1.000000 14.000000 l 6.000000 14.000000 l 6.000000 9.000000 l cp s
/Helvetica-latin1 ff 0.560000 scf sf
(parser) dup sw 2 div 3.500000 ex sub 11.686719 m gs 1 -1 sc sh gr
0.100000 slw
[0.200000] 0 sd
[0.200000] 0 sd
0 slj
0 slc
n 4.000000 5.428570 m 4.000000 7.214290 l 3.500000 7.214290 l 3.500000 8.513197 l s
[] 0 sd
0 slj
0 slc
n 3.500000 8.888197 m 3.250000 8.388197 l 3.500000 8.513197 l 3.750000 8.388197 l ef
n 3.500000 8.888197 m 3.250000 8.388197 l 3.500000 8.513197 l 3.750000 8.388197 l cp s
0.100000 slw
[] 0 sd
[] 0 sd
0 slj
n 19.000000 2.000000 m 19.000000 7.000000 l 24.000000 7.000000 l 24.000000 2.000000 l cp s
/Helvetica-latin1 ff 0.560000 scf sf
(simple) dup sw 2 div 21.500000 ex sub 3.886719 m gs 1 -1 sc sh gr
(declaration) dup sw 2 div 21.500000 ex sub 4.686719 m gs 1 -1 sc sh gr
(processor) dup sw 2 div 21.500000 ex sub 5.486719 m gs 1 -1 sc sh gr
0.100000 slw
[] 0 sd
[] 0 sd
0 slj
n 16.000000 10.000000 m 16.000000 15.000000 l 21.000000 15.000000 l 21.000000 10.000000 l cp s
/Helvetica-latin1 ff 0.560000 scf sf
(declaration) dup sw 2 div 18.500000 ex sub 11.486719 m gs 1 -1 sc sh gr
(specifier) dup sw 2 div 18.500000 ex sub 12.286719 m gs 1 -1 sc sh gr
(sequence) dup sw 2 div 18.500000 ex sub 13.086719 m gs 1 -1 sc sh gr
(processor) dup sw 2 div 18.500000 ex sub 13.886719 m gs 1 -1 sc sh gr
0.100000 slw
[] 0 sd
[] 0 sd
0 slj
n 16.000000 18.000000 m 16.000000 23.000000 l 21.000000 23.000000 l 21.000000 18.000000 l cp s
/Helvetica-latin1 ff 0.560000 scf sf
(declaration) dup sw 2 div 18.500000 ex sub 19.886719 m gs 1 -1 sc sh gr
(specifier) dup sw 2 div 18.500000 ex sub 20.686719 m gs 1 -1 sc sh gr
(visitor) dup sw 2 div 18.500000 ex sub 21.486719 m gs 1 -1 sc sh gr
0.100000 slw
[] 0 sd
[] 0 sd
0 slj
n 22.000000 10.000000 m 22.000000 15.000000 l 27.000000 15.000000 l 27.000000 10.000000 l cp s
/Helvetica-latin1 ff 0.560000 scf sf
(declarator) dup sw 2 div 24.500000 ex sub 11.886719 m gs 1 -1 sc sh gr
(type) dup sw 2 div 24.500000 ex sub 12.686719 m gs 1 -1 sc sh gr
(processor) dup sw 2 div 24.500000 ex sub 13.486719 m gs 1 -1 sc sh gr
0.100000 slw
[] 0 sd
[] 0 sd
0 slj
n 22.000000 18.000000 m 22.000000 23.000000 l 27.000000 23.000000 l 27.000000 18.000000 l cp s
/Helvetica-latin1 ff 0.560000 scf sf
(declarator) dup sw 2 div 24.500000 ex sub 19.886719 m gs 1 -1 sc sh gr
(operator) dup sw 2 div 24.500000 ex sub 20.686719 m gs 1 -1 sc sh gr
(visitor) dup sw 2 div 24.500000 ex sub 21.486719 m gs 1 -1 sc sh gr
0.100000 slw
[] 0 sd
[] 0 sd
0 slj
n 29.000000 9.000000 m 29.000000 14.000000 l 34.000000 14.000000 l 34.000000 9.000000 l cp s
/Helvetica-latin1 ff 0.560000 scf sf
(declaration) dup sw 2 div 31.500000 ex sub 11.286719 m gs 1 -1 sc sh gr
(visitor) dup sw 2 div 31.500000 ex sub 12.086719 m gs 1 -1 sc sh gr
0.100000 slw
[] 0 sd
[] 0 sd
0 slj
n 29.000000 2.000000 m 29.000000 7.000000 l 34.000000 7.000000 l 34.000000 2.000000 l cp s
/Helvetica-latin1 ff 0.560000 scf sf
(lookup) dup sw 2 div 31.500000 ex sub 4.686719 m gs 1 -1 sc sh gr
0.100000 slw
[] 0 sd
[] 0 sd
0 slj
0 slc
n 24.000000 2.000000 m 24.000000 2.000000 l 28.513197 2.000000 l s
[] 0 sd
0 slj
0 slc
n 28.888197 2.000000 m 28.388197 2.250000 l 28.513197 2.000000 l 28.388197 1.750000 l ef
n 28.888197 2.000000 m 28.388197 2.250000 l 28.513197 2.000000 l 28.388197 1.750000 l cp s
0.100000 slw
[0.200000] 0 sd
[0.200000] 0 sd
0 slj
0 slc
n 31.500000 7.000000 m 31.500000 7.000000 l 31.500000 8.513197 l s
[] 0 sd
0 slj
0 slc
n 31.500000 8.888197 m 31.250000 8.388197 l 31.500000 8.513197 l 31.750000 8.388197 l ef
n 31.500000 8.888197 m 31.250000 8.388197 l 31.500000 8.513197 l 31.750000 8.388197 l cp s
0.100000 slw
[0.200000] 0 sd
[0.200000] 0 sd
0 slj
0 slc
n 29.000000 9.000000 m 28.000000 9.000000 l 28.000000 4.500000 l 24.486803 4.500000 l s
[] 0 sd
0 slj
0 slc
n 24.111803 4.500000 m 24.611803 4.250000 l 24.486803 4.500000 l 24.611803 4.750000 l ef
n 24.111803 4.500000 m 24.611803 4.250000 l 24.486803 4.500000 l 24.611803 4.750000 l cp s
0.100000 slw
[] 0 sd
[] 0 sd
0 slj
0 slc
n 19.000000 7.000000 m 19.000000 8.500000 l 21.000000 8.500000 l 21.000000 9.513197 l s
[] 0 sd
0 slj
0 slc
n 21.000000 9.888197 m 20.750000 9.388197 l 21.000000 9.513197 l 21.250000 9.388197 l ef
n 21.000000 9.888197 m 20.750000 9.388197 l 21.000000 9.513197 l 21.250000 9.388197 l cp s
0.100000 slw
[] 0 sd
[] 0 sd
0 slj
0 slc
n 17.250000 15.000000 m 17.250000 15.000000 l 17.250000 17.513197 l s
[] 0 sd
0 slj
0 slc
n 17.250000 17.888197 m 17.000000 17.388197 l 17.250000 17.513197 l 17.500000 17.388197 l ef
n 17.250000 17.888197 m 17.000000 17.388197 l 17.250000 17.513197 l 17.500000 17.388197 l cp s
0.100000 slw
[] 0 sd
[] 0 sd
0 slj
0 slc
n 24.000000 7.000000 m 24.000000 8.500000 l 22.000000 8.500000 l 22.000000 9.513197 l s
[] 0 sd
0 slj
0 slc
n 22.000000 9.888197 m 21.750000 9.388197 l 22.000000 9.513197 l 22.250000 9.388197 l ef
n 22.000000 9.888197 m 21.750000 9.388197 l 22.000000 9.513197 l 22.250000 9.388197 l cp s
0.100000 slw
[] 0 sd
[] 0 sd
0 slj
0 slc
n 23.250000 15.000000 m 23.250000 15.000000 l 23.250000 17.513197 l s
[] 0 sd
0 slj
0 slc
n 23.250000 17.888197 m 23.000000 17.388197 l 23.250000 17.513197 l 23.500000 17.388197 l ef
n 23.250000 17.888197 m 23.000000 17.388197 l 23.250000 17.513197 l 23.500000 17.388197 l cp s
0.100000 slw
[0.200000] 0 sd
[0.200000] 0 sd
0 slj
0 slc
n 25.750000 18.000000 m 25.750000 18.000000 l 25.750000 15.486803 l s
[] 0 sd
0 slj
0 slc
n 25.750000 15.111803 m 26.000000 15.611803 l 25.750000 15.486803 l 25.500000 15.611803 l ef
n 25.750000 15.111803 m 26.000000 15.611803 l 25.750000 15.486803 l 25.500000 15.611803 l cp s
0.100000 slw
[0.200000] 0 sd
[0.200000] 0 sd
0 slj
0 slc
n 25.750000 10.000000 m 25.750000 5.750000 l 24.486803 5.750000 l s
[] 0 sd
0 slj
0 slc
n 24.111803 5.750000 m 24.611803 5.500000 l 24.486803 5.750000 l 24.611803 6.000000 l ef
n 24.111803 5.750000 m 24.611803 5.500000 l 24.486803 5.750000 l 24.611803 6.000000 l cp s
0.100000 slw
[0.200000] 0 sd
[0.200000] 0 sd
0 slj
0 slc
n 19.750000 18.000000 m 19.750000 18.000000 l 19.750000 15.486803 l s
[] 0 sd
0 slj
0 slc
n 19.750000 15.111803 m 20.000000 15.611803 l 19.750000 15.486803 l 19.500000 15.611803 l ef
n 19.750000 15.111803 m 20.000000 15.611803 l 19.750000 15.486803 l 19.500000 15.611803 l cp s
0.100000 slw
[] 0 sd
[] 0 sd
0 slc
0 slj
0 slc
0 slj
[] 0 sd
n 10.000000 10.000000 m 10.000000 15.000000 l 15.000000 15.000000 l 15.000000 10.000000 l cp s
0 slc
0 slj
[] 0 sd
n 10.500000 10.000000 m 10.500000 15.000000 l s
0 slc
0 slj
[] 0 sd
n 10.000000 10.500000 m 15.000000 10.500000 l s
/Helvetica-latin1 ff 0.560000 scf sf
(context) dup sw 2 div 12.750000 ex sub 12.936719 m gs 1 -1 sc sh gr
0.100000 slw
[0.200000] 0 sd
[0.200000] 0 sd
0 slj
0 slc
n 19.000000 3.250000 m 12.500000 3.250000 l 12.500000 9.513197 l s
[] 0 sd
0 slj
0 slc
n 12.500000 9.888197 m 12.250000 9.388197 l 12.500000 9.513197 l 12.750000 9.388197 l ef
n 12.500000 9.888197 m 12.250000 9.388197 l 12.500000 9.513197 l 12.750000 9.388197 l cp s
0.100000 slw
[0.200000] 0 sd
[0.200000] 0 sd
0 slj
0 slc
n 13.750000 10.000000 m 13.750000 4.500000 l 18.513197 4.500000 l s
[] 0 sd
0 slj
0 slc
n 18.888197 4.500000 m 18.388197 4.750000 l 18.513197 4.500000 l 18.388197 4.250000 l ef
n 18.888197 4.500000 m 18.388197 4.750000 l 18.513197 4.500000 l 18.388197 4.250000 l cp s
0.100000 slw
[] 0 sd
[] 0 sd
0 slj
0 slc
n 6.000000 9.000000 m 8.000000 9.000000 l 8.000000 1.000000 l 20.250000 1.000000 l 20.250000 1.513197 l s
[] 0 sd
0 slj
0 slc
n 20.250000 1.888197 m 20.000000 1.388197 l 20.250000 1.513197 l 20.500000 1.388197 l ef
n 20.250000 1.888197 m 20.000000 1.388197 l 20.250000 1.513197 l 20.500000 1.388197 l cp s
0.100000 slw
[0.200000] 0 sd
[0.200000] 0 sd
0 slj
0 slc
n 16.000000 10.000000 m 16.000000 5.750000 l 18.513197 5.750000 l s
[] 0 sd
0 slj
0 slc
n 18.888197 5.750000 m 18.388197 6.000000 l 18.513197 5.750000 l 18.388197 5.500000 l ef
n 18.888197 5.750000 m 18.388197 6.000000 l 18.513197 5.750000 l 18.388197 5.500000 l cp s
/Helvetica-latin1 ff 0.560000 scf sf
(declarator specifier sequence parsed) dup sw 2 div 14.200000 ex sub 0.738281 m gs 1 -1 sc sh gr
/Helvetica-latin1 ff 0.560000 scf sf
(2) dup sw 2 div 15.000000 ex sub 3.113280 m gs 1 -1 sc sh gr
/Helvetica-latin1 ff 0.560000 scf sf
(3) dup sw 2 div 15.050000 ex sub 4.213280 m gs 1 -1 sc sh gr
/Helvetica-latin1 ff 0.560000 scf sf
(4) dup sw 2 div 19.850000 ex sub 7.663280 m gs 1 -1 sc sh gr
/Helvetica-latin1 ff 0.560000 scf sf
(5) dup sw 2 div 17.450000 ex sub 5.513280 m gs 1 -1 sc sh gr
/Helvetica-latin1 ff 0.560000 scf sf
(6) dup sw 2 div 23.450000 ex sub 7.863280 m gs 1 -1 sc sh gr
/Helvetica-latin1 ff 0.560000 scf sf
(7) dup sw 2 div 25.450000 ex sub 8.013280 m gs 1 -1 sc sh gr
/Helvetica-latin1 ff 0.560000 scf sf
(10) dup sw 2 div 22.850000 ex sub 17.213300 m gs 1 -1 sc sh gr
/Helvetica-latin1 ff 0.560000 scf sf
(11) dup sw 2 div 25.350000 ex sub 17.413300 m gs 1 -1 sc sh gr
/Helvetica-latin1 ff 0.560000 scf sf
/Helvetica-latin1 ff 0.560000 scf sf
(12) dup sw 2 div 26.650000 ex sub 1.813280 m gs 1 -1 sc sh gr
/Helvetica-latin1 ff 0.560000 scf sf
(8) dup sw 2 div 16.950000 ex sub 17.113300 m gs 1 -1 sc sh gr
/Helvetica-latin1 ff 0.560000 scf sf
(9) dup sw 2 div 19.350000 ex sub 17.413300 m gs 1 -1 sc sh gr
/Helvetica-latin1 ff 0.560000 scf sf
(13) dup sw 2 div 31.000000 ex sub 8.050000 m gs 1 -1 sc sh gr
/Helvetica-latin1 ff 0.560000 scf sf
(1) dup sw 2 div 4.500000 ex sub 6.963280 m gs 1 -1 sc sh gr
0.100000 slw
[] 0 sd
[] 0 sd
0 slj
0 slc
n 6.000000 10.250000 m 9.000000 10.250000 l 9.000000 2.000000 l 18.513197 2.000000 l s
[] 0 sd
0 slj
0 slc
n 18.888197 2.000000 m 18.388197 2.250000 l 18.513197 2.000000 l 18.388197 1.750000 l ef
n 18.888197 2.000000 m 18.388197 2.250000 l 18.513197 2.000000 l 18.388197 1.750000 l cp s
/Helvetica-latin1 ff 0.560000 scf sf
(declarator parsed) dup sw 2 div 13.550000 ex sub 1.788280 m gs 1 -1 sc sh gr
/Helvetica-latin1 ff 0.560000 scf sf
(14) dup sw 2 div 26.400000 ex sub 4.163280 m gs 1 -1 sc sh gr
0.100000 slw
[] 0 sd
[] 0 sd
0 slj
n 35.000000 0.000000 m 35.000000 24.000000 l 51.000000 24.000000 l 51.000000 0.000000 l cp s
/Helvetica-latin1 ff 0.560000 scf sf
0.100000 slw
[] 0 sd
[] 0 sd
0 slj
0 slc
n 36.000000 4.000000 m 36.000000 4.000000 l 43.513197 4.000000 l s
[] 0 sd
0 slj
0 slc
n 43.888197 4.000000 m 43.388197 4.250000 l 43.513197 4.000000 l 43.388197 3.750000 l ef
n 43.888197 4.000000 m 43.388197 4.250000 l 43.513197 4.000000 l 43.388197 3.750000 l cp s
0.100000 slw
[0.200000] 0 sd
[0.200000] 0 sd
0 slj
0 slc
n 36.000000 6.000000 m 36.000000 6.000000 l 43.513197 6.000000 l s
[] 0 sd
0 slj
0 slc
n 43.888197 6.000000 m 43.388197 6.250000 l 43.513197 6.000000 l 43.388197 5.750000 l ef
n 43.888197 6.000000 m 43.388197 6.250000 l 43.513197 6.000000 l 43.388197 5.750000 l cp s
/Helvetica-latin1 ff 0.560000 scf sf
(control passing) dup sw 2 div 40.000000 ex sub 5.000000 m gs 1 -1 sc sh gr
/Helvetica-latin1 ff 0.560000 scf sf
(data passing) dup sw 2 div 40.000000 ex sub 7.000000 m gs 1 -1 sc sh gr
0.100000 slw
[1.000000] 0 sd
[1.000000] 0 sd
0 slj
0 slc
n 36.000000 8.000000 m 40.000000 8.000000 l 40.000000 8.000000 l 43.513197 8.000000 l s
[] 0 sd
0 slj
0 slc
n 43.888197 8.000000 m 43.388197 8.250000 l 43.513197 8.000000 l 43.388197 7.750000 l ef
n 43.888197 8.000000 m 43.388197 8.250000 l 43.513197 8.000000 l 43.388197 7.750000 l cp s
/Helvetica-latin1 ff 0.560000 scf sf
(data and control) dup sw 2 div 40.000000 ex sub 9.000000 m gs 1 -1 sc sh gr
(passing) dup sw 2 div 40.000000 ex sub 9.800000 m gs 1 -1 sc sh gr
/Helvetica-latin1 ff 1.400000 scf sf
(LEGEND) dup sw 2 div 43.000000 ex sub 2.000000 m gs 1 -1 sc sh gr
0.100000 slw
[] 0 sd
[] 0 sd
0 slj
n 46.000000 3.000000 m 46.000000 6.000000 l 50.000000 6.000000 l 50.000000 3.000000 l cp s
/Helvetica-latin1 ff 0.560000 scf sf
(process) dup sw 2 div 48.000000 ex sub 4.686719 m gs 1 -1 sc sh gr
0.100000 slw
[] 0 sd
[] 0 sd
0 slc
0 slj
0 slc
0 slj
[] 0 sd
n 46.000000 7.000000 m 46.000000 10.000000 l 50.000000 10.000000 l 50.000000 7.000000 l cp s
0 slc
0 slj
[] 0 sd
n 46.400000 7.000000 m 46.400000 10.000000 l s
0 slc
0 slj
[] 0 sd
n 46.000000 7.300000 m 50.000000 7.300000 l s
/Helvetica-latin1 ff 0.560000 scf sf
(storage) dup sw 2 div 48.200000 ex sub 8.836719 m gs 1 -1 sc sh gr
/Helvetica-latin1 ff 0.560000 scf sf
/Helvetica-latin1 ff 0.560000 scf sf
(1 preprocessed and tokenized source to parser) 36.000000 12.000000 m gs 1 -1 sc sh gr
(2 declarator specifier sequence is saved) 36.000000 12.800000 m gs 1 -1 sc sh gr
(3 declarator specifier sequence is retrieved) 36.000000 13.600000 m gs 1 -1 sc sh gr
(4 DSS iprocessing starts) 36.000000 14.400000 m gs 1 -1 sc sh gr
(5 processed DSS) 36.000000 15.200000 m gs 1 -1 sc sh gr
(6 DTR processing starts) 36.000000 16.000000 m gs 1 -1 sc sh gr
(7 processed DTR type) 36.000000 16.800000 m gs 1 -1 sc sh gr
(8 process single DS) 36.000000 17.600000 m gs 1 -1 sc sh gr
(9 flags from single DS) 36.000000 18.400000 m gs 1 -1 sc sh gr
(10 one DTR processing) 36.000000 19.200000 m gs 1 -1 sc sh gr
(11 type and flags) 36.000000 20.000000 m gs 1 -1 sc sh gr
(12 lookup for previous declarations) 36.000000 20.800000 m gs 1 -1 sc sh gr
(13 found declarations) 36.000000 21.600000 m gs 1 -1 sc sh gr
(14 previous declaration or error signal) 36.000000 22.400000 m gs 1 -1 sc sh gr
showpage
