%!PS-Adobe-2.0 EPSF-2.0
%%Title: ss_uml_type.dia
%%Creator: Dia v0.94
%%CreationDate: Thu May 26 14:10:08 2005
%%For: sandp9am
%%Orientation: Portrait
%%Magnification: 1.0000
%%BoundingBox: 0 0 435 199
%%BeginSetup
%%EndSetup
%%EndComments
%%BeginProlog
[ /.notdef /.notdef /.notdef /.notdef /.notdef /.notdef /.notdef /.notdef /.notdef /.notdef
/.notdef /.notdef /.notdef /.notdef /.notdef /.notdef /.notdef /.notdef /.notdef /.notdef
/.notdef /.notdef /.notdef /.notdef /.notdef /.notdef /.notdef /.notdef /.notdef /.notdef
/.notdef /.notdef /space /exclam /quotedbl /numbersign /dollar /percent /ampersand /quoteright
/parenleft /parenright /asterisk /plus /comma /hyphen /period /slash /zero /one
/two /three /four /five /six /seven /eight /nine /colon /semicolon
/less /equal /greater /question /at /A /B /C /D /E
/F /G /H /I /J /K /L /M /N /O
/P /Q /R /S /T /U /V /W /X /Y
/Z /bracketleft /backslash /bracketright /asciicircum /underscore /quoteleft /a /b /c
/d /e /f /g /h /i /j /k /l /m
/n /o /p /q /r /s /t /u /v /w
/x /y /z /braceleft /bar /braceright /asciitilde /.notdef /.notdef /.notdef
/.notdef /.notdef /.notdef /.notdef /.notdef /.notdef /.notdef /.notdef /.notdef /.notdef
/.notdef /.notdef /.notdef /.notdef /.notdef /.notdef /.notdef /.notdef /.notdef /.notdef
/.notdef /.notdef /.notdef /.notdef /.notdef /.notdef /.notdef /.notdef /.notdef /.notdef
/space /exclamdown /cent /sterling /currency /yen /brokenbar /section /dieresis /copyright
/ordfeminine /guillemotleft /logicalnot /hyphen /registered /macron /degree /plusminus /twosuperior /threesuperior
/acute /mu /paragraph /periodcentered /cedilla /onesuperior /ordmasculine /guillemotright /onequarter /onehalf
/threequarters /questiondown /Agrave /Aacute /Acircumflex /Atilde /Adieresis /Aring /AE /Ccedilla
/Egrave /Eacute /Ecircumflex /Edieresis /Igrave /Iacute /Icircumflex /Idieresis /Eth /Ntilde
/Ograve /Oacute /Ocircumflex /Otilde /Odieresis /multiply /Oslash /Ugrave /Uacute /Ucircumflex
/Udieresis /Yacute /Thorn /germandbls /agrave /aacute /acircumflex /atilde /adieresis /aring
/ae /ccedilla /egrave /eacute /ecircumflex /edieresis /igrave /iacute /icircumflex /idieresis
/eth /ntilde /ograve /oacute /ocircumflex /otilde /odieresis /divide /oslash /ugrave
/uacute /ucircumflex /udieresis /yacute /thorn /ydieresis] /isolatin1encoding exch def
/cp {closepath} bind def
/c {curveto} bind def
/f {fill} bind def
/a {arc} bind def
/ef {eofill} bind def
/ex {exch} bind def
/gr {grestore} bind def
/gs {gsave} bind def
/sa {save} bind def
/rs {restore} bind def
/l {lineto} bind def
/m {moveto} bind def
/rm {rmoveto} bind def
/n {newpath} bind def
/s {stroke} bind def
/sh {show} bind def
/slc {setlinecap} bind def
/slj {setlinejoin} bind def
/slw {setlinewidth} bind def
/srgb {setrgbcolor} bind def
/rot {rotate} bind def
/sc {scale} bind def
/sd {setdash} bind def
/ff {findfont} bind def
/sf {setfont} bind def
/scf {scalefont} bind def
/sw {stringwidth pop} bind def
/tr {translate} bind def

/ellipsedict 8 dict def
ellipsedict /mtrx matrix put
/ellipse
{ ellipsedict begin
   /endangle exch def
   /startangle exch def
   /yrad exch def
   /xrad exch def
   /y exch def
   /x exch def   /savematrix mtrx currentmatrix def
   x y tr xrad yrad sc
   0 0 1 startangle endangle arc
   savematrix setmatrix
   end
} def

/mergeprocs {
dup length
3 -1 roll
dup
length
dup
5 1 roll
3 -1 roll
add
array cvx
dup
3 -1 roll
0 exch
putinterval
dup
4 2 roll
putinterval
} bind def
/Times-Roman-latin1
    /Times-Roman findfont
    dup length dict begin
	{1 index /FID ne {def} {pop pop} ifelse} forall
	/Encoding isolatin1encoding def
    currentdict end
definefont pop
/Times-Italic-latin1
    /Times-Italic findfont
    dup length dict begin
	{1 index /FID ne {def} {pop pop} ifelse} forall
	/Encoding isolatin1encoding def
    currentdict end
definefont pop
/Times-Bold-latin1
    /Times-Bold findfont
    dup length dict begin
	{1 index /FID ne {def} {pop pop} ifelse} forall
	/Encoding isolatin1encoding def
    currentdict end
definefont pop
/Times-BoldItalic-latin1
    /Times-BoldItalic findfont
    dup length dict begin
	{1 index /FID ne {def} {pop pop} ifelse} forall
	/Encoding isolatin1encoding def
    currentdict end
definefont pop
/AvantGarde-Book-latin1
    /AvantGarde-Book findfont
    dup length dict begin
	{1 index /FID ne {def} {pop pop} ifelse} forall
	/Encoding isolatin1encoding def
    currentdict end
definefont pop
/AvantGarde-BookOblique-latin1
    /AvantGarde-BookOblique findfont
    dup length dict begin
	{1 index /FID ne {def} {pop pop} ifelse} forall
	/Encoding isolatin1encoding def
    currentdict end
definefont pop
/AvantGarde-Demi-latin1
    /AvantGarde-Demi findfont
    dup length dict begin
	{1 index /FID ne {def} {pop pop} ifelse} forall
	/Encoding isolatin1encoding def
    currentdict end
definefont pop
/AvantGarde-DemiOblique-latin1
    /AvantGarde-DemiOblique findfont
    dup length dict begin
	{1 index /FID ne {def} {pop pop} ifelse} forall
	/Encoding isolatin1encoding def
    currentdict end
definefont pop
/Bookman-Light-latin1
    /Bookman-Light findfont
    dup length dict begin
	{1 index /FID ne {def} {pop pop} ifelse} forall
	/Encoding isolatin1encoding def
    currentdict end
definefont pop
/Bookman-LightItalic-latin1
    /Bookman-LightItalic findfont
    dup length dict begin
	{1 index /FID ne {def} {pop pop} ifelse} forall
	/Encoding isolatin1encoding def
    currentdict end
definefont pop
/Bookman-Demi-latin1
    /Bookman-Demi findfont
    dup length dict begin
	{1 index /FID ne {def} {pop pop} ifelse} forall
	/Encoding isolatin1encoding def
    currentdict end
definefont pop
/Bookman-DemiItalic-latin1
    /Bookman-DemiItalic findfont
    dup length dict begin
	{1 index /FID ne {def} {pop pop} ifelse} forall
	/Encoding isolatin1encoding def
    currentdict end
definefont pop
/Courier-latin1
    /Courier findfont
    dup length dict begin
	{1 index /FID ne {def} {pop pop} ifelse} forall
	/Encoding isolatin1encoding def
    currentdict end
definefont pop
/Courier-Oblique-latin1
    /Courier-Oblique findfont
    dup length dict begin
	{1 index /FID ne {def} {pop pop} ifelse} forall
	/Encoding isolatin1encoding def
    currentdict end
definefont pop
/Courier-Bold-latin1
    /Courier-Bold findfont
    dup length dict begin
	{1 index /FID ne {def} {pop pop} ifelse} forall
	/Encoding isolatin1encoding def
    currentdict end
definefont pop
/Courier-BoldOblique-latin1
    /Courier-BoldOblique findfont
    dup length dict begin
	{1 index /FID ne {def} {pop pop} ifelse} forall
	/Encoding isolatin1encoding def
    currentdict end
definefont pop
/Helvetica-latin1
    /Helvetica findfont
    dup length dict begin
	{1 index /FID ne {def} {pop pop} ifelse} forall
	/Encoding isolatin1encoding def
    currentdict end
definefont pop
/Helvetica-Oblique-latin1
    /Helvetica-Oblique findfont
    dup length dict begin
	{1 index /FID ne {def} {pop pop} ifelse} forall
	/Encoding isolatin1encoding def
    currentdict end
definefont pop
/Helvetica-Bold-latin1
    /Helvetica-Bold findfont
    dup length dict begin
	{1 index /FID ne {def} {pop pop} ifelse} forall
	/Encoding isolatin1encoding def
    currentdict end
definefont pop
/Helvetica-BoldOblique-latin1
    /Helvetica-BoldOblique findfont
    dup length dict begin
	{1 index /FID ne {def} {pop pop} ifelse} forall
	/Encoding isolatin1encoding def
    currentdict end
definefont pop
/Helvetica-Narrow-latin1
    /Helvetica-Narrow findfont
    dup length dict begin
	{1 index /FID ne {def} {pop pop} ifelse} forall
	/Encoding isolatin1encoding def
    currentdict end
definefont pop
/Helvetica-Narrow-Oblique-latin1
    /Helvetica-Narrow-Oblique findfont
    dup length dict begin
	{1 index /FID ne {def} {pop pop} ifelse} forall
	/Encoding isolatin1encoding def
    currentdict end
definefont pop
/Helvetica-Narrow-Bold-latin1
    /Helvetica-Narrow-Bold findfont
    dup length dict begin
	{1 index /FID ne {def} {pop pop} ifelse} forall
	/Encoding isolatin1encoding def
    currentdict end
definefont pop
/Helvetica-Narrow-BoldOblique-latin1
    /Helvetica-Narrow-BoldOblique findfont
    dup length dict begin
	{1 index /FID ne {def} {pop pop} ifelse} forall
	/Encoding isolatin1encoding def
    currentdict end
definefont pop
/NewCenturySchoolbook-Roman-latin1
    /NewCenturySchoolbook-Roman findfont
    dup length dict begin
	{1 index /FID ne {def} {pop pop} ifelse} forall
	/Encoding isolatin1encoding def
    currentdict end
definefont pop
/NewCenturySchoolbook-Italic-latin1
    /NewCenturySchoolbook-Italic findfont
    dup length dict begin
	{1 index /FID ne {def} {pop pop} ifelse} forall
	/Encoding isolatin1encoding def
    currentdict end
definefont pop
/NewCenturySchoolbook-Bold-latin1
    /NewCenturySchoolbook-Bold findfont
    dup length dict begin
	{1 index /FID ne {def} {pop pop} ifelse} forall
	/Encoding isolatin1encoding def
    currentdict end
definefont pop
/NewCenturySchoolbook-BoldItalic-latin1
    /NewCenturySchoolbook-BoldItalic findfont
    dup length dict begin
	{1 index /FID ne {def} {pop pop} ifelse} forall
	/Encoding isolatin1encoding def
    currentdict end
definefont pop
/Palatino-Roman-latin1
    /Palatino-Roman findfont
    dup length dict begin
	{1 index /FID ne {def} {pop pop} ifelse} forall
	/Encoding isolatin1encoding def
    currentdict end
definefont pop
/Palatino-Italic-latin1
    /Palatino-Italic findfont
    dup length dict begin
	{1 index /FID ne {def} {pop pop} ifelse} forall
	/Encoding isolatin1encoding def
    currentdict end
definefont pop
/Palatino-Bold-latin1
    /Palatino-Bold findfont
    dup length dict begin
	{1 index /FID ne {def} {pop pop} ifelse} forall
	/Encoding isolatin1encoding def
    currentdict end
definefont pop
/Palatino-BoldItalic-latin1
    /Palatino-BoldItalic findfont
    dup length dict begin
	{1 index /FID ne {def} {pop pop} ifelse} forall
	/Encoding isolatin1encoding def
    currentdict end
definefont pop
/Symbol-latin1
    /Symbol findfont
definefont pop
/ZapfChancery-MediumItalic-latin1
    /ZapfChancery-MediumItalic findfont
    dup length dict begin
	{1 index /FID ne {def} {pop pop} ifelse} forall
	/Encoding isolatin1encoding def
    currentdict end
definefont pop
/ZapfDingbats-latin1
    /ZapfDingbats findfont
    dup length dict begin
	{1 index /FID ne {def} {pop pop} ifelse} forall
	/Encoding isolatin1encoding def
    currentdict end
definefont pop
5.669200 -5.669200 scale
100.934000 28.991400 translate
%%EndProlog


0.100000 slw
[] 0 sd
1.000000 1.000000 1.000000 srgb
n -69.890800 -63.974100 m -69.890800 -62.374100 l -57.765800 -62.374100 l -57.765800 -63.974100 l f
0.000000 0.000000 0.000000 srgb
n -69.890800 -63.974100 m -69.890800 -62.374100 l -57.765800 -62.374100 l -57.765800 -63.974100 l cp s
/Helvetica-latin1 ff 0.840000 scf sf
(type) dup sw 2 div -63.828300 ex sub -62.774100 m gs 1 -1 sc sh gr
1.000000 1.000000 1.000000 srgb
n -69.890800 -62.374100 m -69.890800 -61.974100 l -57.765800 -61.974100 l -57.765800 -62.374100 l f
0.000000 0.000000 0.000000 srgb
n -69.890800 -62.374100 m -69.890800 -61.974100 l -57.765800 -61.974100 l -57.765800 -62.374100 l cp s
1.000000 1.000000 1.000000 srgb
n -69.890800 -61.974100 m -69.890800 -58.574100 l -57.765800 -58.574100 l -57.765800 -61.974100 l f
0.000000 0.000000 0.000000 srgb
n -69.890800 -61.974100 m -69.890800 -58.574100 l -57.765800 -58.574100 l -57.765800 -61.974100 l cp s
/Courier-latin1 ff 0.560000 scf sf
(+<<virtual>> is_void\(\): bool) -69.740800 -61.344412 m gs 1 -1 sc sh gr
/Helvetica-latin1 ff 0.560000 scf sf
(return false) -69.740800 -60.544412 m gs 1 -1 sc sh gr
/Courier-latin1 ff 0.560000 scf sf
(+<<virtual>> is_volatile\(\): bool) -69.740800 -59.744412 m gs 1 -1 sc sh gr
/Helvetica-latin1 ff 0.560000 scf sf
(return false) -69.740800 -58.944412 m gs 1 -1 sc sh gr
0.100000 slw
[] 0 sd
1.000000 1.000000 1.000000 srgb
n -33.401700 -43.648200 m -33.401700 -42.048200 l -25.958731 -42.048200 l -25.958731 -43.648200 l f
0.000000 0.000000 0.000000 srgb
n -33.401700 -43.648200 m -33.401700 -42.048200 l -25.958731 -42.048200 l -25.958731 -43.648200 l cp s
/Helvetica-latin1 ff 0.840000 scf sf
(function) dup sw 2 div -29.680216 ex sub -42.448200 m gs 1 -1 sc sh gr
1.000000 1.000000 1.000000 srgb
n -33.401700 -42.048200 m -33.401700 -39.448200 l -25.958731 -39.448200 l -25.958731 -42.048200 l f
0.000000 0.000000 0.000000 srgb
n -33.401700 -42.048200 m -33.401700 -39.448200 l -25.958731 -39.448200 l -25.958731 -42.048200 l cp s
/Courier-latin1 ff 0.560000 scf sf
(+returns: type) -33.251700 -41.418512 m gs 1 -1 sc sh gr
/Courier-latin1 ff 0.560000 scf sf
(+params: LIST<type>) -33.251700 -40.618512 m gs 1 -1 sc sh gr
/Courier-latin1 ff 0.560000 scf sf
(+ellipsis: bool) -33.251700 -39.818512 m gs 1 -1 sc sh gr
1.000000 1.000000 1.000000 srgb
n -33.401700 -39.448200 m -33.401700 -39.048200 l -25.958731 -39.048200 l -25.958731 -39.448200 l f
0.000000 0.000000 0.000000 srgb
n -33.401700 -39.448200 m -33.401700 -39.048200 l -25.958731 -39.048200 l -25.958731 -39.448200 l cp s
0.100000 slw
[] 0 sd
1.000000 1.000000 1.000000 srgb
n -55.751700 -43.948200 m -55.751700 -42.348200 l -46.682169 -42.348200 l -46.682169 -43.948200 l f
0.000000 0.000000 0.000000 srgb
n -55.751700 -43.948200 m -55.751700 -42.348200 l -46.682169 -42.348200 l -46.682169 -43.948200 l cp s
/Helvetica-latin1 ff 0.840000 scf sf
(member_pointer) dup sw 2 div -51.216934 ex sub -42.748200 m gs 1 -1 sc sh gr
1.000000 1.000000 1.000000 srgb
n -55.751700 -42.348200 m -55.751700 -40.548200 l -46.682169 -40.548200 l -46.682169 -42.348200 l f
0.000000 0.000000 0.000000 srgb
n -55.751700 -42.348200 m -55.751700 -40.548200 l -46.682169 -40.548200 l -46.682169 -42.348200 l cp s
/Courier-latin1 ff 0.560000 scf sf
(+base: type) -55.601700 -41.718512 m gs 1 -1 sc sh gr
/Courier-latin1 ff 0.560000 scf sf
(+item: type) -55.601700 -40.918512 m gs 1 -1 sc sh gr
1.000000 1.000000 1.000000 srgb
n -55.751700 -40.548200 m -55.751700 -40.148200 l -46.682169 -40.148200 l -46.682169 -40.548200 l f
0.000000 0.000000 0.000000 srgb
n -55.751700 -40.548200 m -55.751700 -40.148200 l -46.682169 -40.148200 l -46.682169 -40.548200 l cp s
0.100000 slw
[] 0 sd
1.000000 1.000000 1.000000 srgb
n -80.901700 -53.698200 m -80.901700 -52.098200 l -74.192325 -52.098200 l -74.192325 -53.698200 l f
0.000000 0.000000 0.000000 srgb
n -80.901700 -53.698200 m -80.901700 -52.098200 l -74.192325 -52.098200 l -74.192325 -53.698200 l cp s
/Helvetica-latin1 ff 0.840000 scf sf
(builtin_type) dup sw 2 div -77.547013 ex sub -52.498200 m gs 1 -1 sc sh gr
1.000000 1.000000 1.000000 srgb
n -80.901700 -52.098200 m -80.901700 -51.698200 l -74.192325 -51.698200 l -74.192325 -52.098200 l f
0.000000 0.000000 0.000000 srgb
n -80.901700 -52.098200 m -80.901700 -51.698200 l -74.192325 -51.698200 l -74.192325 -52.098200 l cp s
1.000000 1.000000 1.000000 srgb
n -80.901700 -51.698200 m -80.901700 -51.298200 l -74.192325 -51.298200 l -74.192325 -51.698200 l f
0.000000 0.000000 0.000000 srgb
n -80.901700 -51.698200 m -80.901700 -51.298200 l -74.192325 -51.298200 l -74.192325 -51.698200 l cp s
0.100000 slw
[] 0 sd
1.000000 1.000000 1.000000 srgb
n -83.101700 -43.648200 m -83.101700 -42.048200 l -71.336856 -42.048200 l -71.336856 -43.648200 l f
0.000000 0.000000 0.000000 srgb
n -83.101700 -43.648200 m -83.101700 -42.048200 l -71.336856 -42.048200 l -71.336856 -43.648200 l cp s
/Helvetica-latin1 ff 0.840000 scf sf
(enum) dup sw 2 div -77.219278 ex sub -42.448200 m gs 1 -1 sc sh gr
1.000000 1.000000 1.000000 srgb
n -83.101700 -42.048200 m -83.101700 -41.048200 l -71.336856 -41.048200 l -71.336856 -42.048200 l f
0.000000 0.000000 0.000000 srgb
n -83.101700 -42.048200 m -83.101700 -41.048200 l -71.336856 -41.048200 l -71.336856 -42.048200 l cp s
/Courier-latin1 ff 0.560000 scf sf
(+enumerators: LIST<declaration>) -82.951700 -41.418512 m gs 1 -1 sc sh gr
1.000000 1.000000 1.000000 srgb
n -83.101700 -41.048200 m -83.101700 -40.648200 l -71.336856 -40.648200 l -71.336856 -41.048200 l f
0.000000 0.000000 0.000000 srgb
n -83.101700 -41.048200 m -83.101700 -40.648200 l -71.336856 -40.648200 l -71.336856 -41.048200 l cp s
0.100000 slw
[] 0 sd
1.000000 1.000000 1.000000 srgb
n -72.018900 -53.723900 m -72.018900 -52.123900 l -67.457181 -52.123900 l -67.457181 -53.723900 l f
0.000000 0.000000 0.000000 srgb
n -72.018900 -53.723900 m -72.018900 -52.123900 l -67.457181 -52.123900 l -67.457181 -53.723900 l cp s
/Helvetica-latin1 ff 0.840000 scf sf
(pointer) dup sw 2 div -69.738041 ex sub -52.523900 m gs 1 -1 sc sh gr
1.000000 1.000000 1.000000 srgb
n -72.018900 -52.123900 m -72.018900 -51.123900 l -67.457181 -51.123900 l -67.457181 -52.123900 l f
0.000000 0.000000 0.000000 srgb
n -72.018900 -52.123900 m -72.018900 -51.123900 l -67.457181 -51.123900 l -67.457181 -52.123900 l cp s
/Courier-latin1 ff 0.560000 scf sf
(+what: type) -71.868900 -51.494212 m gs 1 -1 sc sh gr
1.000000 1.000000 1.000000 srgb
n -72.018900 -51.123900 m -72.018900 -50.723900 l -67.457181 -50.723900 l -67.457181 -51.123900 l f
0.000000 0.000000 0.000000 srgb
n -72.018900 -51.123900 m -72.018900 -50.723900 l -67.457181 -50.723900 l -67.457181 -51.123900 l cp s
0.100000 slw
[] 0 sd
1.000000 1.000000 1.000000 srgb
n -42.701700 -43.748200 m -42.701700 -42.148200 l -37.059513 -42.148200 l -37.059513 -43.748200 l f
0.000000 0.000000 0.000000 srgb
n -42.701700 -43.748200 m -42.701700 -42.148200 l -37.059513 -42.148200 l -37.059513 -43.748200 l cp s
/Helvetica-latin1 ff 0.840000 scf sf
(array) dup sw 2 div -39.880606 ex sub -42.548200 m gs 1 -1 sc sh gr
1.000000 1.000000 1.000000 srgb
n -42.701700 -42.148200 m -42.701700 -40.348200 l -37.059513 -40.348200 l -37.059513 -42.148200 l f
0.000000 0.000000 0.000000 srgb
n -42.701700 -42.148200 m -42.701700 -40.348200 l -37.059513 -40.348200 l -37.059513 -42.148200 l cp s
/Courier-latin1 ff 0.560000 scf sf
(+bound: t_size) -42.551700 -41.518512 m gs 1 -1 sc sh gr
/Courier-latin1 ff 0.560000 scf sf
(+type: type) -42.551700 -40.718512 m gs 1 -1 sc sh gr
1.000000 1.000000 1.000000 srgb
n -42.701700 -40.348200 m -42.701700 -39.948200 l -37.059513 -39.948200 l -37.059513 -40.348200 l f
0.000000 0.000000 0.000000 srgb
n -42.701700 -40.348200 m -42.701700 -39.948200 l -37.059513 -39.948200 l -37.059513 -40.348200 l cp s
0.100000 slw
[] 0 sd
1.000000 1.000000 1.000000 srgb
n -70.235000 -43.660400 m -70.235000 -42.060400 l -57.389688 -42.060400 l -57.389688 -43.660400 l f
0.000000 0.000000 0.000000 srgb
n -70.235000 -43.660400 m -70.235000 -42.060400 l -57.389688 -42.060400 l -57.389688 -43.660400 l cp s
/Helvetica-latin1 ff 0.840000 scf sf
(struct_base) dup sw 2 div -63.812344 ex sub -42.460400 m gs 1 -1 sc sh gr
1.000000 1.000000 1.000000 srgb
n -70.235000 -42.060400 m -70.235000 -37.860400 l -57.389688 -37.860400 l -57.389688 -42.060400 l f
0.000000 0.000000 0.000000 srgb
n -70.235000 -42.060400 m -70.235000 -37.860400 l -57.389688 -37.860400 l -57.389688 -42.060400 l cp s
/Courier-latin1 ff 0.560000 scf sf
(+members: decl_seq) -70.085000 -41.430712 m gs 1 -1 sc sh gr
/Courier-latin1 ff 0.560000 scf sf
(+decl: declaration) -70.085000 -40.630712 m gs 1 -1 sc sh gr
/Courier-latin1 ff 0.560000 scf sf
(+POD: bool) -70.085000 -39.830712 m gs 1 -1 sc sh gr
/Helvetica-latin1 ff 0.560000 scf sf
(is POD?) -70.085000 -39.030712 m gs 1 -1 sc sh gr
/Courier-latin1 ff 0.560000 scf sf
(+completion_time: declaration_time) -70.085000 -38.230712 m gs 1 -1 sc sh gr
1.000000 1.000000 1.000000 srgb
n -70.235000 -37.860400 m -70.235000 -37.460400 l -57.389688 -37.460400 l -57.389688 -37.860400 l f
0.000000 0.000000 0.000000 srgb
n -70.235000 -37.860400 m -70.235000 -37.460400 l -57.389688 -37.460400 l -57.389688 -37.860400 l cp s
0.100000 slw
[] 0 sd
1.000000 1.000000 1.000000 srgb
n -58.847000 -33.408500 m -58.847000 -31.808500 l -55.397000 -31.808500 l -55.397000 -33.408500 l f
0.000000 0.000000 0.000000 srgb
n -58.847000 -33.408500 m -58.847000 -31.808500 l -55.397000 -31.808500 l -55.397000 -33.408500 l cp s
/Helvetica-latin1 ff 0.840000 scf sf
(union) dup sw 2 div -57.122000 ex sub -32.208500 m gs 1 -1 sc sh gr
1.000000 1.000000 1.000000 srgb
n -58.847000 -31.808500 m -58.847000 -31.408500 l -55.397000 -31.408500 l -55.397000 -31.808500 l f
0.000000 0.000000 0.000000 srgb
n -58.847000 -31.808500 m -58.847000 -31.408500 l -55.397000 -31.408500 l -55.397000 -31.808500 l cp s
1.000000 1.000000 1.000000 srgb
n -58.847000 -31.408500 m -58.847000 -31.008500 l -55.397000 -31.008500 l -55.397000 -31.408500 l f
0.000000 0.000000 0.000000 srgb
n -58.847000 -31.408500 m -58.847000 -31.008500 l -55.397000 -31.008500 l -55.397000 -31.408500 l cp s
0.100000 slw
[] 0 sd
1.000000 1.000000 1.000000 srgb
n -53.986300 -53.689800 m -53.986300 -52.089800 l -46.183175 -52.089800 l -46.183175 -53.689800 l f
0.000000 0.000000 0.000000 srgb
n -53.986300 -53.689800 m -53.986300 -52.089800 l -46.183175 -52.089800 l -46.183175 -53.689800 l cp s
/Helvetica-latin1 ff 0.840000 scf sf
(volatile) dup sw 2 div -50.084738 ex sub -52.489800 m gs 1 -1 sc sh gr
1.000000 1.000000 1.000000 srgb
n -53.986300 -52.089800 m -53.986300 -51.089800 l -46.183175 -51.089800 l -46.183175 -52.089800 l f
0.000000 0.000000 0.000000 srgb
n -53.986300 -52.089800 m -53.986300 -51.089800 l -46.183175 -51.089800 l -46.183175 -52.089800 l cp s
/Courier-latin1 ff 0.560000 scf sf
(+what: type) -53.836300 -51.460112 m gs 1 -1 sc sh gr
1.000000 1.000000 1.000000 srgb
n -53.986300 -51.089800 m -53.986300 -47.689800 l -46.183175 -47.689800 l -46.183175 -51.089800 l f
0.000000 0.000000 0.000000 srgb
n -53.986300 -51.089800 m -53.986300 -47.689800 l -46.183175 -47.689800 l -46.183175 -51.089800 l cp s
/Courier-latin1 ff 0.560000 scf sf
(+is_void\(\): bool) -53.836300 -50.460112 m gs 1 -1 sc sh gr
/Helvetica-latin1 ff 0.560000 scf sf
(get from 'what') -53.836300 -49.660112 m gs 1 -1 sc sh gr
/Courier-latin1 ff 0.560000 scf sf
(+is_volatile\(\): boll) -53.836300 -48.860112 m gs 1 -1 sc sh gr
/Helvetica-latin1 ff 0.560000 scf sf
(return true) -53.836300 -48.060112 m gs 1 -1 sc sh gr
0.100000 slw
[] 0 sd
1.000000 1.000000 1.000000 srgb
n -61.751200 -53.648200 m -61.751200 -52.048200 l -55.388700 -52.048200 l -55.388700 -53.648200 l f
0.000000 0.000000 0.000000 srgb
n -61.751200 -53.648200 m -61.751200 -52.048200 l -55.388700 -52.048200 l -55.388700 -53.648200 l cp s
/Helvetica-latin1 ff 0.840000 scf sf
(const) dup sw 2 div -58.569950 ex sub -52.448200 m gs 1 -1 sc sh gr
1.000000 1.000000 1.000000 srgb
n -61.751200 -52.048200 m -61.751200 -51.048200 l -55.388700 -51.048200 l -55.388700 -52.048200 l f
0.000000 0.000000 0.000000 srgb
n -61.751200 -52.048200 m -61.751200 -51.048200 l -55.388700 -51.048200 l -55.388700 -52.048200 l cp s
/Courier-latin1 ff 0.560000 scf sf
(+what: type) -61.601200 -51.418512 m gs 1 -1 sc sh gr
1.000000 1.000000 1.000000 srgb
n -61.751200 -51.048200 m -61.751200 -49.248200 l -55.388700 -49.248200 l -55.388700 -51.048200 l f
0.000000 0.000000 0.000000 srgb
n -61.751200 -51.048200 m -61.751200 -49.248200 l -55.388700 -49.248200 l -55.388700 -51.048200 l cp s
/Courier-latin1 ff 0.560000 scf sf
(+is_void\(\): bool) -61.601200 -50.418512 m gs 1 -1 sc sh gr
/Helvetica-latin1 ff 0.560000 scf sf
(get from 'what') -61.601200 -49.618512 m gs 1 -1 sc sh gr
0.100000 slw
[] 0 sd
0 slj
0 slc
n -63.985000 -36.548597 m -63.985000 -35.434500 l -57.122000 -35.434500 l -57.122000 -33.408500 l s
0 slj
1.000000 1.000000 1.000000 srgb
n -63.585000 -36.548597 m -63.985000 -37.348597 l -64.385000 -36.548597 l ef
0.100000 slw
[] 0 sd
0 slj
0.000000 0.000000 0.000000 srgb
n -63.585000 -36.548597 m -63.985000 -37.348597 l -64.385000 -36.548597 l cp s
/Courier-latin1 ff 0.560000 scf sf
0.100000 slw
[] 0 sd
0 slj
0 slc
n -63.990800 -57.662297 m -63.990800 -56.136150 l -77.547013 -56.136150 l -77.547013 -53.698200 l s
0 slj
1.000000 1.000000 1.000000 srgb
n -63.590800 -57.662297 m -63.990800 -58.462297 l -64.390800 -57.662297 l ef
0.100000 slw
[] 0 sd
0 slj
0.000000 0.000000 0.000000 srgb
n -63.590800 -57.662297 m -63.990800 -58.462297 l -64.390800 -57.662297 l cp s
/Courier-latin1 ff 0.560000 scf sf
0.100000 slw
[] 0 sd
0 slj
0 slc
n -63.990800 -57.662297 m -63.990800 -56.111100 l -58.651200 -56.111100 l -58.651200 -53.648200 l s
0 slj
1.000000 1.000000 1.000000 srgb
n -63.590800 -57.662297 m -63.990800 -58.462297 l -64.390800 -57.662297 l ef
0.100000 slw
[] 0 sd
0 slj
0.000000 0.000000 0.000000 srgb
n -63.590800 -57.662297 m -63.990800 -58.462297 l -64.390800 -57.662297 l cp s
/Courier-latin1 ff 0.560000 scf sf
0.100000 slw
[] 0 sd
0 slj
0 slc
n -63.990800 -57.662297 m -63.990800 -56.149000 l -69.738041 -56.149000 l -69.738041 -53.723900 l s
0 slj
1.000000 1.000000 1.000000 srgb
n -63.590800 -57.662297 m -63.990800 -58.462297 l -64.390800 -57.662297 l ef
0.100000 slw
[] 0 sd
0 slj
0.000000 0.000000 0.000000 srgb
n -63.590800 -57.662297 m -63.990800 -58.462297 l -64.390800 -57.662297 l cp s
/Courier-latin1 ff 0.560000 scf sf
0.100000 slw
[] 0 sd
0 slj
0 slc
n -63.990800 -57.662297 m -63.990800 -56.132000 l -50.084800 -56.132000 l -50.084800 -53.689800 l s
0 slj
1.000000 1.000000 1.000000 srgb
n -63.590800 -57.662297 m -63.990800 -58.462297 l -64.390800 -57.662297 l ef
0.100000 slw
[] 0 sd
0 slj
0.000000 0.000000 0.000000 srgb
n -63.590800 -57.662297 m -63.990800 -58.462297 l -64.390800 -57.662297 l cp s
/Courier-latin1 ff 0.560000 scf sf
0.100000 slw
[] 0 sd
0 slj
0 slc
n -63.990800 -57.662297 m -63.990800 -46.271500 l -77.376700 -46.271500 l -77.376700 -43.648200 l s
0 slj
1.000000 1.000000 1.000000 srgb
n -63.590800 -57.662297 m -63.990800 -58.462297 l -64.390800 -57.662297 l ef
0.100000 slw
[] 0 sd
0 slj
0.000000 0.000000 0.000000 srgb
n -63.590800 -57.662297 m -63.990800 -58.462297 l -64.390800 -57.662297 l cp s
/Courier-latin1 ff 0.560000 scf sf
0.100000 slw
[] 0 sd
0 slj
0 slc
n -63.990800 -57.662297 m -63.990800 -46.271500 l -29.776700 -46.271500 l -29.776700 -43.648200 l s
0 slj
1.000000 1.000000 1.000000 srgb
n -63.590800 -57.662297 m -63.990800 -58.462297 l -64.390800 -57.662297 l ef
0.100000 slw
[] 0 sd
0 slj
0.000000 0.000000 0.000000 srgb
n -63.590800 -57.662297 m -63.990800 -58.462297 l -64.390800 -57.662297 l cp s
/Courier-latin1 ff 0.560000 scf sf
0.100000 slw
[] 0 sd
0 slj
0 slc
n -63.990800 -57.662297 m -63.990800 -46.271500 l -51.201700 -46.271500 l -51.201700 -43.948200 l s
0 slj
1.000000 1.000000 1.000000 srgb
n -63.590800 -57.662297 m -63.990800 -58.462297 l -64.390800 -57.662297 l ef
0.100000 slw
[] 0 sd
0 slj
0.000000 0.000000 0.000000 srgb
n -63.590800 -57.662297 m -63.990800 -58.462297 l -64.390800 -57.662297 l cp s
/Courier-latin1 ff 0.560000 scf sf
0.100000 slw
[] 0 sd
0 slj
0 slc
n -63.990800 -57.662297 m -63.990800 -46.271500 l -39.951700 -46.271500 l -39.951700 -43.748200 l s
0 slj
1.000000 1.000000 1.000000 srgb
n -63.590800 -57.662297 m -63.990800 -58.462297 l -64.390800 -57.662297 l ef
0.100000 slw
[] 0 sd
0 slj
0.000000 0.000000 0.000000 srgb
n -63.590800 -57.662297 m -63.990800 -58.462297 l -64.390800 -57.662297 l cp s
/Courier-latin1 ff 0.560000 scf sf
0.100000 slw
[] 0 sd
0 slj
0 slc
n -63.990800 -57.662297 m -63.990800 -51.117200 l -63.985000 -51.117200 l -63.985000 -43.660400 l s
0 slj
1.000000 1.000000 1.000000 srgb
n -63.590800 -57.662297 m -63.990800 -58.462297 l -64.390800 -57.662297 l ef
0.100000 slw
[] 0 sd
0 slj
0.000000 0.000000 0.000000 srgb
n -63.590800 -57.662297 m -63.990800 -58.462297 l -64.390800 -57.662297 l cp s
/Courier-latin1 ff 0.560000 scf sf
0.100000 slw
[] 0 sd
1.000000 1.000000 1.000000 srgb
n -44.784500 -53.658400 m -44.784500 -52.058400 l -36.981375 -52.058400 l -36.981375 -53.658400 l f
0.000000 0.000000 0.000000 srgb
n -44.784500 -53.658400 m -44.784500 -52.058400 l -36.981375 -52.058400 l -36.981375 -53.658400 l cp s
/Helvetica-latin1 ff 0.840000 scf sf
(const_volatile) dup sw 2 div -40.882938 ex sub -52.458400 m gs 1 -1 sc sh gr
1.000000 1.000000 1.000000 srgb
n -44.784500 -52.058400 m -44.784500 -51.058400 l -36.981375 -51.058400 l -36.981375 -52.058400 l f
0.000000 0.000000 0.000000 srgb
n -44.784500 -52.058400 m -44.784500 -51.058400 l -36.981375 -51.058400 l -36.981375 -52.058400 l cp s
/Courier-latin1 ff 0.560000 scf sf
(+what: type) -44.634500 -51.428712 m gs 1 -1 sc sh gr
1.000000 1.000000 1.000000 srgb
n -44.784500 -51.058400 m -44.784500 -47.658400 l -36.981375 -47.658400 l -36.981375 -51.058400 l f
0.000000 0.000000 0.000000 srgb
n -44.784500 -51.058400 m -44.784500 -47.658400 l -36.981375 -47.658400 l -36.981375 -51.058400 l cp s
/Courier-latin1 ff 0.560000 scf sf
(+is_void\(\): bool) -44.634500 -50.428712 m gs 1 -1 sc sh gr
/Helvetica-latin1 ff 0.560000 scf sf
(get from 'what') -44.634500 -49.628712 m gs 1 -1 sc sh gr
/Courier-latin1 ff 0.560000 scf sf
(+is_volatile\(\): boll) -44.634500 -48.828712 m gs 1 -1 sc sh gr
/Helvetica-latin1 ff 0.560000 scf sf
(return true) -44.634500 -48.028712 m gs 1 -1 sc sh gr
0.100000 slw
[] 0 sd
0 slj
0 slc
n -63.990800 -57.662297 m -63.990800 -56.116200 l -40.882900 -56.116200 l -40.882900 -53.658400 l s
0 slj
1.000000 1.000000 1.000000 srgb
n -63.590800 -57.662297 m -63.990800 -58.462297 l -64.390800 -57.662297 l ef
0.100000 slw
[] 0 sd
0 slj
0.000000 0.000000 0.000000 srgb
n -63.590800 -57.662297 m -63.990800 -58.462297 l -64.390800 -57.662297 l cp s
/Courier-latin1 ff 0.560000 scf sf
0.100000 slw
[] 0 sd
1.000000 1.000000 1.000000 srgb
n -90.929700 -53.642700 m -90.929700 -52.042700 l -83.126575 -52.042700 l -83.126575 -53.642700 l f
0.000000 0.000000 0.000000 srgb
n -90.929700 -53.642700 m -90.929700 -52.042700 l -83.126575 -52.042700 l -83.126575 -53.642700 l cp s
/Helvetica-latin1 ff 0.840000 scf sf
(referential) dup sw 2 div -87.028137 ex sub -52.442700 m gs 1 -1 sc sh gr
1.000000 1.000000 1.000000 srgb
n -90.929700 -52.042700 m -90.929700 -51.042700 l -83.126575 -51.042700 l -83.126575 -52.042700 l f
0.000000 0.000000 0.000000 srgb
n -90.929700 -52.042700 m -90.929700 -51.042700 l -83.126575 -51.042700 l -83.126575 -52.042700 l cp s
/Courier-latin1 ff 0.560000 scf sf
(+what: type) -90.779700 -51.413012 m gs 1 -1 sc sh gr
1.000000 1.000000 1.000000 srgb
n -90.929700 -51.042700 m -90.929700 -49.242700 l -83.126575 -49.242700 l -83.126575 -51.042700 l f
0.000000 0.000000 0.000000 srgb
n -90.929700 -51.042700 m -90.929700 -49.242700 l -83.126575 -49.242700 l -83.126575 -51.042700 l cp s
/Courier-latin1 ff 0.560000 scf sf
(+is_void\(\): bool) -90.779700 -50.413012 m gs 1 -1 sc sh gr
/Courier-latin1 ff 0.560000 scf sf
(+is_volatile\(\): bool) -90.779700 -49.613012 m gs 1 -1 sc sh gr
0.100000 slw
[] 0 sd
0 slj
0 slc
n -63.990800 -57.662297 m -63.990800 -56.108400 l -87.028137 -56.108400 l -87.028137 -53.642700 l s
0 slj
1.000000 1.000000 1.000000 srgb
n -63.590800 -57.662297 m -63.990800 -58.462297 l -64.390800 -57.662297 l ef
0.100000 slw
[] 0 sd
0 slj
0.000000 0.000000 0.000000 srgb
n -63.590800 -57.662297 m -63.990800 -58.462297 l -64.390800 -57.662297 l cp s
/Courier-latin1 ff 0.560000 scf sf
0.100000 slw
[] 0 sd
1.000000 1.000000 1.000000 srgb
n -77.467500 -33.441400 m -77.467500 -31.841400 l -62.821406 -31.841400 l -62.821406 -33.441400 l f
0.000000 0.000000 0.000000 srgb
n -77.467500 -33.441400 m -77.467500 -31.841400 l -62.821406 -31.841400 l -62.821406 -33.441400 l cp s
/Helvetica-latin1 ff 0.840000 scf sf
(class\(=struct\)) dup sw 2 div -70.144453 ex sub -32.241400 m gs 1 -1 sc sh gr
1.000000 1.000000 1.000000 srgb
n -77.467500 -31.841400 m -77.467500 -30.041400 l -62.821406 -30.041400 l -62.821406 -31.841400 l f
0.000000 0.000000 0.000000 srgb
n -77.467500 -31.841400 m -77.467500 -30.041400 l -62.821406 -30.041400 l -62.821406 -31.841400 l cp s
/Courier-latin1 ff 0.560000 scf sf
(+bases: LIST<base_specifier>) -77.317500 -31.211712 m gs 1 -1 sc sh gr
/Courier-latin1 ff 0.560000 scf sf
(+descendants: SET<class>) -77.317500 -30.411712 m gs 1 -1 sc sh gr
1.000000 1.000000 1.000000 srgb
n -77.467500 -30.041400 m -77.467500 -29.041400 l -62.821406 -29.041400 l -62.821406 -30.041400 l f
0.000000 0.000000 0.000000 srgb
n -77.467500 -30.041400 m -77.467500 -29.041400 l -62.821406 -29.041400 l -62.821406 -30.041400 l cp s
/Courier-latin1 ff 0.560000 scf sf
(+is_ancestor\(descendant:ss_class\): bool) -77.317500 -29.411712 m gs 1 -1 sc sh gr
0.100000 slw
[] 0 sd
0 slj
0 slc
n -63.985000 -36.548597 m -63.985000 -35.450900 l -70.342500 -35.450900 l -70.342500 -33.441400 l s
0 slj
1.000000 1.000000 1.000000 srgb
n -63.585000 -36.548597 m -63.985000 -37.348597 l -64.385000 -36.548597 l ef
0.100000 slw
[] 0 sd
0 slj
0.000000 0.000000 0.000000 srgb
n -63.585000 -36.548597 m -63.985000 -37.348597 l -64.385000 -36.548597 l cp s
/Courier-latin1 ff 0.560000 scf sf
0.100000 slw
[] 0 sd
1.000000 1.000000 1.000000 srgb
n -34.534300 -33.881500 m -34.534300 -32.281500 l -24.946800 -32.281500 l -24.946800 -33.881500 l f
0.000000 0.000000 0.000000 srgb
n -34.534300 -33.881500 m -34.534300 -32.281500 l -24.946800 -32.281500 l -24.946800 -33.881500 l cp s
/Helvetica-latin1 ff 0.840000 scf sf
(member_function) dup sw 2 div -29.740550 ex sub -32.681500 m gs 1 -1 sc sh gr
1.000000 1.000000 1.000000 srgb
n -34.534300 -32.281500 m -34.534300 -31.281500 l -24.946800 -31.281500 l -24.946800 -32.281500 l f
0.000000 0.000000 0.000000 srgb
n -34.534300 -32.281500 m -34.534300 -31.281500 l -24.946800 -31.281500 l -24.946800 -32.281500 l cp s
/Courier-latin1 ff 0.560000 scf sf
(+this_type: ss_type) -34.384300 -31.651812 m gs 1 -1 sc sh gr
1.000000 1.000000 1.000000 srgb
n -34.534300 -31.281500 m -34.534300 -30.881500 l -24.946800 -30.881500 l -24.946800 -31.281500 l f
0.000000 0.000000 0.000000 srgb
n -34.534300 -31.281500 m -34.534300 -30.881500 l -24.946800 -30.881500 l -24.946800 -31.281500 l cp s
0.100000 slw
[] 0 sd
0 slj
0 slc
n -29.776700 -38.136397 m -29.776700 -36.464850 l -29.740550 -36.464850 l -29.740550 -33.881500 l s
0 slj
1.000000 1.000000 1.000000 srgb
n -29.376700 -38.136397 m -29.776700 -38.936397 l -30.176700 -38.136397 l ef
0.100000 slw
[] 0 sd
0 slj
0.000000 0.000000 0.000000 srgb
n -29.376700 -38.136397 m -29.776700 -38.936397 l -30.176700 -38.136397 l cp s
/Courier-latin1 ff 0.560000 scf sf
0.100000 slw
[] 0 sd
1.000000 1.000000 1.000000 srgb
n -34.996300 -53.703900 m -34.996300 -52.103900 l -24.311925 -52.103900 l -24.311925 -53.703900 l f
0.000000 0.000000 0.000000 srgb
n -34.996300 -53.703900 m -34.996300 -52.103900 l -24.311925 -52.103900 l -24.311925 -53.703900 l cp s
/Helvetica-latin1 ff 0.840000 scf sf
(template_type) dup sw 2 div -29.654112 ex sub -52.503900 m gs 1 -1 sc sh gr
1.000000 1.000000 1.000000 srgb
n -34.996300 -52.103900 m -34.996300 -49.503900 l -24.311925 -49.503900 l -24.311925 -52.103900 l f
0.000000 0.000000 0.000000 srgb
n -34.996300 -52.103900 m -34.996300 -49.503900 l -24.311925 -49.503900 l -24.311925 -52.103900 l cp s
/Courier-latin1 ff 0.560000 scf sf
(+contained_in: decl_seq) -34.846300 -51.474212 m gs 1 -1 sc sh gr
/Courier-latin1 ff 0.560000 scf sf
(+decl_time: declaration_time) -34.846300 -50.674212 m gs 1 -1 sc sh gr
/Courier-latin1 ff 0.560000 scf sf
(+qualified_name: as_name) -34.846300 -49.874212 m gs 1 -1 sc sh gr
1.000000 1.000000 1.000000 srgb
n -34.996300 -49.503900 m -34.996300 -49.103900 l -24.311925 -49.103900 l -24.311925 -49.503900 l f
0.000000 0.000000 0.000000 srgb
n -34.996300 -49.503900 m -34.996300 -49.103900 l -24.311925 -49.103900 l -24.311925 -49.503900 l cp s
0.100000 slw
[] 0 sd
0 slj
0 slc
n -63.990800 -57.662297 m -63.990800 -56.139000 l -29.796300 -56.139000 l -29.796300 -53.703900 l s
0 slj
1.000000 1.000000 1.000000 srgb
n -63.590800 -57.662297 m -63.990800 -58.462297 l -64.390800 -57.662297 l ef
0.100000 slw
[] 0 sd
0 slj
0.000000 0.000000 0.000000 srgb
n -63.590800 -57.662297 m -63.990800 -58.462297 l -64.390800 -57.662297 l cp s
/Courier-latin1 ff 0.560000 scf sf
0.100000 slw
[] 0 sd
1.000000 1.000000 1.000000 srgb
n -100.884000 -43.835200 m -100.884000 -42.235200 l -91.156656 -42.235200 l -91.156656 -43.835200 l f
0.000000 0.000000 0.000000 srgb
n -100.884000 -43.835200 m -100.884000 -42.235200 l -91.156656 -42.235200 l -91.156656 -43.835200 l cp s
/Helvetica-latin1 ff 0.840000 scf sf
(pseudo_reference) dup sw 2 div -96.020328 ex sub -42.635200 m gs 1 -1 sc sh gr
1.000000 1.000000 1.000000 srgb
n -100.884000 -42.235200 m -100.884000 -41.835200 l -91.156656 -41.835200 l -91.156656 -42.235200 l f
0.000000 0.000000 0.000000 srgb
n -100.884000 -42.235200 m -100.884000 -41.835200 l -91.156656 -41.835200 l -91.156656 -42.235200 l cp s
1.000000 1.000000 1.000000 srgb
n -100.884000 -41.835200 m -100.884000 -41.435200 l -91.156656 -41.435200 l -91.156656 -41.835200 l f
0.000000 0.000000 0.000000 srgb
n -100.884000 -41.835200 m -100.884000 -41.435200 l -91.156656 -41.435200 l -91.156656 -41.835200 l cp s
0.100000 slw
[] 0 sd
1.000000 1.000000 1.000000 srgb
n -89.741400 -43.785200 m -89.741400 -42.185200 l -84.303900 -42.185200 l -84.303900 -43.785200 l f
0.000000 0.000000 0.000000 srgb
n -89.741400 -43.785200 m -89.741400 -42.185200 l -84.303900 -42.185200 l -84.303900 -43.785200 l cp s
/Helvetica-latin1 ff 0.840000 scf sf
(reference) dup sw 2 div -87.022650 ex sub -42.585200 m gs 1 -1 sc sh gr
1.000000 1.000000 1.000000 srgb
n -89.741400 -42.185200 m -89.741400 -41.785200 l -84.303900 -41.785200 l -84.303900 -42.185200 l f
0.000000 0.000000 0.000000 srgb
n -89.741400 -42.185200 m -89.741400 -41.785200 l -84.303900 -41.785200 l -84.303900 -42.185200 l cp s
1.000000 1.000000 1.000000 srgb
n -89.741400 -41.785200 m -89.741400 -41.385200 l -84.303900 -41.385200 l -84.303900 -41.785200 l f
0.000000 0.000000 0.000000 srgb
n -89.741400 -41.785200 m -89.741400 -41.385200 l -84.303900 -41.385200 l -84.303900 -41.785200 l cp s
0.100000 slw
[] 0 sd
0 slj
0 slc
n -87.028137 -48.330897 m -87.028137 -46.538950 l -96.020300 -46.538950 l -96.020300 -43.835200 l s
0 slj
1.000000 1.000000 1.000000 srgb
n -86.628137 -48.330897 m -87.028137 -49.130897 l -87.428138 -48.330897 l ef
0.100000 slw
[] 0 sd
0 slj
0.000000 0.000000 0.000000 srgb
n -86.628137 -48.330897 m -87.028137 -49.130897 l -87.428138 -48.330897 l cp s
/Courier-latin1 ff 0.560000 scf sf
0.100000 slw
[] 0 sd
0 slj
0 slc
n -87.028137 -48.330897 m -87.028137 -46.513950 l -87.022650 -46.513950 l -87.022650 -43.785200 l s
0 slj
1.000000 1.000000 1.000000 srgb
n -86.628137 -48.330897 m -87.028137 -49.130897 l -87.428138 -48.330897 l ef
0.100000 slw
[] 0 sd
0 slj
0.000000 0.000000 0.000000 srgb
n -86.628137 -48.330897 m -87.028137 -49.130897 l -87.428138 -48.330897 l cp s
/Courier-latin1 ff 0.560000 scf sf
showpage
