<?xml version="1.0" encoding="UTF-8"?>
<dump xmlns="http://lestes.jikos.cz/schemas/dump">
	<instance type="dumped_object" id="i_1">
		<field name="i" type="lint" origin="middle_object"><simple type="lint" value="1" /></field>
		<field name="o" type="object" origin="dumped_object"><pointer idref="i_2" /></field>
		<field name="c" type="list&lt;dumped_object&gt;" origin="dumped_object"><pointer idref="i_3" /></field>
	</instance>
	<instance type="dumped_object" id="i_2">
		<field name="i" type="lint" origin="middle_object"><simple type="lint" value="0" /></field>
		<field name="o" type="object" origin="dumped_object"><null /></field>
		<field name="c" type="list&lt;dumped_object&gt;" origin="dumped_object"><null /></field>
	</instance>
	<instance type="list_of_srp" id="i_3">
		<field name="item0" type="srp" origin="list_of_srp"><simple type="lint" value="5" /></field>
		<field name="item1" type="srp" origin="list_of_srp"><simple type="ulint" value="6" /></field>
		<field name="item2" type="srp" origin="list_of_srp"><pointer idref="i_1" /></field>
		<field name="item3" type="srp" origin="list_of_srp"><null /></field>
		<field name="item4" type="srp" origin="list_of_srp"><pointer idref="i_4" /></field>
		<field name="item5" type="srp" origin="list_of_srp"><pointer idref="i_5" /></field>
		<field name="item6" type="srp" origin="list_of_srp"><pointer idref="i_6" /></field>
	</instance>
	<instance type="list_of_simple" id="i_4">
		<field name="item0" type="simple" origin="list_of_simple"><simple type="bool" value="true" /></field>
		<field name="item1" type="simple" origin="list_of_simple"><simple type="bool" value="true" /></field>
		<field name="item2" type="simple" origin="list_of_simple"><simple type="bool" value="false" /></field>
	</instance>
	<instance type="vector_of_srp" id="i_5">
		<field name="item0" type="srp" origin="vector_of_srp"><pointer idref="i_7" /></field>
		<field name="item1" type="srp" origin="vector_of_srp"><null /></field>
		<field name="item2" type="srp" origin="vector_of_srp"><pointer idref="i_5" /></field>
	</instance>
	<instance type="list_of_simple" id="i_6">
		<field name="item" type="simple" origin="list_of_simple"><nondumpable /></field>
	</instance>
	<instance type="map_simple_srp" id="i_7">
		<field name="item0" type="pair_simple_srp" origin="map_simple_srp"><pointer idref="i_8" /></field>
		<field name="item1" type="pair_simple_srp" origin="map_simple_srp"><pointer idref="i_9" /></field>
		<field name="item2" type="pair_simple_srp" origin="map_simple_srp"><pointer idref="i_10" /></field>
	</instance>
	<instance type="pair_simple_srp" id="i_8">
		<field name="first" type="simple" origin="pair_simple_srp"><simple type="lint" value="-10" /></field>
		<field name="second" type="srp" origin="pair_simple_srp"><null /></field>
	</instance>
	<instance type="pair_simple_srp" id="i_9">
		<field name="first" type="simple" origin="pair_simple_srp"><simple type="lint" value="5" /></field>
		<field name="second" type="srp" origin="pair_simple_srp"><pointer idref="i_11" /></field>
	</instance>
	<instance type="pair_simple_srp" id="i_10">
		<field name="first" type="simple" origin="pair_simple_srp"><simple type="lint" value="31" /></field>
		<field name="second" type="srp" origin="pair_simple_srp"><pointer idref="i_7" /></field>
	</instance>
	<instance type="set_of_simple" id="i_11">
		<field name="item0" type="simple" origin="set_of_simple"><simple type="lint" value="-1" /></field>
		<field name="item1" type="simple" origin="set_of_simple"><simple type="lint" value="3" /></field>
		<field name="item2" type="simple" origin="set_of_simple"><simple type="lint" value="5" /></field>
	</instance>
</dump>
