%!PS-Adobe-2.0 EPSF-2.0
%%Title: ss_uml_statement.dia
%%Creator: Dia v0.94
%%CreationDate: Thu May 26 14:04:40 2005
%%For: sandp9am
%%Orientation: Portrait
%%Magnification: 1.0000
%%BoundingBox: 0 0 471 280
%%BeginSetup
%%EndSetup
%%EndComments
%%BeginProlog
[ /.notdef /.notdef /.notdef /.notdef /.notdef /.notdef /.notdef /.notdef /.notdef /.notdef
/.notdef /.notdef /.notdef /.notdef /.notdef /.notdef /.notdef /.notdef /.notdef /.notdef
/.notdef /.notdef /.notdef /.notdef /.notdef /.notdef /.notdef /.notdef /.notdef /.notdef
/.notdef /.notdef /space /exclam /quotedbl /numbersign /dollar /percent /ampersand /quoteright
/parenleft /parenright /asterisk /plus /comma /hyphen /period /slash /zero /one
/two /three /four /five /six /seven /eight /nine /colon /semicolon
/less /equal /greater /question /at /A /B /C /D /E
/F /G /H /I /J /K /L /M /N /O
/P /Q /R /S /T /U /V /W /X /Y
/Z /bracketleft /backslash /bracketright /asciicircum /underscore /quoteleft /a /b /c
/d /e /f /g /h /i /j /k /l /m
/n /o /p /q /r /s /t /u /v /w
/x /y /z /braceleft /bar /braceright /asciitilde /.notdef /.notdef /.notdef
/.notdef /.notdef /.notdef /.notdef /.notdef /.notdef /.notdef /.notdef /.notdef /.notdef
/.notdef /.notdef /.notdef /.notdef /.notdef /.notdef /.notdef /.notdef /.notdef /.notdef
/.notdef /.notdef /.notdef /.notdef /.notdef /.notdef /.notdef /.notdef /.notdef /.notdef
/space /exclamdown /cent /sterling /currency /yen /brokenbar /section /dieresis /copyright
/ordfeminine /guillemotleft /logicalnot /hyphen /registered /macron /degree /plusminus /twosuperior /threesuperior
/acute /mu /paragraph /periodcentered /cedilla /onesuperior /ordmasculine /guillemotright /onequarter /onehalf
/threequarters /questiondown /Agrave /Aacute /Acircumflex /Atilde /Adieresis /Aring /AE /Ccedilla
/Egrave /Eacute /Ecircumflex /Edieresis /Igrave /Iacute /Icircumflex /Idieresis /Eth /Ntilde
/Ograve /Oacute /Ocircumflex /Otilde /Odieresis /multiply /Oslash /Ugrave /Uacute /Ucircumflex
/Udieresis /Yacute /Thorn /germandbls /agrave /aacute /acircumflex /atilde /adieresis /aring
/ae /ccedilla /egrave /eacute /ecircumflex /edieresis /igrave /iacute /icircumflex /idieresis
/eth /ntilde /ograve /oacute /ocircumflex /otilde /odieresis /divide /oslash /ugrave
/uacute /ucircumflex /udieresis /yacute /thorn /ydieresis] /isolatin1encoding exch def
/cp {closepath} bind def
/c {curveto} bind def
/f {fill} bind def
/a {arc} bind def
/ef {eofill} bind def
/ex {exch} bind def
/gr {grestore} bind def
/gs {gsave} bind def
/sa {save} bind def
/rs {restore} bind def
/l {lineto} bind def
/m {moveto} bind def
/rm {rmoveto} bind def
/n {newpath} bind def
/s {stroke} bind def
/sh {show} bind def
/slc {setlinecap} bind def
/slj {setlinejoin} bind def
/slw {setlinewidth} bind def
/srgb {setrgbcolor} bind def
/rot {rotate} bind def
/sc {scale} bind def
/sd {setdash} bind def
/ff {findfont} bind def
/sf {setfont} bind def
/scf {scalefont} bind def
/sw {stringwidth pop} bind def
/tr {translate} bind def

/ellipsedict 8 dict def
ellipsedict /mtrx matrix put
/ellipse
{ ellipsedict begin
   /endangle exch def
   /startangle exch def
   /yrad exch def
   /xrad exch def
   /y exch def
   /x exch def   /savematrix mtrx currentmatrix def
   x y tr xrad yrad sc
   0 0 1 startangle endangle arc
   savematrix setmatrix
   end
} def

/mergeprocs {
dup length
3 -1 roll
dup
length
dup
5 1 roll
3 -1 roll
add
array cvx
dup
3 -1 roll
0 exch
putinterval
dup
4 2 roll
putinterval
} bind def
/Times-Roman-latin1
    /Times-Roman findfont
    dup length dict begin
	{1 index /FID ne {def} {pop pop} ifelse} forall
	/Encoding isolatin1encoding def
    currentdict end
definefont pop
/Times-Italic-latin1
    /Times-Italic findfont
    dup length dict begin
	{1 index /FID ne {def} {pop pop} ifelse} forall
	/Encoding isolatin1encoding def
    currentdict end
definefont pop
/Times-Bold-latin1
    /Times-Bold findfont
    dup length dict begin
	{1 index /FID ne {def} {pop pop} ifelse} forall
	/Encoding isolatin1encoding def
    currentdict end
definefont pop
/Times-BoldItalic-latin1
    /Times-BoldItalic findfont
    dup length dict begin
	{1 index /FID ne {def} {pop pop} ifelse} forall
	/Encoding isolatin1encoding def
    currentdict end
definefont pop
/AvantGarde-Book-latin1
    /AvantGarde-Book findfont
    dup length dict begin
	{1 index /FID ne {def} {pop pop} ifelse} forall
	/Encoding isolatin1encoding def
    currentdict end
definefont pop
/AvantGarde-BookOblique-latin1
    /AvantGarde-BookOblique findfont
    dup length dict begin
	{1 index /FID ne {def} {pop pop} ifelse} forall
	/Encoding isolatin1encoding def
    currentdict end
definefont pop
/AvantGarde-Demi-latin1
    /AvantGarde-Demi findfont
    dup length dict begin
	{1 index /FID ne {def} {pop pop} ifelse} forall
	/Encoding isolatin1encoding def
    currentdict end
definefont pop
/AvantGarde-DemiOblique-latin1
    /AvantGarde-DemiOblique findfont
    dup length dict begin
	{1 index /FID ne {def} {pop pop} ifelse} forall
	/Encoding isolatin1encoding def
    currentdict end
definefont pop
/Bookman-Light-latin1
    /Bookman-Light findfont
    dup length dict begin
	{1 index /FID ne {def} {pop pop} ifelse} forall
	/Encoding isolatin1encoding def
    currentdict end
definefont pop
/Bookman-LightItalic-latin1
    /Bookman-LightItalic findfont
    dup length dict begin
	{1 index /FID ne {def} {pop pop} ifelse} forall
	/Encoding isolatin1encoding def
    currentdict end
definefont pop
/Bookman-Demi-latin1
    /Bookman-Demi findfont
    dup length dict begin
	{1 index /FID ne {def} {pop pop} ifelse} forall
	/Encoding isolatin1encoding def
    currentdict end
definefont pop
/Bookman-DemiItalic-latin1
    /Bookman-DemiItalic findfont
    dup length dict begin
	{1 index /FID ne {def} {pop pop} ifelse} forall
	/Encoding isolatin1encoding def
    currentdict end
definefont pop
/Courier-latin1
    /Courier findfont
    dup length dict begin
	{1 index /FID ne {def} {pop pop} ifelse} forall
	/Encoding isolatin1encoding def
    currentdict end
definefont pop
/Courier-Oblique-latin1
    /Courier-Oblique findfont
    dup length dict begin
	{1 index /FID ne {def} {pop pop} ifelse} forall
	/Encoding isolatin1encoding def
    currentdict end
definefont pop
/Courier-Bold-latin1
    /Courier-Bold findfont
    dup length dict begin
	{1 index /FID ne {def} {pop pop} ifelse} forall
	/Encoding isolatin1encoding def
    currentdict end
definefont pop
/Courier-BoldOblique-latin1
    /Courier-BoldOblique findfont
    dup length dict begin
	{1 index /FID ne {def} {pop pop} ifelse} forall
	/Encoding isolatin1encoding def
    currentdict end
definefont pop
/Helvetica-latin1
    /Helvetica findfont
    dup length dict begin
	{1 index /FID ne {def} {pop pop} ifelse} forall
	/Encoding isolatin1encoding def
    currentdict end
definefont pop
/Helvetica-Oblique-latin1
    /Helvetica-Oblique findfont
    dup length dict begin
	{1 index /FID ne {def} {pop pop} ifelse} forall
	/Encoding isolatin1encoding def
    currentdict end
definefont pop
/Helvetica-Bold-latin1
    /Helvetica-Bold findfont
    dup length dict begin
	{1 index /FID ne {def} {pop pop} ifelse} forall
	/Encoding isolatin1encoding def
    currentdict end
definefont pop
/Helvetica-BoldOblique-latin1
    /Helvetica-BoldOblique findfont
    dup length dict begin
	{1 index /FID ne {def} {pop pop} ifelse} forall
	/Encoding isolatin1encoding def
    currentdict end
definefont pop
/Helvetica-Narrow-latin1
    /Helvetica-Narrow findfont
    dup length dict begin
	{1 index /FID ne {def} {pop pop} ifelse} forall
	/Encoding isolatin1encoding def
    currentdict end
definefont pop
/Helvetica-Narrow-Oblique-latin1
    /Helvetica-Narrow-Oblique findfont
    dup length dict begin
	{1 index /FID ne {def} {pop pop} ifelse} forall
	/Encoding isolatin1encoding def
    currentdict end
definefont pop
/Helvetica-Narrow-Bold-latin1
    /Helvetica-Narrow-Bold findfont
    dup length dict begin
	{1 index /FID ne {def} {pop pop} ifelse} forall
	/Encoding isolatin1encoding def
    currentdict end
definefont pop
/Helvetica-Narrow-BoldOblique-latin1
    /Helvetica-Narrow-BoldOblique findfont
    dup length dict begin
	{1 index /FID ne {def} {pop pop} ifelse} forall
	/Encoding isolatin1encoding def
    currentdict end
definefont pop
/NewCenturySchoolbook-Roman-latin1
    /NewCenturySchoolbook-Roman findfont
    dup length dict begin
	{1 index /FID ne {def} {pop pop} ifelse} forall
	/Encoding isolatin1encoding def
    currentdict end
definefont pop
/NewCenturySchoolbook-Italic-latin1
    /NewCenturySchoolbook-Italic findfont
    dup length dict begin
	{1 index /FID ne {def} {pop pop} ifelse} forall
	/Encoding isolatin1encoding def
    currentdict end
definefont pop
/NewCenturySchoolbook-Bold-latin1
    /NewCenturySchoolbook-Bold findfont
    dup length dict begin
	{1 index /FID ne {def} {pop pop} ifelse} forall
	/Encoding isolatin1encoding def
    currentdict end
definefont pop
/NewCenturySchoolbook-BoldItalic-latin1
    /NewCenturySchoolbook-BoldItalic findfont
    dup length dict begin
	{1 index /FID ne {def} {pop pop} ifelse} forall
	/Encoding isolatin1encoding def
    currentdict end
definefont pop
/Palatino-Roman-latin1
    /Palatino-Roman findfont
    dup length dict begin
	{1 index /FID ne {def} {pop pop} ifelse} forall
	/Encoding isolatin1encoding def
    currentdict end
definefont pop
/Palatino-Italic-latin1
    /Palatino-Italic findfont
    dup length dict begin
	{1 index /FID ne {def} {pop pop} ifelse} forall
	/Encoding isolatin1encoding def
    currentdict end
definefont pop
/Palatino-Bold-latin1
    /Palatino-Bold findfont
    dup length dict begin
	{1 index /FID ne {def} {pop pop} ifelse} forall
	/Encoding isolatin1encoding def
    currentdict end
definefont pop
/Palatino-BoldItalic-latin1
    /Palatino-BoldItalic findfont
    dup length dict begin
	{1 index /FID ne {def} {pop pop} ifelse} forall
	/Encoding isolatin1encoding def
    currentdict end
definefont pop
/Symbol-latin1
    /Symbol findfont
definefont pop
/ZapfChancery-MediumItalic-latin1
    /ZapfChancery-MediumItalic findfont
    dup length dict begin
	{1 index /FID ne {def} {pop pop} ifelse} forall
	/Encoding isolatin1encoding def
    currentdict end
definefont pop
/ZapfDingbats-latin1
    /ZapfDingbats findfont
    dup length dict begin
	{1 index /FID ne {def} {pop pop} ifelse} forall
	/Encoding isolatin1encoding def
    currentdict end
definefont pop
5.669200 -5.669200 scale
117.250000 95.550000 translate
%%EndProlog


0.100000 slw
[] 0 sd
1.000000 1.000000 1.000000 srgb
n -90.670600 -144.738000 m -90.670600 -143.138000 l -79.265912 -143.138000 l -79.265912 -144.738000 l f
0.000000 0.000000 0.000000 srgb
n -90.670600 -144.738000 m -90.670600 -143.138000 l -79.265912 -143.138000 l -79.265912 -144.738000 l cp s
/Helvetica-latin1 ff 0.840000 scf sf
(statement) dup sw 2 div -84.968256 ex sub -143.538000 m gs 1 -1 sc sh gr
1.000000 1.000000 1.000000 srgb
n -90.670600 -143.138000 m -90.670600 -138.138000 l -79.265912 -138.138000 l -79.265912 -143.138000 l f
0.000000 0.000000 0.000000 srgb
n -90.670600 -143.138000 m -90.670600 -138.138000 l -79.265912 -138.138000 l -79.265912 -143.138000 l cp s
/Courier-latin1 ff 0.560000 scf sf
(+labels: LIST<Label>) -90.520600 -142.508313 m gs 1 -1 sc sh gr
/Courier-latin1 ff 0.560000 scf sf
(+"location"\(source\)) -90.520600 -141.708313 m gs 1 -1 sc sh gr
/Courier-latin1 ff 0.560000 scf sf
(+parent: compound_stmt) -90.520600 -140.908313 m gs 1 -1 sc sh gr
/Courier-latin1 ff 0.560000 scf sf
(+psp: sp) -90.520600 -140.108313 m gs 1 -1 sc sh gr
/Courier-latin1 ff 0.560000 scf sf
(+nsp: sp) -90.520600 -139.308313 m gs 1 -1 sc sh gr
/Courier-latin1 ff 0.560000 scf sf
(+sequence_points: LIST <ss_sp>) -90.520600 -138.508313 m gs 1 -1 sc sh gr
1.000000 1.000000 1.000000 srgb
n -90.670600 -138.138000 m -90.670600 -137.738000 l -79.265912 -137.738000 l -79.265912 -138.138000 l f
0.000000 0.000000 0.000000 srgb
n -90.670600 -138.138000 m -90.670600 -137.738000 l -79.265912 -137.738000 l -79.265912 -138.138000 l cp s
0.100000 slw
[] 0 sd
1.000000 1.000000 1.000000 srgb
n -94.700000 -98.500000 m -94.700000 -96.900000 l -91.364063 -96.900000 l -91.364063 -98.500000 l f
0.000000 0.000000 0.000000 srgb
n -94.700000 -98.500000 m -94.700000 -96.900000 l -91.364063 -96.900000 l -91.364063 -98.500000 l cp s
/Helvetica-latin1 ff 0.840000 scf sf
(while) dup sw 2 div -93.032031 ex sub -97.300000 m gs 1 -1 sc sh gr
1.000000 1.000000 1.000000 srgb
n -94.700000 -96.900000 m -94.700000 -96.500000 l -91.364063 -96.500000 l -91.364063 -96.900000 l f
0.000000 0.000000 0.000000 srgb
n -94.700000 -96.900000 m -94.700000 -96.500000 l -91.364063 -96.500000 l -91.364063 -96.900000 l cp s
1.000000 1.000000 1.000000 srgb
n -94.700000 -96.500000 m -94.700000 -96.100000 l -91.364063 -96.100000 l -91.364063 -96.500000 l f
0.000000 0.000000 0.000000 srgb
n -94.700000 -96.500000 m -94.700000 -96.100000 l -91.364063 -96.100000 l -91.364063 -96.500000 l cp s
0.100000 slw
[] 0 sd
1.000000 1.000000 1.000000 srgb
n -105.400000 -98.600000 m -105.400000 -97.000000 l -96.876563 -97.000000 l -96.876563 -98.600000 l f
0.000000 0.000000 0.000000 srgb
n -105.400000 -98.600000 m -105.400000 -97.000000 l -96.876563 -97.000000 l -96.876563 -98.600000 l cp s
/Helvetica-latin1 ff 0.840000 scf sf
(for) dup sw 2 div -101.138281 ex sub -97.400000 m gs 1 -1 sc sh gr
1.000000 1.000000 1.000000 srgb
n -105.400000 -97.000000 m -105.400000 -96.000000 l -96.876563 -96.000000 l -96.876563 -97.000000 l f
0.000000 0.000000 0.000000 srgb
n -105.400000 -97.000000 m -105.400000 -96.000000 l -96.876563 -96.000000 l -96.876563 -97.000000 l cp s
/Courier-latin1 ff 0.560000 scf sf
(+iteration: expression) -105.250000 -96.370313 m gs 1 -1 sc sh gr
1.000000 1.000000 1.000000 srgb
n -105.400000 -96.000000 m -105.400000 -95.600000 l -96.876563 -95.600000 l -96.876563 -96.000000 l f
0.000000 0.000000 0.000000 srgb
n -105.400000 -96.000000 m -105.400000 -95.600000 l -96.876563 -95.600000 l -96.876563 -96.000000 l cp s
0.100000 slw
[] 0 sd
1.000000 1.000000 1.000000 srgb
n -90.666700 -109.067000 m -90.666700 -107.467000 l -79.262013 -107.467000 l -79.262013 -109.067000 l f
0.000000 0.000000 0.000000 srgb
n -90.666700 -109.067000 m -90.666700 -107.467000 l -79.262013 -107.467000 l -79.262013 -109.067000 l cp s
/Helvetica-latin1 ff 0.840000 scf sf
(switch_stmt) dup sw 2 div -84.964356 ex sub -107.867000 m gs 1 -1 sc sh gr
1.000000 1.000000 1.000000 srgb
n -90.666700 -107.467000 m -90.666700 -105.667000 l -79.262013 -105.667000 l -79.262013 -107.467000 l f
0.000000 0.000000 0.000000 srgb
n -90.666700 -107.467000 m -90.666700 -105.667000 l -79.262013 -105.667000 l -79.262013 -107.467000 l cp s
/Courier-latin1 ff 0.560000 scf sf
(+case_labels: LIST<case_label>) -90.516700 -106.837313 m gs 1 -1 sc sh gr
/Courier-latin1 ff 0.560000 scf sf
(+default_label: default_label) -90.516700 -106.037313 m gs 1 -1 sc sh gr
1.000000 1.000000 1.000000 srgb
n -90.666700 -105.667000 m -90.666700 -105.267000 l -79.262013 -105.267000 l -79.262013 -105.667000 l f
0.000000 0.000000 0.000000 srgb
n -90.666700 -105.667000 m -90.666700 -105.267000 l -79.262013 -105.267000 l -79.262013 -105.667000 l cp s
0.100000 slw
[] 0 sd
1.000000 1.000000 1.000000 srgb
n -56.470700 -117.271000 m -56.470700 -115.671000 l -46.866794 -115.671000 l -46.866794 -117.271000 l f
0.000000 0.000000 0.000000 srgb
n -56.470700 -117.271000 m -56.470700 -115.671000 l -46.866794 -115.671000 l -46.866794 -117.271000 l cp s
/Helvetica-latin1 ff 0.840000 scf sf
(catch \(handler\)) dup sw 2 div -51.668747 ex sub -116.071000 m gs 1 -1 sc sh gr
1.000000 1.000000 1.000000 srgb
n -56.470700 -115.671000 m -56.470700 -113.871000 l -46.866794 -113.871000 l -46.866794 -115.671000 l f
0.000000 0.000000 0.000000 srgb
n -56.470700 -115.671000 m -56.470700 -113.871000 l -46.866794 -113.871000 l -46.866794 -115.671000 l cp s
/Courier-latin1 ff 0.560000 scf sf
(+body: compound_stmt) -56.320700 -115.041313 m gs 1 -1 sc sh gr
/Courier-latin1 ff 0.560000 scf sf
(+declaration: declaration) -56.320700 -114.241313 m gs 1 -1 sc sh gr
1.000000 1.000000 1.000000 srgb
n -56.470700 -113.871000 m -56.470700 -113.471000 l -46.866794 -113.471000 l -46.866794 -113.871000 l f
0.000000 0.000000 0.000000 srgb
n -56.470700 -113.871000 m -56.470700 -113.471000 l -46.866794 -113.471000 l -46.866794 -113.871000 l cp s
0.100000 slw
[] 0 sd
1.000000 1.000000 1.000000 srgb
n -74.595500 -131.131000 m -74.595500 -129.531000 l -66.072063 -129.531000 l -66.072063 -131.131000 l f
0.000000 0.000000 0.000000 srgb
n -74.595500 -131.131000 m -74.595500 -129.531000 l -66.072063 -129.531000 l -66.072063 -131.131000 l cp s
/Helvetica-latin1 ff 0.840000 scf sf
(try \(block\)) dup sw 2 div -70.333781 ex sub -129.931000 m gs 1 -1 sc sh gr
1.000000 1.000000 1.000000 srgb
n -74.595500 -129.531000 m -74.595500 -127.731000 l -66.072063 -127.731000 l -66.072063 -129.531000 l f
0.000000 0.000000 0.000000 srgb
n -74.595500 -129.531000 m -74.595500 -127.731000 l -66.072063 -127.731000 l -66.072063 -129.531000 l cp s
/Courier-latin1 ff 0.560000 scf sf
(+block: compound_stmt) -74.445500 -128.901313 m gs 1 -1 sc sh gr
/Courier-latin1 ff 0.560000 scf sf
(+handlers: LIST<catch>) -74.445500 -128.101313 m gs 1 -1 sc sh gr
1.000000 1.000000 1.000000 srgb
n -74.595500 -127.731000 m -74.595500 -127.331000 l -66.072063 -127.331000 l -66.072063 -127.731000 l f
0.000000 0.000000 0.000000 srgb
n -74.595500 -127.731000 m -74.595500 -127.331000 l -66.072063 -127.331000 l -66.072063 -127.731000 l cp s
0.100000 slw
[] 0 sd
1.000000 1.000000 1.000000 srgb
n -117.200000 -117.200000 m -117.200000 -115.600000 l -111.917969 -115.600000 l -111.917969 -117.200000 l f
0.000000 0.000000 0.000000 srgb
n -117.200000 -117.200000 m -117.200000 -115.600000 l -111.917969 -115.600000 l -111.917969 -117.200000 l cp s
/Helvetica-latin1 ff 0.840000 scf sf
(goto) dup sw 2 div -114.558984 ex sub -116.000000 m gs 1 -1 sc sh gr
1.000000 1.000000 1.000000 srgb
n -117.200000 -115.600000 m -117.200000 -114.600000 l -111.917969 -114.600000 l -111.917969 -115.600000 l f
0.000000 0.000000 0.000000 srgb
n -117.200000 -115.600000 m -117.200000 -114.600000 l -111.917969 -114.600000 l -111.917969 -115.600000 l cp s
/Courier-latin1 ff 0.560000 scf sf
(+label: label) -117.050000 -114.970313 m gs 1 -1 sc sh gr
1.000000 1.000000 1.000000 srgb
n -117.200000 -114.600000 m -117.200000 -114.200000 l -111.917969 -114.200000 l -111.917969 -114.600000 l f
0.000000 0.000000 0.000000 srgb
n -117.200000 -114.600000 m -117.200000 -114.200000 l -111.917969 -114.200000 l -111.917969 -114.600000 l cp s
0.100000 slw
[] 0 sd
1.000000 1.000000 1.000000 srgb
n -109.500000 -98.500000 m -109.500000 -96.900000 l -107.652344 -96.900000 l -107.652344 -98.500000 l f
0.000000 0.000000 0.000000 srgb
n -109.500000 -98.500000 m -109.500000 -96.900000 l -107.652344 -96.900000 l -107.652344 -98.500000 l cp s
/Helvetica-latin1 ff 0.840000 scf sf
(do) dup sw 2 div -108.576172 ex sub -97.300000 m gs 1 -1 sc sh gr
1.000000 1.000000 1.000000 srgb
n -109.500000 -96.900000 m -109.500000 -96.500000 l -107.652344 -96.500000 l -107.652344 -96.900000 l f
0.000000 0.000000 0.000000 srgb
n -109.500000 -96.900000 m -109.500000 -96.500000 l -107.652344 -96.500000 l -107.652344 -96.900000 l cp s
1.000000 1.000000 1.000000 srgb
n -109.500000 -96.500000 m -109.500000 -96.100000 l -107.652344 -96.100000 l -107.652344 -96.500000 l f
0.000000 0.000000 0.000000 srgb
n -109.500000 -96.500000 m -109.500000 -96.100000 l -107.652344 -96.100000 l -107.652344 -96.500000 l cp s
0.100000 slw
[] 0 sd
1.000000 1.000000 1.000000 srgb
n -83.986900 -131.161000 m -83.986900 -129.561000 l -75.823619 -129.561000 l -75.823619 -131.161000 l f
0.000000 0.000000 0.000000 srgb
n -83.986900 -131.161000 m -83.986900 -129.561000 l -75.823619 -129.561000 l -75.823619 -131.161000 l cp s
/Helvetica-latin1 ff 0.840000 scf sf
(break) dup sw 2 div -79.905259 ex sub -129.961000 m gs 1 -1 sc sh gr
1.000000 1.000000 1.000000 srgb
n -83.986900 -129.561000 m -83.986900 -128.561000 l -75.823619 -128.561000 l -75.823619 -129.561000 l f
0.000000 0.000000 0.000000 srgb
n -83.986900 -129.561000 m -83.986900 -128.561000 l -75.823619 -128.561000 l -75.823619 -129.561000 l cp s
/Courier-latin1 ff 0.560000 scf sf
(+from: breakable_stmt) -83.836900 -128.931313 m gs 1 -1 sc sh gr
1.000000 1.000000 1.000000 srgb
n -83.986900 -128.561000 m -83.986900 -128.161000 l -75.823619 -128.161000 l -75.823619 -128.561000 l f
0.000000 0.000000 0.000000 srgb
n -83.986900 -128.561000 m -83.986900 -128.161000 l -75.823619 -128.161000 l -75.823619 -128.561000 l cp s
0.100000 slw
[] 0 sd
1.000000 1.000000 1.000000 srgb
n -84.777900 -117.121000 m -84.777900 -115.521000 l -76.614619 -115.521000 l -76.614619 -117.121000 l f
0.000000 0.000000 0.000000 srgb
n -84.777900 -117.121000 m -84.777900 -115.521000 l -76.614619 -115.521000 l -76.614619 -117.121000 l cp s
/Helvetica-latin1 ff 0.840000 scf sf
(continue) dup sw 2 div -80.696259 ex sub -115.921000 m gs 1 -1 sc sh gr
1.000000 1.000000 1.000000 srgb
n -84.777900 -115.521000 m -84.777900 -114.521000 l -76.614619 -114.521000 l -76.614619 -115.521000 l f
0.000000 0.000000 0.000000 srgb
n -84.777900 -115.521000 m -84.777900 -114.521000 l -76.614619 -114.521000 l -76.614619 -115.521000 l cp s
/Courier-latin1 ff 0.560000 scf sf
(+from: iteration_stmt) -84.627900 -114.891313 m gs 1 -1 sc sh gr
1.000000 1.000000 1.000000 srgb
n -84.777900 -114.521000 m -84.777900 -114.121000 l -76.614619 -114.121000 l -76.614619 -114.521000 l f
0.000000 0.000000 0.000000 srgb
n -84.777900 -114.521000 m -84.777900 -114.121000 l -76.614619 -114.121000 l -76.614619 -114.521000 l cp s
0.100000 slw
[] 0 sd
1.000000 1.000000 1.000000 srgb
n -110.200000 -117.200000 m -110.200000 -115.600000 l -101.316406 -115.600000 l -101.316406 -117.200000 l f
0.000000 0.000000 0.000000 srgb
n -110.200000 -117.200000 m -110.200000 -115.600000 l -101.316406 -115.600000 l -101.316406 -117.200000 l cp s
/Helvetica-latin1 ff 0.840000 scf sf
(expr_stmt) dup sw 2 div -105.758203 ex sub -116.000000 m gs 1 -1 sc sh gr
1.000000 1.000000 1.000000 srgb
n -110.200000 -115.600000 m -110.200000 -114.600000 l -101.316406 -114.600000 l -101.316406 -115.600000 l f
0.000000 0.000000 0.000000 srgb
n -110.200000 -115.600000 m -110.200000 -114.600000 l -101.316406 -114.600000 l -101.316406 -115.600000 l cp s
/Courier-latin1 ff 0.560000 scf sf
(+expression: expression) -110.050000 -114.970313 m gs 1 -1 sc sh gr
1.000000 1.000000 1.000000 srgb
n -110.200000 -114.600000 m -110.200000 -114.200000 l -101.316406 -114.200000 l -101.316406 -114.600000 l f
0.000000 0.000000 0.000000 srgb
n -110.200000 -114.600000 m -110.200000 -114.200000 l -101.316406 -114.200000 l -101.316406 -114.600000 l cp s
0.100000 slw
[] 0 sd
1.000000 1.000000 1.000000 srgb
n -66.734700 -117.141000 m -66.734700 -115.541000 l -58.211263 -115.541000 l -58.211263 -117.141000 l f
0.000000 0.000000 0.000000 srgb
n -66.734700 -117.141000 m -66.734700 -115.541000 l -58.211263 -115.541000 l -58.211263 -117.141000 l cp s
/Helvetica-latin1 ff 0.840000 scf sf
(if_stmt) dup sw 2 div -62.472981 ex sub -115.941000 m gs 1 -1 sc sh gr
1.000000 1.000000 1.000000 srgb
n -66.734700 -115.541000 m -66.734700 -112.941000 l -58.211263 -112.941000 l -58.211263 -115.541000 l f
0.000000 0.000000 0.000000 srgb
n -66.734700 -115.541000 m -66.734700 -112.941000 l -58.211263 -112.941000 l -58.211263 -115.541000 l cp s
/Courier-latin1 ff 0.560000 scf sf
(+condition: expression) -66.584700 -114.911313 m gs 1 -1 sc sh gr
/Courier-latin1 ff 0.560000 scf sf
(+cthen: compound_stmt) -66.584700 -114.111313 m gs 1 -1 sc sh gr
/Courier-latin1 ff 0.560000 scf sf
(+celse: compound_stmt) -66.584700 -113.311313 m gs 1 -1 sc sh gr
1.000000 1.000000 1.000000 srgb
n -66.734700 -112.941000 m -66.734700 -112.541000 l -58.211263 -112.541000 l -58.211263 -112.941000 l f
0.000000 0.000000 0.000000 srgb
n -66.734700 -112.941000 m -66.734700 -112.541000 l -58.211263 -112.541000 l -58.211263 -112.941000 l cp s
0.100000 slw
[] 0 sd
1.000000 1.000000 1.000000 srgb
n -113.022000 -131.185000 m -113.022000 -129.585000 l -102.337625 -129.585000 l -102.337625 -131.185000 l f
0.000000 0.000000 0.000000 srgb
n -113.022000 -131.185000 m -113.022000 -129.585000 l -102.337625 -129.585000 l -102.337625 -131.185000 l cp s
/Helvetica-latin1 ff 0.840000 scf sf
(compound_stmt) dup sw 2 div -107.679813 ex sub -129.985000 m gs 1 -1 sc sh gr
1.000000 1.000000 1.000000 srgb
n -113.022000 -129.585000 m -113.022000 -126.185000 l -102.337625 -126.185000 l -102.337625 -129.585000 l f
0.000000 0.000000 0.000000 srgb
n -113.022000 -129.585000 m -113.022000 -126.185000 l -102.337625 -126.185000 l -102.337625 -129.585000 l cp s
/Courier-latin1 ff 0.560000 scf sf
(+decl_seq: decl_seq) -112.872000 -128.955313 m gs 1 -1 sc sh gr
/Helvetica-latin1 ff 0.560000 scf sf
(\(Scope\)) -112.872000 -128.155313 m gs 1 -1 sc sh gr
/Courier-latin1 ff 0.560000 scf sf
(+statements: LIST<statement>) -112.872000 -127.355313 m gs 1 -1 sc sh gr
/Courier-latin1 ff 0.560000 scf sf
(+destructor_sp: sp) -112.872000 -126.555313 m gs 1 -1 sc sh gr
1.000000 1.000000 1.000000 srgb
n -113.022000 -126.185000 m -113.022000 -125.785000 l -102.337625 -125.785000 l -102.337625 -126.185000 l f
0.000000 0.000000 0.000000 srgb
n -113.022000 -126.185000 m -113.022000 -125.785000 l -102.337625 -125.785000 l -102.337625 -126.185000 l cp s
0.100000 slw
[] 0 sd
1.000000 1.000000 1.000000 srgb
n -101.139000 -131.092000 m -101.139000 -129.492000 l -86.132750 -129.492000 l -86.132750 -131.092000 l f
0.000000 0.000000 0.000000 srgb
n -101.139000 -131.092000 m -101.139000 -129.492000 l -86.132750 -129.492000 l -86.132750 -131.092000 l cp s
/Helvetica-latin1 ff 0.840000 scf sf
(decl_stmt) dup sw 2 div -93.635875 ex sub -129.892000 m gs 1 -1 sc sh gr
1.000000 1.000000 1.000000 srgb
n -101.139000 -129.492000 m -101.139000 -126.092000 l -86.132750 -126.092000 l -86.132750 -129.492000 l f
0.000000 0.000000 0.000000 srgb
n -101.139000 -129.492000 m -101.139000 -126.092000 l -86.132750 -126.092000 l -86.132750 -129.492000 l cp s
/Courier-latin1 ff 0.560000 scf sf
(+decl: declaration) -100.989000 -128.862313 m gs 1 -1 sc sh gr
/Courier-latin1 ff 0.560000 scf sf
(+args: LIST<expression>) -100.989000 -128.062313 m gs 1 -1 sc sh gr
/Courier-latin1 ff 0.560000 scf sf
(+odkaz na konstruktor ??) -100.989000 -127.262313 m gs 1 -1 sc sh gr
/Courier-latin1 ff 0.560000 scf sf
(+initializer_kind: initializer_kind_enum) -100.989000 -126.462313 m gs 1 -1 sc sh gr
1.000000 1.000000 1.000000 srgb
n -101.139000 -126.092000 m -101.139000 -125.692000 l -86.132750 -125.692000 l -86.132750 -126.092000 l f
0.000000 0.000000 0.000000 srgb
n -101.139000 -126.092000 m -101.139000 -125.692000 l -86.132750 -125.692000 l -86.132750 -126.092000 l cp s
0.100000 slw
[] 0 sd
1.000000 1.000000 1.000000 srgb
n -99.200000 -117.200000 m -99.200000 -115.600000 l -86.354687 -115.600000 l -86.354687 -117.200000 l f
0.000000 0.000000 0.000000 srgb
n -99.200000 -117.200000 m -99.200000 -115.600000 l -86.354687 -115.600000 l -86.354687 -117.200000 l cp s
/Helvetica-latin1 ff 0.840000 scf sf
(breakable_stmt) dup sw 2 div -92.777344 ex sub -116.000000 m gs 1 -1 sc sh gr
1.000000 1.000000 1.000000 srgb
n -99.200000 -115.600000 m -99.200000 -113.000000 l -86.354687 -113.000000 l -86.354687 -115.600000 l f
0.000000 0.000000 0.000000 srgb
n -99.200000 -115.600000 m -99.200000 -113.000000 l -86.354687 -113.000000 l -86.354687 -115.600000 l cp s
/Courier-latin1 ff 0.560000 scf sf
(+break_label: breakable_stmt_label) -99.050000 -114.970313 m gs 1 -1 sc sh gr
/Courier-latin1 ff 0.560000 scf sf
(+body: compound_stmt) -99.050000 -114.170313 m gs 1 -1 sc sh gr
/Courier-latin1 ff 0.560000 scf sf
(+condition: expression) -99.050000 -113.370313 m gs 1 -1 sc sh gr
1.000000 1.000000 1.000000 srgb
n -99.200000 -113.000000 m -99.200000 -112.600000 l -86.354687 -112.600000 l -86.354687 -113.000000 l f
0.000000 0.000000 0.000000 srgb
n -99.200000 -113.000000 m -99.200000 -112.600000 l -86.354687 -112.600000 l -86.354687 -113.000000 l cp s
0.100000 slw
[] 0 sd
1.000000 1.000000 1.000000 srgb
n -108.100000 -109.000000 m -108.100000 -107.400000 l -94.174219 -107.400000 l -94.174219 -109.000000 l f
0.000000 0.000000 0.000000 srgb
n -108.100000 -109.000000 m -108.100000 -107.400000 l -94.174219 -107.400000 l -94.174219 -109.000000 l cp s
/Helvetica-latin1 ff 0.840000 scf sf
(iteration_stmt) dup sw 2 div -101.137109 ex sub -107.800000 m gs 1 -1 sc sh gr
1.000000 1.000000 1.000000 srgb
n -108.100000 -107.400000 m -108.100000 -104.800000 l -94.174219 -104.800000 l -94.174219 -107.400000 l f
0.000000 0.000000 0.000000 srgb
n -108.100000 -107.400000 m -108.100000 -104.800000 l -94.174219 -104.800000 l -94.174219 -107.400000 l cp s
/Courier-latin1 ff 0.560000 scf sf
(+continue_label: breakable_stmt_label) -107.950000 -106.770313 m gs 1 -1 sc sh gr
/Courier-latin1 ff 0.560000 scf sf
(+body: compound_stmt) -107.950000 -105.970313 m gs 1 -1 sc sh gr
/Courier-latin1 ff 0.560000 scf sf
(+condition: expression) -107.950000 -105.170313 m gs 1 -1 sc sh gr
1.000000 1.000000 1.000000 srgb
n -108.100000 -104.800000 m -108.100000 -104.400000 l -94.174219 -104.400000 l -94.174219 -104.800000 l f
0.000000 0.000000 0.000000 srgb
n -108.100000 -104.800000 m -108.100000 -104.400000 l -94.174219 -104.400000 l -94.174219 -104.800000 l cp s
0.100000 slw
[] 0 sd
0 slj
0 slc
n -92.950000 -111.688197 m -92.950000 -110.800000 l -101.325000 -110.800000 l -101.325000 -109.000000 l s
0 slj
1.000000 1.000000 1.000000 srgb
n -92.550000 -111.688197 m -92.950000 -112.488197 l -93.350000 -111.688197 l ef
0.100000 slw
[] 0 sd
0 slj
0.000000 0.000000 0.000000 srgb
n -92.550000 -111.688197 m -92.950000 -112.488197 l -93.350000 -111.688197 l cp s
/Courier-latin1 ff 0.560000 scf sf
0.100000 slw
[] 0 sd
0 slj
0 slc
n -101.137109 -103.488197 m -101.137109 -101.450000 l -108.575000 -101.450000 l -108.575000 -98.500000 l s
0 slj
1.000000 1.000000 1.000000 srgb
n -100.737109 -103.488197 m -101.137109 -104.288197 l -101.537109 -103.488197 l ef
0.100000 slw
[] 0 sd
0 slj
0.000000 0.000000 0.000000 srgb
n -100.737109 -103.488197 m -101.137109 -104.288197 l -101.537109 -103.488197 l cp s
/Courier-latin1 ff 0.560000 scf sf
0.100000 slw
[] 0 sd
0 slj
0 slc
n -101.137109 -103.488197 m -101.137109 -101.450000 l -93.025000 -101.450000 l -93.025000 -98.500000 l s
0 slj
1.000000 1.000000 1.000000 srgb
n -100.737109 -103.488197 m -101.137109 -104.288197 l -101.537109 -103.488197 l ef
0.100000 slw
[] 0 sd
0 slj
0.000000 0.000000 0.000000 srgb
n -100.737109 -103.488197 m -101.137109 -104.288197 l -101.537109 -103.488197 l cp s
/Courier-latin1 ff 0.560000 scf sf
0.100000 slw
[] 0 sd
0 slj
0 slc
n -101.137109 -103.488197 m -101.137109 -101.500000 l -101.138281 -101.500000 l -101.138281 -98.600000 l s
0 slj
1.000000 1.000000 1.000000 srgb
n -100.737109 -103.488197 m -101.137109 -104.288197 l -101.537109 -103.488197 l ef
0.100000 slw
[] 0 sd
0 slj
0.000000 0.000000 0.000000 srgb
n -100.737109 -103.488197 m -101.137109 -104.288197 l -101.537109 -103.488197 l cp s
/Courier-latin1 ff 0.560000 scf sf
0.100000 slw
[] 0 sd
0 slj
0 slc
n -92.950000 -111.688197 m -92.950000 -110.799990 l -85.116700 -110.799990 l -85.116700 -109.067000 l s
0 slj
1.000000 1.000000 1.000000 srgb
n -92.550000 -111.688197 m -92.950000 -112.488197 l -93.350000 -111.688197 l ef
0.100000 slw
[] 0 sd
0 slj
0.000000 0.000000 0.000000 srgb
n -92.550000 -111.688197 m -92.950000 -112.488197 l -93.350000 -111.688197 l cp s
/Courier-latin1 ff 0.560000 scf sf
0.100000 slw
[] 0 sd
0 slj
0 slc
n -85.120600 -136.826197 m -85.120600 -121.988000 l -92.950000 -121.988000 l -92.950000 -117.200000 l s
0 slj
1.000000 1.000000 1.000000 srgb
n -84.720600 -136.826197 m -85.120600 -137.626197 l -85.520600 -136.826197 l ef
0.100000 slw
[] 0 sd
0 slj
0.000000 0.000000 0.000000 srgb
n -84.720600 -136.826197 m -85.120600 -137.626197 l -85.520600 -136.826197 l cp s
/Courier-latin1 ff 0.560000 scf sf
0.100000 slw
[] 0 sd
0 slj
0 slc
n -85.120600 -136.826197 m -85.120600 -134.449500 l -79.905259 -134.449500 l -79.905259 -131.161000 l s
0 slj
1.000000 1.000000 1.000000 srgb
n -84.720600 -136.826197 m -85.120600 -137.626197 l -85.520600 -136.826197 l ef
0.100000 slw
[] 0 sd
0 slj
0.000000 0.000000 0.000000 srgb
n -84.720600 -136.826197 m -85.120600 -137.626197 l -85.520600 -136.826197 l cp s
/Courier-latin1 ff 0.560000 scf sf
0.100000 slw
[] 0 sd
0 slj
0 slc
n -85.120600 -136.826197 m -85.120600 -122.005000 l -51.795700 -122.005000 l -51.795700 -117.271000 l s
0 slj
1.000000 1.000000 1.000000 srgb
n -84.720600 -136.826197 m -85.120600 -137.626197 l -85.520600 -136.826197 l ef
0.100000 slw
[] 0 sd
0 slj
0.000000 0.000000 0.000000 srgb
n -84.720600 -136.826197 m -85.120600 -137.626197 l -85.520600 -136.826197 l cp s
/Courier-latin1 ff 0.560000 scf sf
0.100000 slw
[] 0 sd
0 slj
0 slc
n -85.120600 -136.826197 m -85.120600 -134.434500 l -70.333781 -134.434500 l -70.333781 -131.131000 l s
0 slj
1.000000 1.000000 1.000000 srgb
n -84.720600 -136.826197 m -85.120600 -137.626197 l -85.520600 -136.826197 l ef
0.100000 slw
[] 0 sd
0 slj
0.000000 0.000000 0.000000 srgb
n -84.720600 -136.826197 m -85.120600 -137.626197 l -85.520600 -136.826197 l cp s
/Courier-latin1 ff 0.560000 scf sf
0.100000 slw
[] 0 sd
0 slj
0 slc
n -85.120600 -136.826197 m -85.120600 -121.988000 l -80.696259 -121.988000 l -80.696259 -117.121000 l s
0 slj
1.000000 1.000000 1.000000 srgb
n -84.720600 -136.826197 m -85.120600 -137.626197 l -85.520600 -136.826197 l ef
0.100000 slw
[] 0 sd
0 slj
0.000000 0.000000 0.000000 srgb
n -84.720600 -136.826197 m -85.120600 -137.626197 l -85.520600 -136.826197 l cp s
/Courier-latin1 ff 0.560000 scf sf
0.100000 slw
[] 0 sd
0 slj
0 slc
n -85.120600 -136.826197 m -85.120600 -134.462000 l -107.822000 -134.462000 l -107.822000 -131.185000 l s
0 slj
1.000000 1.000000 1.000000 srgb
n -84.720600 -136.826197 m -85.120600 -137.626197 l -85.520600 -136.826197 l ef
0.100000 slw
[] 0 sd
0 slj
0.000000 0.000000 0.000000 srgb
n -84.720600 -136.826197 m -85.120600 -137.626197 l -85.520600 -136.826197 l cp s
/Courier-latin1 ff 0.560000 scf sf
0.100000 slw
[] 0 sd
0 slj
0 slc
n -85.120600 -136.826197 m -85.120600 -121.988000 l -105.875000 -121.988000 l -105.875000 -117.200000 l s
0 slj
1.000000 1.000000 1.000000 srgb
n -84.720600 -136.826197 m -85.120600 -137.626197 l -85.520600 -136.826197 l ef
0.100000 slw
[] 0 sd
0 slj
0.000000 0.000000 0.000000 srgb
n -84.720600 -136.826197 m -85.120600 -137.626197 l -85.520600 -136.826197 l cp s
/Courier-latin1 ff 0.560000 scf sf
0.100000 slw
[] 0 sd
0 slj
0 slc
n -85.120600 -136.826197 m -85.120600 -134.415000 l -93.635875 -134.415000 l -93.635875 -131.092000 l s
0 slj
1.000000 1.000000 1.000000 srgb
n -84.720600 -136.826197 m -85.120600 -137.626197 l -85.520600 -136.826197 l ef
0.100000 slw
[] 0 sd
0 slj
0.000000 0.000000 0.000000 srgb
n -84.720600 -136.826197 m -85.120600 -137.626197 l -85.520600 -136.826197 l cp s
/Courier-latin1 ff 0.560000 scf sf
0.100000 slw
[] 0 sd
0 slj
0 slc
n -85.120600 -136.826197 m -85.120600 -121.988000 l -114.625000 -121.988000 l -114.625000 -117.200000 l s
0 slj
1.000000 1.000000 1.000000 srgb
n -84.720600 -136.826197 m -85.120600 -137.626197 l -85.520600 -136.826197 l ef
0.100000 slw
[] 0 sd
0 slj
0.000000 0.000000 0.000000 srgb
n -84.720600 -136.826197 m -85.120600 -137.626197 l -85.520600 -136.826197 l cp s
/Courier-latin1 ff 0.560000 scf sf
0.100000 slw
[] 0 sd
0 slj
0 slc
n -85.120600 -136.826197 m -85.120600 -121.990000 l -62.584700 -121.990000 l -62.584700 -117.141000 l s
0 slj
1.000000 1.000000 1.000000 srgb
n -84.720600 -136.826197 m -85.120600 -137.626197 l -85.520600 -136.826197 l ef
0.100000 slw
[] 0 sd
0 slj
0.000000 0.000000 0.000000 srgb
n -84.720600 -136.826197 m -85.120600 -137.626197 l -85.520600 -136.826197 l cp s
/Courier-latin1 ff 0.560000 scf sf
0.100000 slw
[] 0 sd
1.000000 1.000000 1.000000 srgb
n -59.333900 -132.147000 m -59.333900 -130.547000 l -50.810462 -130.547000 l -50.810462 -132.147000 l f
0.000000 0.000000 0.000000 srgb
n -59.333900 -132.147000 m -59.333900 -130.547000 l -50.810462 -130.547000 l -50.810462 -132.147000 l cp s
/Helvetica-latin1 ff 0.840000 scf sf
(id_label) dup sw 2 div -55.072181 ex sub -130.947000 m gs 1 -1 sc sh gr
1.000000 1.000000 1.000000 srgb
n -59.333900 -130.547000 m -59.333900 -127.947000 l -50.810462 -127.947000 l -50.810462 -130.547000 l f
0.000000 0.000000 0.000000 srgb
n -59.333900 -130.547000 m -59.333900 -127.947000 l -50.810462 -127.947000 l -50.810462 -130.547000 l cp s
/Courier-latin1 ff 0.560000 scf sf
(+name: string) -59.183900 -129.917313 m gs 1 -1 sc sh gr
/Courier-latin1 ff 0.560000 scf sf
(+function: declaration) -59.183900 -129.117313 m gs 1 -1 sc sh gr
/Courier-latin1 ff 0.560000 scf sf
(+statement: statement) -59.183900 -128.317313 m gs 1 -1 sc sh gr
1.000000 1.000000 1.000000 srgb
n -59.333900 -127.947000 m -59.333900 -127.547000 l -50.810462 -127.547000 l -50.810462 -127.947000 l f
0.000000 0.000000 0.000000 srgb
n -59.333900 -127.947000 m -59.333900 -127.547000 l -50.810462 -127.547000 l -50.810462 -127.947000 l cp s
0.100000 slw
[] 0 sd
1.000000 1.000000 1.000000 srgb
n -50.313000 -126.255000 m -50.313000 -124.655000 l -43.230187 -124.655000 l -43.230187 -126.255000 l f
0.000000 0.000000 0.000000 srgb
n -50.313000 -126.255000 m -50.313000 -124.655000 l -43.230187 -124.655000 l -43.230187 -126.255000 l cp s
/Helvetica-latin1 ff 0.840000 scf sf
(case_label) dup sw 2 div -46.771594 ex sub -125.055000 m gs 1 -1 sc sh gr
1.000000 1.000000 1.000000 srgb
n -50.313000 -124.655000 m -50.313000 -123.655000 l -43.230187 -123.655000 l -43.230187 -124.655000 l f
0.000000 0.000000 0.000000 srgb
n -50.313000 -124.655000 m -50.313000 -123.655000 l -43.230187 -123.655000 l -43.230187 -124.655000 l cp s
/Courier-latin1 ff 0.560000 scf sf
(+value: expression) -50.163000 -124.025313 m gs 1 -1 sc sh gr
1.000000 1.000000 1.000000 srgb
n -50.313000 -123.655000 m -50.313000 -123.255000 l -43.230187 -123.255000 l -43.230187 -123.655000 l f
0.000000 0.000000 0.000000 srgb
n -50.313000 -123.655000 m -50.313000 -123.255000 l -43.230187 -123.255000 l -43.230187 -123.655000 l cp s
0.100000 slw
[] 0 sd
1.000000 1.000000 1.000000 srgb
n -41.580000 -126.355000 m -41.580000 -124.755000 l -34.326875 -124.755000 l -34.326875 -126.355000 l f
0.000000 0.000000 0.000000 srgb
n -41.580000 -126.355000 m -41.580000 -124.755000 l -34.326875 -124.755000 l -34.326875 -126.355000 l cp s
/Helvetica-latin1 ff 0.840000 scf sf
(default_label) dup sw 2 div -37.953437 ex sub -125.155000 m gs 1 -1 sc sh gr
1.000000 1.000000 1.000000 srgb
n -41.580000 -124.755000 m -41.580000 -124.355000 l -34.326875 -124.355000 l -34.326875 -124.755000 l f
0.000000 0.000000 0.000000 srgb
n -41.580000 -124.755000 m -41.580000 -124.355000 l -34.326875 -124.355000 l -34.326875 -124.755000 l cp s
1.000000 1.000000 1.000000 srgb
n -41.580000 -124.355000 m -41.580000 -123.955000 l -34.326875 -123.955000 l -34.326875 -124.355000 l f
0.000000 0.000000 0.000000 srgb
n -41.580000 -124.355000 m -41.580000 -123.955000 l -34.326875 -123.955000 l -34.326875 -124.355000 l cp s
0.100000 slw
[] 0 sd
0 slj
0 slc
n -42.263000 -128.343197 m -42.263000 -127.755000 l -46.863000 -127.755000 l -46.863000 -126.255000 l s
0 slj
1.000000 1.000000 1.000000 srgb
n -41.863000 -128.343197 m -42.263000 -129.143197 l -42.663000 -128.343197 l ef
0.100000 slw
[] 0 sd
0 slj
0.000000 0.000000 0.000000 srgb
n -41.863000 -128.343197 m -42.263000 -129.143197 l -42.663000 -128.343197 l cp s
/Courier-latin1 ff 0.560000 scf sf
0.100000 slw
[] 0 sd
0 slj
0 slc
n -42.263000 -128.343197 m -42.263000 -127.738000 l -37.930000 -127.738000 l -37.930000 -126.355000 l s
0 slj
1.000000 1.000000 1.000000 srgb
n -41.863000 -128.343197 m -42.263000 -129.143197 l -42.663000 -128.343197 l ef
0.100000 slw
[] 0 sd
0 slj
0.000000 0.000000 0.000000 srgb
n -41.863000 -128.343197 m -42.263000 -129.143197 l -42.663000 -128.343197 l cp s
/Courier-latin1 ff 0.560000 scf sf
0.100000 slw
[] 0 sd
0 slj
0 slc
n -48.088000 -136.643197 m -48.088000 -134.851000 l -55.183900 -134.851000 l -55.183900 -132.147000 l s
0 slj
1.000000 1.000000 1.000000 srgb
n -47.688000 -136.643197 m -48.088000 -137.443197 l -48.488000 -136.643197 l ef
0.100000 slw
[] 0 sd
0 slj
0.000000 0.000000 0.000000 srgb
n -47.688000 -136.643197 m -48.088000 -137.443197 l -48.488000 -136.643197 l cp s
/Courier-latin1 ff 0.560000 scf sf
0.100000 slw
[] 0 sd
1.000000 1.000000 1.000000 srgb
n -49.613000 -139.955000 m -49.613000 -138.355000 l -46.568469 -138.355000 l -46.568469 -139.955000 l f
0.000000 0.000000 0.000000 srgb
n -49.613000 -139.955000 m -49.613000 -138.355000 l -46.568469 -138.355000 l -46.568469 -139.955000 l cp s
/Helvetica-latin1 ff 0.840000 scf sf
(label) dup sw 2 div -48.090734 ex sub -138.755000 m gs 1 -1 sc sh gr
1.000000 1.000000 1.000000 srgb
n -49.613000 -138.355000 m -49.613000 -137.955000 l -46.568469 -137.955000 l -46.568469 -138.355000 l f
0.000000 0.000000 0.000000 srgb
n -49.613000 -138.355000 m -49.613000 -137.955000 l -46.568469 -137.955000 l -46.568469 -138.355000 l cp s
1.000000 1.000000 1.000000 srgb
n -49.613000 -137.955000 m -49.613000 -137.555000 l -46.568469 -137.555000 l -46.568469 -137.955000 l f
0.000000 0.000000 0.000000 srgb
n -49.613000 -137.955000 m -49.613000 -137.555000 l -46.568469 -137.555000 l -46.568469 -137.955000 l cp s
0.100000 slw
[] 0 sd
1.000000 1.000000 1.000000 srgb
n -48.113000 -132.255000 m -48.113000 -130.655000 l -36.465344 -130.655000 l -36.465344 -132.255000 l f
0.000000 0.000000 0.000000 srgb
n -48.113000 -132.255000 m -48.113000 -130.655000 l -36.465344 -130.655000 l -36.465344 -132.255000 l cp s
/Helvetica-latin1 ff 0.840000 scf sf
(breakable_stmt_label) dup sw 2 div -42.289172 ex sub -131.055000 m gs 1 -1 sc sh gr
1.000000 1.000000 1.000000 srgb
n -48.113000 -130.655000 m -48.113000 -129.655000 l -36.465344 -129.655000 l -36.465344 -130.655000 l f
0.000000 0.000000 0.000000 srgb
n -48.113000 -130.655000 m -48.113000 -129.655000 l -36.465344 -129.655000 l -36.465344 -130.655000 l cp s
/Courier-latin1 ff 0.560000 scf sf
(+breakable: breakable_stmt) -47.963000 -130.025313 m gs 1 -1 sc sh gr
1.000000 1.000000 1.000000 srgb
n -48.113000 -129.655000 m -48.113000 -129.255000 l -36.465344 -129.255000 l -36.465344 -129.655000 l f
0.000000 0.000000 0.000000 srgb
n -48.113000 -129.655000 m -48.113000 -129.255000 l -36.465344 -129.255000 l -36.465344 -129.655000 l cp s
0.100000 slw
[] 0 sd
0 slj
0 slc
n -48.088000 -136.643197 m -48.088000 -134.838000 l -42.263000 -134.838000 l -42.263000 -132.255000 l s
0 slj
1.000000 1.000000 1.000000 srgb
n -47.688000 -136.643197 m -48.088000 -137.443197 l -48.488000 -136.643197 l ef
0.100000 slw
[] 0 sd
0 slj
0.000000 0.000000 0.000000 srgb
n -47.688000 -136.643197 m -48.088000 -137.443197 l -48.488000 -136.643197 l cp s
/Courier-latin1 ff 0.560000 scf sf
0.100000 slw
[] 0 sd
1.000000 1.000000 1.000000 srgb
n -75.291400 -117.117000 m -75.291400 -115.517000 l -67.848431 -115.517000 l -67.848431 -117.117000 l f
0.000000 0.000000 0.000000 srgb
n -75.291400 -117.117000 m -75.291400 -115.517000 l -67.848431 -115.517000 l -67.848431 -117.117000 l cp s
/Helvetica-latin1 ff 0.840000 scf sf
(return) dup sw 2 div -71.569916 ex sub -115.917000 m gs 1 -1 sc sh gr
1.000000 1.000000 1.000000 srgb
n -75.291400 -115.517000 m -75.291400 -114.517000 l -67.848431 -114.517000 l -67.848431 -115.517000 l f
0.000000 0.000000 0.000000 srgb
n -75.291400 -115.517000 m -75.291400 -114.517000 l -67.848431 -114.517000 l -67.848431 -115.517000 l cp s
/Courier-latin1 ff 0.560000 scf sf
(+result: expression) -75.141400 -114.887313 m gs 1 -1 sc sh gr
1.000000 1.000000 1.000000 srgb
n -75.291400 -114.517000 m -75.291400 -114.117000 l -67.848431 -114.117000 l -67.848431 -114.517000 l f
0.000000 0.000000 0.000000 srgb
n -75.291400 -114.517000 m -75.291400 -114.117000 l -67.848431 -114.117000 l -67.848431 -114.517000 l cp s
0.100000 slw
[] 0 sd
0 slj
0 slc
n -85.120600 -136.826197 m -85.120600 -121.988000 l -71.666400 -121.988000 l -71.666400 -117.117000 l s
0 slj
1.000000 1.000000 1.000000 srgb
n -84.720600 -136.826197 m -85.120600 -137.626197 l -85.520600 -136.826197 l ef
0.100000 slw
[] 0 sd
0 slj
0.000000 0.000000 0.000000 srgb
n -84.720600 -136.826197 m -85.120600 -137.626197 l -85.520600 -136.826197 l cp s
/Courier-latin1 ff 0.560000 scf sf
showpage
