%!PS-Adobe-2.0 EPSF-2.0
%%Title: ss2pi_ifstmt.dia
%%Creator: Dia v0.93
%%CreationDate: Mon May 23 15:42:25 2005
%%For: ps
%%Orientation: Portrait
%%Magnification: 1.0000
%%BoundingBox: 0 0 1279 913
%%BeginSetup
%%EndSetup
%%EndComments
%%BeginProlog
[ /.notdef /.notdef /.notdef /.notdef /.notdef /.notdef /.notdef /.notdef /.notdef /.notdef
/.notdef /.notdef /.notdef /.notdef /.notdef /.notdef /.notdef /.notdef /.notdef /.notdef
/.notdef /.notdef /.notdef /.notdef /.notdef /.notdef /.notdef /.notdef /.notdef /.notdef
/.notdef /.notdef /space /exclam /quotedbl /numbersign /dollar /percent /ampersand /quoteright
/parenleft /parenright /asterisk /plus /comma /hyphen /period /slash /zero /one
/two /three /four /five /six /seven /eight /nine /colon /semicolon
/less /equal /greater /question /at /A /B /C /D /E
/F /G /H /I /J /K /L /M /N /O
/P /Q /R /S /T /U /V /W /X /Y
/Z /bracketleft /backslash /bracketright /asciicircum /underscore /quoteleft /a /b /c
/d /e /f /g /h /i /j /k /l /m
/n /o /p /q /r /s /t /u /v /w
/x /y /z /braceleft /bar /braceright /asciitilde /.notdef /.notdef /.notdef
/.notdef /.notdef /.notdef /.notdef /.notdef /.notdef /.notdef /.notdef /.notdef /.notdef
/.notdef /.notdef /.notdef /.notdef /.notdef /.notdef /.notdef /.notdef /.notdef /.notdef
/.notdef /.notdef /.notdef /.notdef /.notdef /.notdef /.notdef /.notdef /.notdef /.notdef
/space /exclamdown /cent /sterling /currency /yen /brokenbar /section /dieresis /copyright
/ordfeminine /guillemotleft /logicalnot /hyphen /registered /macron /degree /plusminus /twosuperior /threesuperior
/acute /mu /paragraph /periodcentered /cedilla /onesuperior /ordmasculine /guillemotright /onequarter /onehalf
/threequarters /questiondown /Agrave /Aacute /Acircumflex /Atilde /Adieresis /Aring /AE /Ccedilla
/Egrave /Eacute /Ecircumflex /Edieresis /Igrave /Iacute /Icircumflex /Idieresis /Eth /Ntilde
/Ograve /Oacute /Ocircumflex /Otilde /Odieresis /multiply /Oslash /Ugrave /Uacute /Ucircumflex
/Udieresis /Yacute /Thorn /germandbls /agrave /aacute /acircumflex /atilde /adieresis /aring
/ae /ccedilla /egrave /eacute /ecircumflex /edieresis /igrave /iacute /icircumflex /idieresis
/eth /ntilde /ograve /oacute /ocircumflex /otilde /odieresis /divide /oslash /ugrave
/uacute /ucircumflex /udieresis /yacute /thorn /ydieresis] /isolatin1encoding exch def
/cp {closepath} bind def
/c {curveto} bind def
/f {fill} bind def
/a {arc} bind def
/ef {eofill} bind def
/ex {exch} bind def
/gr {grestore} bind def
/gs {gsave} bind def
/sa {save} bind def
/rs {restore} bind def
/l {lineto} bind def
/m {moveto} bind def
/rm {rmoveto} bind def
/n {newpath} bind def
/s {stroke} bind def
/sh {show} bind def
/slc {setlinecap} bind def
/slj {setlinejoin} bind def
/slw {setlinewidth} bind def
/srgb {setrgbcolor} bind def
/rot {rotate} bind def
/sc {scale} bind def
/sd {setdash} bind def
/ff {findfont} bind def
/sf {setfont} bind def
/scf {scalefont} bind def
/sw {stringwidth pop} bind def
/tr {translate} bind def

/ellipsedict 8 dict def
ellipsedict /mtrx matrix put
/ellipse
{ ellipsedict begin
   /endangle exch def
   /startangle exch def
   /yrad exch def
   /xrad exch def
   /y exch def
   /x exch def   /savematrix mtrx currentmatrix def
   x y tr xrad yrad sc
   0 0 1 startangle endangle arc
   savematrix setmatrix
   end
} def

/mergeprocs {
dup length
3 -1 roll
dup
length
dup
5 1 roll
3 -1 roll
add
array cvx
dup
3 -1 roll
0 exch
putinterval
dup
4 2 roll
putinterval
} bind def
/Times-Roman-latin1
    /Times-Roman findfont
    dup length dict begin
	{1 index /FID ne {def} {pop pop} ifelse} forall
	/Encoding isolatin1encoding def
    currentdict end
definefont pop
/Times-Italic-latin1
    /Times-Italic findfont
    dup length dict begin
	{1 index /FID ne {def} {pop pop} ifelse} forall
	/Encoding isolatin1encoding def
    currentdict end
definefont pop
/Times-Bold-latin1
    /Times-Bold findfont
    dup length dict begin
	{1 index /FID ne {def} {pop pop} ifelse} forall
	/Encoding isolatin1encoding def
    currentdict end
definefont pop
/Times-BoldItalic-latin1
    /Times-BoldItalic findfont
    dup length dict begin
	{1 index /FID ne {def} {pop pop} ifelse} forall
	/Encoding isolatin1encoding def
    currentdict end
definefont pop
/AvantGarde-Book-latin1
    /AvantGarde-Book findfont
    dup length dict begin
	{1 index /FID ne {def} {pop pop} ifelse} forall
	/Encoding isolatin1encoding def
    currentdict end
definefont pop
/AvantGarde-BookOblique-latin1
    /AvantGarde-BookOblique findfont
    dup length dict begin
	{1 index /FID ne {def} {pop pop} ifelse} forall
	/Encoding isolatin1encoding def
    currentdict end
definefont pop
/AvantGarde-Demi-latin1
    /AvantGarde-Demi findfont
    dup length dict begin
	{1 index /FID ne {def} {pop pop} ifelse} forall
	/Encoding isolatin1encoding def
    currentdict end
definefont pop
/AvantGarde-DemiOblique-latin1
    /AvantGarde-DemiOblique findfont
    dup length dict begin
	{1 index /FID ne {def} {pop pop} ifelse} forall
	/Encoding isolatin1encoding def
    currentdict end
definefont pop
/Bookman-Light-latin1
    /Bookman-Light findfont
    dup length dict begin
	{1 index /FID ne {def} {pop pop} ifelse} forall
	/Encoding isolatin1encoding def
    currentdict end
definefont pop
/Bookman-LightItalic-latin1
    /Bookman-LightItalic findfont
    dup length dict begin
	{1 index /FID ne {def} {pop pop} ifelse} forall
	/Encoding isolatin1encoding def
    currentdict end
definefont pop
/Bookman-Demi-latin1
    /Bookman-Demi findfont
    dup length dict begin
	{1 index /FID ne {def} {pop pop} ifelse} forall
	/Encoding isolatin1encoding def
    currentdict end
definefont pop
/Bookman-DemiItalic-latin1
    /Bookman-DemiItalic findfont
    dup length dict begin
	{1 index /FID ne {def} {pop pop} ifelse} forall
	/Encoding isolatin1encoding def
    currentdict end
definefont pop
/Courier-latin1
    /Courier findfont
    dup length dict begin
	{1 index /FID ne {def} {pop pop} ifelse} forall
	/Encoding isolatin1encoding def
    currentdict end
definefont pop
/Courier-Oblique-latin1
    /Courier-Oblique findfont
    dup length dict begin
	{1 index /FID ne {def} {pop pop} ifelse} forall
	/Encoding isolatin1encoding def
    currentdict end
definefont pop
/Courier-Bold-latin1
    /Courier-Bold findfont
    dup length dict begin
	{1 index /FID ne {def} {pop pop} ifelse} forall
	/Encoding isolatin1encoding def
    currentdict end
definefont pop
/Courier-BoldOblique-latin1
    /Courier-BoldOblique findfont
    dup length dict begin
	{1 index /FID ne {def} {pop pop} ifelse} forall
	/Encoding isolatin1encoding def
    currentdict end
definefont pop
/Helvetica-latin1
    /Helvetica findfont
    dup length dict begin
	{1 index /FID ne {def} {pop pop} ifelse} forall
	/Encoding isolatin1encoding def
    currentdict end
definefont pop
/Helvetica-Oblique-latin1
    /Helvetica-Oblique findfont
    dup length dict begin
	{1 index /FID ne {def} {pop pop} ifelse} forall
	/Encoding isolatin1encoding def
    currentdict end
definefont pop
/Helvetica-Bold-latin1
    /Helvetica-Bold findfont
    dup length dict begin
	{1 index /FID ne {def} {pop pop} ifelse} forall
	/Encoding isolatin1encoding def
    currentdict end
definefont pop
/Helvetica-BoldOblique-latin1
    /Helvetica-BoldOblique findfont
    dup length dict begin
	{1 index /FID ne {def} {pop pop} ifelse} forall
	/Encoding isolatin1encoding def
    currentdict end
definefont pop
/Helvetica-Narrow-latin1
    /Helvetica-Narrow findfont
    dup length dict begin
	{1 index /FID ne {def} {pop pop} ifelse} forall
	/Encoding isolatin1encoding def
    currentdict end
definefont pop
/Helvetica-Narrow-Oblique-latin1
    /Helvetica-Narrow-Oblique findfont
    dup length dict begin
	{1 index /FID ne {def} {pop pop} ifelse} forall
	/Encoding isolatin1encoding def
    currentdict end
definefont pop
/Helvetica-Narrow-Bold-latin1
    /Helvetica-Narrow-Bold findfont
    dup length dict begin
	{1 index /FID ne {def} {pop pop} ifelse} forall
	/Encoding isolatin1encoding def
    currentdict end
definefont pop
/Helvetica-Narrow-BoldOblique-latin1
    /Helvetica-Narrow-BoldOblique findfont
    dup length dict begin
	{1 index /FID ne {def} {pop pop} ifelse} forall
	/Encoding isolatin1encoding def
    currentdict end
definefont pop
/NewCenturySchoolbook-Roman-latin1
    /NewCenturySchoolbook-Roman findfont
    dup length dict begin
	{1 index /FID ne {def} {pop pop} ifelse} forall
	/Encoding isolatin1encoding def
    currentdict end
definefont pop
/NewCenturySchoolbook-Italic-latin1
    /NewCenturySchoolbook-Italic findfont
    dup length dict begin
	{1 index /FID ne {def} {pop pop} ifelse} forall
	/Encoding isolatin1encoding def
    currentdict end
definefont pop
/NewCenturySchoolbook-Bold-latin1
    /NewCenturySchoolbook-Bold findfont
    dup length dict begin
	{1 index /FID ne {def} {pop pop} ifelse} forall
	/Encoding isolatin1encoding def
    currentdict end
definefont pop
/NewCenturySchoolbook-BoldItalic-latin1
    /NewCenturySchoolbook-BoldItalic findfont
    dup length dict begin
	{1 index /FID ne {def} {pop pop} ifelse} forall
	/Encoding isolatin1encoding def
    currentdict end
definefont pop
/Palatino-Roman-latin1
    /Palatino-Roman findfont
    dup length dict begin
	{1 index /FID ne {def} {pop pop} ifelse} forall
	/Encoding isolatin1encoding def
    currentdict end
definefont pop
/Palatino-Italic-latin1
    /Palatino-Italic findfont
    dup length dict begin
	{1 index /FID ne {def} {pop pop} ifelse} forall
	/Encoding isolatin1encoding def
    currentdict end
definefont pop
/Palatino-Bold-latin1
    /Palatino-Bold findfont
    dup length dict begin
	{1 index /FID ne {def} {pop pop} ifelse} forall
	/Encoding isolatin1encoding def
    currentdict end
definefont pop
/Palatino-BoldItalic-latin1
    /Palatino-BoldItalic findfont
    dup length dict begin
	{1 index /FID ne {def} {pop pop} ifelse} forall
	/Encoding isolatin1encoding def
    currentdict end
definefont pop
/Symbol-latin1
    /Symbol findfont
definefont pop
/ZapfChancery-MediumItalic-latin1
    /ZapfChancery-MediumItalic findfont
    dup length dict begin
	{1 index /FID ne {def} {pop pop} ifelse} forall
	/Encoding isolatin1encoding def
    currentdict end
definefont pop
/ZapfDingbats-latin1
    /ZapfDingbats findfont
    dup length dict begin
	{1 index /FID ne {def} {pop pop} ifelse} forall
	/Encoding isolatin1encoding def
    currentdict end
definefont pop
28.346000 -28.346000 scale
7.840210 -33.592250 translate
%%EndProlog


0.100000 slw
[] 0 sd
1.000000 1.000000 1.000000 srgb
n -7.790210 1.442250 m 36.609790 1.442250 l 37.209790 2.042250 l 37.209790 33.542250 l -7.790210 33.542250 l f
0.000000 0.000000 0.000000 srgb
n -7.790210 1.442250 m 36.609790 1.442250 l 37.209790 2.042250 l 37.209790 33.542250 l -7.790210 33.542250 l cp s
0.050000 slw
n 36.609790 1.442250 m 36.609790 2.042250 l 37.209790 2.042250 l s
/Courier-latin1 ff 1.680000 scf sf
(       ss layer              pi layer) -7.440210 3.742250 m gs 1 -1 sc sh gr
(    {) -7.440210 6.142250 m gs 1 -1 sc sh gr
(      if\(i\)                    bf PSP3   ) -7.440210 8.542250 m gs 1 -1 sc sh gr
(           {) -7.440210 10.942250 m gs 1 -1 sc sh gr
(                                 ...) -7.440210 13.342250 m gs 1 -1 sc sh gr
(           }) -7.440210 15.742250 m gs 1 -1 sc sh gr
(        else                   ba DSP1) -7.440210 18.142250 m gs 1 -1 sc sh gr
(             {) -7.440210 20.542250 m gs 1 -1 sc sh gr
(                                ) -7.440210 22.942250 m gs 1 -1 sc sh gr
(             }                   ...) -7.440210 25.342250 m gs 1 -1 sc sh gr
(                                          ) -7.440210 27.742250 m gs 1 -1 sc sh gr
(    }) -7.440210 30.142250 m gs 1 -1 sc sh gr
(                                          ) -7.440210 32.542250 m gs 1 -1 sc sh gr
0.100000 slw
[] 0 sd
[] 0 sd
0 slc
0 slj
0 slc
0 slj
[] 0 sd
1.000000 1.000000 1.000000 srgb
n -5.662384 4.544210 m -5.286496 4.544210 l -4.158831 4.969412 -3.594998 5.182013 -3.594998 5.607215 c -3.594998 6.032417 -3.970887 6.245018 -5.286496 6.670220 c -5.662384 6.670220 l -6.790049 6.245018 -7.353882 6.032417 -7.353882 5.607215 c -7.353882 5.182013 -6.977993 4.969412 -5.662384 4.544210 c f
0.000000 0.000000 0.000000 srgb
n -5.662384 4.544210 m -5.286496 4.544210 l -4.158831 4.969412 -3.594998 5.182013 -3.594998 5.607215 c -3.594998 6.032417 -3.970887 6.245018 -5.286496 6.670220 c -5.662384 6.670220 l -6.790049 6.245018 -7.353882 6.032417 -7.353882 5.607215 c -7.353882 5.182013 -6.977993 4.969412 -5.662384 4.544210 c s
/Helvetica-latin1 ff 0.700000 scf sf
(PSP1) dup sw 2 div -5.474440 ex sub 5.957215 m gs 1 -1 sc sh gr
0.100000 slw
[] 0 sd
[] 0 sd
0 slc
0 slj
0 slc
0 slj
[] 0 sd
1.000000 1.000000 1.000000 srgb
n -5.668809 28.711600 m -5.286671 28.711600 l -4.140256 29.136802 -3.567048 29.349403 -3.567048 29.774605 c -3.567048 30.199807 -3.949187 30.412408 -5.286671 30.837610 c -5.668809 30.837610 l -6.815224 30.412408 -7.388432 30.199807 -7.388432 29.774605 c -7.388432 29.349403 -7.006293 29.136802 -5.668809 28.711600 c f
0.000000 0.000000 0.000000 srgb
n -5.668809 28.711600 m -5.286671 28.711600 l -4.140256 29.136802 -3.567048 29.349403 -3.567048 29.774605 c -3.567048 30.199807 -3.949187 30.412408 -5.286671 30.837610 c -5.668809 30.837610 l -6.815224 30.412408 -7.388432 30.199807 -7.388432 29.774605 c -7.388432 29.349403 -7.006293 29.136802 -5.668809 28.711600 c s
/Helvetica-latin1 ff 0.700000 scf sf
(DSP1) dup sw 2 div -5.477740 ex sub 30.124605 m gs 1 -1 sc sh gr
0.100000 slw
[] 0 sd
[] 0 sd
0 slc
0 slj
0 slc
0 slj
[] 0 sd
1.000000 1.000000 1.000000 srgb
n -0.216299 28.682300 m 0.165839 28.682300 l 1.312254 29.107502 1.885462 29.320103 1.885462 29.745305 c 1.885462 30.170507 1.503323 30.383108 0.165839 30.808310 c -0.216299 30.808310 l -1.362714 30.383108 -1.935922 30.170507 -1.935922 29.745305 c -1.935922 29.320103 -1.553783 29.107502 -0.216299 28.682300 c f
0.000000 0.000000 0.000000 srgb
n -0.216299 28.682300 m 0.165839 28.682300 l 1.312254 29.107502 1.885462 29.320103 1.885462 29.745305 c 1.885462 30.170507 1.503323 30.383108 0.165839 30.808310 c -0.216299 30.808310 l -1.362714 30.383108 -1.935922 30.170507 -1.935922 29.745305 c -1.935922 29.320103 -1.553783 29.107502 -0.216299 28.682300 c s
/Helvetica-latin1 ff 0.700000 scf sf
(NSP1) dup sw 2 div -0.025230 ex sub 30.095305 m gs 1 -1 sc sh gr
0.100000 slw
[] 0 sd
[] 0 sd
0 slc
0 slj
0 slc
0 slj
[] 0 sd
1.000000 1.000000 1.000000 srgb
n 1.084140 9.404700 m 1.460028 9.404700 l 2.587693 9.829902 3.151526 10.042503 3.151526 10.467705 c 3.151526 10.892907 2.775637 11.105508 1.460028 11.530710 c 1.084140 11.530710 l -0.043525 11.105508 -0.607358 10.892907 -0.607358 10.467705 c -0.607358 10.042503 -0.231469 9.829902 1.084140 9.404700 c f
0.000000 0.000000 0.000000 srgb
n 1.084140 9.404700 m 1.460028 9.404700 l 2.587693 9.829902 3.151526 10.042503 3.151526 10.467705 c 3.151526 10.892907 2.775637 11.105508 1.460028 11.530710 c 1.084140 11.530710 l -0.043525 11.105508 -0.607358 10.892907 -0.607358 10.467705 c -0.607358 10.042503 -0.231469 9.829902 1.084140 9.404700 c s
/Helvetica-latin1 ff 0.700000 scf sf
(PSP2) dup sw 2 div 1.272084 ex sub 10.817705 m gs 1 -1 sc sh gr
0.100000 slw
[] 0 sd
[] 0 sd
0 slc
0 slj
0 slc
0 slj
[] 0 sd
1.000000 1.000000 1.000000 srgb
n 1.182987 14.213700 m 1.565125 14.213700 l 2.711540 14.638902 3.284748 14.851503 3.284748 15.276705 c 3.284748 15.701907 2.902609 15.914508 1.565125 16.339710 c 1.182987 16.339710 l 0.036572 15.914508 -0.536636 15.701907 -0.536636 15.276705 c -0.536636 14.851503 -0.154497 14.638902 1.182987 14.213700 c f
0.000000 0.000000 0.000000 srgb
n 1.182987 14.213700 m 1.565125 14.213700 l 2.711540 14.638902 3.284748 14.851503 3.284748 15.276705 c 3.284748 15.701907 2.902609 15.914508 1.565125 16.339710 c 1.182987 16.339710 l 0.036572 15.914508 -0.536636 15.701907 -0.536636 15.276705 c -0.536636 14.851503 -0.154497 14.638902 1.182987 14.213700 c s
/Helvetica-latin1 ff 0.700000 scf sf
(DSP2) dup sw 2 div 1.374056 ex sub 15.626705 m gs 1 -1 sc sh gr
0.100000 slw
[] 0 sd
[] 0 sd
0 slc
0 slj
0 slc
0 slj
[] 0 sd
1.000000 1.000000 1.000000 srgb
n 6.987091 14.213700 m 7.369229 14.213700 l 8.515644 14.638902 9.088852 14.851503 9.088852 15.276705 c 9.088852 15.701907 8.706713 15.914508 7.369229 16.339710 c 6.987091 16.339710 l 5.840676 15.914508 5.267468 15.701907 5.267468 15.276705 c 5.267468 14.851503 5.649607 14.638902 6.987091 14.213700 c f
0.000000 0.000000 0.000000 srgb
n 6.987091 14.213700 m 7.369229 14.213700 l 8.515644 14.638902 9.088852 14.851503 9.088852 15.276705 c 9.088852 15.701907 8.706713 15.914508 7.369229 16.339710 c 6.987091 16.339710 l 5.840676 15.914508 5.267468 15.701907 5.267468 15.276705 c 5.267468 14.851503 5.649607 14.638902 6.987091 14.213700 c s
/Helvetica-latin1 ff 0.700000 scf sf
(NSP2) dup sw 2 div 7.178160 ex sub 15.626705 m gs 1 -1 sc sh gr
0.100000 slw
[] 0 sd
[] 0 sd
0 slc
0 slj
0 slc
0 slj
[] 0 sd
1.000000 1.000000 1.000000 srgb
n 3.105446 18.881400 m 3.481334 18.881400 l 4.608999 19.306602 5.172832 19.519203 5.172832 19.944405 c 5.172832 20.369607 4.796943 20.582208 3.481334 21.007410 c 3.105446 21.007410 l 1.977781 20.582208 1.413948 20.369607 1.413948 19.944405 c 1.413948 19.519203 1.789837 19.306602 3.105446 18.881400 c f
0.000000 0.000000 0.000000 srgb
n 3.105446 18.881400 m 3.481334 18.881400 l 4.608999 19.306602 5.172832 19.519203 5.172832 19.944405 c 5.172832 20.369607 4.796943 20.582208 3.481334 21.007410 c 3.105446 21.007410 l 1.977781 20.582208 1.413948 20.369607 1.413948 19.944405 c 1.413948 19.519203 1.789837 19.306602 3.105446 18.881400 c s
/Helvetica-latin1 ff 0.700000 scf sf
(PSP3) dup sw 2 div 3.293390 ex sub 20.294405 m gs 1 -1 sc sh gr
0.100000 slw
[] 0 sd
[] 0 sd
0 slc
0 slj
0 slc
0 slj
[] 0 sd
1.000000 1.000000 1.000000 srgb
n 3.163181 23.690400 m 3.545319 23.690400 l 4.691734 24.115602 5.264942 24.328203 5.264942 24.753405 c 5.264942 25.178607 4.882803 25.391208 3.545319 25.816410 c 3.163181 25.816410 l 2.016766 25.391208 1.443558 25.178607 1.443558 24.753405 c 1.443558 24.328203 1.825697 24.115602 3.163181 23.690400 c f
0.000000 0.000000 0.000000 srgb
n 3.163181 23.690400 m 3.545319 23.690400 l 4.691734 24.115602 5.264942 24.328203 5.264942 24.753405 c 5.264942 25.178607 4.882803 25.391208 3.545319 25.816410 c 3.163181 25.816410 l 2.016766 25.391208 1.443558 25.178607 1.443558 24.753405 c 1.443558 24.328203 1.825697 24.115602 3.163181 23.690400 c s
/Helvetica-latin1 ff 0.700000 scf sf
(DSP3) dup sw 2 div 3.354250 ex sub 25.103405 m gs 1 -1 sc sh gr
0.100000 slw
[] 0 sd
[] 0 sd
0 slc
0 slj
0 slc
0 slj
[] 0 sd
1.000000 1.000000 1.000000 srgb
n 9.275841 23.961100 m 9.657979 23.961100 l 10.804394 24.386302 11.377602 24.598903 11.377602 25.024105 c 11.377602 25.449307 10.995463 25.661908 9.657979 26.087110 c 9.275841 26.087110 l 8.129426 25.661908 7.556218 25.449307 7.556218 25.024105 c 7.556218 24.598903 7.938357 24.386302 9.275841 23.961100 c f
0.000000 0.000000 0.000000 srgb
n 9.275841 23.961100 m 9.657979 23.961100 l 10.804394 24.386302 11.377602 24.598903 11.377602 25.024105 c 11.377602 25.449307 10.995463 25.661908 9.657979 26.087110 c 9.275841 26.087110 l 8.129426 25.661908 7.556218 25.449307 7.556218 25.024105 c 7.556218 24.598903 7.938357 24.386302 9.275841 23.961100 c s
/Helvetica-latin1 ff 0.700000 scf sf
(NSP3) dup sw 2 div 9.466910 ex sub 25.374105 m gs 1 -1 sc sh gr
0.100000 slw
[] 0 sd
[] 0 sd
0 slc
0 slj
0 slc
0 slj
[] 0 sd
1.000000 1.000000 1.000000 srgb
n -3.937074 6.858730 m -3.561186 6.858730 l -2.433522 7.283932 -1.869690 7.496533 -1.869690 7.921735 c -1.869690 8.346937 -2.245578 8.559538 -3.561186 8.984740 c -3.937074 8.984740 l -5.064738 8.559538 -5.628570 8.346937 -5.628570 7.921735 c -5.628570 7.496533 -5.252682 7.283932 -3.937074 6.858730 c f
0.000000 0.000000 0.000000 srgb
n -3.937074 6.858730 m -3.561186 6.858730 l -2.433522 7.283932 -1.869690 7.496533 -1.869690 7.921735 c -1.869690 8.346937 -2.245578 8.559538 -3.561186 8.984740 c -3.937074 8.984740 l -5.064738 8.559538 -5.628570 8.346937 -5.628570 7.921735 c -5.628570 7.496533 -5.252682 7.283932 -3.937074 6.858730 c s
/Helvetica-latin1 ff 0.700000 scf sf
(PSPi) dup sw 2 div -3.749130 ex sub 8.271735 m gs 1 -1 sc sh gr
0.100000 slw
[] 0 sd
[] 0 sd
0 slc
0 slj
0 slc
0 slj
[] 0 sd
1.000000 1.000000 1.000000 srgb
n 6.710791 7.050170 m 7.092929 7.050170 l 8.239343 7.475372 8.812550 7.687973 8.812550 8.113175 c 8.812550 8.538377 8.430412 8.750978 7.092929 9.176180 c 6.710791 9.176180 l 5.564377 8.750978 4.991170 8.538377 4.991170 8.113175 c 4.991170 7.687973 5.373308 7.475372 6.710791 7.050170 c f
0.000000 0.000000 0.000000 srgb
n 6.710791 7.050170 m 7.092929 7.050170 l 8.239343 7.475372 8.812550 7.687973 8.812550 8.113175 c 8.812550 8.538377 8.430412 8.750978 7.092929 9.176180 c 6.710791 9.176180 l 5.564377 8.750978 4.991170 8.538377 4.991170 8.113175 c 4.991170 7.687973 5.373308 7.475372 6.710791 7.050170 c s
/Helvetica-latin1 ff 0.700000 scf sf
(NSPi) dup sw 2 div 6.901860 ex sub 8.463175 m gs 1 -1 sc sh gr
0.100000 slw
[] 0 sd
[] 0 sd
0 slc
0 slj
0 slc
0 slj
[] 0 sd
1.000000 1.000000 1.000000 srgb
n 21.360896 6.758730 m 21.736784 6.758730 l 22.864448 7.183932 23.428280 7.396533 23.428280 7.821735 c 23.428280 8.246937 23.052392 8.459538 21.736784 8.884740 c 21.360896 8.884740 l 20.233232 8.459538 19.669400 8.246937 19.669400 7.821735 c 19.669400 7.396533 20.045288 7.183932 21.360896 6.758730 c f
0.000000 0.000000 0.000000 srgb
n 21.360896 6.758730 m 21.736784 6.758730 l 22.864448 7.183932 23.428280 7.396533 23.428280 7.821735 c 23.428280 8.246937 23.052392 8.459538 21.736784 8.884740 c 21.360896 8.884740 l 20.233232 8.459538 19.669400 8.246937 19.669400 7.821735 c 19.669400 7.396533 20.045288 7.183932 21.360896 6.758730 c s
/Helvetica-latin1 ff 0.700000 scf sf
(PSPi) dup sw 2 div 21.548840 ex sub 8.171735 m gs 1 -1 sc sh gr
0.100000 slw
[] 0 sd
[] 0 sd
0 slc
0 slj
0 slc
0 slj
[] 0 sd
1.000000 1.000000 1.000000 srgb
n 33.196821 6.967290 m 33.578959 6.967290 l 34.725373 7.392492 35.298580 7.605093 35.298580 8.030295 c 35.298580 8.455497 34.916442 8.668098 33.578959 9.093300 c 33.196821 9.093300 l 32.050407 8.668098 31.477200 8.455497 31.477200 8.030295 c 31.477200 7.605093 31.859338 7.392492 33.196821 6.967290 c f
0.000000 0.000000 0.000000 srgb
n 33.196821 6.967290 m 33.578959 6.967290 l 34.725373 7.392492 35.298580 7.605093 35.298580 8.030295 c 35.298580 8.455497 34.916442 8.668098 33.578959 9.093300 c 33.196821 9.093300 l 32.050407 8.668098 31.477200 8.455497 31.477200 8.030295 c 31.477200 7.605093 31.859338 7.392492 33.196821 6.967290 c s
/Helvetica-latin1 ff 0.700000 scf sf
(NSPi) dup sw 2 div 33.387890 ex sub 8.380295 m gs 1 -1 sc sh gr
0.100000 slw
[] 0 sd
[] 0 sd
0 slc
0 slj
0 slc
0 slj
[] 0 sd
1.000000 1.000000 1.000000 srgb
n 21.284121 16.426800 m 21.666259 16.426800 l 22.812674 16.852002 23.385882 17.064603 23.385882 17.489805 c 23.385882 17.915007 23.003743 18.127608 21.666259 18.552810 c 21.284121 18.552810 l 20.137706 18.127608 19.564498 17.915007 19.564498 17.489805 c 19.564498 17.064603 19.946637 16.852002 21.284121 16.426800 c f
0.000000 0.000000 0.000000 srgb
n 21.284121 16.426800 m 21.666259 16.426800 l 22.812674 16.852002 23.385882 17.064603 23.385882 17.489805 c 23.385882 17.915007 23.003743 18.127608 21.666259 18.552810 c 21.284121 18.552810 l 20.137706 18.127608 19.564498 17.915007 19.564498 17.489805 c 19.564498 17.064603 19.946637 16.852002 21.284121 16.426800 c s
/Helvetica-latin1 ff 0.700000 scf sf
(NSP2) dup sw 2 div 21.475190 ex sub 17.839805 m gs 1 -1 sc sh gr
0.100000 slw
[] 0 sd
[] 0 sd
0 slc
0 slj
0 slc
0 slj
[] 0 sd
1.000000 1.000000 1.000000 srgb
n 33.035796 16.497600 m 33.411684 16.497600 l 34.539349 16.922802 35.103182 17.135403 35.103182 17.560605 c 35.103182 17.985807 34.727293 18.198408 33.411684 18.623610 c 33.035796 18.623610 l 31.908131 18.198408 31.344298 17.985807 31.344298 17.560605 c 31.344298 17.135403 31.720187 16.922802 33.035796 16.497600 c f
0.000000 0.000000 0.000000 srgb
n 33.035796 16.497600 m 33.411684 16.497600 l 34.539349 16.922802 35.103182 17.135403 35.103182 17.560605 c 35.103182 17.985807 34.727293 18.198408 33.411684 18.623610 c 33.035796 18.623610 l 31.908131 18.198408 31.344298 17.985807 31.344298 17.560605 c 31.344298 17.135403 31.720187 16.922802 33.035796 16.497600 c s
/Helvetica-latin1 ff 0.700000 scf sf
(PSP3) dup sw 2 div 33.223740 ex sub 17.910605 m gs 1 -1 sc sh gr
0.100000 slw
[] 0 sd
[] 0 sd
0 slc
0 slj
0 slc
0 slj
[] 0 sd
1.000000 1.000000 1.000000 srgb
n 21.255996 20.130000 m 21.631884 20.130000 l 22.759549 20.555202 23.323382 20.767803 23.323382 21.193005 c 23.323382 21.618207 22.947493 21.830808 21.631884 22.256010 c 21.255996 22.256010 l 20.128331 21.830808 19.564498 21.618207 19.564498 21.193005 c 19.564498 20.767803 19.940387 20.555202 21.255996 20.130000 c f
0.000000 0.000000 0.000000 srgb
n 21.255996 20.130000 m 21.631884 20.130000 l 22.759549 20.555202 23.323382 20.767803 23.323382 21.193005 c 23.323382 21.618207 22.947493 21.830808 21.631884 22.256010 c 21.255996 22.256010 l 20.128331 21.830808 19.564498 21.618207 19.564498 21.193005 c 19.564498 20.767803 19.940387 20.555202 21.255996 20.130000 c s
/Helvetica-latin1 ff 0.700000 scf sf
(PSP3) dup sw 2 div 21.443940 ex sub 21.543005 m gs 1 -1 sc sh gr
0.100000 slw
[] 0 sd
[] 0 sd
0 slc
0 slj
0 slc
0 slj
[] 0 sd
1.000000 1.000000 1.000000 srgb
n 21.584121 28.475100 m 21.966259 28.475100 l 23.112674 28.900302 23.685882 29.112903 23.685882 29.538105 c 23.685882 29.963307 23.303743 30.175908 21.966259 30.601110 c 21.584121 30.601110 l 20.437706 30.175908 19.864498 29.963307 19.864498 29.538105 c 19.864498 29.112903 20.246637 28.900302 21.584121 28.475100 c f
0.000000 0.000000 0.000000 srgb
n 21.584121 28.475100 m 21.966259 28.475100 l 23.112674 28.900302 23.685882 29.112903 23.685882 29.538105 c 23.685882 29.963307 23.303743 30.175908 21.966259 30.601110 c 21.584121 30.601110 l 20.437706 30.175908 19.864498 29.963307 19.864498 29.538105 c 19.864498 29.112903 20.246637 28.900302 21.584121 28.475100 c s
/Helvetica-latin1 ff 0.700000 scf sf
(DSP1) dup sw 2 div 21.775190 ex sub 29.888105 m gs 1 -1 sc sh gr
0.100000 slw
[] 0 sd
[] 0 sd
0 slc
0 slj
0 slc
0 slj
[] 0 sd
1.000000 1.000000 1.000000 srgb
n 11.983587 13.158515 m 13.468736 13.158515 l 13.468736 11.655687 l 14.953884 14.661344 l 13.468736 17.667002 l 13.468736 16.164173 l 11.983587 16.164173 l f
0.000000 0.000000 0.000000 srgb
n 11.983587 13.158515 m 13.468736 13.158515 l 13.468736 11.655687 l 14.953884 14.661344 l 13.468736 17.667002 l 13.468736 16.164173 l 11.983587 16.164173 l cp s
0.010000 slw
0 slc
0 slj
[] 0 sd
n 11.983587 13.158515 m 13.468736 13.158515 l 13.468736 11.655687 l 14.953884 14.661344 l 13.468736 17.667002 l 13.468736 16.164173 l 11.983587 16.164173 l cp s
showpage
