<?xml version="1.0" encoding="UTF-8"?>
<dia:diagram xmlns:dia="http://www.lysator.liu.se/~alla/dia/">
  <dia:diagramdata>
    <dia:attribute name="background">
      <dia:color val="#ffffff"/>
    </dia:attribute>
    <dia:attribute name="pagebreak">
      <dia:color val="#000099"/>
    </dia:attribute>
    <dia:attribute name="paper">
      <dia:composite type="paper">
        <dia:attribute name="name">
          <dia:string>#A4#</dia:string>
        </dia:attribute>
        <dia:attribute name="tmargin">
          <dia:real val="2.8222000598907471"/>
        </dia:attribute>
        <dia:attribute name="bmargin">
          <dia:real val="2.8222000598907471"/>
        </dia:attribute>
        <dia:attribute name="lmargin">
          <dia:real val="2.8222000598907471"/>
        </dia:attribute>
        <dia:attribute name="rmargin">
          <dia:real val="2.8222000598907471"/>
        </dia:attribute>
        <dia:attribute name="is_portrait">
          <dia:boolean val="true"/>
        </dia:attribute>
        <dia:attribute name="scaling">
          <dia:real val="1"/>
        </dia:attribute>
        <dia:attribute name="fitto">
          <dia:boolean val="false"/>
        </dia:attribute>
      </dia:composite>
    </dia:attribute>
    <dia:attribute name="grid">
      <dia:composite type="grid">
        <dia:attribute name="width_x">
          <dia:real val="1"/>
        </dia:attribute>
        <dia:attribute name="width_y">
          <dia:real val="1"/>
        </dia:attribute>
        <dia:attribute name="visible_x">
          <dia:int val="1"/>
        </dia:attribute>
        <dia:attribute name="visible_y">
          <dia:int val="1"/>
        </dia:attribute>
        <dia:composite type="color"/>
      </dia:composite>
    </dia:attribute>
    <dia:attribute name="color">
      <dia:color val="#d8e5e5"/>
    </dia:attribute>
    <dia:attribute name="guides">
      <dia:composite type="guides">
        <dia:attribute name="hguides"/>
        <dia:attribute name="vguides"/>
      </dia:composite>
    </dia:attribute>
  </dia:diagramdata>
  <dia:layer name="Background" visible="true">
    <dia:object type="Flowchart - Document" version="0" id="O0">
      <dia:attribute name="obj_pos">
        <dia:point val="1,2"/>
      </dia:attribute>
      <dia:attribute name="obj_bb">
        <dia:rectangle val="0.95,1.95;7.05,6"/>
      </dia:attribute>
      <dia:attribute name="elem_corner">
        <dia:point val="1,2"/>
      </dia:attribute>
      <dia:attribute name="elem_width">
        <dia:real val="6"/>
      </dia:attribute>
      <dia:attribute name="elem_height">
        <dia:real val="4"/>
      </dia:attribute>
      <dia:attribute name="line_width">
        <dia:real val="0.10000000000000001"/>
      </dia:attribute>
      <dia:attribute name="line_colour">
        <dia:color val="#000000"/>
      </dia:attribute>
      <dia:attribute name="fill_colour">
        <dia:color val="#ffffff"/>
      </dia:attribute>
      <dia:attribute name="show_background">
        <dia:boolean val="true"/>
      </dia:attribute>
      <dia:attribute name="line_style">
        <dia:enum val="0"/>
        <dia:real val="1"/>
      </dia:attribute>
      <dia:attribute name="text">
        <dia:composite type="text">
          <dia:attribute name="string">
            <dia:string>##</dia:string>
          </dia:attribute>
          <dia:attribute name="font">
            <dia:font family="sans" style="0" name="Helvetica"/>
          </dia:attribute>
          <dia:attribute name="height">
            <dia:real val="0.80000000000000004"/>
          </dia:attribute>
          <dia:attribute name="pos">
            <dia:point val="4,3.61529"/>
          </dia:attribute>
          <dia:attribute name="color">
            <dia:color val="#000000"/>
          </dia:attribute>
          <dia:attribute name="alignment">
            <dia:enum val="1"/>
          </dia:attribute>
        </dia:composite>
      </dia:attribute>
      <dia:attribute name="flip_horizontal">
        <dia:boolean val="false"/>
      </dia:attribute>
      <dia:attribute name="flip_vertical">
        <dia:boolean val="false"/>
      </dia:attribute>
    </dia:object>
    <dia:object type="Standard - Text" version="0" id="O1">
      <dia:attribute name="obj_pos">
        <dia:point val="4,1"/>
      </dia:attribute>
      <dia:attribute name="obj_bb">
        <dia:rectangle val="1.10078,0.413281;6.89922,1.33594"/>
      </dia:attribute>
      <dia:attribute name="text">
        <dia:composite type="text">
          <dia:attribute name="string">
            <dia:string>#SOURCE PROGRAM#</dia:string>
          </dia:attribute>
          <dia:attribute name="font">
            <dia:font family="sans" style="0" name="Helvetica"/>
          </dia:attribute>
          <dia:attribute name="height">
            <dia:real val="0.80000000000000004"/>
          </dia:attribute>
          <dia:attribute name="pos">
            <dia:point val="4,1"/>
          </dia:attribute>
          <dia:attribute name="color">
            <dia:color val="#000000"/>
          </dia:attribute>
          <dia:attribute name="alignment">
            <dia:enum val="1"/>
          </dia:attribute>
        </dia:composite>
      </dia:attribute>
    </dia:object>
    <dia:object type="Flowchart - Box" version="0" id="O2">
      <dia:attribute name="obj_pos">
        <dia:point val="1,9"/>
      </dia:attribute>
      <dia:attribute name="obj_bb">
        <dia:rectangle val="0.95,8.95;6.05,14.05"/>
      </dia:attribute>
      <dia:attribute name="elem_corner">
        <dia:point val="1,9"/>
      </dia:attribute>
      <dia:attribute name="elem_width">
        <dia:real val="5"/>
      </dia:attribute>
      <dia:attribute name="elem_height">
        <dia:real val="5"/>
      </dia:attribute>
      <dia:attribute name="show_background">
        <dia:boolean val="false"/>
      </dia:attribute>
      <dia:attribute name="padding">
        <dia:real val="0.5"/>
      </dia:attribute>
      <dia:attribute name="text">
        <dia:composite type="text">
          <dia:attribute name="string">
            <dia:string>#parser#</dia:string>
          </dia:attribute>
          <dia:attribute name="font">
            <dia:font family="sans" style="0" name="Helvetica"/>
          </dia:attribute>
          <dia:attribute name="height">
            <dia:real val="0.80000000000000004"/>
          </dia:attribute>
          <dia:attribute name="pos">
            <dia:point val="3.5,11.6867"/>
          </dia:attribute>
          <dia:attribute name="color">
            <dia:color val="#000000"/>
          </dia:attribute>
          <dia:attribute name="alignment">
            <dia:enum val="1"/>
          </dia:attribute>
        </dia:composite>
      </dia:attribute>
    </dia:object>
    <dia:object type="Standard - ZigZagLine" version="0" id="O3">
      <dia:attribute name="obj_pos">
        <dia:point val="4,5.42857"/>
      </dia:attribute>
      <dia:attribute name="obj_bb">
        <dia:rectangle val="3,5.37857;4.05,9.05"/>
      </dia:attribute>
      <dia:attribute name="orth_points">
        <dia:point val="4,5.42857"/>
        <dia:point val="4,7.21429"/>
        <dia:point val="3.5,7.21429"/>
        <dia:point val="3.5,9"/>
      </dia:attribute>
      <dia:attribute name="orth_orient">
        <dia:enum val="1"/>
        <dia:enum val="0"/>
        <dia:enum val="1"/>
      </dia:attribute>
      <dia:attribute name="line_style">
        <dia:enum val="4"/>
      </dia:attribute>
      <dia:attribute name="end_arrow">
        <dia:enum val="22"/>
      </dia:attribute>
      <dia:attribute name="end_arrow_length">
        <dia:real val="0.5"/>
      </dia:attribute>
      <dia:attribute name="end_arrow_width">
        <dia:real val="0.5"/>
      </dia:attribute>
      <dia:connections>
        <dia:connection handle="0" to="O0" connection="14"/>
        <dia:connection handle="1" to="O2" connection="2"/>
      </dia:connections>
    </dia:object>
    <dia:object type="Flowchart - Box" version="0" id="O4">
      <dia:attribute name="obj_pos">
        <dia:point val="19,2"/>
      </dia:attribute>
      <dia:attribute name="obj_bb">
        <dia:rectangle val="18.95,1.95;24.05,7.05"/>
      </dia:attribute>
      <dia:attribute name="elem_corner">
        <dia:point val="19,2"/>
      </dia:attribute>
      <dia:attribute name="elem_width">
        <dia:real val="5"/>
      </dia:attribute>
      <dia:attribute name="elem_height">
        <dia:real val="5"/>
      </dia:attribute>
      <dia:attribute name="show_background">
        <dia:boolean val="false"/>
      </dia:attribute>
      <dia:attribute name="padding">
        <dia:real val="0.5"/>
      </dia:attribute>
      <dia:attribute name="text">
        <dia:composite type="text">
          <dia:attribute name="string">
            <dia:string>#simple
declaration
processor#</dia:string>
          </dia:attribute>
          <dia:attribute name="font">
            <dia:font family="sans" style="0" name="Helvetica"/>
          </dia:attribute>
          <dia:attribute name="height">
            <dia:real val="0.80000000000000004"/>
          </dia:attribute>
          <dia:attribute name="pos">
            <dia:point val="21.5,3.88672"/>
          </dia:attribute>
          <dia:attribute name="color">
            <dia:color val="#000000"/>
          </dia:attribute>
          <dia:attribute name="alignment">
            <dia:enum val="1"/>
          </dia:attribute>
        </dia:composite>
      </dia:attribute>
    </dia:object>
    <dia:object type="Flowchart - Box" version="0" id="O5">
      <dia:attribute name="obj_pos">
        <dia:point val="16,10"/>
      </dia:attribute>
      <dia:attribute name="obj_bb">
        <dia:rectangle val="15.95,9.95;21.05,15.05"/>
      </dia:attribute>
      <dia:attribute name="elem_corner">
        <dia:point val="16,10"/>
      </dia:attribute>
      <dia:attribute name="elem_width">
        <dia:real val="5"/>
      </dia:attribute>
      <dia:attribute name="elem_height">
        <dia:real val="5"/>
      </dia:attribute>
      <dia:attribute name="show_background">
        <dia:boolean val="false"/>
      </dia:attribute>
      <dia:attribute name="padding">
        <dia:real val="0.5"/>
      </dia:attribute>
      <dia:attribute name="text">
        <dia:composite type="text">
          <dia:attribute name="string">
            <dia:string>#declaration
specifier
sequence
processor#</dia:string>
          </dia:attribute>
          <dia:attribute name="font">
            <dia:font family="sans" style="0" name="Helvetica"/>
          </dia:attribute>
          <dia:attribute name="height">
            <dia:real val="0.80000000000000004"/>
          </dia:attribute>
          <dia:attribute name="pos">
            <dia:point val="18.5,11.4867"/>
          </dia:attribute>
          <dia:attribute name="color">
            <dia:color val="#000000"/>
          </dia:attribute>
          <dia:attribute name="alignment">
            <dia:enum val="1"/>
          </dia:attribute>
        </dia:composite>
      </dia:attribute>
    </dia:object>
    <dia:object type="Flowchart - Box" version="0" id="O6">
      <dia:attribute name="obj_pos">
        <dia:point val="16,18"/>
      </dia:attribute>
      <dia:attribute name="obj_bb">
        <dia:rectangle val="15.95,17.95;21.05,23.05"/>
      </dia:attribute>
      <dia:attribute name="elem_corner">
        <dia:point val="16,18"/>
      </dia:attribute>
      <dia:attribute name="elem_width">
        <dia:real val="5"/>
      </dia:attribute>
      <dia:attribute name="elem_height">
        <dia:real val="5"/>
      </dia:attribute>
      <dia:attribute name="show_background">
        <dia:boolean val="false"/>
      </dia:attribute>
      <dia:attribute name="padding">
        <dia:real val="0.5"/>
      </dia:attribute>
      <dia:attribute name="text">
        <dia:composite type="text">
          <dia:attribute name="string">
            <dia:string>#declaration
specifier
visitor#</dia:string>
          </dia:attribute>
          <dia:attribute name="font">
            <dia:font family="sans" style="0" name="Helvetica"/>
          </dia:attribute>
          <dia:attribute name="height">
            <dia:real val="0.80000000000000004"/>
          </dia:attribute>
          <dia:attribute name="pos">
            <dia:point val="18.5,19.8867"/>
          </dia:attribute>
          <dia:attribute name="color">
            <dia:color val="#000000"/>
          </dia:attribute>
          <dia:attribute name="alignment">
            <dia:enum val="1"/>
          </dia:attribute>
        </dia:composite>
      </dia:attribute>
    </dia:object>
    <dia:object type="Flowchart - Box" version="0" id="O7">
      <dia:attribute name="obj_pos">
        <dia:point val="22,10"/>
      </dia:attribute>
      <dia:attribute name="obj_bb">
        <dia:rectangle val="21.95,9.95;27.05,15.05"/>
      </dia:attribute>
      <dia:attribute name="elem_corner">
        <dia:point val="22,10"/>
      </dia:attribute>
      <dia:attribute name="elem_width">
        <dia:real val="5"/>
      </dia:attribute>
      <dia:attribute name="elem_height">
        <dia:real val="5"/>
      </dia:attribute>
      <dia:attribute name="show_background">
        <dia:boolean val="false"/>
      </dia:attribute>
      <dia:attribute name="padding">
        <dia:real val="0.5"/>
      </dia:attribute>
      <dia:attribute name="text">
        <dia:composite type="text">
          <dia:attribute name="string">
            <dia:string>#declarator
type
processor#</dia:string>
          </dia:attribute>
          <dia:attribute name="font">
            <dia:font family="sans" style="0" name="Helvetica"/>
          </dia:attribute>
          <dia:attribute name="height">
            <dia:real val="0.80000000000000004"/>
          </dia:attribute>
          <dia:attribute name="pos">
            <dia:point val="24.5,11.8867"/>
          </dia:attribute>
          <dia:attribute name="color">
            <dia:color val="#000000"/>
          </dia:attribute>
          <dia:attribute name="alignment">
            <dia:enum val="1"/>
          </dia:attribute>
        </dia:composite>
      </dia:attribute>
    </dia:object>
    <dia:object type="Flowchart - Box" version="0" id="O8">
      <dia:attribute name="obj_pos">
        <dia:point val="22,18"/>
      </dia:attribute>
      <dia:attribute name="obj_bb">
        <dia:rectangle val="21.95,17.95;27.05,23.05"/>
      </dia:attribute>
      <dia:attribute name="elem_corner">
        <dia:point val="22,18"/>
      </dia:attribute>
      <dia:attribute name="elem_width">
        <dia:real val="5"/>
      </dia:attribute>
      <dia:attribute name="elem_height">
        <dia:real val="5"/>
      </dia:attribute>
      <dia:attribute name="show_background">
        <dia:boolean val="false"/>
      </dia:attribute>
      <dia:attribute name="padding">
        <dia:real val="0.5"/>
      </dia:attribute>
      <dia:attribute name="text">
        <dia:composite type="text">
          <dia:attribute name="string">
            <dia:string>#declarator
operator
visitor#</dia:string>
          </dia:attribute>
          <dia:attribute name="font">
            <dia:font family="sans" style="0" name="Helvetica"/>
          </dia:attribute>
          <dia:attribute name="height">
            <dia:real val="0.80000000000000004"/>
          </dia:attribute>
          <dia:attribute name="pos">
            <dia:point val="24.5,19.8867"/>
          </dia:attribute>
          <dia:attribute name="color">
            <dia:color val="#000000"/>
          </dia:attribute>
          <dia:attribute name="alignment">
            <dia:enum val="1"/>
          </dia:attribute>
        </dia:composite>
      </dia:attribute>
    </dia:object>
    <dia:object type="Flowchart - Box" version="0" id="O9">
      <dia:attribute name="obj_pos">
        <dia:point val="29,9"/>
      </dia:attribute>
      <dia:attribute name="obj_bb">
        <dia:rectangle val="28.95,8.95;34.05,14.05"/>
      </dia:attribute>
      <dia:attribute name="elem_corner">
        <dia:point val="29,9"/>
      </dia:attribute>
      <dia:attribute name="elem_width">
        <dia:real val="5"/>
      </dia:attribute>
      <dia:attribute name="elem_height">
        <dia:real val="5"/>
      </dia:attribute>
      <dia:attribute name="show_background">
        <dia:boolean val="false"/>
      </dia:attribute>
      <dia:attribute name="padding">
        <dia:real val="0.5"/>
      </dia:attribute>
      <dia:attribute name="text">
        <dia:composite type="text">
          <dia:attribute name="string">
            <dia:string>#declaration
visitor#</dia:string>
          </dia:attribute>
          <dia:attribute name="font">
            <dia:font family="sans" style="0" name="Helvetica"/>
          </dia:attribute>
          <dia:attribute name="height">
            <dia:real val="0.80000000000000004"/>
          </dia:attribute>
          <dia:attribute name="pos">
            <dia:point val="31.5,11.2867"/>
          </dia:attribute>
          <dia:attribute name="color">
            <dia:color val="#000000"/>
          </dia:attribute>
          <dia:attribute name="alignment">
            <dia:enum val="1"/>
          </dia:attribute>
        </dia:composite>
      </dia:attribute>
    </dia:object>
    <dia:object type="Flowchart - Box" version="0" id="O10">
      <dia:attribute name="obj_pos">
        <dia:point val="29,2"/>
      </dia:attribute>
      <dia:attribute name="obj_bb">
        <dia:rectangle val="28.95,1.95;34.05,7.05"/>
      </dia:attribute>
      <dia:attribute name="elem_corner">
        <dia:point val="29,2"/>
      </dia:attribute>
      <dia:attribute name="elem_width">
        <dia:real val="5"/>
      </dia:attribute>
      <dia:attribute name="elem_height">
        <dia:real val="5"/>
      </dia:attribute>
      <dia:attribute name="show_background">
        <dia:boolean val="false"/>
      </dia:attribute>
      <dia:attribute name="padding">
        <dia:real val="0.5"/>
      </dia:attribute>
      <dia:attribute name="text">
        <dia:composite type="text">
          <dia:attribute name="string">
            <dia:string>#lookup#</dia:string>
          </dia:attribute>
          <dia:attribute name="font">
            <dia:font family="sans" style="0" name="Helvetica"/>
          </dia:attribute>
          <dia:attribute name="height">
            <dia:real val="0.80000000000000004"/>
          </dia:attribute>
          <dia:attribute name="pos">
            <dia:point val="31.5,4.68672"/>
          </dia:attribute>
          <dia:attribute name="color">
            <dia:color val="#000000"/>
          </dia:attribute>
          <dia:attribute name="alignment">
            <dia:enum val="1"/>
          </dia:attribute>
        </dia:composite>
      </dia:attribute>
    </dia:object>
    <dia:object type="Standard - ZigZagLine" version="0" id="O11">
      <dia:attribute name="obj_pos">
        <dia:point val="24,2"/>
      </dia:attribute>
      <dia:attribute name="obj_bb">
        <dia:rectangle val="24,1.95;29.0707,2.05"/>
      </dia:attribute>
      <dia:attribute name="orth_points">
        <dia:point val="24,2"/>
        <dia:point val="24,2"/>
        <dia:point val="29,2"/>
        <dia:point val="29,2"/>
      </dia:attribute>
      <dia:attribute name="orth_orient">
        <dia:enum val="0"/>
        <dia:enum val="1"/>
        <dia:enum val="0"/>
      </dia:attribute>
      <dia:attribute name="end_arrow">
        <dia:enum val="22"/>
      </dia:attribute>
      <dia:attribute name="end_arrow_length">
        <dia:real val="0.5"/>
      </dia:attribute>
      <dia:attribute name="end_arrow_width">
        <dia:real val="0.5"/>
      </dia:attribute>
      <dia:connections>
        <dia:connection handle="0" to="O4" connection="4"/>
        <dia:connection handle="1" to="O10" connection="0"/>
      </dia:connections>
    </dia:object>
    <dia:object type="Standard - ZigZagLine" version="0" id="O12">
      <dia:attribute name="obj_pos">
        <dia:point val="31.5,7"/>
      </dia:attribute>
      <dia:attribute name="obj_bb">
        <dia:rectangle val="31.45,7;31.55,9.07071"/>
      </dia:attribute>
      <dia:attribute name="orth_points">
        <dia:point val="31.5,7"/>
        <dia:point val="31.5,7"/>
        <dia:point val="31.5,9"/>
        <dia:point val="31.5,9"/>
      </dia:attribute>
      <dia:attribute name="orth_orient">
        <dia:enum val="0"/>
        <dia:enum val="1"/>
        <dia:enum val="0"/>
      </dia:attribute>
      <dia:attribute name="line_style">
        <dia:enum val="4"/>
      </dia:attribute>
      <dia:attribute name="end_arrow">
        <dia:enum val="22"/>
      </dia:attribute>
      <dia:attribute name="end_arrow_length">
        <dia:real val="0.5"/>
      </dia:attribute>
      <dia:attribute name="end_arrow_width">
        <dia:real val="0.5"/>
      </dia:attribute>
      <dia:attribute name="dashlength">
        <dia:real val="0.99999999999999989"/>
      </dia:attribute>
      <dia:connections>
        <dia:connection handle="0" to="O10" connection="13"/>
        <dia:connection handle="1" to="O9" connection="2"/>
      </dia:connections>
    </dia:object>
    <dia:object type="Standard - ZigZagLine" version="0" id="O13">
      <dia:attribute name="obj_pos">
        <dia:point val="29,9"/>
      </dia:attribute>
      <dia:attribute name="obj_bb">
        <dia:rectangle val="23.95,4;29.05,9.05"/>
      </dia:attribute>
      <dia:attribute name="orth_points">
        <dia:point val="29,9"/>
        <dia:point val="28,9"/>
        <dia:point val="28,4.5"/>
        <dia:point val="24,4.5"/>
      </dia:attribute>
      <dia:attribute name="orth_orient">
        <dia:enum val="0"/>
        <dia:enum val="1"/>
        <dia:enum val="0"/>
      </dia:attribute>
      <dia:attribute name="autorouting">
        <dia:boolean val="false"/>
      </dia:attribute>
      <dia:attribute name="line_style">
        <dia:enum val="4"/>
      </dia:attribute>
      <dia:attribute name="end_arrow">
        <dia:enum val="22"/>
      </dia:attribute>
      <dia:attribute name="end_arrow_length">
        <dia:real val="0.5"/>
      </dia:attribute>
      <dia:attribute name="end_arrow_width">
        <dia:real val="0.5"/>
      </dia:attribute>
      <dia:attribute name="dashlength">
        <dia:real val="0.99999999999999989"/>
      </dia:attribute>
      <dia:connections>
        <dia:connection handle="0" to="O9" connection="0"/>
        <dia:connection handle="1" to="O4" connection="8"/>
      </dia:connections>
    </dia:object>
    <dia:object type="Standard - ZigZagLine" version="0" id="O14">
      <dia:attribute name="obj_pos">
        <dia:point val="19,7"/>
      </dia:attribute>
      <dia:attribute name="obj_bb">
        <dia:rectangle val="18.95,6.95;21.5,10.05"/>
      </dia:attribute>
      <dia:attribute name="orth_points">
        <dia:point val="19,7"/>
        <dia:point val="19,8.5"/>
        <dia:point val="21,8.5"/>
        <dia:point val="21,10"/>
      </dia:attribute>
      <dia:attribute name="orth_orient">
        <dia:enum val="1"/>
        <dia:enum val="0"/>
        <dia:enum val="1"/>
      </dia:attribute>
      <dia:attribute name="end_arrow">
        <dia:enum val="22"/>
      </dia:attribute>
      <dia:attribute name="end_arrow_length">
        <dia:real val="0.5"/>
      </dia:attribute>
      <dia:attribute name="end_arrow_width">
        <dia:real val="0.5"/>
      </dia:attribute>
      <dia:connections>
        <dia:connection handle="0" to="O4" connection="11"/>
        <dia:connection handle="1" to="O5" connection="4"/>
      </dia:connections>
    </dia:object>
    <dia:object type="Standard - ZigZagLine" version="0" id="O15">
      <dia:attribute name="obj_pos">
        <dia:point val="17.25,15"/>
      </dia:attribute>
      <dia:attribute name="obj_bb">
        <dia:rectangle val="17.2,15;17.3,18.0707"/>
      </dia:attribute>
      <dia:attribute name="orth_points">
        <dia:point val="17.25,15"/>
        <dia:point val="17.25,15"/>
        <dia:point val="17.25,18"/>
        <dia:point val="17.25,18"/>
      </dia:attribute>
      <dia:attribute name="orth_orient">
        <dia:enum val="0"/>
        <dia:enum val="1"/>
        <dia:enum val="0"/>
      </dia:attribute>
      <dia:attribute name="end_arrow">
        <dia:enum val="22"/>
      </dia:attribute>
      <dia:attribute name="end_arrow_length">
        <dia:real val="0.5"/>
      </dia:attribute>
      <dia:attribute name="end_arrow_width">
        <dia:real val="0.5"/>
      </dia:attribute>
      <dia:connections>
        <dia:connection handle="0" to="O5" connection="12"/>
        <dia:connection handle="1" to="O6" connection="1"/>
      </dia:connections>
    </dia:object>
    <dia:object type="Standard - ZigZagLine" version="0" id="O16">
      <dia:attribute name="obj_pos">
        <dia:point val="24,7"/>
      </dia:attribute>
      <dia:attribute name="obj_bb">
        <dia:rectangle val="21.5,6.95;24.05,10.05"/>
      </dia:attribute>
      <dia:attribute name="orth_points">
        <dia:point val="24,7"/>
        <dia:point val="24,8.5"/>
        <dia:point val="22,8.5"/>
        <dia:point val="22,10"/>
      </dia:attribute>
      <dia:attribute name="orth_orient">
        <dia:enum val="1"/>
        <dia:enum val="0"/>
        <dia:enum val="1"/>
      </dia:attribute>
      <dia:attribute name="end_arrow">
        <dia:enum val="22"/>
      </dia:attribute>
      <dia:attribute name="end_arrow_length">
        <dia:real val="0.5"/>
      </dia:attribute>
      <dia:attribute name="end_arrow_width">
        <dia:real val="0.5"/>
      </dia:attribute>
      <dia:connections>
        <dia:connection handle="0" to="O4" connection="15"/>
        <dia:connection handle="1" to="O7" connection="0"/>
      </dia:connections>
    </dia:object>
    <dia:object type="Standard - ZigZagLine" version="0" id="O17">
      <dia:attribute name="obj_pos">
        <dia:point val="23.25,15"/>
      </dia:attribute>
      <dia:attribute name="obj_bb">
        <dia:rectangle val="23.2,15;23.3,18.0707"/>
      </dia:attribute>
      <dia:attribute name="orth_points">
        <dia:point val="23.25,15"/>
        <dia:point val="23.25,15"/>
        <dia:point val="23.25,18"/>
        <dia:point val="23.25,18"/>
      </dia:attribute>
      <dia:attribute name="orth_orient">
        <dia:enum val="0"/>
        <dia:enum val="1"/>
        <dia:enum val="0"/>
      </dia:attribute>
      <dia:attribute name="end_arrow">
        <dia:enum val="22"/>
      </dia:attribute>
      <dia:attribute name="end_arrow_length">
        <dia:real val="0.5"/>
      </dia:attribute>
      <dia:attribute name="end_arrow_width">
        <dia:real val="0.5"/>
      </dia:attribute>
      <dia:connections>
        <dia:connection handle="0" to="O7" connection="12"/>
        <dia:connection handle="1" to="O8" connection="1"/>
      </dia:connections>
    </dia:object>
    <dia:object type="Standard - ZigZagLine" version="0" id="O18">
      <dia:attribute name="obj_pos">
        <dia:point val="25.75,18"/>
      </dia:attribute>
      <dia:attribute name="obj_bb">
        <dia:rectangle val="25.7,14.9293;25.8,18"/>
      </dia:attribute>
      <dia:attribute name="orth_points">
        <dia:point val="25.75,18"/>
        <dia:point val="25.75,18"/>
        <dia:point val="25.75,15"/>
        <dia:point val="25.75,15"/>
      </dia:attribute>
      <dia:attribute name="orth_orient">
        <dia:enum val="0"/>
        <dia:enum val="1"/>
        <dia:enum val="0"/>
      </dia:attribute>
      <dia:attribute name="line_style">
        <dia:enum val="4"/>
      </dia:attribute>
      <dia:attribute name="end_arrow">
        <dia:enum val="22"/>
      </dia:attribute>
      <dia:attribute name="end_arrow_length">
        <dia:real val="0.5"/>
      </dia:attribute>
      <dia:attribute name="end_arrow_width">
        <dia:real val="0.5"/>
      </dia:attribute>
      <dia:attribute name="dashlength">
        <dia:real val="0.99999999999999989"/>
      </dia:attribute>
      <dia:connections>
        <dia:connection handle="0" to="O8" connection="3"/>
        <dia:connection handle="1" to="O7" connection="14"/>
      </dia:connections>
    </dia:object>
    <dia:object type="Standard - ZigZagLine" version="0" id="O19">
      <dia:attribute name="obj_pos">
        <dia:point val="25.75,10"/>
      </dia:attribute>
      <dia:attribute name="obj_bb">
        <dia:rectangle val="23.95,5.25;25.8,10.05"/>
      </dia:attribute>
      <dia:attribute name="orth_points">
        <dia:point val="25.75,10"/>
        <dia:point val="25.75,5.75"/>
        <dia:point val="24,5.75"/>
      </dia:attribute>
      <dia:attribute name="orth_orient">
        <dia:enum val="1"/>
        <dia:enum val="0"/>
      </dia:attribute>
      <dia:attribute name="line_style">
        <dia:enum val="4"/>
      </dia:attribute>
      <dia:attribute name="end_arrow">
        <dia:enum val="22"/>
      </dia:attribute>
      <dia:attribute name="end_arrow_length">
        <dia:real val="0.5"/>
      </dia:attribute>
      <dia:attribute name="end_arrow_width">
        <dia:real val="0.5"/>
      </dia:attribute>
      <dia:attribute name="dashlength">
        <dia:real val="0.99999999999999989"/>
      </dia:attribute>
      <dia:connections>
        <dia:connection handle="0" to="O7" connection="3"/>
        <dia:connection handle="1" to="O4" connection="10"/>
      </dia:connections>
    </dia:object>
    <dia:object type="Standard - ZigZagLine" version="0" id="O20">
      <dia:attribute name="obj_pos">
        <dia:point val="19.75,18"/>
      </dia:attribute>
      <dia:attribute name="obj_bb">
        <dia:rectangle val="19.7,14.9293;19.8,18"/>
      </dia:attribute>
      <dia:attribute name="orth_points">
        <dia:point val="19.75,18"/>
        <dia:point val="19.75,18"/>
        <dia:point val="19.75,15"/>
        <dia:point val="19.75,15"/>
      </dia:attribute>
      <dia:attribute name="orth_orient">
        <dia:enum val="0"/>
        <dia:enum val="1"/>
        <dia:enum val="0"/>
      </dia:attribute>
      <dia:attribute name="line_style">
        <dia:enum val="4"/>
      </dia:attribute>
      <dia:attribute name="end_arrow">
        <dia:enum val="22"/>
      </dia:attribute>
      <dia:attribute name="end_arrow_length">
        <dia:real val="0.5"/>
      </dia:attribute>
      <dia:attribute name="end_arrow_width">
        <dia:real val="0.5"/>
      </dia:attribute>
      <dia:attribute name="dashlength">
        <dia:real val="0.99999999999999989"/>
      </dia:attribute>
      <dia:connections>
        <dia:connection handle="0" to="O6" connection="3"/>
        <dia:connection handle="1" to="O5" connection="14"/>
      </dia:connections>
    </dia:object>
    <dia:object type="Flowchart - Internal Storage" version="0" id="O21">
      <dia:attribute name="obj_pos">
        <dia:point val="10,10"/>
      </dia:attribute>
      <dia:attribute name="obj_bb">
        <dia:rectangle val="9.95,9.95;15.05,15.05"/>
      </dia:attribute>
      <dia:attribute name="elem_corner">
        <dia:point val="10,10"/>
      </dia:attribute>
      <dia:attribute name="elem_width">
        <dia:real val="5"/>
      </dia:attribute>
      <dia:attribute name="elem_height">
        <dia:real val="5"/>
      </dia:attribute>
      <dia:attribute name="line_width">
        <dia:real val="0.10000000000000001"/>
      </dia:attribute>
      <dia:attribute name="line_colour">
        <dia:color val="#000000"/>
      </dia:attribute>
      <dia:attribute name="fill_colour">
        <dia:color val="#ffffff"/>
      </dia:attribute>
      <dia:attribute name="show_background">
        <dia:boolean val="false"/>
      </dia:attribute>
      <dia:attribute name="line_style">
        <dia:enum val="0"/>
        <dia:real val="0.99999999999999989"/>
      </dia:attribute>
      <dia:attribute name="text">
        <dia:composite type="text">
          <dia:attribute name="string">
            <dia:string>#context#</dia:string>
          </dia:attribute>
          <dia:attribute name="font">
            <dia:font family="sans" style="0" name="Helvetica"/>
          </dia:attribute>
          <dia:attribute name="height">
            <dia:real val="0.80000000000000004"/>
          </dia:attribute>
          <dia:attribute name="pos">
            <dia:point val="12.75,12.9367"/>
          </dia:attribute>
          <dia:attribute name="color">
            <dia:color val="#000000"/>
          </dia:attribute>
          <dia:attribute name="alignment">
            <dia:enum val="1"/>
          </dia:attribute>
        </dia:composite>
      </dia:attribute>
      <dia:attribute name="flip_horizontal">
        <dia:boolean val="false"/>
      </dia:attribute>
      <dia:attribute name="flip_vertical">
        <dia:boolean val="false"/>
      </dia:attribute>
    </dia:object>
    <dia:object type="Standard - ZigZagLine" version="0" id="O22">
      <dia:attribute name="obj_pos">
        <dia:point val="19,3.25"/>
      </dia:attribute>
      <dia:attribute name="obj_bb">
        <dia:rectangle val="12,3.2;19.05,10.05"/>
      </dia:attribute>
      <dia:attribute name="orth_points">
        <dia:point val="19,3.25"/>
        <dia:point val="12.5,3.25"/>
        <dia:point val="12.5,10"/>
      </dia:attribute>
      <dia:attribute name="orth_orient">
        <dia:enum val="0"/>
        <dia:enum val="1"/>
      </dia:attribute>
      <dia:attribute name="line_style">
        <dia:enum val="4"/>
      </dia:attribute>
      <dia:attribute name="end_arrow">
        <dia:enum val="22"/>
      </dia:attribute>
      <dia:attribute name="end_arrow_length">
        <dia:real val="0.5"/>
      </dia:attribute>
      <dia:attribute name="end_arrow_width">
        <dia:real val="0.5"/>
      </dia:attribute>
      <dia:attribute name="dashlength">
        <dia:real val="0.99999999999999989"/>
      </dia:attribute>
      <dia:connections>
        <dia:connection handle="0" to="O4" connection="5"/>
        <dia:connection handle="1" to="O21" connection="2"/>
      </dia:connections>
    </dia:object>
    <dia:object type="Standard - ZigZagLine" version="0" id="O23">
      <dia:attribute name="obj_pos">
        <dia:point val="13.75,10"/>
      </dia:attribute>
      <dia:attribute name="obj_bb">
        <dia:rectangle val="13.7,4;19.05,10.05"/>
      </dia:attribute>
      <dia:attribute name="orth_points">
        <dia:point val="13.75,10"/>
        <dia:point val="13.75,4.5"/>
        <dia:point val="19,4.5"/>
      </dia:attribute>
      <dia:attribute name="orth_orient">
        <dia:enum val="1"/>
        <dia:enum val="0"/>
      </dia:attribute>
      <dia:attribute name="line_style">
        <dia:enum val="4"/>
      </dia:attribute>
      <dia:attribute name="end_arrow">
        <dia:enum val="22"/>
      </dia:attribute>
      <dia:attribute name="end_arrow_length">
        <dia:real val="0.5"/>
      </dia:attribute>
      <dia:attribute name="end_arrow_width">
        <dia:real val="0.5"/>
      </dia:attribute>
      <dia:attribute name="dashlength">
        <dia:real val="0.99999999999999989"/>
      </dia:attribute>
      <dia:connections>
        <dia:connection handle="0" to="O21" connection="3"/>
        <dia:connection handle="1" to="O4" connection="7"/>
      </dia:connections>
    </dia:object>
    <dia:object type="Standard - ZigZagLine" version="0" id="O24">
      <dia:attribute name="obj_pos">
        <dia:point val="6,9"/>
      </dia:attribute>
      <dia:attribute name="obj_bb">
        <dia:rectangle val="5.95,0.95;20.75,9.05"/>
      </dia:attribute>
      <dia:attribute name="orth_points">
        <dia:point val="6,9"/>
        <dia:point val="8,9"/>
        <dia:point val="8,1"/>
        <dia:point val="20.25,1"/>
        <dia:point val="20.25,2"/>
      </dia:attribute>
      <dia:attribute name="orth_orient">
        <dia:enum val="0"/>
        <dia:enum val="1"/>
        <dia:enum val="0"/>
        <dia:enum val="1"/>
      </dia:attribute>
      <dia:attribute name="autorouting">
        <dia:boolean val="false"/>
      </dia:attribute>
      <dia:attribute name="end_arrow">
        <dia:enum val="22"/>
      </dia:attribute>
      <dia:attribute name="end_arrow_length">
        <dia:real val="0.5"/>
      </dia:attribute>
      <dia:attribute name="end_arrow_width">
        <dia:real val="0.5"/>
      </dia:attribute>
      <dia:connections>
        <dia:connection handle="0" to="O2" connection="4"/>
        <dia:connection handle="1" to="O4" connection="1"/>
      </dia:connections>
    </dia:object>
    <dia:object type="Standard - ZigZagLine" version="0" id="O25">
      <dia:attribute name="obj_pos">
        <dia:point val="16,10"/>
      </dia:attribute>
      <dia:attribute name="obj_bb">
        <dia:rectangle val="15.95,5.25;19.05,10.05"/>
      </dia:attribute>
      <dia:attribute name="orth_points">
        <dia:point val="16,10"/>
        <dia:point val="16,5.75"/>
        <dia:point val="19,5.75"/>
      </dia:attribute>
      <dia:attribute name="orth_orient">
        <dia:enum val="1"/>
        <dia:enum val="0"/>
      </dia:attribute>
      <dia:attribute name="line_style">
        <dia:enum val="4"/>
      </dia:attribute>
      <dia:attribute name="end_arrow">
        <dia:enum val="22"/>
      </dia:attribute>
      <dia:attribute name="end_arrow_length">
        <dia:real val="0.5"/>
      </dia:attribute>
      <dia:attribute name="end_arrow_width">
        <dia:real val="0.5"/>
      </dia:attribute>
      <dia:attribute name="dashlength">
        <dia:real val="0.99999999999999989"/>
      </dia:attribute>
      <dia:connections>
        <dia:connection handle="0" to="O5" connection="0"/>
        <dia:connection handle="1" to="O4" connection="9"/>
      </dia:connections>
    </dia:object>
    <dia:object type="Standard - Text" version="0" id="O26">
      <dia:attribute name="obj_pos">
        <dia:point val="14.2,0.738281"/>
      </dia:attribute>
      <dia:attribute name="obj_bb">
        <dia:rectangle val="8.67266,0.133828;19.7451,1.10969"/>
      </dia:attribute>
      <dia:attribute name="text">
        <dia:composite type="text">
          <dia:attribute name="string">
            <dia:string>#declarator specifier sequence parsed#</dia:string>
          </dia:attribute>
          <dia:attribute name="font">
            <dia:font family="sans" style="0" name="Helvetica"/>
          </dia:attribute>
          <dia:attribute name="height">
            <dia:real val="0.80000000000000004"/>
          </dia:attribute>
          <dia:attribute name="pos">
            <dia:point val="14.2,0.738281"/>
          </dia:attribute>
          <dia:attribute name="color">
            <dia:color val="#000000"/>
          </dia:attribute>
          <dia:attribute name="alignment">
            <dia:enum val="1"/>
          </dia:attribute>
        </dia:composite>
      </dia:attribute>
    </dia:object>
    <dia:object type="Standard - Text" version="0" id="O27">
      <dia:attribute name="obj_pos">
        <dia:point val="15,3.11328"/>
      </dia:attribute>
      <dia:attribute name="obj_bb">
        <dia:rectangle val="14.7916,2.50883;15.1906,3.48469"/>
      </dia:attribute>
      <dia:attribute name="text">
        <dia:composite type="text">
          <dia:attribute name="string">
            <dia:string>#2#</dia:string>
          </dia:attribute>
          <dia:attribute name="font">
            <dia:font family="sans" style="0" name="Helvetica"/>
          </dia:attribute>
          <dia:attribute name="height">
            <dia:real val="0.80000000000000004"/>
          </dia:attribute>
          <dia:attribute name="pos">
            <dia:point val="15,3.11328"/>
          </dia:attribute>
          <dia:attribute name="color">
            <dia:color val="#000000"/>
          </dia:attribute>
          <dia:attribute name="alignment">
            <dia:enum val="1"/>
          </dia:attribute>
        </dia:composite>
      </dia:attribute>
    </dia:object>
    <dia:object type="Standard - Text" version="0" id="O28">
      <dia:attribute name="obj_pos">
        <dia:point val="15.05,4.21328"/>
      </dia:attribute>
      <dia:attribute name="obj_bb">
        <dia:rectangle val="14.8416,3.60883;15.2406,4.58469"/>
      </dia:attribute>
      <dia:attribute name="text">
        <dia:composite type="text">
          <dia:attribute name="string">
            <dia:string>#3#</dia:string>
          </dia:attribute>
          <dia:attribute name="font">
            <dia:font family="sans" style="0" name="Helvetica"/>
          </dia:attribute>
          <dia:attribute name="height">
            <dia:real val="0.80000000000000004"/>
          </dia:attribute>
          <dia:attribute name="pos">
            <dia:point val="15.05,4.21328"/>
          </dia:attribute>
          <dia:attribute name="color">
            <dia:color val="#000000"/>
          </dia:attribute>
          <dia:attribute name="alignment">
            <dia:enum val="1"/>
          </dia:attribute>
        </dia:composite>
      </dia:attribute>
    </dia:object>
    <dia:object type="Standard - Text" version="0" id="O29">
      <dia:attribute name="obj_pos">
        <dia:point val="19.85,7.66328"/>
      </dia:attribute>
      <dia:attribute name="obj_bb">
        <dia:rectangle val="19.6416,7.05883;20.0406,8.03469"/>
      </dia:attribute>
      <dia:attribute name="text">
        <dia:composite type="text">
          <dia:attribute name="string">
            <dia:string>#4#</dia:string>
          </dia:attribute>
          <dia:attribute name="font">
            <dia:font family="sans" style="0" name="Helvetica"/>
          </dia:attribute>
          <dia:attribute name="height">
            <dia:real val="0.80000000000000004"/>
          </dia:attribute>
          <dia:attribute name="pos">
            <dia:point val="19.85,7.66328"/>
          </dia:attribute>
          <dia:attribute name="color">
            <dia:color val="#000000"/>
          </dia:attribute>
          <dia:attribute name="alignment">
            <dia:enum val="1"/>
          </dia:attribute>
        </dia:composite>
      </dia:attribute>
    </dia:object>
    <dia:object type="Standard - Text" version="0" id="O30">
      <dia:attribute name="obj_pos">
        <dia:point val="17.45,5.51328"/>
      </dia:attribute>
      <dia:attribute name="obj_bb">
        <dia:rectangle val="17.2416,4.90883;17.6406,5.88469"/>
      </dia:attribute>
      <dia:attribute name="text">
        <dia:composite type="text">
          <dia:attribute name="string">
            <dia:string>#5#</dia:string>
          </dia:attribute>
          <dia:attribute name="font">
            <dia:font family="sans" style="0" name="Helvetica"/>
          </dia:attribute>
          <dia:attribute name="height">
            <dia:real val="0.80000000000000004"/>
          </dia:attribute>
          <dia:attribute name="pos">
            <dia:point val="17.45,5.51328"/>
          </dia:attribute>
          <dia:attribute name="color">
            <dia:color val="#000000"/>
          </dia:attribute>
          <dia:attribute name="alignment">
            <dia:enum val="1"/>
          </dia:attribute>
        </dia:composite>
      </dia:attribute>
    </dia:object>
    <dia:object type="Standard - Text" version="0" id="O31">
      <dia:attribute name="obj_pos">
        <dia:point val="23.45,7.86328"/>
      </dia:attribute>
      <dia:attribute name="obj_bb">
        <dia:rectangle val="23.2416,7.25883;23.6406,8.23469"/>
      </dia:attribute>
      <dia:attribute name="text">
        <dia:composite type="text">
          <dia:attribute name="string">
            <dia:string>#6#</dia:string>
          </dia:attribute>
          <dia:attribute name="font">
            <dia:font family="sans" style="0" name="Helvetica"/>
          </dia:attribute>
          <dia:attribute name="height">
            <dia:real val="0.80000000000000004"/>
          </dia:attribute>
          <dia:attribute name="pos">
            <dia:point val="23.45,7.86328"/>
          </dia:attribute>
          <dia:attribute name="color">
            <dia:color val="#000000"/>
          </dia:attribute>
          <dia:attribute name="alignment">
            <dia:enum val="1"/>
          </dia:attribute>
        </dia:composite>
      </dia:attribute>
    </dia:object>
    <dia:object type="Standard - Text" version="0" id="O32">
      <dia:attribute name="obj_pos">
        <dia:point val="25.45,8.01328"/>
      </dia:attribute>
      <dia:attribute name="obj_bb">
        <dia:rectangle val="25.2416,7.40883;25.6406,8.38469"/>
      </dia:attribute>
      <dia:attribute name="text">
        <dia:composite type="text">
          <dia:attribute name="string">
            <dia:string>#7#</dia:string>
          </dia:attribute>
          <dia:attribute name="font">
            <dia:font family="sans" style="0" name="Helvetica"/>
          </dia:attribute>
          <dia:attribute name="height">
            <dia:real val="0.80000000000000004"/>
          </dia:attribute>
          <dia:attribute name="pos">
            <dia:point val="25.45,8.01328"/>
          </dia:attribute>
          <dia:attribute name="color">
            <dia:color val="#000000"/>
          </dia:attribute>
          <dia:attribute name="alignment">
            <dia:enum val="1"/>
          </dia:attribute>
        </dia:composite>
      </dia:attribute>
    </dia:object>
    <dia:object type="Standard - Text" version="0" id="O33">
      <dia:attribute name="obj_pos">
        <dia:point val="22.85,17.2133"/>
      </dia:attribute>
      <dia:attribute name="obj_bb">
        <dia:rectangle val="22.4688,16.6266;23.2312,17.5492"/>
      </dia:attribute>
      <dia:attribute name="text">
        <dia:composite type="text">
          <dia:attribute name="string">
            <dia:string>#10#</dia:string>
          </dia:attribute>
          <dia:attribute name="font">
            <dia:font family="sans" style="0" name="Helvetica"/>
          </dia:attribute>
          <dia:attribute name="height">
            <dia:real val="0.80000000000000004"/>
          </dia:attribute>
          <dia:attribute name="pos">
            <dia:point val="22.85,17.2133"/>
          </dia:attribute>
          <dia:attribute name="color">
            <dia:color val="#000000"/>
          </dia:attribute>
          <dia:attribute name="alignment">
            <dia:enum val="1"/>
          </dia:attribute>
        </dia:composite>
      </dia:attribute>
    </dia:object>
    <dia:object type="Standard - Text" version="0" id="O34">
      <dia:attribute name="obj_pos">
        <dia:point val="25.35,17.4133"/>
      </dia:attribute>
      <dia:attribute name="obj_bb">
        <dia:rectangle val="24.9688,16.8266;25.7312,17.7492"/>
      </dia:attribute>
      <dia:attribute name="text">
        <dia:composite type="text">
          <dia:attribute name="string">
            <dia:string>#11#</dia:string>
          </dia:attribute>
          <dia:attribute name="font">
            <dia:font family="sans" style="0" name="Helvetica"/>
          </dia:attribute>
          <dia:attribute name="height">
            <dia:real val="0.80000000000000004"/>
          </dia:attribute>
          <dia:attribute name="pos">
            <dia:point val="25.35,17.4133"/>
          </dia:attribute>
          <dia:attribute name="color">
            <dia:color val="#000000"/>
          </dia:attribute>
          <dia:attribute name="alignment">
            <dia:enum val="1"/>
          </dia:attribute>
        </dia:composite>
      </dia:attribute>
    </dia:object>
    <dia:object type="Standard - Text" version="0" id="O35">
      <dia:attribute name="obj_pos">
        <dia:point val="26,7"/>
      </dia:attribute>
      <dia:attribute name="obj_bb">
        <dia:rectangle val="25.9823,6.39555;26,7.37141"/>
      </dia:attribute>
      <dia:attribute name="text">
        <dia:composite type="text">
          <dia:attribute name="string">
            <dia:string>##</dia:string>
          </dia:attribute>
          <dia:attribute name="font">
            <dia:font family="sans" style="0" name="Helvetica"/>
          </dia:attribute>
          <dia:attribute name="height">
            <dia:real val="0.80000000000000004"/>
          </dia:attribute>
          <dia:attribute name="pos">
            <dia:point val="26,7"/>
          </dia:attribute>
          <dia:attribute name="color">
            <dia:color val="#000000"/>
          </dia:attribute>
          <dia:attribute name="alignment">
            <dia:enum val="1"/>
          </dia:attribute>
        </dia:composite>
      </dia:attribute>
    </dia:object>
    <dia:object type="Standard - Text" version="0" id="O36">
      <dia:attribute name="obj_pos">
        <dia:point val="26.65,1.81328"/>
      </dia:attribute>
      <dia:attribute name="obj_bb">
        <dia:rectangle val="26.2687,1.20883;27.049,2.18469"/>
      </dia:attribute>
      <dia:attribute name="text">
        <dia:composite type="text">
          <dia:attribute name="string">
            <dia:string>#12#</dia:string>
          </dia:attribute>
          <dia:attribute name="font">
            <dia:font family="sans" style="0" name="Helvetica"/>
          </dia:attribute>
          <dia:attribute name="height">
            <dia:real val="0.80000000000000004"/>
          </dia:attribute>
          <dia:attribute name="pos">
            <dia:point val="26.65,1.81328"/>
          </dia:attribute>
          <dia:attribute name="color">
            <dia:color val="#000000"/>
          </dia:attribute>
          <dia:attribute name="alignment">
            <dia:enum val="1"/>
          </dia:attribute>
        </dia:composite>
      </dia:attribute>
    </dia:object>
    <dia:object type="Standard - Text" version="0" id="O37">
      <dia:attribute name="obj_pos">
        <dia:point val="16.95,17.1133"/>
      </dia:attribute>
      <dia:attribute name="obj_bb">
        <dia:rectangle val="16.7594,16.5266;17.1406,17.4492"/>
      </dia:attribute>
      <dia:attribute name="text">
        <dia:composite type="text">
          <dia:attribute name="string">
            <dia:string>#8#</dia:string>
          </dia:attribute>
          <dia:attribute name="font">
            <dia:font family="sans" style="0" name="Helvetica"/>
          </dia:attribute>
          <dia:attribute name="height">
            <dia:real val="0.80000000000000004"/>
          </dia:attribute>
          <dia:attribute name="pos">
            <dia:point val="16.95,17.1133"/>
          </dia:attribute>
          <dia:attribute name="color">
            <dia:color val="#000000"/>
          </dia:attribute>
          <dia:attribute name="alignment">
            <dia:enum val="1"/>
          </dia:attribute>
        </dia:composite>
      </dia:attribute>
    </dia:object>
    <dia:object type="Standard - Text" version="0" id="O38">
      <dia:attribute name="obj_pos">
        <dia:point val="19.35,17.4133"/>
      </dia:attribute>
      <dia:attribute name="obj_bb">
        <dia:rectangle val="19.1594,16.8266;19.5406,17.7492"/>
      </dia:attribute>
      <dia:attribute name="text">
        <dia:composite type="text">
          <dia:attribute name="string">
            <dia:string>#9#</dia:string>
          </dia:attribute>
          <dia:attribute name="font">
            <dia:font family="sans" style="0" name="Helvetica"/>
          </dia:attribute>
          <dia:attribute name="height">
            <dia:real val="0.80000000000000004"/>
          </dia:attribute>
          <dia:attribute name="pos">
            <dia:point val="19.35,17.4133"/>
          </dia:attribute>
          <dia:attribute name="color">
            <dia:color val="#000000"/>
          </dia:attribute>
          <dia:attribute name="alignment">
            <dia:enum val="1"/>
          </dia:attribute>
        </dia:composite>
      </dia:attribute>
    </dia:object>
    <dia:object type="Standard - Text" version="0" id="O39">
      <dia:attribute name="obj_pos">
        <dia:point val="31,8.05"/>
      </dia:attribute>
      <dia:attribute name="obj_bb">
        <dia:rectangle val="30.601,7.44555;31.3812,8.42141"/>
      </dia:attribute>
      <dia:attribute name="text">
        <dia:composite type="text">
          <dia:attribute name="string">
            <dia:string>#13#</dia:string>
          </dia:attribute>
          <dia:attribute name="font">
            <dia:font family="sans" style="0" name="Helvetica"/>
          </dia:attribute>
          <dia:attribute name="height">
            <dia:real val="0.80000000000000004"/>
          </dia:attribute>
          <dia:attribute name="pos">
            <dia:point val="31,8.05"/>
          </dia:attribute>
          <dia:attribute name="color">
            <dia:color val="#000000"/>
          </dia:attribute>
          <dia:attribute name="alignment">
            <dia:enum val="1"/>
          </dia:attribute>
        </dia:composite>
      </dia:attribute>
    </dia:object>
    <dia:object type="Standard - Text" version="0" id="O40">
      <dia:attribute name="obj_pos">
        <dia:point val="4.5,6.96328"/>
      </dia:attribute>
      <dia:attribute name="obj_bb">
        <dia:rectangle val="4.29164,6.35883;4.69063,7.33469"/>
      </dia:attribute>
      <dia:attribute name="text">
        <dia:composite type="text">
          <dia:attribute name="string">
            <dia:string>#1#</dia:string>
          </dia:attribute>
          <dia:attribute name="font">
            <dia:font family="sans" style="0" name="Helvetica"/>
          </dia:attribute>
          <dia:attribute name="height">
            <dia:real val="0.80000000000000004"/>
          </dia:attribute>
          <dia:attribute name="pos">
            <dia:point val="4.5,6.96328"/>
          </dia:attribute>
          <dia:attribute name="color">
            <dia:color val="#000000"/>
          </dia:attribute>
          <dia:attribute name="alignment">
            <dia:enum val="1"/>
          </dia:attribute>
        </dia:composite>
      </dia:attribute>
    </dia:object>
    <dia:object type="Standard - ZigZagLine" version="0" id="O41">
      <dia:attribute name="obj_pos">
        <dia:point val="6,10.25"/>
      </dia:attribute>
      <dia:attribute name="obj_bb">
        <dia:rectangle val="5.95,1.5;19.05,10.3"/>
      </dia:attribute>
      <dia:attribute name="orth_points">
        <dia:point val="6,10.25"/>
        <dia:point val="9,10.25"/>
        <dia:point val="9,2"/>
        <dia:point val="19,2"/>
      </dia:attribute>
      <dia:attribute name="orth_orient">
        <dia:enum val="0"/>
        <dia:enum val="1"/>
        <dia:enum val="0"/>
      </dia:attribute>
      <dia:attribute name="autorouting">
        <dia:boolean val="false"/>
      </dia:attribute>
      <dia:attribute name="end_arrow">
        <dia:enum val="22"/>
      </dia:attribute>
      <dia:attribute name="end_arrow_length">
        <dia:real val="0.5"/>
      </dia:attribute>
      <dia:attribute name="end_arrow_width">
        <dia:real val="0.5"/>
      </dia:attribute>
      <dia:connections>
        <dia:connection handle="0" to="O2" connection="6"/>
        <dia:connection handle="1" to="O4" connection="0"/>
      </dia:connections>
    </dia:object>
    <dia:object type="Standard - Text" version="0" id="O42">
      <dia:attribute name="obj_pos">
        <dia:point val="13.55,1.78828"/>
      </dia:attribute>
      <dia:attribute name="obj_bb">
        <dia:rectangle val="10.9055,1.18383;16.2123,2.15969"/>
      </dia:attribute>
      <dia:attribute name="text">
        <dia:composite type="text">
          <dia:attribute name="string">
            <dia:string>#declarator parsed#</dia:string>
          </dia:attribute>
          <dia:attribute name="font">
            <dia:font family="sans" style="0" name="Helvetica"/>
          </dia:attribute>
          <dia:attribute name="height">
            <dia:real val="0.80000000000000004"/>
          </dia:attribute>
          <dia:attribute name="pos">
            <dia:point val="13.55,1.78828"/>
          </dia:attribute>
          <dia:attribute name="color">
            <dia:color val="#000000"/>
          </dia:attribute>
          <dia:attribute name="alignment">
            <dia:enum val="1"/>
          </dia:attribute>
        </dia:composite>
      </dia:attribute>
    </dia:object>
    <dia:object type="Standard - Text" version="0" id="O43">
      <dia:attribute name="obj_pos">
        <dia:point val="26.4,4.16328"/>
      </dia:attribute>
      <dia:attribute name="obj_bb">
        <dia:rectangle val="26.001,3.55883;26.7812,4.53469"/>
      </dia:attribute>
      <dia:attribute name="text">
        <dia:composite type="text">
          <dia:attribute name="string">
            <dia:string>#14#</dia:string>
          </dia:attribute>
          <dia:attribute name="font">
            <dia:font family="sans" style="0" name="Helvetica"/>
          </dia:attribute>
          <dia:attribute name="height">
            <dia:real val="0.80000000000000004"/>
          </dia:attribute>
          <dia:attribute name="pos">
            <dia:point val="26.4,4.16328"/>
          </dia:attribute>
          <dia:attribute name="color">
            <dia:color val="#000000"/>
          </dia:attribute>
          <dia:attribute name="alignment">
            <dia:enum val="1"/>
          </dia:attribute>
        </dia:composite>
      </dia:attribute>
    </dia:object>
    <dia:group>
      <dia:object type="Flowchart - Box" version="0" id="O44">
        <dia:attribute name="obj_pos">
          <dia:point val="35,0"/>
        </dia:attribute>
        <dia:attribute name="obj_bb">
          <dia:rectangle val="34.95,-0.05;51.05,24.05"/>
        </dia:attribute>
        <dia:attribute name="elem_corner">
          <dia:point val="35,0"/>
        </dia:attribute>
        <dia:attribute name="elem_width">
          <dia:real val="16"/>
        </dia:attribute>
        <dia:attribute name="elem_height">
          <dia:real val="24"/>
        </dia:attribute>
        <dia:attribute name="show_background">
          <dia:boolean val="false"/>
        </dia:attribute>
        <dia:attribute name="padding">
          <dia:real val="0.5"/>
        </dia:attribute>
        <dia:attribute name="text">
          <dia:composite type="text">
            <dia:attribute name="string">
              <dia:string>##</dia:string>
            </dia:attribute>
            <dia:attribute name="font">
              <dia:font family="sans" style="0" name="Helvetica"/>
            </dia:attribute>
            <dia:attribute name="height">
              <dia:real val="0.80000000000000004"/>
            </dia:attribute>
            <dia:attribute name="pos">
              <dia:point val="43,12.1867"/>
            </dia:attribute>
            <dia:attribute name="color">
              <dia:color val="#000000"/>
            </dia:attribute>
            <dia:attribute name="alignment">
              <dia:enum val="1"/>
            </dia:attribute>
          </dia:composite>
        </dia:attribute>
      </dia:object>
      <dia:object type="Standard - ZigZagLine" version="0" id="O45">
        <dia:attribute name="obj_pos">
          <dia:point val="36,4"/>
        </dia:attribute>
        <dia:attribute name="obj_bb">
          <dia:rectangle val="36,3.95;44.0707,4.05"/>
        </dia:attribute>
        <dia:attribute name="orth_points">
          <dia:point val="36,4"/>
          <dia:point val="36,4"/>
          <dia:point val="44,4"/>
          <dia:point val="44,4"/>
        </dia:attribute>
        <dia:attribute name="orth_orient">
          <dia:enum val="0"/>
          <dia:enum val="1"/>
          <dia:enum val="0"/>
        </dia:attribute>
        <dia:attribute name="end_arrow">
          <dia:enum val="22"/>
        </dia:attribute>
        <dia:attribute name="end_arrow_length">
          <dia:real val="0.5"/>
        </dia:attribute>
        <dia:attribute name="end_arrow_width">
          <dia:real val="0.5"/>
        </dia:attribute>
      </dia:object>
      <dia:object type="Standard - ZigZagLine" version="0" id="O46">
        <dia:attribute name="obj_pos">
          <dia:point val="36,6"/>
        </dia:attribute>
        <dia:attribute name="obj_bb">
          <dia:rectangle val="36,5.95;44.0707,6.05"/>
        </dia:attribute>
        <dia:attribute name="orth_points">
          <dia:point val="36,6"/>
          <dia:point val="36,6"/>
          <dia:point val="44,6"/>
          <dia:point val="44,6"/>
        </dia:attribute>
        <dia:attribute name="orth_orient">
          <dia:enum val="0"/>
          <dia:enum val="1"/>
          <dia:enum val="0"/>
        </dia:attribute>
        <dia:attribute name="line_style">
          <dia:enum val="4"/>
        </dia:attribute>
        <dia:attribute name="end_arrow">
          <dia:enum val="22"/>
        </dia:attribute>
        <dia:attribute name="end_arrow_length">
          <dia:real val="0.5"/>
        </dia:attribute>
        <dia:attribute name="end_arrow_width">
          <dia:real val="0.5"/>
        </dia:attribute>
        <dia:attribute name="dashlength">
          <dia:real val="0.99999999999999989"/>
        </dia:attribute>
      </dia:object>
      <dia:object type="Standard - Text" version="0" id="O47">
        <dia:attribute name="obj_pos">
          <dia:point val="40,5"/>
        </dia:attribute>
        <dia:attribute name="obj_bb">
          <dia:rectangle val="37.7164,4.41328;42.2836,5.33594"/>
        </dia:attribute>
        <dia:attribute name="text">
          <dia:composite type="text">
            <dia:attribute name="string">
              <dia:string>#control passing#</dia:string>
            </dia:attribute>
            <dia:attribute name="font">
              <dia:font family="sans" style="0" name="Helvetica"/>
            </dia:attribute>
            <dia:attribute name="height">
              <dia:real val="0.80000000000000004"/>
            </dia:attribute>
            <dia:attribute name="pos">
              <dia:point val="40,5"/>
            </dia:attribute>
            <dia:attribute name="color">
              <dia:color val="#000000"/>
            </dia:attribute>
            <dia:attribute name="alignment">
              <dia:enum val="1"/>
            </dia:attribute>
          </dia:composite>
        </dia:attribute>
      </dia:object>
      <dia:object type="Standard - Text" version="0" id="O48">
        <dia:attribute name="obj_pos">
          <dia:point val="40,7"/>
        </dia:attribute>
        <dia:attribute name="obj_bb">
          <dia:rectangle val="38.0898,6.41328;41.9102,7.33594"/>
        </dia:attribute>
        <dia:attribute name="text">
          <dia:composite type="text">
            <dia:attribute name="string">
              <dia:string>#data passing#</dia:string>
            </dia:attribute>
            <dia:attribute name="font">
              <dia:font family="sans" style="0" name="Helvetica"/>
            </dia:attribute>
            <dia:attribute name="height">
              <dia:real val="0.80000000000000004"/>
            </dia:attribute>
            <dia:attribute name="pos">
              <dia:point val="40,7"/>
            </dia:attribute>
            <dia:attribute name="color">
              <dia:color val="#000000"/>
            </dia:attribute>
            <dia:attribute name="alignment">
              <dia:enum val="1"/>
            </dia:attribute>
          </dia:composite>
        </dia:attribute>
      </dia:object>
      <dia:object type="Standard - ZigZagLine" version="0" id="O49">
        <dia:attribute name="obj_pos">
          <dia:point val="36,8"/>
        </dia:attribute>
        <dia:attribute name="obj_bb">
          <dia:rectangle val="35.95,7.5;44.05,8.5"/>
        </dia:attribute>
        <dia:attribute name="orth_points">
          <dia:point val="36,8"/>
          <dia:point val="40,8"/>
          <dia:point val="40,8"/>
          <dia:point val="44,8"/>
        </dia:attribute>
        <dia:attribute name="orth_orient">
          <dia:enum val="0"/>
          <dia:enum val="1"/>
          <dia:enum val="0"/>
        </dia:attribute>
        <dia:attribute name="autorouting">
          <dia:boolean val="false"/>
        </dia:attribute>
        <dia:attribute name="line_style">
          <dia:enum val="1"/>
        </dia:attribute>
        <dia:attribute name="end_arrow">
          <dia:enum val="22"/>
        </dia:attribute>
        <dia:attribute name="end_arrow_length">
          <dia:real val="0.5"/>
        </dia:attribute>
        <dia:attribute name="end_arrow_width">
          <dia:real val="0.5"/>
        </dia:attribute>
        <dia:attribute name="dashlength">
          <dia:real val="0.99999999999999989"/>
        </dia:attribute>
      </dia:object>
      <dia:object type="Standard - Text" version="0" id="O50">
        <dia:attribute name="obj_pos">
          <dia:point val="40,9"/>
        </dia:attribute>
        <dia:attribute name="obj_bb">
          <dia:rectangle val="37.5273,8.41328;42.4727,10.1359"/>
        </dia:attribute>
        <dia:attribute name="text">
          <dia:composite type="text">
            <dia:attribute name="string">
              <dia:string>#data and control
passing#</dia:string>
            </dia:attribute>
            <dia:attribute name="font">
              <dia:font family="sans" style="0" name="Helvetica"/>
            </dia:attribute>
            <dia:attribute name="height">
              <dia:real val="0.80000000000000004"/>
            </dia:attribute>
            <dia:attribute name="pos">
              <dia:point val="40,9"/>
            </dia:attribute>
            <dia:attribute name="color">
              <dia:color val="#000000"/>
            </dia:attribute>
            <dia:attribute name="alignment">
              <dia:enum val="1"/>
            </dia:attribute>
          </dia:composite>
        </dia:attribute>
      </dia:object>
      <dia:object type="Standard - Text" version="0" id="O51">
        <dia:attribute name="obj_pos">
          <dia:point val="43,2"/>
        </dia:attribute>
        <dia:attribute name="obj_bb">
          <dia:rectangle val="40.0164,0.533594;45.9836,2.83984"/>
        </dia:attribute>
        <dia:attribute name="text">
          <dia:composite type="text">
            <dia:attribute name="string">
              <dia:string>#LEGEND#</dia:string>
            </dia:attribute>
            <dia:attribute name="font">
              <dia:font family="sans" style="0" name="Helvetica"/>
            </dia:attribute>
            <dia:attribute name="height">
              <dia:real val="2"/>
            </dia:attribute>
            <dia:attribute name="pos">
              <dia:point val="43,2"/>
            </dia:attribute>
            <dia:attribute name="color">
              <dia:color val="#000000"/>
            </dia:attribute>
            <dia:attribute name="alignment">
              <dia:enum val="1"/>
            </dia:attribute>
          </dia:composite>
        </dia:attribute>
      </dia:object>
      <dia:object type="Flowchart - Box" version="0" id="O52">
        <dia:attribute name="obj_pos">
          <dia:point val="46,3"/>
        </dia:attribute>
        <dia:attribute name="obj_bb">
          <dia:rectangle val="45.95,2.95;50.05,6.05"/>
        </dia:attribute>
        <dia:attribute name="elem_corner">
          <dia:point val="46,3"/>
        </dia:attribute>
        <dia:attribute name="elem_width">
          <dia:real val="4"/>
        </dia:attribute>
        <dia:attribute name="elem_height">
          <dia:real val="3"/>
        </dia:attribute>
        <dia:attribute name="show_background">
          <dia:boolean val="false"/>
        </dia:attribute>
        <dia:attribute name="padding">
          <dia:real val="0.5"/>
        </dia:attribute>
        <dia:attribute name="text">
          <dia:composite type="text">
            <dia:attribute name="string">
              <dia:string>#process#</dia:string>
            </dia:attribute>
            <dia:attribute name="font">
              <dia:font family="sans" style="0" name="Helvetica"/>
            </dia:attribute>
            <dia:attribute name="height">
              <dia:real val="0.80000000000000004"/>
            </dia:attribute>
            <dia:attribute name="pos">
              <dia:point val="48,4.68672"/>
            </dia:attribute>
            <dia:attribute name="color">
              <dia:color val="#000000"/>
            </dia:attribute>
            <dia:attribute name="alignment">
              <dia:enum val="1"/>
            </dia:attribute>
          </dia:composite>
        </dia:attribute>
      </dia:object>
      <dia:object type="Flowchart - Internal Storage" version="0" id="O53">
        <dia:attribute name="obj_pos">
          <dia:point val="46,7"/>
        </dia:attribute>
        <dia:attribute name="obj_bb">
          <dia:rectangle val="45.95,6.95;50.05,10.05"/>
        </dia:attribute>
        <dia:attribute name="elem_corner">
          <dia:point val="46,7"/>
        </dia:attribute>
        <dia:attribute name="elem_width">
          <dia:real val="4"/>
        </dia:attribute>
        <dia:attribute name="elem_height">
          <dia:real val="3"/>
        </dia:attribute>
        <dia:attribute name="line_width">
          <dia:real val="0.10000000000000001"/>
        </dia:attribute>
        <dia:attribute name="line_colour">
          <dia:color val="#000000"/>
        </dia:attribute>
        <dia:attribute name="fill_colour">
          <dia:color val="#ffffff"/>
        </dia:attribute>
        <dia:attribute name="show_background">
          <dia:boolean val="false"/>
        </dia:attribute>
        <dia:attribute name="line_style">
          <dia:enum val="0"/>
          <dia:real val="1"/>
        </dia:attribute>
        <dia:attribute name="text">
          <dia:composite type="text">
            <dia:attribute name="string">
              <dia:string>#storage#</dia:string>
            </dia:attribute>
            <dia:attribute name="font">
              <dia:font family="sans" style="0" name="Helvetica"/>
            </dia:attribute>
            <dia:attribute name="height">
              <dia:real val="0.80000000000000004"/>
            </dia:attribute>
            <dia:attribute name="pos">
              <dia:point val="48.2,8.83672"/>
            </dia:attribute>
            <dia:attribute name="color">
              <dia:color val="#000000"/>
            </dia:attribute>
            <dia:attribute name="alignment">
              <dia:enum val="1"/>
            </dia:attribute>
          </dia:composite>
        </dia:attribute>
        <dia:attribute name="flip_horizontal">
          <dia:boolean val="false"/>
        </dia:attribute>
        <dia:attribute name="flip_vertical">
          <dia:boolean val="false"/>
        </dia:attribute>
      </dia:object>
      <dia:object type="Standard - Text" version="0" id="O54">
        <dia:attribute name="obj_pos">
          <dia:point val="36,13"/>
        </dia:attribute>
        <dia:attribute name="obj_bb">
          <dia:rectangle val="36,12.4133;36,13.3359"/>
        </dia:attribute>
        <dia:attribute name="text">
          <dia:composite type="text">
            <dia:attribute name="string">
              <dia:string>##</dia:string>
            </dia:attribute>
            <dia:attribute name="font">
              <dia:font family="sans" style="0" name="Helvetica"/>
            </dia:attribute>
            <dia:attribute name="height">
              <dia:real val="0.80000000000000004"/>
            </dia:attribute>
            <dia:attribute name="pos">
              <dia:point val="36,13"/>
            </dia:attribute>
            <dia:attribute name="color">
              <dia:color val="#000000"/>
            </dia:attribute>
            <dia:attribute name="alignment">
              <dia:enum val="1"/>
            </dia:attribute>
          </dia:composite>
        </dia:attribute>
      </dia:object>
      <dia:object type="Standard - Text" version="0" id="O55">
        <dia:attribute name="obj_pos">
          <dia:point val="36,12"/>
        </dia:attribute>
        <dia:attribute name="obj_bb">
          <dia:rectangle val="36,11.4133;50.1781,22.7359"/>
        </dia:attribute>
        <dia:attribute name="text">
          <dia:composite type="text">
            <dia:attribute name="string">
              <dia:string>#1 preprocessed and tokenized source to parser
2 declarator specifier sequence is saved
3 declarator specifier sequence is retrieved
4 DSS iprocessing starts
5 processed DSS
6 DTR processing starts
7 processed DTR type
8 process single DS
9 flags from single DS
10 one DTR processing
11 type and flags
12 lookup for previous declarations
13 found declarations
14 previous declaration or error signal#</dia:string>
            </dia:attribute>
            <dia:attribute name="font">
              <dia:font family="sans" style="0" name="Helvetica"/>
            </dia:attribute>
            <dia:attribute name="height">
              <dia:real val="0.80000000000000004"/>
            </dia:attribute>
            <dia:attribute name="pos">
              <dia:point val="36,12"/>
            </dia:attribute>
            <dia:attribute name="color">
              <dia:color val="#000000"/>
            </dia:attribute>
            <dia:attribute name="alignment">
              <dia:enum val="0"/>
            </dia:attribute>
          </dia:composite>
        </dia:attribute>
      </dia:object>
    </dia:group>
  </dia:layer>
</dia:diagram>
