<?xml version="1.0" encoding="UTF-8"?>
<dia:diagram xmlns:dia="http://www.lysator.liu.se/~alla/dia/">
  <dia:diagramdata>
    <dia:attribute name="background">
      <dia:color val="#ffffff"/>
    </dia:attribute>
    <dia:attribute name="pagebreak">
      <dia:color val="#000099"/>
    </dia:attribute>
    <dia:attribute name="paper">
      <dia:composite type="paper">
        <dia:attribute name="name">
          <dia:string>#A4#</dia:string>
        </dia:attribute>
        <dia:attribute name="tmargin">
          <dia:real val="2.8222"/>
        </dia:attribute>
        <dia:attribute name="bmargin">
          <dia:real val="2.8222"/>
        </dia:attribute>
        <dia:attribute name="lmargin">
          <dia:real val="2.8222"/>
        </dia:attribute>
        <dia:attribute name="rmargin">
          <dia:real val="2.8222"/>
        </dia:attribute>
        <dia:attribute name="is_portrait">
          <dia:boolean val="true"/>
        </dia:attribute>
        <dia:attribute name="scaling">
          <dia:real val="1"/>
        </dia:attribute>
        <dia:attribute name="fitto">
          <dia:boolean val="false"/>
        </dia:attribute>
      </dia:composite>
    </dia:attribute>
    <dia:attribute name="grid">
      <dia:composite type="grid">
        <dia:attribute name="width_x">
          <dia:real val="1"/>
        </dia:attribute>
        <dia:attribute name="width_y">
          <dia:real val="1"/>
        </dia:attribute>
        <dia:attribute name="visible_x">
          <dia:int val="1"/>
        </dia:attribute>
        <dia:attribute name="visible_y">
          <dia:int val="1"/>
        </dia:attribute>
        <dia:composite type="color"/>
      </dia:composite>
    </dia:attribute>
    <dia:attribute name="color">
      <dia:color val="#d8e5e5"/>
    </dia:attribute>
    <dia:attribute name="guides">
      <dia:composite type="guides">
        <dia:attribute name="hguides"/>
        <dia:attribute name="vguides"/>
      </dia:composite>
    </dia:attribute>
  </dia:diagramdata>
  <dia:layer name="Background" visible="true">
    <dia:object type="UML - Note" version="0" id="O0">
      <dia:attribute name="obj_pos">
        <dia:point val="-7.79021,1.44225"/>
      </dia:attribute>
      <dia:attribute name="obj_bb">
        <dia:rectangle val="-7.84021,1.39225;37.2598,33.5922"/>
      </dia:attribute>
      <dia:attribute name="elem_corner">
        <dia:point val="-7.79021,1.44225"/>
      </dia:attribute>
      <dia:attribute name="elem_width">
        <dia:real val="45"/>
      </dia:attribute>
      <dia:attribute name="elem_height">
        <dia:real val="32.1"/>
      </dia:attribute>
      <dia:attribute name="line_colour">
        <dia:color val="#000000"/>
      </dia:attribute>
      <dia:attribute name="fill_colour">
        <dia:color val="#ffffff"/>
      </dia:attribute>
      <dia:attribute name="text">
        <dia:composite type="text">
          <dia:attribute name="string">
            <dia:string>#       ss layer              pi layer
    {
      if(i)                    bf PSP3   
           {
                                 ...
           }
        else                   ba DSP1
             {
                                
             }                   ...
                                          
    }
                                          #</dia:string>
          </dia:attribute>
          <dia:attribute name="font">
            <dia:font family="monospace" style="0" name="Courier"/>
          </dia:attribute>
          <dia:attribute name="height">
            <dia:real val="2.4"/>
          </dia:attribute>
          <dia:attribute name="pos">
            <dia:point val="-7.44021,3.74225"/>
          </dia:attribute>
          <dia:attribute name="color">
            <dia:color val="#000000"/>
          </dia:attribute>
          <dia:attribute name="alignment">
            <dia:enum val="0"/>
          </dia:attribute>
        </dia:composite>
      </dia:attribute>
    </dia:object>
    <dia:object type="SDL - Service" version="0" id="O1">
      <dia:attribute name="obj_pos">
        <dia:point val="-7.35388,4.54421"/>
      </dia:attribute>
      <dia:attribute name="obj_bb">
        <dia:rectangle val="-7.40388,4.49421;-3.545,6.72022"/>
      </dia:attribute>
      <dia:attribute name="elem_corner">
        <dia:point val="-7.35388,4.54421"/>
      </dia:attribute>
      <dia:attribute name="elem_width">
        <dia:real val="3.75888"/>
      </dia:attribute>
      <dia:attribute name="elem_height">
        <dia:real val="2.12601"/>
      </dia:attribute>
      <dia:attribute name="line_width">
        <dia:real val="0.1"/>
      </dia:attribute>
      <dia:attribute name="line_colour">
        <dia:color val="#000000"/>
      </dia:attribute>
      <dia:attribute name="fill_colour">
        <dia:color val="#ffffff"/>
      </dia:attribute>
      <dia:attribute name="show_background">
        <dia:boolean val="true"/>
      </dia:attribute>
      <dia:attribute name="line_style">
        <dia:enum val="0"/>
        <dia:real val="1"/>
      </dia:attribute>
      <dia:attribute name="text">
        <dia:composite type="text">
          <dia:attribute name="string">
            <dia:string>#PSP1#</dia:string>
          </dia:attribute>
          <dia:attribute name="font">
            <dia:font family="sans" style="80" name="Helvetica"/>
          </dia:attribute>
          <dia:attribute name="height">
            <dia:real val="1"/>
          </dia:attribute>
          <dia:attribute name="pos">
            <dia:point val="-5.47444,5.95721"/>
          </dia:attribute>
          <dia:attribute name="color">
            <dia:color val="#000000"/>
          </dia:attribute>
          <dia:attribute name="alignment">
            <dia:enum val="1"/>
          </dia:attribute>
        </dia:composite>
      </dia:attribute>
      <dia:attribute name="flip_horizontal">
        <dia:boolean val="false"/>
      </dia:attribute>
      <dia:attribute name="flip_vertical">
        <dia:boolean val="false"/>
      </dia:attribute>
    </dia:object>
    <dia:object type="SDL - Service" version="0" id="O2">
      <dia:attribute name="obj_pos">
        <dia:point val="-7.38843,28.7116"/>
      </dia:attribute>
      <dia:attribute name="obj_bb">
        <dia:rectangle val="-7.43843,28.6616;-3.51705,30.8876"/>
      </dia:attribute>
      <dia:attribute name="elem_corner">
        <dia:point val="-7.38843,28.7116"/>
      </dia:attribute>
      <dia:attribute name="elem_width">
        <dia:real val="3.82138"/>
      </dia:attribute>
      <dia:attribute name="elem_height">
        <dia:real val="2.12601"/>
      </dia:attribute>
      <dia:attribute name="line_width">
        <dia:real val="0.1"/>
      </dia:attribute>
      <dia:attribute name="line_colour">
        <dia:color val="#000000"/>
      </dia:attribute>
      <dia:attribute name="fill_colour">
        <dia:color val="#ffffff"/>
      </dia:attribute>
      <dia:attribute name="show_background">
        <dia:boolean val="true"/>
      </dia:attribute>
      <dia:attribute name="line_style">
        <dia:enum val="0"/>
        <dia:real val="1"/>
      </dia:attribute>
      <dia:attribute name="text">
        <dia:composite type="text">
          <dia:attribute name="string">
            <dia:string>#DSP1#</dia:string>
          </dia:attribute>
          <dia:attribute name="font">
            <dia:font family="sans" style="80" name="Helvetica"/>
          </dia:attribute>
          <dia:attribute name="height">
            <dia:real val="1"/>
          </dia:attribute>
          <dia:attribute name="pos">
            <dia:point val="-5.47774,30.1246"/>
          </dia:attribute>
          <dia:attribute name="color">
            <dia:color val="#000000"/>
          </dia:attribute>
          <dia:attribute name="alignment">
            <dia:enum val="1"/>
          </dia:attribute>
        </dia:composite>
      </dia:attribute>
      <dia:attribute name="flip_horizontal">
        <dia:boolean val="false"/>
      </dia:attribute>
      <dia:attribute name="flip_vertical">
        <dia:boolean val="false"/>
      </dia:attribute>
    </dia:object>
    <dia:object type="SDL - Service" version="0" id="O3">
      <dia:attribute name="obj_pos">
        <dia:point val="-1.93592,28.6823"/>
      </dia:attribute>
      <dia:attribute name="obj_bb">
        <dia:rectangle val="-1.98592,28.6323;1.93546,30.8583"/>
      </dia:attribute>
      <dia:attribute name="elem_corner">
        <dia:point val="-1.93592,28.6823"/>
      </dia:attribute>
      <dia:attribute name="elem_width">
        <dia:real val="3.82138"/>
      </dia:attribute>
      <dia:attribute name="elem_height">
        <dia:real val="2.12601"/>
      </dia:attribute>
      <dia:attribute name="line_width">
        <dia:real val="0.1"/>
      </dia:attribute>
      <dia:attribute name="line_colour">
        <dia:color val="#000000"/>
      </dia:attribute>
      <dia:attribute name="fill_colour">
        <dia:color val="#ffffff"/>
      </dia:attribute>
      <dia:attribute name="show_background">
        <dia:boolean val="true"/>
      </dia:attribute>
      <dia:attribute name="line_style">
        <dia:enum val="0"/>
        <dia:real val="1"/>
      </dia:attribute>
      <dia:attribute name="text">
        <dia:composite type="text">
          <dia:attribute name="string">
            <dia:string>#NSP1#</dia:string>
          </dia:attribute>
          <dia:attribute name="font">
            <dia:font family="sans" style="80" name="Helvetica"/>
          </dia:attribute>
          <dia:attribute name="height">
            <dia:real val="1"/>
          </dia:attribute>
          <dia:attribute name="pos">
            <dia:point val="-0.02523,30.0953"/>
          </dia:attribute>
          <dia:attribute name="color">
            <dia:color val="#000000"/>
          </dia:attribute>
          <dia:attribute name="alignment">
            <dia:enum val="1"/>
          </dia:attribute>
        </dia:composite>
      </dia:attribute>
      <dia:attribute name="flip_horizontal">
        <dia:boolean val="false"/>
      </dia:attribute>
      <dia:attribute name="flip_vertical">
        <dia:boolean val="false"/>
      </dia:attribute>
    </dia:object>
    <dia:object type="SDL - Service" version="0" id="O4">
      <dia:attribute name="obj_pos">
        <dia:point val="-0.607358,9.4047"/>
      </dia:attribute>
      <dia:attribute name="obj_bb">
        <dia:rectangle val="-0.657358,9.3547;3.20153,11.5807"/>
      </dia:attribute>
      <dia:attribute name="elem_corner">
        <dia:point val="-0.607358,9.4047"/>
      </dia:attribute>
      <dia:attribute name="elem_width">
        <dia:real val="3.75888"/>
      </dia:attribute>
      <dia:attribute name="elem_height">
        <dia:real val="2.12601"/>
      </dia:attribute>
      <dia:attribute name="line_width">
        <dia:real val="0.1"/>
      </dia:attribute>
      <dia:attribute name="line_colour">
        <dia:color val="#000000"/>
      </dia:attribute>
      <dia:attribute name="fill_colour">
        <dia:color val="#ffffff"/>
      </dia:attribute>
      <dia:attribute name="show_background">
        <dia:boolean val="true"/>
      </dia:attribute>
      <dia:attribute name="line_style">
        <dia:enum val="0"/>
        <dia:real val="1"/>
      </dia:attribute>
      <dia:attribute name="text">
        <dia:composite type="text">
          <dia:attribute name="string">
            <dia:string>#PSP2#</dia:string>
          </dia:attribute>
          <dia:attribute name="font">
            <dia:font family="sans" style="80" name="Helvetica"/>
          </dia:attribute>
          <dia:attribute name="height">
            <dia:real val="1"/>
          </dia:attribute>
          <dia:attribute name="pos">
            <dia:point val="1.27208,10.8177"/>
          </dia:attribute>
          <dia:attribute name="color">
            <dia:color val="#000000"/>
          </dia:attribute>
          <dia:attribute name="alignment">
            <dia:enum val="1"/>
          </dia:attribute>
        </dia:composite>
      </dia:attribute>
      <dia:attribute name="flip_horizontal">
        <dia:boolean val="false"/>
      </dia:attribute>
      <dia:attribute name="flip_vertical">
        <dia:boolean val="false"/>
      </dia:attribute>
    </dia:object>
    <dia:object type="SDL - Service" version="0" id="O5">
      <dia:attribute name="obj_pos">
        <dia:point val="-0.536636,14.2137"/>
      </dia:attribute>
      <dia:attribute name="obj_bb">
        <dia:rectangle val="-0.586636,14.1637;3.33475,16.3897"/>
      </dia:attribute>
      <dia:attribute name="elem_corner">
        <dia:point val="-0.536636,14.2137"/>
      </dia:attribute>
      <dia:attribute name="elem_width">
        <dia:real val="3.82138"/>
      </dia:attribute>
      <dia:attribute name="elem_height">
        <dia:real val="2.12601"/>
      </dia:attribute>
      <dia:attribute name="line_width">
        <dia:real val="0.1"/>
      </dia:attribute>
      <dia:attribute name="line_colour">
        <dia:color val="#000000"/>
      </dia:attribute>
      <dia:attribute name="fill_colour">
        <dia:color val="#ffffff"/>
      </dia:attribute>
      <dia:attribute name="show_background">
        <dia:boolean val="true"/>
      </dia:attribute>
      <dia:attribute name="line_style">
        <dia:enum val="0"/>
        <dia:real val="1"/>
      </dia:attribute>
      <dia:attribute name="text">
        <dia:composite type="text">
          <dia:attribute name="string">
            <dia:string>#DSP2#</dia:string>
          </dia:attribute>
          <dia:attribute name="font">
            <dia:font family="sans" style="80" name="Helvetica"/>
          </dia:attribute>
          <dia:attribute name="height">
            <dia:real val="1"/>
          </dia:attribute>
          <dia:attribute name="pos">
            <dia:point val="1.37406,15.6267"/>
          </dia:attribute>
          <dia:attribute name="color">
            <dia:color val="#000000"/>
          </dia:attribute>
          <dia:attribute name="alignment">
            <dia:enum val="1"/>
          </dia:attribute>
        </dia:composite>
      </dia:attribute>
      <dia:attribute name="flip_horizontal">
        <dia:boolean val="false"/>
      </dia:attribute>
      <dia:attribute name="flip_vertical">
        <dia:boolean val="false"/>
      </dia:attribute>
    </dia:object>
    <dia:object type="SDL - Service" version="0" id="O6">
      <dia:attribute name="obj_pos">
        <dia:point val="5.26747,14.2137"/>
      </dia:attribute>
      <dia:attribute name="obj_bb">
        <dia:rectangle val="5.21747,14.1637;9.13885,16.3897"/>
      </dia:attribute>
      <dia:attribute name="elem_corner">
        <dia:point val="5.26747,14.2137"/>
      </dia:attribute>
      <dia:attribute name="elem_width">
        <dia:real val="3.82138"/>
      </dia:attribute>
      <dia:attribute name="elem_height">
        <dia:real val="2.12601"/>
      </dia:attribute>
      <dia:attribute name="line_width">
        <dia:real val="0.1"/>
      </dia:attribute>
      <dia:attribute name="line_colour">
        <dia:color val="#000000"/>
      </dia:attribute>
      <dia:attribute name="fill_colour">
        <dia:color val="#ffffff"/>
      </dia:attribute>
      <dia:attribute name="show_background">
        <dia:boolean val="true"/>
      </dia:attribute>
      <dia:attribute name="line_style">
        <dia:enum val="0"/>
        <dia:real val="1"/>
      </dia:attribute>
      <dia:attribute name="text">
        <dia:composite type="text">
          <dia:attribute name="string">
            <dia:string>#NSP2#</dia:string>
          </dia:attribute>
          <dia:attribute name="font">
            <dia:font family="sans" style="80" name="Helvetica"/>
          </dia:attribute>
          <dia:attribute name="height">
            <dia:real val="1"/>
          </dia:attribute>
          <dia:attribute name="pos">
            <dia:point val="7.17816,15.6267"/>
          </dia:attribute>
          <dia:attribute name="color">
            <dia:color val="#000000"/>
          </dia:attribute>
          <dia:attribute name="alignment">
            <dia:enum val="1"/>
          </dia:attribute>
        </dia:composite>
      </dia:attribute>
      <dia:attribute name="flip_horizontal">
        <dia:boolean val="false"/>
      </dia:attribute>
      <dia:attribute name="flip_vertical">
        <dia:boolean val="false"/>
      </dia:attribute>
    </dia:object>
    <dia:object type="SDL - Service" version="0" id="O7">
      <dia:attribute name="obj_pos">
        <dia:point val="1.41395,18.8814"/>
      </dia:attribute>
      <dia:attribute name="obj_bb">
        <dia:rectangle val="1.36395,18.8314;5.22283,21.0574"/>
      </dia:attribute>
      <dia:attribute name="elem_corner">
        <dia:point val="1.41395,18.8814"/>
      </dia:attribute>
      <dia:attribute name="elem_width">
        <dia:real val="3.75888"/>
      </dia:attribute>
      <dia:attribute name="elem_height">
        <dia:real val="2.12601"/>
      </dia:attribute>
      <dia:attribute name="line_width">
        <dia:real val="0.1"/>
      </dia:attribute>
      <dia:attribute name="line_colour">
        <dia:color val="#000000"/>
      </dia:attribute>
      <dia:attribute name="fill_colour">
        <dia:color val="#ffffff"/>
      </dia:attribute>
      <dia:attribute name="show_background">
        <dia:boolean val="true"/>
      </dia:attribute>
      <dia:attribute name="line_style">
        <dia:enum val="0"/>
        <dia:real val="1"/>
      </dia:attribute>
      <dia:attribute name="text">
        <dia:composite type="text">
          <dia:attribute name="string">
            <dia:string>#PSP3#</dia:string>
          </dia:attribute>
          <dia:attribute name="font">
            <dia:font family="sans" style="80" name="Helvetica"/>
          </dia:attribute>
          <dia:attribute name="height">
            <dia:real val="1"/>
          </dia:attribute>
          <dia:attribute name="pos">
            <dia:point val="3.29339,20.2944"/>
          </dia:attribute>
          <dia:attribute name="color">
            <dia:color val="#000000"/>
          </dia:attribute>
          <dia:attribute name="alignment">
            <dia:enum val="1"/>
          </dia:attribute>
        </dia:composite>
      </dia:attribute>
      <dia:attribute name="flip_horizontal">
        <dia:boolean val="false"/>
      </dia:attribute>
      <dia:attribute name="flip_vertical">
        <dia:boolean val="false"/>
      </dia:attribute>
    </dia:object>
    <dia:object type="SDL - Service" version="0" id="O8">
      <dia:attribute name="obj_pos">
        <dia:point val="1.44356,23.6904"/>
      </dia:attribute>
      <dia:attribute name="obj_bb">
        <dia:rectangle val="1.39356,23.6404;5.31494,25.8664"/>
      </dia:attribute>
      <dia:attribute name="elem_corner">
        <dia:point val="1.44356,23.6904"/>
      </dia:attribute>
      <dia:attribute name="elem_width">
        <dia:real val="3.82138"/>
      </dia:attribute>
      <dia:attribute name="elem_height">
        <dia:real val="2.12601"/>
      </dia:attribute>
      <dia:attribute name="line_width">
        <dia:real val="0.1"/>
      </dia:attribute>
      <dia:attribute name="line_colour">
        <dia:color val="#000000"/>
      </dia:attribute>
      <dia:attribute name="fill_colour">
        <dia:color val="#ffffff"/>
      </dia:attribute>
      <dia:attribute name="show_background">
        <dia:boolean val="true"/>
      </dia:attribute>
      <dia:attribute name="line_style">
        <dia:enum val="0"/>
        <dia:real val="1"/>
      </dia:attribute>
      <dia:attribute name="text">
        <dia:composite type="text">
          <dia:attribute name="string">
            <dia:string>#DSP3#</dia:string>
          </dia:attribute>
          <dia:attribute name="font">
            <dia:font family="sans" style="80" name="Helvetica"/>
          </dia:attribute>
          <dia:attribute name="height">
            <dia:real val="1"/>
          </dia:attribute>
          <dia:attribute name="pos">
            <dia:point val="3.35425,25.1034"/>
          </dia:attribute>
          <dia:attribute name="color">
            <dia:color val="#000000"/>
          </dia:attribute>
          <dia:attribute name="alignment">
            <dia:enum val="1"/>
          </dia:attribute>
        </dia:composite>
      </dia:attribute>
      <dia:attribute name="flip_horizontal">
        <dia:boolean val="false"/>
      </dia:attribute>
      <dia:attribute name="flip_vertical">
        <dia:boolean val="false"/>
      </dia:attribute>
    </dia:object>
    <dia:object type="SDL - Service" version="0" id="O9">
      <dia:attribute name="obj_pos">
        <dia:point val="7.55622,23.9611"/>
      </dia:attribute>
      <dia:attribute name="obj_bb">
        <dia:rectangle val="7.50622,23.9111;11.4276,26.1371"/>
      </dia:attribute>
      <dia:attribute name="elem_corner">
        <dia:point val="7.55622,23.9611"/>
      </dia:attribute>
      <dia:attribute name="elem_width">
        <dia:real val="3.82138"/>
      </dia:attribute>
      <dia:attribute name="elem_height">
        <dia:real val="2.12601"/>
      </dia:attribute>
      <dia:attribute name="line_width">
        <dia:real val="0.1"/>
      </dia:attribute>
      <dia:attribute name="line_colour">
        <dia:color val="#000000"/>
      </dia:attribute>
      <dia:attribute name="fill_colour">
        <dia:color val="#ffffff"/>
      </dia:attribute>
      <dia:attribute name="show_background">
        <dia:boolean val="true"/>
      </dia:attribute>
      <dia:attribute name="line_style">
        <dia:enum val="0"/>
        <dia:real val="1"/>
      </dia:attribute>
      <dia:attribute name="text">
        <dia:composite type="text">
          <dia:attribute name="string">
            <dia:string>#NSP3#</dia:string>
          </dia:attribute>
          <dia:attribute name="font">
            <dia:font family="sans" style="80" name="Helvetica"/>
          </dia:attribute>
          <dia:attribute name="height">
            <dia:real val="1"/>
          </dia:attribute>
          <dia:attribute name="pos">
            <dia:point val="9.46691,25.3741"/>
          </dia:attribute>
          <dia:attribute name="color">
            <dia:color val="#000000"/>
          </dia:attribute>
          <dia:attribute name="alignment">
            <dia:enum val="1"/>
          </dia:attribute>
        </dia:composite>
      </dia:attribute>
      <dia:attribute name="flip_horizontal">
        <dia:boolean val="false"/>
      </dia:attribute>
      <dia:attribute name="flip_vertical">
        <dia:boolean val="false"/>
      </dia:attribute>
    </dia:object>
    <dia:object type="SDL - Service" version="0" id="O10">
      <dia:attribute name="obj_pos">
        <dia:point val="-5.62857,6.85873"/>
      </dia:attribute>
      <dia:attribute name="obj_bb">
        <dia:rectangle val="-5.67857,6.80873;-1.81969,9.03474"/>
      </dia:attribute>
      <dia:attribute name="elem_corner">
        <dia:point val="-5.62857,6.85873"/>
      </dia:attribute>
      <dia:attribute name="elem_width">
        <dia:real val="3.75888"/>
      </dia:attribute>
      <dia:attribute name="elem_height">
        <dia:real val="2.12601"/>
      </dia:attribute>
      <dia:attribute name="line_width">
        <dia:real val="0.1"/>
      </dia:attribute>
      <dia:attribute name="line_colour">
        <dia:color val="#000000"/>
      </dia:attribute>
      <dia:attribute name="fill_colour">
        <dia:color val="#ffffff"/>
      </dia:attribute>
      <dia:attribute name="show_background">
        <dia:boolean val="true"/>
      </dia:attribute>
      <dia:attribute name="line_style">
        <dia:enum val="0"/>
        <dia:real val="1"/>
      </dia:attribute>
      <dia:attribute name="text">
        <dia:composite type="text">
          <dia:attribute name="string">
            <dia:string>#PSPi#</dia:string>
          </dia:attribute>
          <dia:attribute name="font">
            <dia:font family="sans" style="80" name="Helvetica"/>
          </dia:attribute>
          <dia:attribute name="height">
            <dia:real val="1"/>
          </dia:attribute>
          <dia:attribute name="pos">
            <dia:point val="-3.74913,8.27173"/>
          </dia:attribute>
          <dia:attribute name="color">
            <dia:color val="#000000"/>
          </dia:attribute>
          <dia:attribute name="alignment">
            <dia:enum val="1"/>
          </dia:attribute>
        </dia:composite>
      </dia:attribute>
      <dia:attribute name="flip_horizontal">
        <dia:boolean val="false"/>
      </dia:attribute>
      <dia:attribute name="flip_vertical">
        <dia:boolean val="false"/>
      </dia:attribute>
    </dia:object>
    <dia:object type="SDL - Service" version="0" id="O11">
      <dia:attribute name="obj_pos">
        <dia:point val="4.99117,7.05017"/>
      </dia:attribute>
      <dia:attribute name="obj_bb">
        <dia:rectangle val="4.94117,7.00017;8.86255,9.22618"/>
      </dia:attribute>
      <dia:attribute name="elem_corner">
        <dia:point val="4.99117,7.05017"/>
      </dia:attribute>
      <dia:attribute name="elem_width">
        <dia:real val="3.82138"/>
      </dia:attribute>
      <dia:attribute name="elem_height">
        <dia:real val="2.12601"/>
      </dia:attribute>
      <dia:attribute name="line_width">
        <dia:real val="0.1"/>
      </dia:attribute>
      <dia:attribute name="line_colour">
        <dia:color val="#000000"/>
      </dia:attribute>
      <dia:attribute name="fill_colour">
        <dia:color val="#ffffff"/>
      </dia:attribute>
      <dia:attribute name="show_background">
        <dia:boolean val="true"/>
      </dia:attribute>
      <dia:attribute name="line_style">
        <dia:enum val="0"/>
        <dia:real val="1"/>
      </dia:attribute>
      <dia:attribute name="text">
        <dia:composite type="text">
          <dia:attribute name="string">
            <dia:string>#NSPi#</dia:string>
          </dia:attribute>
          <dia:attribute name="font">
            <dia:font family="sans" style="80" name="Helvetica"/>
          </dia:attribute>
          <dia:attribute name="height">
            <dia:real val="1"/>
          </dia:attribute>
          <dia:attribute name="pos">
            <dia:point val="6.90186,8.46317"/>
          </dia:attribute>
          <dia:attribute name="color">
            <dia:color val="#000000"/>
          </dia:attribute>
          <dia:attribute name="alignment">
            <dia:enum val="1"/>
          </dia:attribute>
        </dia:composite>
      </dia:attribute>
      <dia:attribute name="flip_horizontal">
        <dia:boolean val="false"/>
      </dia:attribute>
      <dia:attribute name="flip_vertical">
        <dia:boolean val="false"/>
      </dia:attribute>
    </dia:object>
    <dia:object type="SDL - Service" version="0" id="O12">
      <dia:attribute name="obj_pos">
        <dia:point val="19.6694,6.75873"/>
      </dia:attribute>
      <dia:attribute name="obj_bb">
        <dia:rectangle val="19.6194,6.70873;23.4783,8.93474"/>
      </dia:attribute>
      <dia:attribute name="elem_corner">
        <dia:point val="19.6694,6.75873"/>
      </dia:attribute>
      <dia:attribute name="elem_width">
        <dia:real val="3.75888"/>
      </dia:attribute>
      <dia:attribute name="elem_height">
        <dia:real val="2.12601"/>
      </dia:attribute>
      <dia:attribute name="line_width">
        <dia:real val="0.1"/>
      </dia:attribute>
      <dia:attribute name="line_colour">
        <dia:color val="#000000"/>
      </dia:attribute>
      <dia:attribute name="fill_colour">
        <dia:color val="#ffffff"/>
      </dia:attribute>
      <dia:attribute name="show_background">
        <dia:boolean val="true"/>
      </dia:attribute>
      <dia:attribute name="line_style">
        <dia:enum val="0"/>
        <dia:real val="1"/>
      </dia:attribute>
      <dia:attribute name="text">
        <dia:composite type="text">
          <dia:attribute name="string">
            <dia:string>#PSPi#</dia:string>
          </dia:attribute>
          <dia:attribute name="font">
            <dia:font family="sans" style="80" name="Helvetica"/>
          </dia:attribute>
          <dia:attribute name="height">
            <dia:real val="1"/>
          </dia:attribute>
          <dia:attribute name="pos">
            <dia:point val="21.5488,8.17174"/>
          </dia:attribute>
          <dia:attribute name="color">
            <dia:color val="#000000"/>
          </dia:attribute>
          <dia:attribute name="alignment">
            <dia:enum val="1"/>
          </dia:attribute>
        </dia:composite>
      </dia:attribute>
      <dia:attribute name="flip_horizontal">
        <dia:boolean val="false"/>
      </dia:attribute>
      <dia:attribute name="flip_vertical">
        <dia:boolean val="false"/>
      </dia:attribute>
    </dia:object>
    <dia:object type="SDL - Service" version="0" id="O13">
      <dia:attribute name="obj_pos">
        <dia:point val="31.4772,6.96729"/>
      </dia:attribute>
      <dia:attribute name="obj_bb">
        <dia:rectangle val="31.4272,6.91729;35.3486,9.1433"/>
      </dia:attribute>
      <dia:attribute name="elem_corner">
        <dia:point val="31.4772,6.96729"/>
      </dia:attribute>
      <dia:attribute name="elem_width">
        <dia:real val="3.82138"/>
      </dia:attribute>
      <dia:attribute name="elem_height">
        <dia:real val="2.12601"/>
      </dia:attribute>
      <dia:attribute name="line_width">
        <dia:real val="0.1"/>
      </dia:attribute>
      <dia:attribute name="line_colour">
        <dia:color val="#000000"/>
      </dia:attribute>
      <dia:attribute name="fill_colour">
        <dia:color val="#ffffff"/>
      </dia:attribute>
      <dia:attribute name="show_background">
        <dia:boolean val="true"/>
      </dia:attribute>
      <dia:attribute name="line_style">
        <dia:enum val="0"/>
        <dia:real val="1"/>
      </dia:attribute>
      <dia:attribute name="text">
        <dia:composite type="text">
          <dia:attribute name="string">
            <dia:string>#NSPi#</dia:string>
          </dia:attribute>
          <dia:attribute name="font">
            <dia:font family="sans" style="80" name="Helvetica"/>
          </dia:attribute>
          <dia:attribute name="height">
            <dia:real val="1"/>
          </dia:attribute>
          <dia:attribute name="pos">
            <dia:point val="33.3879,8.38029"/>
          </dia:attribute>
          <dia:attribute name="color">
            <dia:color val="#000000"/>
          </dia:attribute>
          <dia:attribute name="alignment">
            <dia:enum val="1"/>
          </dia:attribute>
        </dia:composite>
      </dia:attribute>
      <dia:attribute name="flip_horizontal">
        <dia:boolean val="false"/>
      </dia:attribute>
      <dia:attribute name="flip_vertical">
        <dia:boolean val="false"/>
      </dia:attribute>
    </dia:object>
    <dia:object type="SDL - Service" version="0" id="O14">
      <dia:attribute name="obj_pos">
        <dia:point val="19.5645,16.4268"/>
      </dia:attribute>
      <dia:attribute name="obj_bb">
        <dia:rectangle val="19.5145,16.3768;23.4359,18.6028"/>
      </dia:attribute>
      <dia:attribute name="elem_corner">
        <dia:point val="19.5645,16.4268"/>
      </dia:attribute>
      <dia:attribute name="elem_width">
        <dia:real val="3.82138"/>
      </dia:attribute>
      <dia:attribute name="elem_height">
        <dia:real val="2.12601"/>
      </dia:attribute>
      <dia:attribute name="line_width">
        <dia:real val="0.1"/>
      </dia:attribute>
      <dia:attribute name="line_colour">
        <dia:color val="#000000"/>
      </dia:attribute>
      <dia:attribute name="fill_colour">
        <dia:color val="#ffffff"/>
      </dia:attribute>
      <dia:attribute name="show_background">
        <dia:boolean val="true"/>
      </dia:attribute>
      <dia:attribute name="line_style">
        <dia:enum val="0"/>
        <dia:real val="1"/>
      </dia:attribute>
      <dia:attribute name="text">
        <dia:composite type="text">
          <dia:attribute name="string">
            <dia:string>#NSP2#</dia:string>
          </dia:attribute>
          <dia:attribute name="font">
            <dia:font family="sans" style="80" name="Helvetica"/>
          </dia:attribute>
          <dia:attribute name="height">
            <dia:real val="1"/>
          </dia:attribute>
          <dia:attribute name="pos">
            <dia:point val="21.4752,17.8398"/>
          </dia:attribute>
          <dia:attribute name="color">
            <dia:color val="#000000"/>
          </dia:attribute>
          <dia:attribute name="alignment">
            <dia:enum val="1"/>
          </dia:attribute>
        </dia:composite>
      </dia:attribute>
      <dia:attribute name="flip_horizontal">
        <dia:boolean val="false"/>
      </dia:attribute>
      <dia:attribute name="flip_vertical">
        <dia:boolean val="false"/>
      </dia:attribute>
    </dia:object>
    <dia:object type="SDL - Service" version="0" id="O15">
      <dia:attribute name="obj_pos">
        <dia:point val="31.3443,16.4976"/>
      </dia:attribute>
      <dia:attribute name="obj_bb">
        <dia:rectangle val="31.2943,16.4476;35.1532,18.6736"/>
      </dia:attribute>
      <dia:attribute name="elem_corner">
        <dia:point val="31.3443,16.4976"/>
      </dia:attribute>
      <dia:attribute name="elem_width">
        <dia:real val="3.75888"/>
      </dia:attribute>
      <dia:attribute name="elem_height">
        <dia:real val="2.12601"/>
      </dia:attribute>
      <dia:attribute name="line_width">
        <dia:real val="0.1"/>
      </dia:attribute>
      <dia:attribute name="line_colour">
        <dia:color val="#000000"/>
      </dia:attribute>
      <dia:attribute name="fill_colour">
        <dia:color val="#ffffff"/>
      </dia:attribute>
      <dia:attribute name="show_background">
        <dia:boolean val="true"/>
      </dia:attribute>
      <dia:attribute name="line_style">
        <dia:enum val="0"/>
        <dia:real val="1"/>
      </dia:attribute>
      <dia:attribute name="text">
        <dia:composite type="text">
          <dia:attribute name="string">
            <dia:string>#PSP3#</dia:string>
          </dia:attribute>
          <dia:attribute name="font">
            <dia:font family="sans" style="80" name="Helvetica"/>
          </dia:attribute>
          <dia:attribute name="height">
            <dia:real val="1"/>
          </dia:attribute>
          <dia:attribute name="pos">
            <dia:point val="33.2237,17.9106"/>
          </dia:attribute>
          <dia:attribute name="color">
            <dia:color val="#000000"/>
          </dia:attribute>
          <dia:attribute name="alignment">
            <dia:enum val="1"/>
          </dia:attribute>
        </dia:composite>
      </dia:attribute>
      <dia:attribute name="flip_horizontal">
        <dia:boolean val="false"/>
      </dia:attribute>
      <dia:attribute name="flip_vertical">
        <dia:boolean val="false"/>
      </dia:attribute>
    </dia:object>
    <dia:object type="SDL - Service" version="0" id="O16">
      <dia:attribute name="obj_pos">
        <dia:point val="19.5645,20.13"/>
      </dia:attribute>
      <dia:attribute name="obj_bb">
        <dia:rectangle val="19.5145,20.08;23.3734,22.306"/>
      </dia:attribute>
      <dia:attribute name="elem_corner">
        <dia:point val="19.5645,20.13"/>
      </dia:attribute>
      <dia:attribute name="elem_width">
        <dia:real val="3.75888"/>
      </dia:attribute>
      <dia:attribute name="elem_height">
        <dia:real val="2.12601"/>
      </dia:attribute>
      <dia:attribute name="line_width">
        <dia:real val="0.1"/>
      </dia:attribute>
      <dia:attribute name="line_colour">
        <dia:color val="#000000"/>
      </dia:attribute>
      <dia:attribute name="fill_colour">
        <dia:color val="#ffffff"/>
      </dia:attribute>
      <dia:attribute name="show_background">
        <dia:boolean val="true"/>
      </dia:attribute>
      <dia:attribute name="line_style">
        <dia:enum val="0"/>
        <dia:real val="1"/>
      </dia:attribute>
      <dia:attribute name="text">
        <dia:composite type="text">
          <dia:attribute name="string">
            <dia:string>#PSP3#</dia:string>
          </dia:attribute>
          <dia:attribute name="font">
            <dia:font family="sans" style="80" name="Helvetica"/>
          </dia:attribute>
          <dia:attribute name="height">
            <dia:real val="1"/>
          </dia:attribute>
          <dia:attribute name="pos">
            <dia:point val="21.4439,21.543"/>
          </dia:attribute>
          <dia:attribute name="color">
            <dia:color val="#000000"/>
          </dia:attribute>
          <dia:attribute name="alignment">
            <dia:enum val="1"/>
          </dia:attribute>
        </dia:composite>
      </dia:attribute>
      <dia:attribute name="flip_horizontal">
        <dia:boolean val="false"/>
      </dia:attribute>
      <dia:attribute name="flip_vertical">
        <dia:boolean val="false"/>
      </dia:attribute>
    </dia:object>
    <dia:object type="SDL - Service" version="0" id="O17">
      <dia:attribute name="obj_pos">
        <dia:point val="19.8645,28.4751"/>
      </dia:attribute>
      <dia:attribute name="obj_bb">
        <dia:rectangle val="19.8145,28.4251;23.7359,30.6511"/>
      </dia:attribute>
      <dia:attribute name="elem_corner">
        <dia:point val="19.8645,28.4751"/>
      </dia:attribute>
      <dia:attribute name="elem_width">
        <dia:real val="3.82138"/>
      </dia:attribute>
      <dia:attribute name="elem_height">
        <dia:real val="2.12601"/>
      </dia:attribute>
      <dia:attribute name="line_width">
        <dia:real val="0.1"/>
      </dia:attribute>
      <dia:attribute name="line_colour">
        <dia:color val="#000000"/>
      </dia:attribute>
      <dia:attribute name="fill_colour">
        <dia:color val="#ffffff"/>
      </dia:attribute>
      <dia:attribute name="show_background">
        <dia:boolean val="true"/>
      </dia:attribute>
      <dia:attribute name="line_style">
        <dia:enum val="0"/>
        <dia:real val="1"/>
      </dia:attribute>
      <dia:attribute name="text">
        <dia:composite type="text">
          <dia:attribute name="string">
            <dia:string>#DSP1#</dia:string>
          </dia:attribute>
          <dia:attribute name="font">
            <dia:font family="sans" style="80" name="Helvetica"/>
          </dia:attribute>
          <dia:attribute name="height">
            <dia:real val="1"/>
          </dia:attribute>
          <dia:attribute name="pos">
            <dia:point val="21.7752,29.8881"/>
          </dia:attribute>
          <dia:attribute name="color">
            <dia:color val="#000000"/>
          </dia:attribute>
          <dia:attribute name="alignment">
            <dia:enum val="1"/>
          </dia:attribute>
        </dia:composite>
      </dia:attribute>
      <dia:attribute name="flip_horizontal">
        <dia:boolean val="false"/>
      </dia:attribute>
      <dia:attribute name="flip_vertical">
        <dia:boolean val="false"/>
      </dia:attribute>
    </dia:object>
    <dia:object type="Geometric - Right Arrow" version="0" id="O18">
      <dia:attribute name="obj_pos">
        <dia:point val="11.9836,11.6557"/>
      </dia:attribute>
      <dia:attribute name="obj_bb">
        <dia:rectangle val="11.9336,11.4416;15.0097,17.8811"/>
      </dia:attribute>
      <dia:attribute name="elem_corner">
        <dia:point val="11.9836,11.6557"/>
      </dia:attribute>
      <dia:attribute name="elem_width">
        <dia:real val="2.9703"/>
      </dia:attribute>
      <dia:attribute name="elem_height">
        <dia:real val="6.01132"/>
      </dia:attribute>
      <dia:attribute name="line_width">
        <dia:real val="0.1"/>
      </dia:attribute>
      <dia:attribute name="line_colour">
        <dia:color val="#000000"/>
      </dia:attribute>
      <dia:attribute name="fill_colour">
        <dia:color val="#ffffff"/>
      </dia:attribute>
      <dia:attribute name="show_background">
        <dia:boolean val="true"/>
      </dia:attribute>
      <dia:attribute name="line_style">
        <dia:enum val="0"/>
        <dia:real val="1"/>
      </dia:attribute>
      <dia:attribute name="flip_horizontal">
        <dia:boolean val="false"/>
      </dia:attribute>
      <dia:attribute name="flip_vertical">
        <dia:boolean val="false"/>
      </dia:attribute>
    </dia:object>
  </dia:layer>
</dia:diagram>
