%!PS-Adobe-2.0 EPSF-2.0
%%Title: /home/ps/les/les/doc/lyx/ss2pi_returnstmt.dia
%%Creator: Dia v0.93
%%CreationDate: Tue Apr 26 11:42:06 2005
%%For: ps
%%Orientation: Portrait
%%Magnification: 1.0000
%%BoundingBox: 0 0 1385 595
%%BeginSetup
%%EndSetup
%%EndComments
%%BeginProlog
[ /.notdef /.notdef /.notdef /.notdef /.notdef /.notdef /.notdef /.notdef /.notdef /.notdef
/.notdef /.notdef /.notdef /.notdef /.notdef /.notdef /.notdef /.notdef /.notdef /.notdef
/.notdef /.notdef /.notdef /.notdef /.notdef /.notdef /.notdef /.notdef /.notdef /.notdef
/.notdef /.notdef /space /exclam /quotedbl /numbersign /dollar /percent /ampersand /quoteright
/parenleft /parenright /asterisk /plus /comma /hyphen /period /slash /zero /one
/two /three /four /five /six /seven /eight /nine /colon /semicolon
/less /equal /greater /question /at /A /B /C /D /E
/F /G /H /I /J /K /L /M /N /O
/P /Q /R /S /T /U /V /W /X /Y
/Z /bracketleft /backslash /bracketright /asciicircum /underscore /quoteleft /a /b /c
/d /e /f /g /h /i /j /k /l /m
/n /o /p /q /r /s /t /u /v /w
/x /y /z /braceleft /bar /braceright /asciitilde /.notdef /.notdef /.notdef
/.notdef /.notdef /.notdef /.notdef /.notdef /.notdef /.notdef /.notdef /.notdef /.notdef
/.notdef /.notdef /.notdef /.notdef /.notdef /.notdef /.notdef /.notdef /.notdef /.notdef
/.notdef /.notdef /.notdef /.notdef /.notdef /.notdef /.notdef /.notdef /.notdef /.notdef
/space /exclamdown /cent /sterling /currency /yen /brokenbar /section /dieresis /copyright
/ordfeminine /guillemotleft /logicalnot /hyphen /registered /macron /degree /plusminus /twosuperior /threesuperior
/acute /mu /paragraph /periodcentered /cedilla /onesuperior /ordmasculine /guillemotright /onequarter /onehalf
/threequarters /questiondown /Agrave /Aacute /Acircumflex /Atilde /Adieresis /Aring /AE /Ccedilla
/Egrave /Eacute /Ecircumflex /Edieresis /Igrave /Iacute /Icircumflex /Idieresis /Eth /Ntilde
/Ograve /Oacute /Ocircumflex /Otilde /Odieresis /multiply /Oslash /Ugrave /Uacute /Ucircumflex
/Udieresis /Yacute /Thorn /germandbls /agrave /aacute /acircumflex /atilde /adieresis /aring
/ae /ccedilla /egrave /eacute /ecircumflex /edieresis /igrave /iacute /icircumflex /idieresis
/eth /ntilde /ograve /oacute /ocircumflex /otilde /odieresis /divide /oslash /ugrave
/uacute /ucircumflex /udieresis /yacute /thorn /ydieresis] /isolatin1encoding exch def
/cp {closepath} bind def
/c {curveto} bind def
/f {fill} bind def
/a {arc} bind def
/ef {eofill} bind def
/ex {exch} bind def
/gr {grestore} bind def
/gs {gsave} bind def
/sa {save} bind def
/rs {restore} bind def
/l {lineto} bind def
/m {moveto} bind def
/rm {rmoveto} bind def
/n {newpath} bind def
/s {stroke} bind def
/sh {show} bind def
/slc {setlinecap} bind def
/slj {setlinejoin} bind def
/slw {setlinewidth} bind def
/srgb {setrgbcolor} bind def
/rot {rotate} bind def
/sc {scale} bind def
/sd {setdash} bind def
/ff {findfont} bind def
/sf {setfont} bind def
/scf {scalefont} bind def
/sw {stringwidth pop} bind def
/tr {translate} bind def

/ellipsedict 8 dict def
ellipsedict /mtrx matrix put
/ellipse
{ ellipsedict begin
   /endangle exch def
   /startangle exch def
   /yrad exch def
   /xrad exch def
   /y exch def
   /x exch def   /savematrix mtrx currentmatrix def
   x y tr xrad yrad sc
   0 0 1 startangle endangle arc
   savematrix setmatrix
   end
} def

/mergeprocs {
dup length
3 -1 roll
dup
length
dup
5 1 roll
3 -1 roll
add
array cvx
dup
3 -1 roll
0 exch
putinterval
dup
4 2 roll
putinterval
} bind def
/Times-Roman-latin1
    /Times-Roman findfont
    dup length dict begin
	{1 index /FID ne {def} {pop pop} ifelse} forall
	/Encoding isolatin1encoding def
    currentdict end
definefont pop
/Times-Italic-latin1
    /Times-Italic findfont
    dup length dict begin
	{1 index /FID ne {def} {pop pop} ifelse} forall
	/Encoding isolatin1encoding def
    currentdict end
definefont pop
/Times-Bold-latin1
    /Times-Bold findfont
    dup length dict begin
	{1 index /FID ne {def} {pop pop} ifelse} forall
	/Encoding isolatin1encoding def
    currentdict end
definefont pop
/Times-BoldItalic-latin1
    /Times-BoldItalic findfont
    dup length dict begin
	{1 index /FID ne {def} {pop pop} ifelse} forall
	/Encoding isolatin1encoding def
    currentdict end
definefont pop
/AvantGarde-Book-latin1
    /AvantGarde-Book findfont
    dup length dict begin
	{1 index /FID ne {def} {pop pop} ifelse} forall
	/Encoding isolatin1encoding def
    currentdict end
definefont pop
/AvantGarde-BookOblique-latin1
    /AvantGarde-BookOblique findfont
    dup length dict begin
	{1 index /FID ne {def} {pop pop} ifelse} forall
	/Encoding isolatin1encoding def
    currentdict end
definefont pop
/AvantGarde-Demi-latin1
    /AvantGarde-Demi findfont
    dup length dict begin
	{1 index /FID ne {def} {pop pop} ifelse} forall
	/Encoding isolatin1encoding def
    currentdict end
definefont pop
/AvantGarde-DemiOblique-latin1
    /AvantGarde-DemiOblique findfont
    dup length dict begin
	{1 index /FID ne {def} {pop pop} ifelse} forall
	/Encoding isolatin1encoding def
    currentdict end
definefont pop
/Bookman-Light-latin1
    /Bookman-Light findfont
    dup length dict begin
	{1 index /FID ne {def} {pop pop} ifelse} forall
	/Encoding isolatin1encoding def
    currentdict end
definefont pop
/Bookman-LightItalic-latin1
    /Bookman-LightItalic findfont
    dup length dict begin
	{1 index /FID ne {def} {pop pop} ifelse} forall
	/Encoding isolatin1encoding def
    currentdict end
definefont pop
/Bookman-Demi-latin1
    /Bookman-Demi findfont
    dup length dict begin
	{1 index /FID ne {def} {pop pop} ifelse} forall
	/Encoding isolatin1encoding def
    currentdict end
definefont pop
/Bookman-DemiItalic-latin1
    /Bookman-DemiItalic findfont
    dup length dict begin
	{1 index /FID ne {def} {pop pop} ifelse} forall
	/Encoding isolatin1encoding def
    currentdict end
definefont pop
/Courier-latin1
    /Courier findfont
    dup length dict begin
	{1 index /FID ne {def} {pop pop} ifelse} forall
	/Encoding isolatin1encoding def
    currentdict end
definefont pop
/Courier-Oblique-latin1
    /Courier-Oblique findfont
    dup length dict begin
	{1 index /FID ne {def} {pop pop} ifelse} forall
	/Encoding isolatin1encoding def
    currentdict end
definefont pop
/Courier-Bold-latin1
    /Courier-Bold findfont
    dup length dict begin
	{1 index /FID ne {def} {pop pop} ifelse} forall
	/Encoding isolatin1encoding def
    currentdict end
definefont pop
/Courier-BoldOblique-latin1
    /Courier-BoldOblique findfont
    dup length dict begin
	{1 index /FID ne {def} {pop pop} ifelse} forall
	/Encoding isolatin1encoding def
    currentdict end
definefont pop
/Helvetica-latin1
    /Helvetica findfont
    dup length dict begin
	{1 index /FID ne {def} {pop pop} ifelse} forall
	/Encoding isolatin1encoding def
    currentdict end
definefont pop
/Helvetica-Oblique-latin1
    /Helvetica-Oblique findfont
    dup length dict begin
	{1 index /FID ne {def} {pop pop} ifelse} forall
	/Encoding isolatin1encoding def
    currentdict end
definefont pop
/Helvetica-Bold-latin1
    /Helvetica-Bold findfont
    dup length dict begin
	{1 index /FID ne {def} {pop pop} ifelse} forall
	/Encoding isolatin1encoding def
    currentdict end
definefont pop
/Helvetica-BoldOblique-latin1
    /Helvetica-BoldOblique findfont
    dup length dict begin
	{1 index /FID ne {def} {pop pop} ifelse} forall
	/Encoding isolatin1encoding def
    currentdict end
definefont pop
/Helvetica-Narrow-latin1
    /Helvetica-Narrow findfont
    dup length dict begin
	{1 index /FID ne {def} {pop pop} ifelse} forall
	/Encoding isolatin1encoding def
    currentdict end
definefont pop
/Helvetica-Narrow-Oblique-latin1
    /Helvetica-Narrow-Oblique findfont
    dup length dict begin
	{1 index /FID ne {def} {pop pop} ifelse} forall
	/Encoding isolatin1encoding def
    currentdict end
definefont pop
/Helvetica-Narrow-Bold-latin1
    /Helvetica-Narrow-Bold findfont
    dup length dict begin
	{1 index /FID ne {def} {pop pop} ifelse} forall
	/Encoding isolatin1encoding def
    currentdict end
definefont pop
/Helvetica-Narrow-BoldOblique-latin1
    /Helvetica-Narrow-BoldOblique findfont
    dup length dict begin
	{1 index /FID ne {def} {pop pop} ifelse} forall
	/Encoding isolatin1encoding def
    currentdict end
definefont pop
/NewCenturySchoolbook-Roman-latin1
    /NewCenturySchoolbook-Roman findfont
    dup length dict begin
	{1 index /FID ne {def} {pop pop} ifelse} forall
	/Encoding isolatin1encoding def
    currentdict end
definefont pop
/NewCenturySchoolbook-Italic-latin1
    /NewCenturySchoolbook-Italic findfont
    dup length dict begin
	{1 index /FID ne {def} {pop pop} ifelse} forall
	/Encoding isolatin1encoding def
    currentdict end
definefont pop
/NewCenturySchoolbook-Bold-latin1
    /NewCenturySchoolbook-Bold findfont
    dup length dict begin
	{1 index /FID ne {def} {pop pop} ifelse} forall
	/Encoding isolatin1encoding def
    currentdict end
definefont pop
/NewCenturySchoolbook-BoldItalic-latin1
    /NewCenturySchoolbook-BoldItalic findfont
    dup length dict begin
	{1 index /FID ne {def} {pop pop} ifelse} forall
	/Encoding isolatin1encoding def
    currentdict end
definefont pop
/Palatino-Roman-latin1
    /Palatino-Roman findfont
    dup length dict begin
	{1 index /FID ne {def} {pop pop} ifelse} forall
	/Encoding isolatin1encoding def
    currentdict end
definefont pop
/Palatino-Italic-latin1
    /Palatino-Italic findfont
    dup length dict begin
	{1 index /FID ne {def} {pop pop} ifelse} forall
	/Encoding isolatin1encoding def
    currentdict end
definefont pop
/Palatino-Bold-latin1
    /Palatino-Bold findfont
    dup length dict begin
	{1 index /FID ne {def} {pop pop} ifelse} forall
	/Encoding isolatin1encoding def
    currentdict end
definefont pop
/Palatino-BoldItalic-latin1
    /Palatino-BoldItalic findfont
    dup length dict begin
	{1 index /FID ne {def} {pop pop} ifelse} forall
	/Encoding isolatin1encoding def
    currentdict end
definefont pop
/Symbol-latin1
    /Symbol findfont
definefont pop
/ZapfChancery-MediumItalic-latin1
    /ZapfChancery-MediumItalic findfont
    dup length dict begin
	{1 index /FID ne {def} {pop pop} ifelse} forall
	/Encoding isolatin1encoding def
    currentdict end
definefont pop
/ZapfDingbats-latin1
    /ZapfDingbats findfont
    dup length dict begin
	{1 index /FID ne {def} {pop pop} ifelse} forall
	/Encoding isolatin1encoding def
    currentdict end
definefont pop
28.346000 -28.346000 scale
-2.950000 -27.950000 translate
%%EndProlog


0.100000 slw
[] 0 sd
[] 0 sd
0 slc
0.000000 0.000000 0.000000 srgb
n 5.935000 23.407600 m 4.543143 21.517964 l s
[] 0 sd
0 slj
0 slc
n 4.320746 21.216030 m 4.818565 21.470344 l 4.543143 21.517964 l 4.415986 21.766874 l f
n 4.320746 21.216030 m 4.818565 21.470344 l 4.543143 21.517964 l 4.415986 21.766874 l cp s
0.100000 slw
[] 0 sd
[] 0 sd
0 slc
0 slj
0 slc
0 slj
[] 0 sd
1.000000 1.000000 1.000000 srgb
n 4.128996 19.000000 m 4.379884 19.000000 l 5.132548 19.425202 5.508880 19.637803 5.508880 20.063005 c 5.508880 20.488207 5.257992 20.700808 4.379884 21.126010 c 4.128996 21.126010 l 3.376332 20.700808 3.000000 20.488207 3.000000 20.063005 c 3.000000 19.637803 3.250888 19.425202 4.128996 19.000000 c f
0.000000 0.000000 0.000000 srgb
n 4.128996 19.000000 m 4.379884 19.000000 l 5.132548 19.425202 5.508880 19.637803 5.508880 20.063005 c 5.508880 20.488207 5.257992 20.700808 4.379884 21.126010 c 4.128996 21.126010 l 3.376332 20.700808 3.000000 20.488207 3.000000 20.063005 c 3.000000 19.637803 3.250888 19.425202 4.128996 19.000000 c s
/Helvetica-latin1 ff 0.700000 scf sf
(SP) dup sw 2 div 4.254440 ex sub 20.313005 m gs 1 -1 sc sh gr
0.100000 slw
[] 0 sd
[] 0 sd
0 slc
0 slj
0 slc
0 slj
[] 0 sd
1.000000 1.000000 1.000000 srgb
n 12.128996 19.000000 m 12.379884 19.000000 l 13.132548 19.425202 13.508880 19.637803 13.508880 20.063005 c 13.508880 20.488207 13.257992 20.700808 12.379884 21.126010 c 12.128996 21.126010 l 11.376332 20.700808 11.000000 20.488207 11.000000 20.063005 c 11.000000 19.637803 11.250888 19.425202 12.128996 19.000000 c f
0.000000 0.000000 0.000000 srgb
n 12.128996 19.000000 m 12.379884 19.000000 l 13.132548 19.425202 13.508880 19.637803 13.508880 20.063005 c 13.508880 20.488207 13.257992 20.700808 12.379884 21.126010 c 12.128996 21.126010 l 11.376332 20.700808 11.000000 20.488207 11.000000 20.063005 c 11.000000 19.637803 11.250888 19.425202 12.128996 19.000000 c s
/Helvetica-latin1 ff 0.700000 scf sf
(SP) dup sw 2 div 12.254440 ex sub 20.313005 m gs 1 -1 sc sh gr
0.100000 slw
[] 0 sd
1.000000 1.000000 1.000000 srgb
n 5.935000 23.407600 m 10.285000 23.407600 l 10.885000 24.007600 l 10.885000 26.307600 l 5.935000 26.307600 l f
0.000000 0.000000 0.000000 srgb
n 5.935000 23.407600 m 10.285000 23.407600 l 10.885000 24.007600 l 10.885000 26.307600 l 5.935000 26.307600 l cp s
0.050000 slw
n 10.285000 23.407600 m 10.285000 24.007600 l 10.885000 24.007600 l s
/Courier-latin1 ff 0.700000 scf sf
(return) 6.285000 24.807600 m gs 1 -1 sc sh gr
(statement) 6.285000 25.807600 m gs 1 -1 sc sh gr
0.100000 slw
[] 0 sd
[] 0 sd
0 slc
n 10.885000 23.407600 m 12.003916 21.543401 l s
[] 0 sd
0 slj
0 slc
n 12.196903 21.221872 m 12.153941 21.779235 l 12.003916 21.543401 l 11.725235 21.521920 l f
n 12.196903 21.221872 m 12.153941 21.779235 l 12.003916 21.543401 l 11.725235 21.521920 l cp s
0.100000 slw
[] 0 sd
[] 0 sd
0 slc
n 44.035000 23.175300 m 42.573724 21.493482 l s
[] 0 sd
0 slj
0 slc
n 42.327769 21.210407 m 42.844425 21.423870 l 42.573724 21.493482 l 42.466992 21.751810 l f
n 42.327769 21.210407 m 42.844425 21.423870 l 42.573724 21.493482 l 42.466992 21.751810 l cp s
0.100000 slw
[] 0 sd
[] 0 sd
0 slc
0 slj
0 slc
0 slj
[] 0 sd
1.000000 1.000000 1.000000 srgb
n 42.128996 19.000000 m 42.379884 19.000000 l 43.132548 19.425202 43.508880 19.637803 43.508880 20.063005 c 43.508880 20.488207 43.257992 20.700808 42.379884 21.126010 c 42.128996 21.126010 l 41.376332 20.700808 41.000000 20.488207 41.000000 20.063005 c 41.000000 19.637803 41.250888 19.425202 42.128996 19.000000 c f
0.000000 0.000000 0.000000 srgb
n 42.128996 19.000000 m 42.379884 19.000000 l 43.132548 19.425202 43.508880 19.637803 43.508880 20.063005 c 43.508880 20.488207 43.257992 20.700808 42.379884 21.126010 c 42.128996 21.126010 l 41.376332 20.700808 41.000000 20.488207 41.000000 20.063005 c 41.000000 19.637803 41.250888 19.425202 42.128996 19.000000 c s
/Helvetica-latin1 ff 0.700000 scf sf
(SP) dup sw 2 div 42.254440 ex sub 20.313005 m gs 1 -1 sc sh gr
0.100000 slw
[] 0 sd
[] 0 sd
0 slc
0 slj
0 slc
0 slj
[] 0 sd
1.000000 1.000000 1.000000 srgb
n 50.128996 19.000000 m 50.379884 19.000000 l 51.132548 19.425202 51.508880 19.637803 51.508880 20.063005 c 51.508880 20.488207 51.257992 20.700808 50.379884 21.126010 c 50.128996 21.126010 l 49.376332 20.700808 49.000000 20.488207 49.000000 20.063005 c 49.000000 19.637803 49.250888 19.425202 50.128996 19.000000 c f
0.000000 0.000000 0.000000 srgb
n 50.128996 19.000000 m 50.379884 19.000000 l 51.132548 19.425202 51.508880 19.637803 51.508880 20.063005 c 51.508880 20.488207 51.257992 20.700808 50.379884 21.126010 c 50.128996 21.126010 l 49.376332 20.700808 49.000000 20.488207 49.000000 20.063005 c 49.000000 19.637803 49.250888 19.425202 50.128996 19.000000 c s
/Helvetica-latin1 ff 0.700000 scf sf
(SP) dup sw 2 div 50.254440 ex sub 20.313005 m gs 1 -1 sc sh gr
0.100000 slw
[] 0 sd
1.000000 1.000000 1.000000 srgb
n 44.035000 23.175300 m 48.385000 23.175300 l 48.985000 23.775300 l 48.985000 25.075300 l 44.035000 25.075300 l f
0.000000 0.000000 0.000000 srgb
n 44.035000 23.175300 m 48.385000 23.175300 l 48.985000 23.775300 l 48.985000 25.075300 l 44.035000 25.075300 l cp s
0.050000 slw
n 48.385000 23.175300 m 48.385000 23.775300 l 48.985000 23.775300 l s
/Courier-latin1 ff 0.700000 scf sf
(statement) 44.385000 24.575300 m gs 1 -1 sc sh gr
0.100000 slw
[] 0 sd
[] 0 sd
0 slc
n 48.985000 23.175300 m 49.998087 21.539847 l s
[] 0 sd
0 slj
0 slc
n 50.195564 21.221055 m 50.144789 21.777762 l 49.998087 21.539847 l 49.719734 21.514460 l f
n 50.195564 21.221055 m 50.144789 21.777762 l 49.998087 21.539847 l 49.719734 21.514460 l cp s
0.200000 slw
[] 0 sd
[] 0 sd
0 slc
n 10.400000 20.063005 m 6.108880 20.063005 l s
0 slj
n 10.400000 20.313005 m 10.900000 20.063005 l 10.400000 19.813005 l f
0 slj
n 6.108880 19.813005 m 5.608880 20.063005 l 6.108880 20.313005 l f
0.200000 slw
[] 0 sd
[] 0 sd
0 slc
n 48.400000 20.063005 m 44.108880 20.063005 l s
0 slj
n 48.400000 20.313005 m 48.900000 20.063005 l 48.400000 19.813005 l f
0 slj
n 44.108880 19.813005 m 43.608880 20.063005 l 44.108880 20.313005 l f
0.200000 slw
[] 0 sd
[] 0 sd
0 slc
n 40.403744 20.129926 m 36.355140 20.584319 l s
0 slj
n 40.431627 20.378366 m 40.900624 20.074158 l 40.375860 19.881485 l f
0 slj
n 36.327256 20.335879 m 35.858260 20.640086 l 36.383023 20.832759 l f
/Helvetica-latin1 ff 0.700000 scf sf
(psp) 5.645000 22.042600 m gs 1 -1 sc sh gr
/Helvetica-latin1 ff 0.700000 scf sf
(psp) 43.630000 22.407600 m gs 1 -1 sc sh gr
/Helvetica-latin1 ff 0.700000 scf sf
(nsp) 10.380000 22.057600 m gs 1 -1 sc sh gr
/Helvetica-latin1 ff 0.700000 scf sf
(nsp) 48.180000 22.557600 m gs 1 -1 sc sh gr
0.100000 slw
[] 0 sd
[] 0 sd
0 slc
0 slj
0 slc
0 slj
[] 0 sd
1.000000 1.000000 1.000000 srgb
n 25.067377 11.319061 m 25.067377 14.223976 l 23.614920 14.223976 l 26.519835 17.128892 l 29.424750 14.223976 l 27.972293 14.223976 l 27.972293 11.319061 l f
0.000000 0.000000 0.000000 srgb
n 25.067377 11.319061 m 25.067377 14.223976 l 23.614920 14.223976 l 26.519835 17.128892 l 29.424750 14.223976 l 27.972293 14.223976 l 27.972293 11.319061 l cp s
0.010000 slw
0 slc
0 slj
[] 0 sd
n 25.067377 11.319061 m 25.067377 14.223976 l 23.614920 14.223976 l 26.519835 17.128892 l 29.424750 14.223976 l 27.972293 14.223976 l 27.972293 11.319061 l cp s
0.100000 slw
[] 0 sd
[] 0 sd
0 slc
0 slj
0 slc
0 slj
[] 0 sd
1.000000 1.000000 1.000000 srgb
n 19.971496 18.906766 m 20.247384 18.906766 l 21.075049 19.567261 21.488882 19.897509 21.488882 20.558005 c 21.488882 21.218501 21.212993 21.548749 20.247384 22.209244 c 19.971496 22.209244 l 19.143831 21.548749 18.729998 21.218501 18.729998 20.558005 c 18.729998 19.897509 19.005887 19.567261 19.971496 18.906766 c f
0.000000 0.000000 0.000000 srgb
n 19.971496 18.906766 m 20.247384 18.906766 l 21.075049 19.567261 21.488882 19.897509 21.488882 20.558005 c 21.488882 21.218501 21.212993 21.548749 20.247384 22.209244 c 19.971496 22.209244 l 19.143831 21.548749 18.729998 21.218501 18.729998 20.558005 c 18.729998 19.897509 19.005887 19.567261 19.971496 18.906766 c s
/Helvetica-latin1 ff 0.700000 scf sf
(SP) dup sw 2 div 20.109440 ex sub 20.308005 m gs 1 -1 sc sh gr
(med) dup sw 2 div 20.109440 ex sub 21.308005 m gs 1 -1 sc sh gr
0.100000 slw
[] 0 sd
1.000000 1.000000 1.000000 srgb
n 15.000000 24.000000 m 18.000000 24.000000 l 18.600000 24.600000 l 18.600000 27.900000 l 15.000000 27.900000 l f
0.000000 0.000000 0.000000 srgb
n 15.000000 24.000000 m 18.000000 24.000000 l 18.600000 24.600000 l 18.600000 27.900000 l 15.000000 27.900000 l cp s
0.050000 slw
n 18.000000 24.000000 m 18.000000 24.600000 l 18.600000 24.600000 l s
/Courier-latin1 ff 0.700000 scf sf
(return) 15.350000 25.400000 m gs 1 -1 sc sh gr
(value) 15.350000 26.400000 m gs 1 -1 sc sh gr
(store) 15.350000 27.400000 m gs 1 -1 sc sh gr
0.100000 slw
[] 0 sd
[] 0 sd
0 slc
0 slj
0 slc
0 slj
[] 0 sd
1.000000 1.000000 1.000000 srgb
n 34.241498 19.000000 m 34.517386 19.000000 l 35.345051 19.660496 35.758883 19.990744 35.758883 20.651239 c 35.758883 21.311735 35.482995 21.641983 34.517386 22.302479 c 34.241498 22.302479 l 33.413833 21.641983 33.000000 21.311735 33.000000 20.651239 c 33.000000 19.990744 33.275888 19.660496 34.241498 19.000000 c f
0.000000 0.000000 0.000000 srgb
n 34.241498 19.000000 m 34.517386 19.000000 l 35.345051 19.660496 35.758883 19.990744 35.758883 20.651239 c 35.758883 21.311735 35.482995 21.641983 34.517386 22.302479 c 34.241498 22.302479 l 33.413833 21.641983 33.000000 21.311735 33.000000 20.651239 c 33.000000 19.990744 33.275888 19.660496 34.241498 19.000000 c s
/Helvetica-latin1 ff 0.700000 scf sf
(SP) dup sw 2 div 34.379442 ex sub 20.401239 m gs 1 -1 sc sh gr
(tenp) dup sw 2 div 34.379442 ex sub 21.401239 m gs 1 -1 sc sh gr
0.100000 slw
[] 0 sd
1.000000 1.000000 1.000000 srgb
n 21.000000 24.000000 m 26.250000 24.000000 l 26.850000 24.600000 l 26.850000 26.900000 l 21.000000 26.900000 l f
0.000000 0.000000 0.000000 srgb
n 21.000000 24.000000 m 26.250000 24.000000 l 26.850000 24.600000 l 26.850000 26.900000 l 21.000000 26.900000 l cp s
0.050000 slw
n 26.250000 24.000000 m 26.250000 24.600000 l 26.850000 24.600000 l s
/Courier-latin1 ff 0.700000 scf sf
(temporaries) 21.350000 25.400000 m gs 1 -1 sc sh gr
(backroll) 21.350000 26.400000 m gs 1 -1 sc sh gr
0.100000 slw
[] 0 sd
[] 0 sd
0 slc
0 slj
0 slc
0 slj
[] 0 sd
1.000000 1.000000 1.000000 srgb
n 27.241498 19.000000 m 27.517386 19.000000 l 28.345051 19.660496 28.758883 19.990744 28.758883 20.651239 c 28.758883 21.311735 28.482995 21.641983 27.517386 22.302479 c 27.241498 22.302479 l 26.413833 21.641983 26.000000 21.311735 26.000000 20.651239 c 26.000000 19.990744 26.275888 19.660496 27.241498 19.000000 c f
0.000000 0.000000 0.000000 srgb
n 27.241498 19.000000 m 27.517386 19.000000 l 28.345051 19.660496 28.758883 19.990744 28.758883 20.651239 c 28.758883 21.311735 28.482995 21.641983 27.517386 22.302479 c 27.241498 22.302479 l 26.413833 21.641983 26.000000 21.311735 26.000000 20.651239 c 26.000000 19.990744 26.275888 19.660496 27.241498 19.000000 c s
/Helvetica-latin1 ff 0.700000 scf sf
(SP) dup sw 2 div 27.379442 ex sub 20.401239 m gs 1 -1 sc sh gr
(dc) dup sw 2 div 27.379442 ex sub 21.401239 m gs 1 -1 sc sh gr
0.100000 slw
[] 0 sd
1.000000 1.000000 1.000000 srgb
n 29.000000 24.000000 m 33.350000 24.000000 l 33.950000 24.600000 l 33.950000 27.900000 l 29.000000 27.900000 l f
0.000000 0.000000 0.000000 srgb
n 29.000000 24.000000 m 33.350000 24.000000 l 33.950000 24.600000 l 33.950000 27.900000 l 29.000000 27.900000 l cp s
0.050000 slw
n 33.350000 24.000000 m 33.350000 24.600000 l 33.950000 24.600000 l s
/Courier-latin1 ff 0.700000 scf sf
(local) 29.350000 25.400000 m gs 1 -1 sc sh gr
(variables) 29.350000 26.400000 m gs 1 -1 sc sh gr
(backroll) 29.350000 27.400000 m gs 1 -1 sc sh gr
0.100000 slw
[] 0 sd
1.000000 1.000000 1.000000 srgb
n 37.000000 24.000000 m 40.900000 24.000000 l 41.500000 24.600000 l 41.500000 26.900000 l 37.000000 26.900000 l f
0.000000 0.000000 0.000000 srgb
n 37.000000 24.000000 m 40.900000 24.000000 l 41.500000 24.600000 l 41.500000 26.900000 l 37.000000 26.900000 l cp s
0.050000 slw
n 40.900000 24.000000 m 40.900000 24.600000 l 41.500000 24.600000 l s
/Courier-latin1 ff 0.700000 scf sf
(pi_leave) 37.350000 25.400000 m gs 1 -1 sc sh gr
(jump) 37.350000 26.400000 m gs 1 -1 sc sh gr
0.200000 slw
[] 0 sd
[] 0 sd
0 slc
n 25.400128 20.638841 m 22.088754 20.570403 l s
0 slj
n 25.394962 20.888788 m 25.900021 20.649173 l 25.405294 20.388895 l f
0 slj
n 22.093919 20.320456 m 21.588860 20.560071 l 22.083588 20.820350 l f
0.200000 slw
[] 0 sd
[] 0 sd
0 slc
n 32.400000 20.651239 m 29.358883 20.651239 l s
0 slj
n 32.400000 20.901239 m 32.900000 20.651239 l 32.400000 20.401239 l f
0 slj
n 29.358883 20.401239 m 28.858883 20.651239 l 29.358883 20.901239 l f
0.200000 slw
[] 0 sd
[] 0 sd
0 slc
n 18.132677 20.501375 m 14.106202 20.119635 l s
0 slj
n 18.109081 20.750259 m 18.630445 20.548567 l 18.156273 20.252491 l f
0 slj
n 14.129798 19.870751 m 13.608434 20.072443 l 14.082606 20.368519 l f
0.100000 slw
[] 0 sd
[] 0 sd
0 slc
n 15.000000 24.000000 m 12.590707 21.478007 l s
[] 0 sd
0 slj
0 slc
n 12.331670 21.206853 m 12.857823 21.395700 l 12.590707 21.478007 l 12.496283 21.741083 l f
n 12.331670 21.206853 m 12.857823 21.395700 l 12.590707 21.478007 l 12.496283 21.741083 l cp s
/Helvetica-latin1 ff 0.700000 scf sf
(psp) 14.300000 22.900000 m gs 1 -1 sc sh gr
0.100000 slw
[] 0 sd
[] 0 sd
0 slc
n 21.000000 24.000000 m 20.326206 22.645123 l s
[] 0 sd
0 slj
0 slc
n 20.159224 22.309352 m 20.605714 22.645725 l 20.326206 22.645123 l 20.158020 22.868367 l f
n 20.159224 22.309352 m 20.605714 22.645725 l 20.326206 22.645123 l 20.158020 22.868367 l cp s
/Helvetica-latin1 ff 0.700000 scf sf
(psp) 21.082792 23.398378 m gs 1 -1 sc sh gr
0.100000 slw
[] 0 sd
[] 0 sd
0 slc
n 29.000000 24.000000 m 27.715589 22.654590 l s
[] 0 sd
0 slj
0 slc
n 27.456644 22.383347 m 27.982732 22.572374 l 27.715589 22.654590 l 27.621076 22.917634 l f
n 27.456644 22.383347 m 27.982732 22.572374 l 27.715589 22.654590 l 27.621076 22.917634 l cp s
/Helvetica-latin1 ff 0.700000 scf sf
(psp) 28.982792 23.498378 m gs 1 -1 sc sh gr
0.100000 slw
[] 0 sd
[] 0 sd
0 slc
n 37.000000 24.000000 m 34.788015 22.567140 l s
[] 0 sd
0 slj
0 slc
n 34.473278 22.363263 m 35.028845 22.425275 l 34.788015 22.567140 l 34.757009 22.844924 l f
n 34.473278 22.363263 m 35.028845 22.425275 l 34.788015 22.567140 l 34.757009 22.844924 l cp s
/Helvetica-latin1 ff 0.700000 scf sf
(psp) 36.282792 23.248378 m gs 1 -1 sc sh gr
0.100000 slw
[] 0 sd
[] 0 sd
0 slc
n 18.600000 24.000000 m 19.795698 22.581459 l s
[] 0 sd
0 slj
0 slc
n 20.037383 22.294730 m 19.906289 22.838158 l 19.795698 22.581459 l 19.523984 22.515911 l f
n 20.037383 22.294730 m 19.906289 22.838158 l 19.795698 22.581459 l 19.523984 22.515911 l cp s
/Helvetica-latin1 ff 0.700000 scf sf
(nsp) 18.110000 22.926776 m gs 1 -1 sc sh gr
/Helvetica-latin1 ff 0.700000 scf sf
(nsp) 25.760000 23.445000 m gs 1 -1 sc sh gr
0.100000 slw
[] 0 sd
[] 0 sd
0 slc
n 26.850000 24.000000 m 27.234498 22.767203 l s
[] 0 sd
0 slj
0 slc
n 27.346153 22.409211 m 27.435941 22.960970 l 27.234498 22.767203 l 26.958619 22.812097 l f
n 27.346153 22.409211 m 27.435941 22.960970 l 27.234498 22.767203 l 26.958619 22.812097 l cp s
0.100000 slw
[] 0 sd
[] 0 sd
0 slc
n 33.950000 24.000000 m 34.260051 22.774414 l s
[] 0 sd
0 slj
0 slc
n 34.352021 22.410867 m 34.471758 22.956910 l 34.260051 22.774414 l 33.987029 22.834283 l f
n 34.352021 22.410867 m 34.471758 22.956910 l 34.260051 22.774414 l 33.987029 22.834283 l cp s
/Helvetica-latin1 ff 0.700000 scf sf
(nsp) 32.810000 23.476776 m gs 1 -1 sc sh gr
0.100000 slw
[] 0 sd
[] 0 sd
0 slc
n 41.500000 24.000000 m 42.130839 21.596861 l s
[] 0 sd
0 slj
0 slc
n 42.226053 21.234150 m 42.340908 21.781240 l 42.130839 21.596861 l 41.857293 21.654288 l f
n 42.226053 21.234150 m 42.340908 21.781240 l 42.130839 21.596861 l 41.857293 21.654288 l cp s
/Helvetica-latin1 ff 0.700000 scf sf
(nsp) 40.410000 23.345000 m gs 1 -1 sc sh gr
0.100000 slw
[] 0 sd
[] 0 sd
0 slc
n 6.170458 11.447870 m 4.778601 9.558234 l s
[] 0 sd
0 slj
0 slc
n 4.556204 9.256300 m 5.054024 9.510614 l 4.778601 9.558234 l 4.651444 9.807144 l f
n 4.556204 9.256300 m 5.054024 9.510614 l 4.778601 9.558234 l 4.651444 9.807144 l cp s
0.100000 slw
[] 0 sd
[] 0 sd
0 slc
0 slj
0 slc
0 slj
[] 0 sd
1.000000 1.000000 1.000000 srgb
n 4.364454 7.040270 m 4.615342 7.040270 l 5.368006 7.465472 5.744338 7.678073 5.744338 8.103275 c 5.744338 8.528477 5.493450 8.741078 4.615342 9.166280 c 4.364454 9.166280 l 3.611790 8.741078 3.235458 8.528477 3.235458 8.103275 c 3.235458 7.678073 3.486346 7.465472 4.364454 7.040270 c f
0.000000 0.000000 0.000000 srgb
n 4.364454 7.040270 m 4.615342 7.040270 l 5.368006 7.465472 5.744338 7.678073 5.744338 8.103275 c 5.744338 8.528477 5.493450 8.741078 4.615342 9.166280 c 4.364454 9.166280 l 3.611790 8.741078 3.235458 8.528477 3.235458 8.103275 c 3.235458 7.678073 3.486346 7.465472 4.364454 7.040270 c s
/Helvetica-latin1 ff 0.700000 scf sf
(SP) dup sw 2 div 4.489898 ex sub 8.353275 m gs 1 -1 sc sh gr
0.100000 slw
[] 0 sd
[] 0 sd
0 slc
0 slj
0 slc
0 slj
[] 0 sd
1.000000 1.000000 1.000000 srgb
n 12.364454 7.040270 m 12.615342 7.040270 l 13.368006 7.465472 13.744338 7.678073 13.744338 8.103275 c 13.744338 8.528477 13.493450 8.741078 12.615342 9.166280 c 12.364454 9.166280 l 11.611790 8.741078 11.235458 8.528477 11.235458 8.103275 c 11.235458 7.678073 11.486346 7.465472 12.364454 7.040270 c f
0.000000 0.000000 0.000000 srgb
n 12.364454 7.040270 m 12.615342 7.040270 l 13.368006 7.465472 13.744338 7.678073 13.744338 8.103275 c 13.744338 8.528477 13.493450 8.741078 12.615342 9.166280 c 12.364454 9.166280 l 11.611790 8.741078 11.235458 8.528477 11.235458 8.103275 c 11.235458 7.678073 11.486346 7.465472 12.364454 7.040270 c s
/Helvetica-latin1 ff 0.700000 scf sf
(SP) dup sw 2 div 12.489898 ex sub 8.353275 m gs 1 -1 sc sh gr
0.100000 slw
[] 0 sd
1.000000 1.000000 1.000000 srgb
n 6.170458 11.447870 m 10.520458 11.447870 l 11.120458 12.047870 l 11.120458 14.347870 l 6.170458 14.347870 l f
0.000000 0.000000 0.000000 srgb
n 6.170458 11.447870 m 10.520458 11.447870 l 11.120458 12.047870 l 11.120458 14.347870 l 6.170458 14.347870 l cp s
0.050000 slw
n 10.520458 11.447870 m 10.520458 12.047870 l 11.120458 12.047870 l s
/Courier-latin1 ff 0.700000 scf sf
(return) 6.520458 12.847870 m gs 1 -1 sc sh gr
(statement) 6.520458 13.847870 m gs 1 -1 sc sh gr
0.100000 slw
[] 0 sd
[] 0 sd
0 slc
n 11.120458 11.447870 m 12.239375 9.583671 l s
[] 0 sd
0 slj
0 slc
n 12.432361 9.262142 m 12.389399 9.819505 l 12.239375 9.583671 l 11.960693 9.562190 l f
n 12.432361 9.262142 m 12.389399 9.819505 l 12.239375 9.583671 l 11.960693 9.562190 l cp s
0.100000 slw
[] 0 sd
[] 0 sd
0 slc
n 44.270458 11.215570 m 42.809182 9.533752 l s
[] 0 sd
0 slj
0 slc
n 42.563228 9.250677 m 43.079884 9.464140 l 42.809182 9.533752 l 42.702450 9.792080 l f
n 42.563228 9.250677 m 43.079884 9.464140 l 42.809182 9.533752 l 42.702450 9.792080 l cp s
0.100000 slw
[] 0 sd
[] 0 sd
0 slc
0 slj
0 slc
0 slj
[] 0 sd
1.000000 1.000000 1.000000 srgb
n 42.364454 7.040270 m 42.615342 7.040270 l 43.368006 7.465472 43.744338 7.678073 43.744338 8.103275 c 43.744338 8.528477 43.493450 8.741078 42.615342 9.166280 c 42.364454 9.166280 l 41.611790 8.741078 41.235458 8.528477 41.235458 8.103275 c 41.235458 7.678073 41.486346 7.465472 42.364454 7.040270 c f
0.000000 0.000000 0.000000 srgb
n 42.364454 7.040270 m 42.615342 7.040270 l 43.368006 7.465472 43.744338 7.678073 43.744338 8.103275 c 43.744338 8.528477 43.493450 8.741078 42.615342 9.166280 c 42.364454 9.166280 l 41.611790 8.741078 41.235458 8.528477 41.235458 8.103275 c 41.235458 7.678073 41.486346 7.465472 42.364454 7.040270 c s
/Helvetica-latin1 ff 0.700000 scf sf
(SP) dup sw 2 div 42.489898 ex sub 8.353275 m gs 1 -1 sc sh gr
0.100000 slw
[] 0 sd
[] 0 sd
0 slc
0 slj
0 slc
0 slj
[] 0 sd
1.000000 1.000000 1.000000 srgb
n 50.364454 7.040270 m 50.615342 7.040270 l 51.368006 7.465472 51.744338 7.678073 51.744338 8.103275 c 51.744338 8.528477 51.493450 8.741078 50.615342 9.166280 c 50.364454 9.166280 l 49.611790 8.741078 49.235458 8.528477 49.235458 8.103275 c 49.235458 7.678073 49.486346 7.465472 50.364454 7.040270 c f
0.000000 0.000000 0.000000 srgb
n 50.364454 7.040270 m 50.615342 7.040270 l 51.368006 7.465472 51.744338 7.678073 51.744338 8.103275 c 51.744338 8.528477 51.493450 8.741078 50.615342 9.166280 c 50.364454 9.166280 l 49.611790 8.741078 49.235458 8.528477 49.235458 8.103275 c 49.235458 7.678073 49.486346 7.465472 50.364454 7.040270 c s
/Helvetica-latin1 ff 0.700000 scf sf
(SP) dup sw 2 div 50.489898 ex sub 8.353275 m gs 1 -1 sc sh gr
0.100000 slw
[] 0 sd
1.000000 1.000000 1.000000 srgb
n 44.270458 11.215570 m 48.620458 11.215570 l 49.220458 11.815570 l 49.220458 13.115570 l 44.270458 13.115570 l f
0.000000 0.000000 0.000000 srgb
n 44.270458 11.215570 m 48.620458 11.215570 l 49.220458 11.815570 l 49.220458 13.115570 l 44.270458 13.115570 l cp s
0.050000 slw
n 48.620458 11.215570 m 48.620458 11.815570 l 49.220458 11.815570 l s
/Courier-latin1 ff 0.700000 scf sf
(statement) 44.620458 12.615570 m gs 1 -1 sc sh gr
0.100000 slw
[] 0 sd
[] 0 sd
0 slc
n 49.220458 11.215570 m 50.233546 9.580117 l s
[] 0 sd
0 slj
0 slc
n 50.431022 9.261325 m 50.380248 9.818032 l 50.233546 9.580117 l 49.955192 9.554730 l f
n 50.431022 9.261325 m 50.380248 9.818032 l 50.233546 9.580117 l 49.955192 9.554730 l cp s
0.200000 slw
[] 0 sd
[] 0 sd
0 slc
n 10.635458 8.103275 m 6.344338 8.103275 l s
0 slj
n 10.635458 8.353275 m 11.135458 8.103275 l 10.635458 7.853275 l f
0 slj
n 6.344338 7.853275 m 5.844338 8.103275 l 6.344338 8.353275 l f
0.200000 slw
[] 0 sd
[] 0 sd
0 slc
n 48.635458 8.103275 m 44.344338 8.103275 l s
0 slj
n 48.635458 8.353275 m 49.135458 8.103275 l 48.635458 7.853275 l f
0 slj
n 44.344338 7.853275 m 43.844338 8.103275 l 44.344338 8.353275 l f
0.200000 slw
[] 0 sd
[] 0 sd
0 slc
n 40.635458 8.103275 m 14.344338 8.103275 l s
0 slj
n 40.635458 8.353275 m 41.135458 8.103275 l 40.635458 7.853275 l f
0 slj
n 14.344338 7.853275 m 13.844338 8.103275 l 14.344338 8.353275 l f
/Helvetica-latin1 ff 0.700000 scf sf
(psp) 5.880458 10.082870 m gs 1 -1 sc sh gr
/Helvetica-latin1 ff 0.700000 scf sf
(psp) 43.865458 10.447870 m gs 1 -1 sc sh gr
/Helvetica-latin1 ff 0.700000 scf sf
(nsp) 10.615458 10.097870 m gs 1 -1 sc sh gr
/Helvetica-latin1 ff 0.700000 scf sf
(nsp) 48.415458 10.597870 m gs 1 -1 sc sh gr
showpage
