%!PS-Adobe-2.0 EPSF-2.0
%%Title: ss2pi_exprbin.dia
%%Creator: Dia v0.93
%%CreationDate: Sun May 22 21:29:19 2005
%%For: ps
%%Orientation: Portrait
%%Magnification: 1.0000
%%BoundingBox: 0 0 1350 615
%%BeginSetup
%%EndSetup
%%EndComments
%%BeginProlog
[ /.notdef /.notdef /.notdef /.notdef /.notdef /.notdef /.notdef /.notdef /.notdef /.notdef
/.notdef /.notdef /.notdef /.notdef /.notdef /.notdef /.notdef /.notdef /.notdef /.notdef
/.notdef /.notdef /.notdef /.notdef /.notdef /.notdef /.notdef /.notdef /.notdef /.notdef
/.notdef /.notdef /space /exclam /quotedbl /numbersign /dollar /percent /ampersand /quoteright
/parenleft /parenright /asterisk /plus /comma /hyphen /period /slash /zero /one
/two /three /four /five /six /seven /eight /nine /colon /semicolon
/less /equal /greater /question /at /A /B /C /D /E
/F /G /H /I /J /K /L /M /N /O
/P /Q /R /S /T /U /V /W /X /Y
/Z /bracketleft /backslash /bracketright /asciicircum /underscore /quoteleft /a /b /c
/d /e /f /g /h /i /j /k /l /m
/n /o /p /q /r /s /t /u /v /w
/x /y /z /braceleft /bar /braceright /asciitilde /.notdef /.notdef /.notdef
/.notdef /.notdef /.notdef /.notdef /.notdef /.notdef /.notdef /.notdef /.notdef /.notdef
/.notdef /.notdef /.notdef /.notdef /.notdef /.notdef /.notdef /.notdef /.notdef /.notdef
/.notdef /.notdef /.notdef /.notdef /.notdef /.notdef /.notdef /.notdef /.notdef /.notdef
/space /exclamdown /cent /sterling /currency /yen /brokenbar /section /dieresis /copyright
/ordfeminine /guillemotleft /logicalnot /hyphen /registered /macron /degree /plusminus /twosuperior /threesuperior
/acute /mu /paragraph /periodcentered /cedilla /onesuperior /ordmasculine /guillemotright /onequarter /onehalf
/threequarters /questiondown /Agrave /Aacute /Acircumflex /Atilde /Adieresis /Aring /AE /Ccedilla
/Egrave /Eacute /Ecircumflex /Edieresis /Igrave /Iacute /Icircumflex /Idieresis /Eth /Ntilde
/Ograve /Oacute /Ocircumflex /Otilde /Odieresis /multiply /Oslash /Ugrave /Uacute /Ucircumflex
/Udieresis /Yacute /Thorn /germandbls /agrave /aacute /acircumflex /atilde /adieresis /aring
/ae /ccedilla /egrave /eacute /ecircumflex /edieresis /igrave /iacute /icircumflex /idieresis
/eth /ntilde /ograve /oacute /ocircumflex /otilde /odieresis /divide /oslash /ugrave
/uacute /ucircumflex /udieresis /yacute /thorn /ydieresis] /isolatin1encoding exch def
/cp {closepath} bind def
/c {curveto} bind def
/f {fill} bind def
/a {arc} bind def
/ef {eofill} bind def
/ex {exch} bind def
/gr {grestore} bind def
/gs {gsave} bind def
/sa {save} bind def
/rs {restore} bind def
/l {lineto} bind def
/m {moveto} bind def
/rm {rmoveto} bind def
/n {newpath} bind def
/s {stroke} bind def
/sh {show} bind def
/slc {setlinecap} bind def
/slj {setlinejoin} bind def
/slw {setlinewidth} bind def
/srgb {setrgbcolor} bind def
/rot {rotate} bind def
/sc {scale} bind def
/sd {setdash} bind def
/ff {findfont} bind def
/sf {setfont} bind def
/scf {scalefont} bind def
/sw {stringwidth pop} bind def
/tr {translate} bind def

/ellipsedict 8 dict def
ellipsedict /mtrx matrix put
/ellipse
{ ellipsedict begin
   /endangle exch def
   /startangle exch def
   /yrad exch def
   /xrad exch def
   /y exch def
   /x exch def   /savematrix mtrx currentmatrix def
   x y tr xrad yrad sc
   0 0 1 startangle endangle arc
   savematrix setmatrix
   end
} def

/mergeprocs {
dup length
3 -1 roll
dup
length
dup
5 1 roll
3 -1 roll
add
array cvx
dup
3 -1 roll
0 exch
putinterval
dup
4 2 roll
putinterval
} bind def
/Times-Roman-latin1
    /Times-Roman findfont
    dup length dict begin
	{1 index /FID ne {def} {pop pop} ifelse} forall
	/Encoding isolatin1encoding def
    currentdict end
definefont pop
/Times-Italic-latin1
    /Times-Italic findfont
    dup length dict begin
	{1 index /FID ne {def} {pop pop} ifelse} forall
	/Encoding isolatin1encoding def
    currentdict end
definefont pop
/Times-Bold-latin1
    /Times-Bold findfont
    dup length dict begin
	{1 index /FID ne {def} {pop pop} ifelse} forall
	/Encoding isolatin1encoding def
    currentdict end
definefont pop
/Times-BoldItalic-latin1
    /Times-BoldItalic findfont
    dup length dict begin
	{1 index /FID ne {def} {pop pop} ifelse} forall
	/Encoding isolatin1encoding def
    currentdict end
definefont pop
/AvantGarde-Book-latin1
    /AvantGarde-Book findfont
    dup length dict begin
	{1 index /FID ne {def} {pop pop} ifelse} forall
	/Encoding isolatin1encoding def
    currentdict end
definefont pop
/AvantGarde-BookOblique-latin1
    /AvantGarde-BookOblique findfont
    dup length dict begin
	{1 index /FID ne {def} {pop pop} ifelse} forall
	/Encoding isolatin1encoding def
    currentdict end
definefont pop
/AvantGarde-Demi-latin1
    /AvantGarde-Demi findfont
    dup length dict begin
	{1 index /FID ne {def} {pop pop} ifelse} forall
	/Encoding isolatin1encoding def
    currentdict end
definefont pop
/AvantGarde-DemiOblique-latin1
    /AvantGarde-DemiOblique findfont
    dup length dict begin
	{1 index /FID ne {def} {pop pop} ifelse} forall
	/Encoding isolatin1encoding def
    currentdict end
definefont pop
/Bookman-Light-latin1
    /Bookman-Light findfont
    dup length dict begin
	{1 index /FID ne {def} {pop pop} ifelse} forall
	/Encoding isolatin1encoding def
    currentdict end
definefont pop
/Bookman-LightItalic-latin1
    /Bookman-LightItalic findfont
    dup length dict begin
	{1 index /FID ne {def} {pop pop} ifelse} forall
	/Encoding isolatin1encoding def
    currentdict end
definefont pop
/Bookman-Demi-latin1
    /Bookman-Demi findfont
    dup length dict begin
	{1 index /FID ne {def} {pop pop} ifelse} forall
	/Encoding isolatin1encoding def
    currentdict end
definefont pop
/Bookman-DemiItalic-latin1
    /Bookman-DemiItalic findfont
    dup length dict begin
	{1 index /FID ne {def} {pop pop} ifelse} forall
	/Encoding isolatin1encoding def
    currentdict end
definefont pop
/Courier-latin1
    /Courier findfont
    dup length dict begin
	{1 index /FID ne {def} {pop pop} ifelse} forall
	/Encoding isolatin1encoding def
    currentdict end
definefont pop
/Courier-Oblique-latin1
    /Courier-Oblique findfont
    dup length dict begin
	{1 index /FID ne {def} {pop pop} ifelse} forall
	/Encoding isolatin1encoding def
    currentdict end
definefont pop
/Courier-Bold-latin1
    /Courier-Bold findfont
    dup length dict begin
	{1 index /FID ne {def} {pop pop} ifelse} forall
	/Encoding isolatin1encoding def
    currentdict end
definefont pop
/Courier-BoldOblique-latin1
    /Courier-BoldOblique findfont
    dup length dict begin
	{1 index /FID ne {def} {pop pop} ifelse} forall
	/Encoding isolatin1encoding def
    currentdict end
definefont pop
/Helvetica-latin1
    /Helvetica findfont
    dup length dict begin
	{1 index /FID ne {def} {pop pop} ifelse} forall
	/Encoding isolatin1encoding def
    currentdict end
definefont pop
/Helvetica-Oblique-latin1
    /Helvetica-Oblique findfont
    dup length dict begin
	{1 index /FID ne {def} {pop pop} ifelse} forall
	/Encoding isolatin1encoding def
    currentdict end
definefont pop
/Helvetica-Bold-latin1
    /Helvetica-Bold findfont
    dup length dict begin
	{1 index /FID ne {def} {pop pop} ifelse} forall
	/Encoding isolatin1encoding def
    currentdict end
definefont pop
/Helvetica-BoldOblique-latin1
    /Helvetica-BoldOblique findfont
    dup length dict begin
	{1 index /FID ne {def} {pop pop} ifelse} forall
	/Encoding isolatin1encoding def
    currentdict end
definefont pop
/Helvetica-Narrow-latin1
    /Helvetica-Narrow findfont
    dup length dict begin
	{1 index /FID ne {def} {pop pop} ifelse} forall
	/Encoding isolatin1encoding def
    currentdict end
definefont pop
/Helvetica-Narrow-Oblique-latin1
    /Helvetica-Narrow-Oblique findfont
    dup length dict begin
	{1 index /FID ne {def} {pop pop} ifelse} forall
	/Encoding isolatin1encoding def
    currentdict end
definefont pop
/Helvetica-Narrow-Bold-latin1
    /Helvetica-Narrow-Bold findfont
    dup length dict begin
	{1 index /FID ne {def} {pop pop} ifelse} forall
	/Encoding isolatin1encoding def
    currentdict end
definefont pop
/Helvetica-Narrow-BoldOblique-latin1
    /Helvetica-Narrow-BoldOblique findfont
    dup length dict begin
	{1 index /FID ne {def} {pop pop} ifelse} forall
	/Encoding isolatin1encoding def
    currentdict end
definefont pop
/NewCenturySchoolbook-Roman-latin1
    /NewCenturySchoolbook-Roman findfont
    dup length dict begin
	{1 index /FID ne {def} {pop pop} ifelse} forall
	/Encoding isolatin1encoding def
    currentdict end
definefont pop
/NewCenturySchoolbook-Italic-latin1
    /NewCenturySchoolbook-Italic findfont
    dup length dict begin
	{1 index /FID ne {def} {pop pop} ifelse} forall
	/Encoding isolatin1encoding def
    currentdict end
definefont pop
/NewCenturySchoolbook-Bold-latin1
    /NewCenturySchoolbook-Bold findfont
    dup length dict begin
	{1 index /FID ne {def} {pop pop} ifelse} forall
	/Encoding isolatin1encoding def
    currentdict end
definefont pop
/NewCenturySchoolbook-BoldItalic-latin1
    /NewCenturySchoolbook-BoldItalic findfont
    dup length dict begin
	{1 index /FID ne {def} {pop pop} ifelse} forall
	/Encoding isolatin1encoding def
    currentdict end
definefont pop
/Palatino-Roman-latin1
    /Palatino-Roman findfont
    dup length dict begin
	{1 index /FID ne {def} {pop pop} ifelse} forall
	/Encoding isolatin1encoding def
    currentdict end
definefont pop
/Palatino-Italic-latin1
    /Palatino-Italic findfont
    dup length dict begin
	{1 index /FID ne {def} {pop pop} ifelse} forall
	/Encoding isolatin1encoding def
    currentdict end
definefont pop
/Palatino-Bold-latin1
    /Palatino-Bold findfont
    dup length dict begin
	{1 index /FID ne {def} {pop pop} ifelse} forall
	/Encoding isolatin1encoding def
    currentdict end
definefont pop
/Palatino-BoldItalic-latin1
    /Palatino-BoldItalic findfont
    dup length dict begin
	{1 index /FID ne {def} {pop pop} ifelse} forall
	/Encoding isolatin1encoding def
    currentdict end
definefont pop
/Symbol-latin1
    /Symbol findfont
definefont pop
/ZapfChancery-MediumItalic-latin1
    /ZapfChancery-MediumItalic findfont
    dup length dict begin
	{1 index /FID ne {def} {pop pop} ifelse} forall
	/Encoding isolatin1encoding def
    currentdict end
definefont pop
/ZapfDingbats-latin1
    /ZapfDingbats findfont
    dup length dict begin
	{1 index /FID ne {def} {pop pop} ifelse} forall
	/Encoding isolatin1encoding def
    currentdict end
definefont pop
28.346000 -28.346000 scale
-5.950000 -26.450000 translate
%%EndProlog


0.100000 slw
[] 0 sd
1.000000 1.000000 1.000000 srgb
n 13.000000 12.000000 m 13.000000 13.600000 l 20.950000 13.600000 l 20.950000 12.000000 l f
0.000000 0.000000 0.000000 srgb
n 13.000000 12.000000 m 13.000000 13.600000 l 20.950000 13.600000 l 20.950000 12.000000 l cp s
/Helvetica-latin1 ff 0.840000 scf sf
(ss_add) dup sw 2 div 16.975000 ex sub 13.200000 m gs 1 -1 sc sh gr
1.000000 1.000000 1.000000 srgb
n 13.000000 13.600000 m 13.000000 18.600000 l 20.950000 18.600000 l 20.950000 13.600000 l f
0.000000 0.000000 0.000000 srgb
n 13.000000 13.600000 m 13.000000 18.600000 l 20.950000 18.600000 l 20.950000 13.600000 l cp s
/Courier-latin1 ff 0.560000 scf sf
(+type: ss_type = sint) 13.150000 14.300000 m gs 1 -1 sc sh gr
/Courier-latin1 ff 0.560000 scf sf
(+psp: ss_sp) 13.150000 15.100000 m gs 1 -1 sc sh gr
/Courier-latin1 ff 0.560000 scf sf
(+nsp: ss_sp) 13.150000 15.900000 m gs 1 -1 sc sh gr
/Courier-latin1 ff 0.560000 scf sf
(+left: ss_expression) 13.150000 16.700000 m gs 1 -1 sc sh gr
/Courier-latin1 ff 0.560000 scf sf
(+right: ss_expression) 13.150000 17.500000 m gs 1 -1 sc sh gr
/Courier-latin1 ff 0.560000 scf sf
(+...) 13.150000 18.300000 m gs 1 -1 sc sh gr
0.100000 slw
[] 0 sd
1.000000 1.000000 1.000000 srgb
n 6.000000 5.000000 m 6.000000 6.600000 l 15.000000 6.600000 l 15.000000 5.000000 l f
0.000000 0.000000 0.000000 srgb
n 6.000000 5.000000 m 6.000000 6.600000 l 15.000000 6.600000 l 15.000000 5.000000 l cp s
/Helvetica-latin1 ff 0.840000 scf sf
(ss_sp) dup sw 2 div 10.500000 ex sub 6.200000 m gs 1 -1 sc sh gr
1.000000 1.000000 1.000000 srgb
n 6.000000 6.600000 m 6.000000 10.800000 l 15.000000 10.800000 l 15.000000 6.600000 l f
0.000000 0.000000 0.000000 srgb
n 6.000000 6.600000 m 6.000000 10.800000 l 15.000000 10.800000 l 15.000000 6.600000 l cp s
/Courier-latin1 ff 0.560000 scf sf
(+psp: ss_sp) 6.150000 7.300000 m gs 1 -1 sc sh gr
/Courier-latin1 ff 0.560000 scf sf
(+nsp: ss_sp) 6.150000 8.100000 m gs 1 -1 sc sh gr
/Courier-latin1 ff 0.560000 scf sf
(+pi_spe: pi_sp = pi_sp 1) 6.150000 8.900000 m gs 1 -1 sc sh gr
/Courier-latin1 ff 0.560000 scf sf
(+level: ulint = n1) 6.150000 9.700000 m gs 1 -1 sc sh gr
/Courier-latin1 ff 0.560000 scf sf
(+...) 6.150000 10.500000 m gs 1 -1 sc sh gr
0.100000 slw
[] 0 sd
1.000000 1.000000 1.000000 srgb
n 21.000000 5.000000 m 21.000000 6.600000 l 30.000000 6.600000 l 30.000000 5.000000 l f
0.000000 0.000000 0.000000 srgb
n 21.000000 5.000000 m 21.000000 6.600000 l 30.000000 6.600000 l 30.000000 5.000000 l cp s
/Helvetica-latin1 ff 0.840000 scf sf
(ss_sp) dup sw 2 div 25.500000 ex sub 6.200000 m gs 1 -1 sc sh gr
1.000000 1.000000 1.000000 srgb
n 21.000000 6.600000 m 21.000000 10.800000 l 30.000000 10.800000 l 30.000000 6.600000 l f
0.000000 0.000000 0.000000 srgb
n 21.000000 6.600000 m 21.000000 10.800000 l 30.000000 10.800000 l 30.000000 6.600000 l cp s
/Courier-latin1 ff 0.560000 scf sf
(+psp: ss_sp) 21.150000 7.300000 m gs 1 -1 sc sh gr
/Courier-latin1 ff 0.560000 scf sf
(+nsp: ss_sp) 21.150000 8.100000 m gs 1 -1 sc sh gr
/Courier-latin1 ff 0.560000 scf sf
(+pi_spe: pi_sp = pi_sp 2) 21.150000 8.900000 m gs 1 -1 sc sh gr
/Courier-latin1 ff 0.560000 scf sf
(+level: ulint = n2) 21.150000 9.700000 m gs 1 -1 sc sh gr
/Courier-latin1 ff 0.560000 scf sf
(+...) 21.150000 10.500000 m gs 1 -1 sc sh gr
0.100000 slw
[] 0 sd
1.000000 1.000000 1.000000 srgb
n 6.000000 21.000000 m 6.000000 22.600000 l 9.550000 22.600000 l 9.550000 21.000000 l f
0.000000 0.000000 0.000000 srgb
n 6.000000 21.000000 m 6.000000 22.600000 l 9.550000 22.600000 l 9.550000 21.000000 l cp s
/Helvetica-latin1 ff 0.840000 scf sf
(expr1) dup sw 2 div 7.775000 ex sub 22.200000 m gs 1 -1 sc sh gr
1.000000 1.000000 1.000000 srgb
n 6.000000 22.600000 m 6.000000 23.600000 l 9.550000 23.600000 l 9.550000 22.600000 l f
0.000000 0.000000 0.000000 srgb
n 6.000000 22.600000 m 6.000000 23.600000 l 9.550000 23.600000 l 9.550000 22.600000 l cp s
/Courier-latin1 ff 0.560000 scf sf
(+...) 6.150000 23.300000 m gs 1 -1 sc sh gr
0.100000 slw
[] 0 sd
1.000000 1.000000 1.000000 srgb
n 10.000000 21.000000 m 10.000000 22.600000 l 13.550000 22.600000 l 13.550000 21.000000 l f
0.000000 0.000000 0.000000 srgb
n 10.000000 21.000000 m 10.000000 22.600000 l 13.550000 22.600000 l 13.550000 21.000000 l cp s
/Helvetica-latin1 ff 0.840000 scf sf
(expr2) dup sw 2 div 11.775000 ex sub 22.200000 m gs 1 -1 sc sh gr
1.000000 1.000000 1.000000 srgb
n 10.000000 22.600000 m 10.000000 23.600000 l 13.550000 23.600000 l 13.550000 22.600000 l f
0.000000 0.000000 0.000000 srgb
n 10.000000 22.600000 m 10.000000 23.600000 l 13.550000 23.600000 l 13.550000 22.600000 l cp s
/Courier-latin1 ff 0.560000 scf sf
(+...) 10.150000 23.300000 m gs 1 -1 sc sh gr
0.100000 slw
[] 0 sd
1.000000 1.000000 1.000000 srgb
n 35.000000 12.000000 m 35.000000 13.600000 l 41.900000 13.600000 l 41.900000 12.000000 l f
0.000000 0.000000 0.000000 srgb
n 35.000000 12.000000 m 35.000000 13.600000 l 41.900000 13.600000 l 41.900000 12.000000 l cp s
/Helvetica-latin1 ff 0.840000 scf sf
(pi_sp 1) dup sw 2 div 38.450000 ex sub 13.200000 m gs 1 -1 sc sh gr
1.000000 1.000000 1.000000 srgb
n 35.000000 13.600000 m 35.000000 17.000000 l 41.900000 17.000000 l 41.900000 13.600000 l f
0.000000 0.000000 0.000000 srgb
n 35.000000 13.600000 m 35.000000 17.000000 l 41.900000 17.000000 l 41.900000 13.600000 l cp s
/Courier-latin1 ff 0.560000 scf sf
(+psp: pi_sp) 35.150000 14.300000 m gs 1 -1 sc sh gr
/Courier-latin1 ff 0.560000 scf sf
(+nsp: ss_sp) 35.150000 15.100000 m gs 1 -1 sc sh gr
/Courier-latin1 ff 0.560000 scf sf
(+level: ulint = n1) 35.150000 15.900000 m gs 1 -1 sc sh gr
/Courier-latin1 ff 0.560000 scf sf
(+...) 35.150000 16.700000 m gs 1 -1 sc sh gr
0.100000 slw
[] 0 sd
1.000000 1.000000 1.000000 srgb
n 46.000000 12.000000 m 46.000000 13.600000 l 52.900000 13.600000 l 52.900000 12.000000 l f
0.000000 0.000000 0.000000 srgb
n 46.000000 12.000000 m 46.000000 13.600000 l 52.900000 13.600000 l 52.900000 12.000000 l cp s
/Helvetica-latin1 ff 0.840000 scf sf
(pi_sp 2) dup sw 2 div 49.450000 ex sub 13.200000 m gs 1 -1 sc sh gr
1.000000 1.000000 1.000000 srgb
n 46.000000 13.600000 m 46.000000 17.000000 l 52.900000 17.000000 l 52.900000 13.600000 l f
0.000000 0.000000 0.000000 srgb
n 46.000000 13.600000 m 46.000000 17.000000 l 52.900000 17.000000 l 52.900000 13.600000 l cp s
/Courier-latin1 ff 0.560000 scf sf
(+psp: pi_sp) 46.150000 14.300000 m gs 1 -1 sc sh gr
/Courier-latin1 ff 0.560000 scf sf
(+nsp: ss_sp) 46.150000 15.100000 m gs 1 -1 sc sh gr
/Courier-latin1 ff 0.560000 scf sf
(+level: ulint = n2) 46.150000 15.900000 m gs 1 -1 sc sh gr
/Courier-latin1 ff 0.560000 scf sf
(+...) 46.150000 16.700000 m gs 1 -1 sc sh gr
0.100000 slw
[] 0 sd
1.000000 1.000000 1.000000 srgb
n 40.000000 19.000000 m 40.000000 20.600000 l 52.500000 20.600000 l 52.500000 19.000000 l f
0.000000 0.000000 0.000000 srgb
n 40.000000 19.000000 m 40.000000 20.600000 l 52.500000 20.600000 l 52.500000 19.000000 l cp s
/Helvetica-latin1 ff 0.840000 scf sf
(pi_add) dup sw 2 div 46.250000 ex sub 20.200000 m gs 1 -1 sc sh gr
1.000000 1.000000 1.000000 srgb
n 40.000000 20.600000 m 40.000000 26.400000 l 52.500000 26.400000 l 52.500000 20.600000 l f
0.000000 0.000000 0.000000 srgb
n 40.000000 20.600000 m 40.000000 26.400000 l 52.500000 26.400000 l 52.500000 20.600000 l cp s
/Courier-latin1 ff 0.560000 scf sf
(+psp: pi_sp) 40.150000 21.300000 m gs 1 -1 sc sh gr
/Courier-latin1 ff 0.560000 scf sf
(+nsp: ss_sp) 40.150000 22.100000 m gs 1 -1 sc sh gr
/Courier-latin1 ff 0.560000 scf sf
(+level: ulint = n3) 40.150000 22.900000 m gs 1 -1 sc sh gr
/Courier-latin1 ff 0.560000 scf sf
(+left: pi_non_mem = expr1 result) 40.150000 23.700000 m gs 1 -1 sc sh gr
/Courier-latin1 ff 0.560000 scf sf
(+right: pi_non_mem = expr2 result) 40.150000 24.500000 m gs 1 -1 sc sh gr
/Courier-latin1 ff 0.560000 scf sf
(+destination: pi_preg = add result) 40.150000 25.300000 m gs 1 -1 sc sh gr
/Courier-latin1 ff 0.560000 scf sf
(+type: tm_data_type = DT_INT32S) 40.150000 26.100000 m gs 1 -1 sc sh gr
0.100000 slw
[] 0 sd
1.000000 1.000000 1.000000 srgb
n 36.000000 5.000000 m 44.400000 5.000000 l 45.000000 5.600000 l 45.000000 10.900000 l 36.000000 10.900000 l f
0.000000 0.000000 0.000000 srgb
n 36.000000 5.000000 m 44.400000 5.000000 l 45.000000 5.600000 l 45.000000 10.900000 l 36.000000 10.900000 l cp s
0.050000 slw
n 44.400000 5.000000 m 44.400000 5.600000 l 45.000000 5.600000 l s
/Courier-latin1 ff 0.700000 scf sf
(...) 36.350000 6.400000 m gs 1 -1 sc sh gr
(store expr1 result) 36.350000 7.400000 m gs 1 -1 sc sh gr
(...) 36.350000 8.400000 m gs 1 -1 sc sh gr
(store expr2 result) 36.350000 9.400000 m gs 1 -1 sc sh gr
(...) 36.350000 10.400000 m gs 1 -1 sc sh gr
0.100000 slw
[] 0 sd
[] 0 sd
0 slc
0 slj
0 slc
0 slj
[] 0 sd
1.000000 1.000000 1.000000 srgb
n 28.000000 17.250000 m 31.000000 17.250000 l 31.000000 15.000000 l 34.000000 19.500000 l 31.000000 24.000000 l 31.000000 21.750000 l 28.000000 21.750000 l f
0.000000 0.000000 0.000000 srgb
n 28.000000 17.250000 m 31.000000 17.250000 l 31.000000 15.000000 l 34.000000 19.500000 l 31.000000 24.000000 l 31.000000 21.750000 l 28.000000 21.750000 l cp s
0.010000 slw
0 slc
0 slj
[] 0 sd
n 28.000000 17.250000 m 31.000000 17.250000 l 31.000000 15.000000 l 34.000000 19.500000 l 31.000000 24.000000 l 31.000000 21.750000 l 28.000000 21.750000 l cp s
0.100000 slw
[] 0 sd
[] 0 sd
0 slj
0 slc
n 13.000000 14.900000 m 10.500000 14.900000 l 10.500000 11.286803 l s
[] 0 sd
0 slj
0 slc
n 10.500000 10.911803 m 10.750000 11.411803 l 10.500000 11.286803 l 10.250000 11.411803 l f
n 10.500000 10.911803 m 10.750000 11.411803 l 10.500000 11.286803 l 10.250000 11.411803 l cp s
0.100000 slw
[] 0 sd
[] 0 sd
0 slj
0 slc
n 20.950000 15.700000 m 25.500000 15.700000 l 25.500000 11.286803 l s
[] 0 sd
0 slj
0 slc
n 25.500000 10.911803 m 25.750000 11.411803 l 25.500000 11.286803 l 25.250000 11.411803 l f
n 25.500000 10.911803 m 25.750000 11.411803 l 25.500000 11.286803 l 25.250000 11.411803 l cp s
0.100000 slw
[] 0 sd
[] 0 sd
0 slj
0 slc
n 13.000000 16.500000 m 7.775000 16.500000 l 7.775000 20.513197 l s
[] 0 sd
0 slj
0 slc
n 7.775000 20.888197 m 7.525000 20.388197 l 7.775000 20.513197 l 8.025000 20.388197 l f
n 7.775000 20.888197 m 7.525000 20.388197 l 7.775000 20.513197 l 8.025000 20.388197 l cp s
0.100000 slw
[] 0 sd
[] 0 sd
0 slj
0 slc
n 13.000000 17.300000 m 11.775000 17.300000 l 11.775000 20.513197 l s
[] 0 sd
0 slj
0 slc
n 11.775000 20.888197 m 11.525000 20.388197 l 11.775000 20.513197 l 12.025000 20.388197 l f
n 11.775000 20.888197 m 11.525000 20.388197 l 11.775000 20.513197 l 12.025000 20.388197 l cp s
0.100000 slw
[] 0 sd
[] 0 sd
0 slj
0 slc
n 35.000000 14.100000 m 34.000000 14.100000 l 34.000000 5.275000 l 35.638197 5.275000 l s
[] 0 sd
0 slj
0 slc
n 36.013197 5.275000 m 35.513197 5.525000 l 35.638197 5.275000 l 35.513197 5.025000 l f
n 36.013197 5.275000 m 35.513197 5.525000 l 35.638197 5.275000 l 35.513197 5.025000 l cp s
0.100000 slw
[] 0 sd
[] 0 sd
0 slj
0 slc
n 40.000000 21.100000 m 38.450000 21.100000 l 38.450000 17.486803 l s
[] 0 sd
0 slj
0 slc
n 38.450000 17.111803 m 38.700000 17.611803 l 38.450000 17.486803 l 38.200000 17.611803 l f
n 38.450000 17.111803 m 38.700000 17.611803 l 38.450000 17.486803 l 38.200000 17.611803 l cp s
0.100000 slw
[] 0 sd
[] 0 sd
0 slj
0 slc
n 52.500000 21.900000 m 53.500000 21.900000 l 53.500000 18.150000 l 49.450000 18.150000 l 49.450000 17.486803 l s
[] 0 sd
0 slj
0 slc
n 49.450000 17.111803 m 49.700000 17.611803 l 49.450000 17.486803 l 49.200000 17.611803 l f
n 49.450000 17.111803 m 49.700000 17.611803 l 49.450000 17.486803 l 49.200000 17.611803 l cp s
showpage
