%!PS-Adobe-2.0 EPSF-2.0
%%Title: ss2pi_exprstmt.dia
%%Creator: Dia v0.93
%%CreationDate: Wed Apr 27 19:28:33 2005
%%For: ps
%%Orientation: Portrait
%%Magnification: 1.0000
%%BoundingBox: 0 0 812 527
%%BeginSetup
%%EndSetup
%%EndComments
%%BeginProlog
[ /.notdef /.notdef /.notdef /.notdef /.notdef /.notdef /.notdef /.notdef /.notdef /.notdef
/.notdef /.notdef /.notdef /.notdef /.notdef /.notdef /.notdef /.notdef /.notdef /.notdef
/.notdef /.notdef /.notdef /.notdef /.notdef /.notdef /.notdef /.notdef /.notdef /.notdef
/.notdef /.notdef /space /exclam /quotedbl /numbersign /dollar /percent /ampersand /quoteright
/parenleft /parenright /asterisk /plus /comma /hyphen /period /slash /zero /one
/two /three /four /five /six /seven /eight /nine /colon /semicolon
/less /equal /greater /question /at /A /B /C /D /E
/F /G /H /I /J /K /L /M /N /O
/P /Q /R /S /T /U /V /W /X /Y
/Z /bracketleft /backslash /bracketright /asciicircum /underscore /quoteleft /a /b /c
/d /e /f /g /h /i /j /k /l /m
/n /o /p /q /r /s /t /u /v /w
/x /y /z /braceleft /bar /braceright /asciitilde /.notdef /.notdef /.notdef
/.notdef /.notdef /.notdef /.notdef /.notdef /.notdef /.notdef /.notdef /.notdef /.notdef
/.notdef /.notdef /.notdef /.notdef /.notdef /.notdef /.notdef /.notdef /.notdef /.notdef
/.notdef /.notdef /.notdef /.notdef /.notdef /.notdef /.notdef /.notdef /.notdef /.notdef
/space /exclamdown /cent /sterling /currency /yen /brokenbar /section /dieresis /copyright
/ordfeminine /guillemotleft /logicalnot /hyphen /registered /macron /degree /plusminus /twosuperior /threesuperior
/acute /mu /paragraph /periodcentered /cedilla /onesuperior /ordmasculine /guillemotright /onequarter /onehalf
/threequarters /questiondown /Agrave /Aacute /Acircumflex /Atilde /Adieresis /Aring /AE /Ccedilla
/Egrave /Eacute /Ecircumflex /Edieresis /Igrave /Iacute /Icircumflex /Idieresis /Eth /Ntilde
/Ograve /Oacute /Ocircumflex /Otilde /Odieresis /multiply /Oslash /Ugrave /Uacute /Ucircumflex
/Udieresis /Yacute /Thorn /germandbls /agrave /aacute /acircumflex /atilde /adieresis /aring
/ae /ccedilla /egrave /eacute /ecircumflex /edieresis /igrave /iacute /icircumflex /idieresis
/eth /ntilde /ograve /oacute /ocircumflex /otilde /odieresis /divide /oslash /ugrave
/uacute /ucircumflex /udieresis /yacute /thorn /ydieresis] /isolatin1encoding exch def
/cp {closepath} bind def
/c {curveto} bind def
/f {fill} bind def
/a {arc} bind def
/ef {eofill} bind def
/ex {exch} bind def
/gr {grestore} bind def
/gs {gsave} bind def
/sa {save} bind def
/rs {restore} bind def
/l {lineto} bind def
/m {moveto} bind def
/rm {rmoveto} bind def
/n {newpath} bind def
/s {stroke} bind def
/sh {show} bind def
/slc {setlinecap} bind def
/slj {setlinejoin} bind def
/slw {setlinewidth} bind def
/srgb {setrgbcolor} bind def
/rot {rotate} bind def
/sc {scale} bind def
/sd {setdash} bind def
/ff {findfont} bind def
/sf {setfont} bind def
/scf {scalefont} bind def
/sw {stringwidth pop} bind def
/tr {translate} bind def

/ellipsedict 8 dict def
ellipsedict /mtrx matrix put
/ellipse
{ ellipsedict begin
   /endangle exch def
   /startangle exch def
   /yrad exch def
   /xrad exch def
   /y exch def
   /x exch def   /savematrix mtrx currentmatrix def
   x y tr xrad yrad sc
   0 0 1 startangle endangle arc
   savematrix setmatrix
   end
} def

/mergeprocs {
dup length
3 -1 roll
dup
length
dup
5 1 roll
3 -1 roll
add
array cvx
dup
3 -1 roll
0 exch
putinterval
dup
4 2 roll
putinterval
} bind def
/Times-Roman-latin1
    /Times-Roman findfont
    dup length dict begin
	{1 index /FID ne {def} {pop pop} ifelse} forall
	/Encoding isolatin1encoding def
    currentdict end
definefont pop
/Times-Italic-latin1
    /Times-Italic findfont
    dup length dict begin
	{1 index /FID ne {def} {pop pop} ifelse} forall
	/Encoding isolatin1encoding def
    currentdict end
definefont pop
/Times-Bold-latin1
    /Times-Bold findfont
    dup length dict begin
	{1 index /FID ne {def} {pop pop} ifelse} forall
	/Encoding isolatin1encoding def
    currentdict end
definefont pop
/Times-BoldItalic-latin1
    /Times-BoldItalic findfont
    dup length dict begin
	{1 index /FID ne {def} {pop pop} ifelse} forall
	/Encoding isolatin1encoding def
    currentdict end
definefont pop
/AvantGarde-Book-latin1
    /AvantGarde-Book findfont
    dup length dict begin
	{1 index /FID ne {def} {pop pop} ifelse} forall
	/Encoding isolatin1encoding def
    currentdict end
definefont pop
/AvantGarde-BookOblique-latin1
    /AvantGarde-BookOblique findfont
    dup length dict begin
	{1 index /FID ne {def} {pop pop} ifelse} forall
	/Encoding isolatin1encoding def
    currentdict end
definefont pop
/AvantGarde-Demi-latin1
    /AvantGarde-Demi findfont
    dup length dict begin
	{1 index /FID ne {def} {pop pop} ifelse} forall
	/Encoding isolatin1encoding def
    currentdict end
definefont pop
/AvantGarde-DemiOblique-latin1
    /AvantGarde-DemiOblique findfont
    dup length dict begin
	{1 index /FID ne {def} {pop pop} ifelse} forall
	/Encoding isolatin1encoding def
    currentdict end
definefont pop
/Bookman-Light-latin1
    /Bookman-Light findfont
    dup length dict begin
	{1 index /FID ne {def} {pop pop} ifelse} forall
	/Encoding isolatin1encoding def
    currentdict end
definefont pop
/Bookman-LightItalic-latin1
    /Bookman-LightItalic findfont
    dup length dict begin
	{1 index /FID ne {def} {pop pop} ifelse} forall
	/Encoding isolatin1encoding def
    currentdict end
definefont pop
/Bookman-Demi-latin1
    /Bookman-Demi findfont
    dup length dict begin
	{1 index /FID ne {def} {pop pop} ifelse} forall
	/Encoding isolatin1encoding def
    currentdict end
definefont pop
/Bookman-DemiItalic-latin1
    /Bookman-DemiItalic findfont
    dup length dict begin
	{1 index /FID ne {def} {pop pop} ifelse} forall
	/Encoding isolatin1encoding def
    currentdict end
definefont pop
/Courier-latin1
    /Courier findfont
    dup length dict begin
	{1 index /FID ne {def} {pop pop} ifelse} forall
	/Encoding isolatin1encoding def
    currentdict end
definefont pop
/Courier-Oblique-latin1
    /Courier-Oblique findfont
    dup length dict begin
	{1 index /FID ne {def} {pop pop} ifelse} forall
	/Encoding isolatin1encoding def
    currentdict end
definefont pop
/Courier-Bold-latin1
    /Courier-Bold findfont
    dup length dict begin
	{1 index /FID ne {def} {pop pop} ifelse} forall
	/Encoding isolatin1encoding def
    currentdict end
definefont pop
/Courier-BoldOblique-latin1
    /Courier-BoldOblique findfont
    dup length dict begin
	{1 index /FID ne {def} {pop pop} ifelse} forall
	/Encoding isolatin1encoding def
    currentdict end
definefont pop
/Helvetica-latin1
    /Helvetica findfont
    dup length dict begin
	{1 index /FID ne {def} {pop pop} ifelse} forall
	/Encoding isolatin1encoding def
    currentdict end
definefont pop
/Helvetica-Oblique-latin1
    /Helvetica-Oblique findfont
    dup length dict begin
	{1 index /FID ne {def} {pop pop} ifelse} forall
	/Encoding isolatin1encoding def
    currentdict end
definefont pop
/Helvetica-Bold-latin1
    /Helvetica-Bold findfont
    dup length dict begin
	{1 index /FID ne {def} {pop pop} ifelse} forall
	/Encoding isolatin1encoding def
    currentdict end
definefont pop
/Helvetica-BoldOblique-latin1
    /Helvetica-BoldOblique findfont
    dup length dict begin
	{1 index /FID ne {def} {pop pop} ifelse} forall
	/Encoding isolatin1encoding def
    currentdict end
definefont pop
/Helvetica-Narrow-latin1
    /Helvetica-Narrow findfont
    dup length dict begin
	{1 index /FID ne {def} {pop pop} ifelse} forall
	/Encoding isolatin1encoding def
    currentdict end
definefont pop
/Helvetica-Narrow-Oblique-latin1
    /Helvetica-Narrow-Oblique findfont
    dup length dict begin
	{1 index /FID ne {def} {pop pop} ifelse} forall
	/Encoding isolatin1encoding def
    currentdict end
definefont pop
/Helvetica-Narrow-Bold-latin1
    /Helvetica-Narrow-Bold findfont
    dup length dict begin
	{1 index /FID ne {def} {pop pop} ifelse} forall
	/Encoding isolatin1encoding def
    currentdict end
definefont pop
/Helvetica-Narrow-BoldOblique-latin1
    /Helvetica-Narrow-BoldOblique findfont
    dup length dict begin
	{1 index /FID ne {def} {pop pop} ifelse} forall
	/Encoding isolatin1encoding def
    currentdict end
definefont pop
/NewCenturySchoolbook-Roman-latin1
    /NewCenturySchoolbook-Roman findfont
    dup length dict begin
	{1 index /FID ne {def} {pop pop} ifelse} forall
	/Encoding isolatin1encoding def
    currentdict end
definefont pop
/NewCenturySchoolbook-Italic-latin1
    /NewCenturySchoolbook-Italic findfont
    dup length dict begin
	{1 index /FID ne {def} {pop pop} ifelse} forall
	/Encoding isolatin1encoding def
    currentdict end
definefont pop
/NewCenturySchoolbook-Bold-latin1
    /NewCenturySchoolbook-Bold findfont
    dup length dict begin
	{1 index /FID ne {def} {pop pop} ifelse} forall
	/Encoding isolatin1encoding def
    currentdict end
definefont pop
/NewCenturySchoolbook-BoldItalic-latin1
    /NewCenturySchoolbook-BoldItalic findfont
    dup length dict begin
	{1 index /FID ne {def} {pop pop} ifelse} forall
	/Encoding isolatin1encoding def
    currentdict end
definefont pop
/Palatino-Roman-latin1
    /Palatino-Roman findfont
    dup length dict begin
	{1 index /FID ne {def} {pop pop} ifelse} forall
	/Encoding isolatin1encoding def
    currentdict end
definefont pop
/Palatino-Italic-latin1
    /Palatino-Italic findfont
    dup length dict begin
	{1 index /FID ne {def} {pop pop} ifelse} forall
	/Encoding isolatin1encoding def
    currentdict end
definefont pop
/Palatino-Bold-latin1
    /Palatino-Bold findfont
    dup length dict begin
	{1 index /FID ne {def} {pop pop} ifelse} forall
	/Encoding isolatin1encoding def
    currentdict end
definefont pop
/Palatino-BoldItalic-latin1
    /Palatino-BoldItalic findfont
    dup length dict begin
	{1 index /FID ne {def} {pop pop} ifelse} forall
	/Encoding isolatin1encoding def
    currentdict end
definefont pop
/Symbol-latin1
    /Symbol findfont
definefont pop
/ZapfChancery-MediumItalic-latin1
    /ZapfChancery-MediumItalic findfont
    dup length dict begin
	{1 index /FID ne {def} {pop pop} ifelse} forall
	/Encoding isolatin1encoding def
    currentdict end
definefont pop
/ZapfDingbats-latin1
    /ZapfDingbats findfont
    dup length dict begin
	{1 index /FID ne {def} {pop pop} ifelse} forall
	/Encoding isolatin1encoding def
    currentdict end
definefont pop
28.346000 -28.346000 scale
-3.035000 -37.465000 translate
%%EndProlog


0.100000 slw
[] 0 sd
[] 0 sd
0 slc
0.000000 0.000000 0.000000 srgb
n 6.490000 34.465000 m 5.168559 32.525699 l s
[] 0 sd
0 slj
0 slc
n 4.957397 32.215803 m 5.445544 32.488222 l 5.168559 32.525699 l 5.032350 32.769772 l f
n 4.957397 32.215803 m 5.445544 32.488222 l 5.168559 32.525699 l 5.032350 32.769772 l cp s
0.100000 slw
[] 0 sd
[] 0 sd
0 slc
0 slj
0 slc
0 slj
[] 0 sd
1.000000 1.000000 1.000000 srgb
n 4.768996 29.997400 m 5.019884 29.997400 l 5.772548 30.422602 6.148880 30.635203 6.148880 31.060405 c 6.148880 31.485607 5.897992 31.698208 5.019884 32.123410 c 4.768996 32.123410 l 4.016332 31.698208 3.640000 31.485607 3.640000 31.060405 c 3.640000 30.635203 3.890888 30.422602 4.768996 29.997400 c f
0.000000 0.000000 0.000000 srgb
n 4.768996 29.997400 m 5.019884 29.997400 l 5.772548 30.422602 6.148880 30.635203 6.148880 31.060405 c 6.148880 31.485607 5.897992 31.698208 5.019884 32.123410 c 4.768996 32.123410 l 4.016332 31.698208 3.640000 31.485607 3.640000 31.060405 c 3.640000 30.635203 3.890888 30.422602 4.768996 29.997400 c s
/Helvetica-latin1 ff 0.700000 scf sf
(SP) dup sw 2 div 4.894440 ex sub 31.310405 m gs 1 -1 sc sh gr
0.100000 slw
[] 0 sd
[] 0 sd
0 slc
0 slj
0 slc
0 slj
[] 0 sd
1.000000 1.000000 1.000000 srgb
n 12.768996 29.997400 m 13.019884 29.997400 l 13.772548 30.422602 14.148880 30.635203 14.148880 31.060405 c 14.148880 31.485607 13.897992 31.698208 13.019884 32.123410 c 12.768996 32.123410 l 12.016332 31.698208 11.640000 31.485607 11.640000 31.060405 c 11.640000 30.635203 11.890888 30.422602 12.768996 29.997400 c f
0.000000 0.000000 0.000000 srgb
n 12.768996 29.997400 m 13.019884 29.997400 l 13.772548 30.422602 14.148880 30.635203 14.148880 31.060405 c 14.148880 31.485607 13.897992 31.698208 13.019884 32.123410 c 12.768996 32.123410 l 12.016332 31.698208 11.640000 31.485607 11.640000 31.060405 c 11.640000 30.635203 11.890888 30.422602 12.768996 29.997400 c s
/Helvetica-latin1 ff 0.700000 scf sf
(SP) dup sw 2 div 12.894440 ex sub 31.310405 m gs 1 -1 sc sh gr
0.100000 slw
[] 0 sd
1.000000 1.000000 1.000000 srgb
n 6.490000 34.465000 m 11.290000 34.465000 l 11.890000 35.065000 l 11.890000 37.365000 l 6.490000 37.365000 l f
0.000000 0.000000 0.000000 srgb
n 6.490000 34.465000 m 11.290000 34.465000 l 11.890000 35.065000 l 11.890000 37.365000 l 6.490000 37.365000 l cp s
0.050000 slw
n 11.290000 34.465000 m 11.290000 35.065000 l 11.890000 35.065000 l s
/Courier-latin1 ff 0.700000 scf sf
(expression) 6.840000 35.865000 m gs 1 -1 sc sh gr
(statement) 6.840000 36.865000 m gs 1 -1 sc sh gr
0.100000 slw
[] 0 sd
[] 0 sd
0 slc
n 11.890000 34.465000 m 12.702533 32.570791 l s
[] 0 sd
0 slj
0 slc
n 12.850365 32.226159 m 12.883010 32.784222 l 12.702533 32.570791 l 12.423502 32.587113 l f
n 12.850365 32.226159 m 12.883010 32.784222 l 12.702533 32.570791 l 12.423502 32.587113 l cp s
0.100000 slw
[] 0 sd
[] 0 sd
0 slc
n 24.190000 34.282600 m 22.800994 32.569166 l s
[] 0 sd
0 slj
0 slc
n 22.564846 32.277861 m 23.073914 32.508835 l 22.800994 32.569166 l 22.685507 32.823700 l f
n 22.564846 32.277861 m 23.073914 32.508835 l 22.800994 32.569166 l 22.685507 32.823700 l cp s
0.100000 slw
[] 0 sd
[] 0 sd
0 slc
0 slj
0 slc
0 slj
[] 0 sd
1.000000 1.000000 1.000000 srgb
n 22.368996 30.065000 m 22.619884 30.065000 l 23.372548 30.490202 23.748880 30.702803 23.748880 31.128005 c 23.748880 31.553207 23.497992 31.765808 22.619884 32.191010 c 22.368996 32.191010 l 21.616332 31.765808 21.240000 31.553207 21.240000 31.128005 c 21.240000 30.702803 21.490888 30.490202 22.368996 30.065000 c f
0.000000 0.000000 0.000000 srgb
n 22.368996 30.065000 m 22.619884 30.065000 l 23.372548 30.490202 23.748880 30.702803 23.748880 31.128005 c 23.748880 31.553207 23.497992 31.765808 22.619884 32.191010 c 22.368996 32.191010 l 21.616332 31.765808 21.240000 31.553207 21.240000 31.128005 c 21.240000 30.702803 21.490888 30.490202 22.368996 30.065000 c s
/Helvetica-latin1 ff 0.700000 scf sf
(SP) dup sw 2 div 22.494440 ex sub 31.378005 m gs 1 -1 sc sh gr
0.100000 slw
[] 0 sd
[] 0 sd
0 slc
0 slj
0 slc
0 slj
[] 0 sd
1.000000 1.000000 1.000000 srgb
n 30.218996 30.065000 m 30.469884 30.065000 l 31.222548 30.490202 31.598880 30.702803 31.598880 31.128005 c 31.598880 31.553207 31.347992 31.765808 30.469884 32.191010 c 30.218996 32.191010 l 29.466332 31.765808 29.090000 31.553207 29.090000 31.128005 c 29.090000 30.702803 29.340888 30.490202 30.218996 30.065000 c f
0.000000 0.000000 0.000000 srgb
n 30.218996 30.065000 m 30.469884 30.065000 l 31.222548 30.490202 31.598880 30.702803 31.598880 31.128005 c 31.598880 31.553207 31.347992 31.765808 30.469884 32.191010 c 30.218996 32.191010 l 29.466332 31.765808 29.090000 31.553207 29.090000 31.128005 c 29.090000 30.702803 29.340888 30.490202 30.218996 30.065000 c s
/Helvetica-latin1 ff 0.700000 scf sf
(SP) dup sw 2 div 30.344440 ex sub 31.378005 m gs 1 -1 sc sh gr
0.100000 slw
[] 0 sd
1.000000 1.000000 1.000000 srgb
n 24.190000 34.282600 m 28.540000 34.282600 l 29.140000 34.882600 l 29.140000 36.182600 l 24.190000 36.182600 l f
0.000000 0.000000 0.000000 srgb
n 24.190000 34.282600 m 28.540000 34.282600 l 29.140000 34.882600 l 29.140000 36.182600 l 24.190000 36.182600 l cp s
0.050000 slw
n 28.540000 34.282600 m 28.540000 34.882600 l 29.140000 34.882600 l s
/Courier-latin1 ff 0.700000 scf sf
(statement) 24.540000 35.682600 m gs 1 -1 sc sh gr
0.100000 slw
[] 0 sd
[] 0 sd
0 slc
n 29.140000 34.282600 m 30.101513 32.612868 l s
[] 0 sd
0 slj
0 slc
n 30.288647 32.287898 m 30.255783 32.845948 l 30.101513 32.612868 l 29.822488 32.596436 l f
n 30.288647 32.287898 m 30.255783 32.845948 l 30.101513 32.612868 l 29.822488 32.596436 l cp s
0.200000 slw
[] 0 sd
[] 0 sd
0 slc
n 11.040000 31.060405 m 6.748880 31.060405 l s
0 slj
n 11.040000 31.310405 m 11.540000 31.060405 l 11.040000 30.810405 l f
0 slj
n 6.748880 30.810405 m 6.248880 31.060405 l 6.748880 31.310405 l f
0.200000 slw
[] 0 sd
[] 0 sd
0 slc
n 28.490000 31.128005 m 24.348880 31.128005 l s
0 slj
n 28.490000 31.378005 m 28.990000 31.128005 l 28.490000 30.878005 l f
0 slj
n 24.348880 30.878005 m 23.848880 31.128005 l 24.348880 31.378005 l f
0.200000 slw
[] 0 sd
[] 0 sd
0 slc
n 20.640027 31.122285 m 14.748853 31.066125 l s
0 slj
n 20.637644 31.372274 m 21.140005 31.127052 l 20.642410 30.872297 l f
0 slj
n 14.751236 30.816136 m 14.248875 31.061358 l 14.746470 31.316113 l f
/Helvetica-latin1 ff 0.700000 scf sf
(psp) 6.200000 33.100000 m gs 1 -1 sc sh gr
/Helvetica-latin1 ff 0.700000 scf sf
(psp) 23.785000 33.515000 m gs 1 -1 sc sh gr
/Helvetica-latin1 ff 0.700000 scf sf
(nsp) 10.935000 33.115000 m gs 1 -1 sc sh gr
/Helvetica-latin1 ff 0.700000 scf sf
(nsp) 28.335000 33.665000 m gs 1 -1 sc sh gr
0.100000 slw
[] 0 sd
1.000000 1.000000 1.000000 srgb
n 14.635000 34.515000 m 20.785000 34.515000 l 21.385000 35.115000 l 21.385000 37.415000 l 14.635000 37.415000 l f
0.000000 0.000000 0.000000 srgb
n 14.635000 34.515000 m 20.785000 34.515000 l 21.385000 35.115000 l 21.385000 37.415000 l 14.635000 37.415000 l cp s
0.050000 slw
n 20.785000 34.515000 m 20.785000 35.115000 l 21.385000 35.115000 l s
/Courier-latin1 ff 0.700000 scf sf
(destructors) 14.985000 35.915000 m gs 1 -1 sc sh gr
(from backroll) 14.985000 36.915000 m gs 1 -1 sc sh gr
0.100000 slw
[] 0 sd
[] 0 sd
0 slc
n 21.385000 34.515000 m 22.284719 32.630322 l s
[] 0 sd
0 slj
0 slc
n 22.446274 32.291906 m 22.456478 32.850830 l 22.284719 32.630322 l 22.005257 32.635423 l f
n 22.446274 32.291906 m 22.456478 32.850830 l 22.284719 32.630322 l 22.005257 32.635423 l cp s
0.100000 slw
[] 0 sd
[] 0 sd
0 slc
n 14.635000 34.515000 m 13.180895 32.517010 l s
[] 0 sd
0 slj
0 slc
n 12.960230 32.213807 m 13.456586 32.470967 l 13.180895 32.517010 l 13.052316 32.765188 l f
n 12.960230 32.213807 m 13.456586 32.470967 l 13.180895 32.517010 l 13.052316 32.765188 l cp s
0.100000 slw
[] 0 sd
[] 0 sd
0 slc
n 5.935000 23.407600 m 4.613559 21.468289 l s
[] 0 sd
0 slj
0 slc
n 4.402396 21.158393 m 4.890543 21.430813 l 4.613559 21.468289 l 4.477349 21.712363 l f
n 4.402396 21.158393 m 4.890543 21.430813 l 4.613559 21.468289 l 4.477349 21.712363 l cp s
0.100000 slw
[] 0 sd
[] 0 sd
0 slc
0 slj
0 slc
0 slj
[] 0 sd
1.000000 1.000000 1.000000 srgb
n 4.213996 18.940000 m 4.464884 18.940000 l 5.217548 19.365202 5.593880 19.577803 5.593880 20.003005 c 5.593880 20.428207 5.342992 20.640808 4.464884 21.066010 c 4.213996 21.066010 l 3.461332 20.640808 3.085000 20.428207 3.085000 20.003005 c 3.085000 19.577803 3.335888 19.365202 4.213996 18.940000 c f
0.000000 0.000000 0.000000 srgb
n 4.213996 18.940000 m 4.464884 18.940000 l 5.217548 19.365202 5.593880 19.577803 5.593880 20.003005 c 5.593880 20.428207 5.342992 20.640808 4.464884 21.066010 c 4.213996 21.066010 l 3.461332 20.640808 3.085000 20.428207 3.085000 20.003005 c 3.085000 19.577803 3.335888 19.365202 4.213996 18.940000 c s
/Helvetica-latin1 ff 0.700000 scf sf
(SP) dup sw 2 div 4.339440 ex sub 20.253005 m gs 1 -1 sc sh gr
0.100000 slw
[] 0 sd
[] 0 sd
0 slc
0 slj
0 slc
0 slj
[] 0 sd
1.000000 1.000000 1.000000 srgb
n 12.213996 18.940000 m 12.464884 18.940000 l 13.217548 19.365202 13.593880 19.577803 13.593880 20.003005 c 13.593880 20.428207 13.342992 20.640808 12.464884 21.066010 c 12.213996 21.066010 l 11.461332 20.640808 11.085000 20.428207 11.085000 20.003005 c 11.085000 19.577803 11.335888 19.365202 12.213996 18.940000 c f
0.000000 0.000000 0.000000 srgb
n 12.213996 18.940000 m 12.464884 18.940000 l 13.217548 19.365202 13.593880 19.577803 13.593880 20.003005 c 13.593880 20.428207 13.342992 20.640808 12.464884 21.066010 c 12.213996 21.066010 l 11.461332 20.640808 11.085000 20.428207 11.085000 20.003005 c 11.085000 19.577803 11.335888 19.365202 12.213996 18.940000 c s
/Helvetica-latin1 ff 0.700000 scf sf
(SP) dup sw 2 div 12.339440 ex sub 20.253005 m gs 1 -1 sc sh gr
0.100000 slw
[] 0 sd
1.000000 1.000000 1.000000 srgb
n 5.935000 23.407600 m 10.735000 23.407600 l 11.335000 24.007600 l 11.335000 26.307600 l 5.935000 26.307600 l f
0.000000 0.000000 0.000000 srgb
n 5.935000 23.407600 m 10.735000 23.407600 l 11.335000 24.007600 l 11.335000 26.307600 l 5.935000 26.307600 l cp s
0.050000 slw
n 10.735000 23.407600 m 10.735000 24.007600 l 11.335000 24.007600 l s
/Courier-latin1 ff 0.700000 scf sf
(expression) 6.285000 24.807600 m gs 1 -1 sc sh gr
(statement) 6.285000 25.807600 m gs 1 -1 sc sh gr
0.100000 slw
[] 0 sd
[] 0 sd
0 slc
n 11.335000 23.407600 m 12.147500 21.513384 l s
[] 0 sd
0 slj
0 slc
n 12.295327 21.168750 m 12.327981 21.726812 l 12.147500 21.513384 l 11.868469 21.529711 l f
n 12.295327 21.168750 m 12.327981 21.726812 l 12.147500 21.513384 l 11.868469 21.529711 l cp s
0.100000 slw
[] 0 sd
[] 0 sd
0 slc
n 23.635000 23.225300 m 22.245958 21.511853 l s
[] 0 sd
0 slj
0 slc
n 22.009807 21.220550 m 22.518877 21.451520 l 22.245958 21.511853 l 22.130473 21.766388 l f
n 22.009807 21.220550 m 22.518877 21.451520 l 22.245958 21.511853 l 22.130473 21.766388 l cp s
0.100000 slw
[] 0 sd
[] 0 sd
0 slc
0 slj
0 slc
0 slj
[] 0 sd
1.000000 1.000000 1.000000 srgb
n 21.813996 19.007600 m 22.064884 19.007600 l 22.817548 19.432802 23.193880 19.645403 23.193880 20.070605 c 23.193880 20.495807 22.942992 20.708408 22.064884 21.133610 c 21.813996 21.133610 l 21.061332 20.708408 20.685000 20.495807 20.685000 20.070605 c 20.685000 19.645403 20.935888 19.432802 21.813996 19.007600 c f
0.000000 0.000000 0.000000 srgb
n 21.813996 19.007600 m 22.064884 19.007600 l 22.817548 19.432802 23.193880 19.645403 23.193880 20.070605 c 23.193880 20.495807 22.942992 20.708408 22.064884 21.133610 c 21.813996 21.133610 l 21.061332 20.708408 20.685000 20.495807 20.685000 20.070605 c 20.685000 19.645403 20.935888 19.432802 21.813996 19.007600 c s
/Helvetica-latin1 ff 0.700000 scf sf
(SP) dup sw 2 div 21.939440 ex sub 20.320605 m gs 1 -1 sc sh gr
0.100000 slw
[] 0 sd
[] 0 sd
0 slc
0 slj
0 slc
0 slj
[] 0 sd
1.000000 1.000000 1.000000 srgb
n 29.663996 19.007600 m 29.914884 19.007600 l 30.667548 19.432802 31.043880 19.645403 31.043880 20.070605 c 31.043880 20.495807 30.792992 20.708408 29.914884 21.133610 c 29.663996 21.133610 l 28.911332 20.708408 28.535000 20.495807 28.535000 20.070605 c 28.535000 19.645403 28.785888 19.432802 29.663996 19.007600 c f
0.000000 0.000000 0.000000 srgb
n 29.663996 19.007600 m 29.914884 19.007600 l 30.667548 19.432802 31.043880 19.645403 31.043880 20.070605 c 31.043880 20.495807 30.792992 20.708408 29.914884 21.133610 c 29.663996 21.133610 l 28.911332 20.708408 28.535000 20.495807 28.535000 20.070605 c 28.535000 19.645403 28.785888 19.432802 29.663996 19.007600 c s
/Helvetica-latin1 ff 0.700000 scf sf
(SP) dup sw 2 div 29.789440 ex sub 20.320605 m gs 1 -1 sc sh gr
0.100000 slw
[] 0 sd
1.000000 1.000000 1.000000 srgb
n 23.635000 23.225300 m 27.985000 23.225300 l 28.585000 23.825300 l 28.585000 25.125300 l 23.635000 25.125300 l f
0.000000 0.000000 0.000000 srgb
n 23.635000 23.225300 m 27.985000 23.225300 l 28.585000 23.825300 l 28.585000 25.125300 l 23.635000 25.125300 l cp s
0.050000 slw
n 27.985000 23.225300 m 27.985000 23.825300 l 28.585000 23.825300 l s
/Courier-latin1 ff 0.700000 scf sf
(statement) 23.985000 24.625300 m gs 1 -1 sc sh gr
0.100000 slw
[] 0 sd
[] 0 sd
0 slc
n 28.585000 23.225300 m 29.546480 21.555562 l s
[] 0 sd
0 slj
0 slc
n 29.733609 21.230588 m 29.700753 21.788639 l 29.546480 21.555562 l 29.267455 21.539134 l f
n 29.733609 21.230588 m 29.700753 21.788639 l 29.546480 21.555562 l 29.267455 21.539134 l cp s
0.200000 slw
[] 0 sd
[] 0 sd
0 slc
n 10.485000 20.003000 m 6.193880 20.003000 l s
0 slj
n 10.485000 20.253000 m 10.985000 20.003000 l 10.485000 19.753000 l f
0 slj
n 6.193880 19.753000 m 5.693880 20.003000 l 6.193880 20.253000 l f
0.200000 slw
[] 0 sd
[] 0 sd
0 slc
n 27.935000 20.070700 m 23.793900 20.070700 l s
0 slj
n 27.935000 20.320700 m 28.435000 20.070700 l 27.935000 19.820700 l f
0 slj
n 23.793900 19.820700 m 23.293900 20.070700 l 23.793900 20.320700 l f
0.200000 slw
[] 0 sd
[] 0 sd
0 slc
n 20.085027 20.064972 m 14.193873 20.008728 l s
0 slj
n 20.082641 20.314961 m 20.585005 20.069745 l 20.087414 19.814983 l f
0 slj
n 14.196259 19.758739 m 13.693895 20.003955 l 14.191486 20.258717 l f
/Helvetica-latin1 ff 0.700000 scf sf
(psp) 5.645000 22.042600 m gs 1 -1 sc sh gr
/Helvetica-latin1 ff 0.700000 scf sf
(psp) 23.230000 22.457600 m gs 1 -1 sc sh gr
/Helvetica-latin1 ff 0.700000 scf sf
(nsp) 10.380000 22.057600 m gs 1 -1 sc sh gr
/Helvetica-latin1 ff 0.700000 scf sf
(nsp) 27.780000 22.607600 m gs 1 -1 sc sh gr
0.100000 slw
[] 0 sd
[] 0 sd
0 slc
0 slj
0 slc
0 slj
[] 0 sd
1.000000 1.000000 1.000000 srgb
n 15.984608 25.233300 m 15.984608 27.202515 l 15.000000 27.202515 l 16.969215 29.171730 l 18.938430 27.202515 l 17.953823 27.202515 l 17.953823 25.233300 l f
0.000000 0.000000 0.000000 srgb
n 15.984608 25.233300 m 15.984608 27.202515 l 15.000000 27.202515 l 16.969215 29.171730 l 18.938430 27.202515 l 17.953823 27.202515 l 17.953823 25.233300 l cp s
0.010000 slw
0 slc
0 slj
[] 0 sd
n 15.984608 25.233300 m 15.984608 27.202515 l 15.000000 27.202515 l 16.969215 29.171730 l 18.938430 27.202515 l 17.953823 27.202515 l 17.953823 25.233300 l cp s
/Helvetica-latin1 ff 0.700000 scf sf
(psp) 14.185000 33.180000 m gs 1 -1 sc sh gr
/Helvetica-latin1 ff 0.700000 scf sf
(nsp) 20.635000 33.180000 m gs 1 -1 sc sh gr
showpage
