%!PS-Adobe-2.0 EPSF-2.0
%%Title: /home/ps/les/doc/doc/lyx/ss_prekrement.dia
%%Creator: Dia v0.93
%%CreationDate: Fri May 20 18:28:12 2005
%%For: ps
%%Orientation: Portrait
%%Magnification: 1.0000
%%BoundingBox: 0 0 711 549
%%BeginSetup
%%EndSetup
%%EndComments
%%BeginProlog
[ /.notdef /.notdef /.notdef /.notdef /.notdef /.notdef /.notdef /.notdef /.notdef /.notdef
/.notdef /.notdef /.notdef /.notdef /.notdef /.notdef /.notdef /.notdef /.notdef /.notdef
/.notdef /.notdef /.notdef /.notdef /.notdef /.notdef /.notdef /.notdef /.notdef /.notdef
/.notdef /.notdef /space /exclam /quotedbl /numbersign /dollar /percent /ampersand /quoteright
/parenleft /parenright /asterisk /plus /comma /hyphen /period /slash /zero /one
/two /three /four /five /six /seven /eight /nine /colon /semicolon
/less /equal /greater /question /at /A /B /C /D /E
/F /G /H /I /J /K /L /M /N /O
/P /Q /R /S /T /U /V /W /X /Y
/Z /bracketleft /backslash /bracketright /asciicircum /underscore /quoteleft /a /b /c
/d /e /f /g /h /i /j /k /l /m
/n /o /p /q /r /s /t /u /v /w
/x /y /z /braceleft /bar /braceright /asciitilde /.notdef /.notdef /.notdef
/.notdef /.notdef /.notdef /.notdef /.notdef /.notdef /.notdef /.notdef /.notdef /.notdef
/.notdef /.notdef /.notdef /.notdef /.notdef /.notdef /.notdef /.notdef /.notdef /.notdef
/.notdef /.notdef /.notdef /.notdef /.notdef /.notdef /.notdef /.notdef /.notdef /.notdef
/space /exclamdown /cent /sterling /currency /yen /brokenbar /section /dieresis /copyright
/ordfeminine /guillemotleft /logicalnot /hyphen /registered /macron /degree /plusminus /twosuperior /threesuperior
/acute /mu /paragraph /periodcentered /cedilla /onesuperior /ordmasculine /guillemotright /onequarter /onehalf
/threequarters /questiondown /Agrave /Aacute /Acircumflex /Atilde /Adieresis /Aring /AE /Ccedilla
/Egrave /Eacute /Ecircumflex /Edieresis /Igrave /Iacute /Icircumflex /Idieresis /Eth /Ntilde
/Ograve /Oacute /Ocircumflex /Otilde /Odieresis /multiply /Oslash /Ugrave /Uacute /Ucircumflex
/Udieresis /Yacute /Thorn /germandbls /agrave /aacute /acircumflex /atilde /adieresis /aring
/ae /ccedilla /egrave /eacute /ecircumflex /edieresis /igrave /iacute /icircumflex /idieresis
/eth /ntilde /ograve /oacute /ocircumflex /otilde /odieresis /divide /oslash /ugrave
/uacute /ucircumflex /udieresis /yacute /thorn /ydieresis] /isolatin1encoding exch def
/cp {closepath} bind def
/c {curveto} bind def
/f {fill} bind def
/a {arc} bind def
/ef {eofill} bind def
/ex {exch} bind def
/gr {grestore} bind def
/gs {gsave} bind def
/sa {save} bind def
/rs {restore} bind def
/l {lineto} bind def
/m {moveto} bind def
/rm {rmoveto} bind def
/n {newpath} bind def
/s {stroke} bind def
/sh {show} bind def
/slc {setlinecap} bind def
/slj {setlinejoin} bind def
/slw {setlinewidth} bind def
/srgb {setrgbcolor} bind def
/rot {rotate} bind def
/sc {scale} bind def
/sd {setdash} bind def
/ff {findfont} bind def
/sf {setfont} bind def
/scf {scalefont} bind def
/sw {stringwidth pop} bind def
/tr {translate} bind def

/ellipsedict 8 dict def
ellipsedict /mtrx matrix put
/ellipse
{ ellipsedict begin
   /endangle exch def
   /startangle exch def
   /yrad exch def
   /xrad exch def
   /y exch def
   /x exch def   /savematrix mtrx currentmatrix def
   x y tr xrad yrad sc
   0 0 1 startangle endangle arc
   savematrix setmatrix
   end
} def

/mergeprocs {
dup length
3 -1 roll
dup
length
dup
5 1 roll
3 -1 roll
add
array cvx
dup
3 -1 roll
0 exch
putinterval
dup
4 2 roll
putinterval
} bind def
/Times-Roman-latin1
    /Times-Roman findfont
    dup length dict begin
	{1 index /FID ne {def} {pop pop} ifelse} forall
	/Encoding isolatin1encoding def
    currentdict end
definefont pop
/Times-Italic-latin1
    /Times-Italic findfont
    dup length dict begin
	{1 index /FID ne {def} {pop pop} ifelse} forall
	/Encoding isolatin1encoding def
    currentdict end
definefont pop
/Times-Bold-latin1
    /Times-Bold findfont
    dup length dict begin
	{1 index /FID ne {def} {pop pop} ifelse} forall
	/Encoding isolatin1encoding def
    currentdict end
definefont pop
/Times-BoldItalic-latin1
    /Times-BoldItalic findfont
    dup length dict begin
	{1 index /FID ne {def} {pop pop} ifelse} forall
	/Encoding isolatin1encoding def
    currentdict end
definefont pop
/AvantGarde-Book-latin1
    /AvantGarde-Book findfont
    dup length dict begin
	{1 index /FID ne {def} {pop pop} ifelse} forall
	/Encoding isolatin1encoding def
    currentdict end
definefont pop
/AvantGarde-BookOblique-latin1
    /AvantGarde-BookOblique findfont
    dup length dict begin
	{1 index /FID ne {def} {pop pop} ifelse} forall
	/Encoding isolatin1encoding def
    currentdict end
definefont pop
/AvantGarde-Demi-latin1
    /AvantGarde-Demi findfont
    dup length dict begin
	{1 index /FID ne {def} {pop pop} ifelse} forall
	/Encoding isolatin1encoding def
    currentdict end
definefont pop
/AvantGarde-DemiOblique-latin1
    /AvantGarde-DemiOblique findfont
    dup length dict begin
	{1 index /FID ne {def} {pop pop} ifelse} forall
	/Encoding isolatin1encoding def
    currentdict end
definefont pop
/Bookman-Light-latin1
    /Bookman-Light findfont
    dup length dict begin
	{1 index /FID ne {def} {pop pop} ifelse} forall
	/Encoding isolatin1encoding def
    currentdict end
definefont pop
/Bookman-LightItalic-latin1
    /Bookman-LightItalic findfont
    dup length dict begin
	{1 index /FID ne {def} {pop pop} ifelse} forall
	/Encoding isolatin1encoding def
    currentdict end
definefont pop
/Bookman-Demi-latin1
    /Bookman-Demi findfont
    dup length dict begin
	{1 index /FID ne {def} {pop pop} ifelse} forall
	/Encoding isolatin1encoding def
    currentdict end
definefont pop
/Bookman-DemiItalic-latin1
    /Bookman-DemiItalic findfont
    dup length dict begin
	{1 index /FID ne {def} {pop pop} ifelse} forall
	/Encoding isolatin1encoding def
    currentdict end
definefont pop
/Courier-latin1
    /Courier findfont
    dup length dict begin
	{1 index /FID ne {def} {pop pop} ifelse} forall
	/Encoding isolatin1encoding def
    currentdict end
definefont pop
/Courier-Oblique-latin1
    /Courier-Oblique findfont
    dup length dict begin
	{1 index /FID ne {def} {pop pop} ifelse} forall
	/Encoding isolatin1encoding def
    currentdict end
definefont pop
/Courier-Bold-latin1
    /Courier-Bold findfont
    dup length dict begin
	{1 index /FID ne {def} {pop pop} ifelse} forall
	/Encoding isolatin1encoding def
    currentdict end
definefont pop
/Courier-BoldOblique-latin1
    /Courier-BoldOblique findfont
    dup length dict begin
	{1 index /FID ne {def} {pop pop} ifelse} forall
	/Encoding isolatin1encoding def
    currentdict end
definefont pop
/Helvetica-latin1
    /Helvetica findfont
    dup length dict begin
	{1 index /FID ne {def} {pop pop} ifelse} forall
	/Encoding isolatin1encoding def
    currentdict end
definefont pop
/Helvetica-Oblique-latin1
    /Helvetica-Oblique findfont
    dup length dict begin
	{1 index /FID ne {def} {pop pop} ifelse} forall
	/Encoding isolatin1encoding def
    currentdict end
definefont pop
/Helvetica-Bold-latin1
    /Helvetica-Bold findfont
    dup length dict begin
	{1 index /FID ne {def} {pop pop} ifelse} forall
	/Encoding isolatin1encoding def
    currentdict end
definefont pop
/Helvetica-BoldOblique-latin1
    /Helvetica-BoldOblique findfont
    dup length dict begin
	{1 index /FID ne {def} {pop pop} ifelse} forall
	/Encoding isolatin1encoding def
    currentdict end
definefont pop
/Helvetica-Narrow-latin1
    /Helvetica-Narrow findfont
    dup length dict begin
	{1 index /FID ne {def} {pop pop} ifelse} forall
	/Encoding isolatin1encoding def
    currentdict end
definefont pop
/Helvetica-Narrow-Oblique-latin1
    /Helvetica-Narrow-Oblique findfont
    dup length dict begin
	{1 index /FID ne {def} {pop pop} ifelse} forall
	/Encoding isolatin1encoding def
    currentdict end
definefont pop
/Helvetica-Narrow-Bold-latin1
    /Helvetica-Narrow-Bold findfont
    dup length dict begin
	{1 index /FID ne {def} {pop pop} ifelse} forall
	/Encoding isolatin1encoding def
    currentdict end
definefont pop
/Helvetica-Narrow-BoldOblique-latin1
    /Helvetica-Narrow-BoldOblique findfont
    dup length dict begin
	{1 index /FID ne {def} {pop pop} ifelse} forall
	/Encoding isolatin1encoding def
    currentdict end
definefont pop
/NewCenturySchoolbook-Roman-latin1
    /NewCenturySchoolbook-Roman findfont
    dup length dict begin
	{1 index /FID ne {def} {pop pop} ifelse} forall
	/Encoding isolatin1encoding def
    currentdict end
definefont pop
/NewCenturySchoolbook-Italic-latin1
    /NewCenturySchoolbook-Italic findfont
    dup length dict begin
	{1 index /FID ne {def} {pop pop} ifelse} forall
	/Encoding isolatin1encoding def
    currentdict end
definefont pop
/NewCenturySchoolbook-Bold-latin1
    /NewCenturySchoolbook-Bold findfont
    dup length dict begin
	{1 index /FID ne {def} {pop pop} ifelse} forall
	/Encoding isolatin1encoding def
    currentdict end
definefont pop
/NewCenturySchoolbook-BoldItalic-latin1
    /NewCenturySchoolbook-BoldItalic findfont
    dup length dict begin
	{1 index /FID ne {def} {pop pop} ifelse} forall
	/Encoding isolatin1encoding def
    currentdict end
definefont pop
/Palatino-Roman-latin1
    /Palatino-Roman findfont
    dup length dict begin
	{1 index /FID ne {def} {pop pop} ifelse} forall
	/Encoding isolatin1encoding def
    currentdict end
definefont pop
/Palatino-Italic-latin1
    /Palatino-Italic findfont
    dup length dict begin
	{1 index /FID ne {def} {pop pop} ifelse} forall
	/Encoding isolatin1encoding def
    currentdict end
definefont pop
/Palatino-Bold-latin1
    /Palatino-Bold findfont
    dup length dict begin
	{1 index /FID ne {def} {pop pop} ifelse} forall
	/Encoding isolatin1encoding def
    currentdict end
definefont pop
/Palatino-BoldItalic-latin1
    /Palatino-BoldItalic findfont
    dup length dict begin
	{1 index /FID ne {def} {pop pop} ifelse} forall
	/Encoding isolatin1encoding def
    currentdict end
definefont pop
/Symbol-latin1
    /Symbol findfont
definefont pop
/ZapfChancery-MediumItalic-latin1
    /ZapfChancery-MediumItalic findfont
    dup length dict begin
	{1 index /FID ne {def} {pop pop} ifelse} forall
	/Encoding isolatin1encoding def
    currentdict end
definefont pop
/ZapfDingbats-latin1
    /ZapfDingbats findfont
    dup length dict begin
	{1 index /FID ne {def} {pop pop} ifelse} forall
	/Encoding isolatin1encoding def
    currentdict end
definefont pop
28.346000 -28.346000 scale
-8.900000 -26.060000 translate
%%EndProlog


0.100000 slw
[] 0 sd
1.000000 1.000000 1.000000 srgb
n 20.000000 10.000000 m 20.000000 11.400000 l 24.650000 11.400000 l 24.650000 10.000000 l f
0.000000 0.000000 0.000000 srgb
n 20.000000 10.000000 m 20.000000 11.400000 l 24.650000 11.400000 l 24.650000 10.000000 l cp s
/Helvetica-latin1 ff 0.700000 scf sf
(ss_assign) dup sw 2 div 22.325000 ex sub 11.000000 m gs 1 -1 sc sh gr
1.000000 1.000000 1.000000 srgb
n 20.000000 11.400000 m 20.000000 14.000000 l 24.650000 14.000000 l 24.650000 11.400000 l f
0.000000 0.000000 0.000000 srgb
n 20.000000 11.400000 m 20.000000 14.000000 l 24.650000 14.000000 l 24.650000 11.400000 l cp s
/Courier-latin1 ff 0.560000 scf sf
(+left) 20.150000 12.100000 m gs 1 -1 sc sh gr
/Courier-latin1 ff 0.560000 scf sf
(+right) 20.150000 12.900000 m gs 1 -1 sc sh gr
/Courier-latin1 ff 0.560000 scf sf
(+...) 20.150000 13.700000 m gs 1 -1 sc sh gr
1.000000 1.000000 1.000000 srgb
n 20.000000 14.000000 m 20.000000 14.400000 l 24.650000 14.400000 l 24.650000 14.000000 l f
0.000000 0.000000 0.000000 srgb
n 20.000000 14.000000 m 20.000000 14.400000 l 24.650000 14.400000 l 24.650000 14.000000 l cp s
0.100000 slw
[] 0 sd
0 slj
0 slc
n 19.088197 10.000000 m 17.750000 10.000000 l 17.750000 8.650000 l 15.500000 8.650000 l s
0 slj
1.000000 1.000000 1.000000 srgb
n 19.088197 10.400000 m 19.888197 10.000000 l 19.088197 9.600000 l f
0.100000 slw
[] 0 sd
0 slj
0.000000 0.000000 0.000000 srgb
n 19.088197 10.400000 m 19.888197 10.000000 l 19.088197 9.600000 l cp s
/Courier-latin1 ff 0.560000 scf sf
0.100000 slw
[] 0 sd
1.000000 1.000000 1.000000 srgb
n 17.000000 18.000000 m 17.000000 19.400000 l 21.100000 19.400000 l 21.100000 18.000000 l f
0.000000 0.000000 0.000000 srgb
n 17.000000 18.000000 m 17.000000 19.400000 l 21.100000 19.400000 l 21.100000 18.000000 l cp s
/Helvetica-latin1 ff 0.700000 scf sf
(ss_get) dup sw 2 div 19.050000 ex sub 19.000000 m gs 1 -1 sc sh gr
1.000000 1.000000 1.000000 srgb
n 17.000000 19.400000 m 17.000000 21.200000 l 21.100000 21.200000 l 21.100000 19.400000 l f
0.000000 0.000000 0.000000 srgb
n 17.000000 19.400000 m 17.000000 21.200000 l 21.100000 21.200000 l 21.100000 19.400000 l cp s
/Courier-latin1 ff 0.560000 scf sf
(+expresion) 17.150000 20.100000 m gs 1 -1 sc sh gr
/Courier-latin1 ff 0.560000 scf sf
(+...) 17.150000 20.900000 m gs 1 -1 sc sh gr
1.000000 1.000000 1.000000 srgb
n 17.000000 21.200000 m 17.000000 21.600000 l 21.100000 21.600000 l 21.100000 21.200000 l f
0.000000 0.000000 0.000000 srgb
n 17.000000 21.200000 m 17.000000 21.600000 l 21.100000 21.600000 l 21.100000 21.200000 l cp s
0.100000 slw
[] 0 sd
1.000000 1.000000 1.000000 srgb
n 12.105000 22.410000 m 12.105000 23.810000 l 17.955000 23.810000 l 17.955000 22.410000 l f
0.000000 0.000000 0.000000 srgb
n 12.105000 22.410000 m 12.105000 23.810000 l 17.955000 23.810000 l 17.955000 22.410000 l cp s
/Helvetica-latin1 ff 0.700000 scf sf
(ss_var_ref) dup sw 2 div 15.030000 ex sub 23.410000 m gs 1 -1 sc sh gr
1.000000 1.000000 1.000000 srgb
n 12.105000 23.810000 m 12.105000 25.610000 l 17.955000 25.610000 l 17.955000 23.810000 l f
0.000000 0.000000 0.000000 srgb
n 12.105000 23.810000 m 12.105000 25.610000 l 17.955000 25.610000 l 17.955000 23.810000 l cp s
/Courier-latin1 ff 0.560000 scf sf
(+declaration\(i\)) 12.255000 24.510000 m gs 1 -1 sc sh gr
/Courier-latin1 ff 0.560000 scf sf
(+...) 12.255000 25.310000 m gs 1 -1 sc sh gr
1.000000 1.000000 1.000000 srgb
n 12.105000 25.610000 m 12.105000 26.010000 l 17.955000 26.010000 l 17.955000 25.610000 l f
0.000000 0.000000 0.000000 srgb
n 12.105000 25.610000 m 12.105000 26.010000 l 17.955000 26.010000 l 17.955000 25.610000 l cp s
0.100000 slw
[] 0 sd
1.000000 1.000000 1.000000 srgb
n 8.950000 6.750000 m 8.950000 8.150000 l 15.500000 8.150000 l 15.500000 6.750000 l f
0.000000 0.000000 0.000000 srgb
n 8.950000 6.750000 m 8.950000 8.150000 l 15.500000 8.150000 l 15.500000 6.750000 l cp s
/Helvetica-latin1 ff 0.700000 scf sf
(ss_expr_stmt) dup sw 2 div 12.225000 ex sub 7.750000 m gs 1 -1 sc sh gr
1.000000 1.000000 1.000000 srgb
n 8.950000 8.150000 m 8.950000 9.950000 l 15.500000 9.950000 l 15.500000 8.150000 l f
0.000000 0.000000 0.000000 srgb
n 8.950000 8.150000 m 8.950000 9.950000 l 15.500000 9.950000 l 15.500000 8.150000 l cp s
/Courier-latin1 ff 0.560000 scf sf
(+expression \(++i\)) 9.100000 8.850000 m gs 1 -1 sc sh gr
/Courier-latin1 ff 0.560000 scf sf
(+...) 9.100000 9.650000 m gs 1 -1 sc sh gr
1.000000 1.000000 1.000000 srgb
n 8.950000 9.950000 m 8.950000 10.350000 l 15.500000 10.350000 l 15.500000 9.950000 l f
0.000000 0.000000 0.000000 srgb
n 8.950000 9.950000 m 8.950000 10.350000 l 15.500000 10.350000 l 15.500000 9.950000 l cp s
0.100000 slw
[] 0 sd
0 slj
0 slc
n 15.030000 21.498197 m 15.030000 19.900000 l 17.000000 19.900000 l s
0 slj
1.000000 1.000000 1.000000 srgb
n 14.630000 21.498197 m 15.030000 22.298197 l 15.430000 21.498197 l f
0.100000 slw
[] 0 sd
0 slj
0.000000 0.000000 0.000000 srgb
n 14.630000 21.498197 m 15.030000 22.298197 l 15.430000 21.498197 l cp s
/Courier-latin1 ff 0.560000 scf sf
0.100000 slw
[] 0 sd
0 slj
0 slc
n 12.105000 21.498197 m 12.105000 11.900000 l 20.000000 11.900000 l s
0 slj
1.000000 1.000000 1.000000 srgb
n 11.705000 21.498197 m 12.105000 22.298197 l 12.505000 21.498197 l f
0.100000 slw
[] 0 sd
0 slj
0.000000 0.000000 0.000000 srgb
n 11.705000 21.498197 m 12.105000 22.298197 l 12.505000 21.498197 l cp s
/Courier-latin1 ff 0.560000 scf sf
0.100000 slw
[] 0 sd
1.000000 1.000000 1.000000 srgb
n 25.000000 15.000000 m 25.000000 16.400000 l 28.550000 16.400000 l 28.550000 15.000000 l f
0.000000 0.000000 0.000000 srgb
n 25.000000 15.000000 m 25.000000 16.400000 l 28.550000 16.400000 l 28.550000 15.000000 l cp s
/Helvetica-latin1 ff 0.700000 scf sf
(ss_add) dup sw 2 div 26.775000 ex sub 16.000000 m gs 1 -1 sc sh gr
1.000000 1.000000 1.000000 srgb
n 25.000000 16.400000 m 25.000000 19.000000 l 28.550000 19.000000 l 28.550000 16.400000 l f
0.000000 0.000000 0.000000 srgb
n 25.000000 16.400000 m 25.000000 19.000000 l 28.550000 19.000000 l 28.550000 16.400000 l cp s
/Courier-latin1 ff 0.560000 scf sf
(+left) 25.150000 17.100000 m gs 1 -1 sc sh gr
/Courier-latin1 ff 0.560000 scf sf
(+right) 25.150000 17.900000 m gs 1 -1 sc sh gr
/Courier-latin1 ff 0.560000 scf sf
(+...) 25.150000 18.700000 m gs 1 -1 sc sh gr
1.000000 1.000000 1.000000 srgb
n 25.000000 19.000000 m 25.000000 19.400000 l 28.550000 19.400000 l 28.550000 19.000000 l f
0.000000 0.000000 0.000000 srgb
n 25.000000 19.000000 m 25.000000 19.400000 l 28.550000 19.400000 l 28.550000 19.000000 l cp s
0.100000 slw
[] 0 sd
1.000000 1.000000 1.000000 srgb
n 27.000000 21.000000 m 27.000000 22.400000 l 33.900000 22.400000 l 33.900000 21.000000 l f
0.000000 0.000000 0.000000 srgb
n 27.000000 21.000000 m 27.000000 22.400000 l 33.900000 22.400000 l 33.900000 21.000000 l cp s
/Helvetica-latin1 ff 0.700000 scf sf
(ss_literal) dup sw 2 div 30.450000 ex sub 22.000000 m gs 1 -1 sc sh gr
1.000000 1.000000 1.000000 srgb
n 27.000000 22.400000 m 27.000000 24.200000 l 33.900000 24.200000 l 33.900000 22.400000 l f
0.000000 0.000000 0.000000 srgb
n 27.000000 22.400000 m 27.000000 24.200000 l 33.900000 24.200000 l 33.900000 22.400000 l cp s
/Courier-latin1 ff 0.560000 scf sf
(+literal_info\("1"\)) 27.150000 23.100000 m gs 1 -1 sc sh gr
/Courier-latin1 ff 0.560000 scf sf
(+...) 27.150000 23.900000 m gs 1 -1 sc sh gr
1.000000 1.000000 1.000000 srgb
n 27.000000 24.200000 m 27.000000 24.600000 l 33.900000 24.600000 l 33.900000 24.200000 l f
0.000000 0.000000 0.000000 srgb
n 27.000000 24.200000 m 27.000000 24.600000 l 33.900000 24.600000 l 33.900000 24.200000 l cp s
0.100000 slw
[] 0 sd
0 slj
0 slc
n 30.450000 20.088197 m 30.450000 16.900000 l 28.550000 16.900000 l s
0 slj
1.000000 1.000000 1.000000 srgb
n 30.050000 20.088197 m 30.450000 20.888197 l 30.850000 20.088197 l f
0.100000 slw
[] 0 sd
0 slj
0.000000 0.000000 0.000000 srgb
n 30.050000 20.088197 m 30.450000 20.888197 l 30.850000 20.088197 l cp s
/Courier-latin1 ff 0.560000 scf sf
0.100000 slw
[] 0 sd
0 slj
0 slc
n 22.011803 18.700000 m 23.050000 18.700000 l 23.050000 17.700000 l 25.000000 17.700000 l s
0 slj
1.000000 1.000000 1.000000 srgb
n 22.011803 18.300000 m 21.211803 18.700000 l 22.011803 19.100000 l f
0.100000 slw
[] 0 sd
0 slj
0.000000 0.000000 0.000000 srgb
n 22.011803 18.300000 m 21.211803 18.700000 l 22.011803 19.100000 l cp s
/Courier-latin1 ff 0.560000 scf sf
0.100000 slw
[] 0 sd
0 slj
0 slc
n 26.775000 14.088197 m 26.775000 12.700000 l 24.650000 12.700000 l s
0 slj
1.000000 1.000000 1.000000 srgb
n 26.375000 14.088197 m 26.775000 14.888197 l 27.175000 14.088197 l f
0.100000 slw
[] 0 sd
0 slj
0.000000 0.000000 0.000000 srgb
n 26.375000 14.088197 m 26.775000 14.888197 l 27.175000 14.088197 l cp s
/Courier-latin1 ff 0.560000 scf sf
showpage
