%!PS-Adobe-2.0 EPSF-2.0
%%Title: /afs/ms.mff.cuni.cz/u/z/zouhj9am/BIG/project/lestes--doc--0.0--patch-157/doc/lyx/pi_pi_hierarchy.dia
%%Creator: Dia v0.94
%%CreationDate: Thu May 26 12:39:51 2005
%%For: zouhj9am
%%Orientation: Portrait
%%Magnification: 1.0000
%%BoundingBox: 0 0 1211 696
%%BeginSetup
%%EndSetup
%%EndComments
%%BeginProlog
[ /.notdef /.notdef /.notdef /.notdef /.notdef /.notdef /.notdef /.notdef /.notdef /.notdef
/.notdef /.notdef /.notdef /.notdef /.notdef /.notdef /.notdef /.notdef /.notdef /.notdef
/.notdef /.notdef /.notdef /.notdef /.notdef /.notdef /.notdef /.notdef /.notdef /.notdef
/.notdef /.notdef /space /exclam /quotedbl /numbersign /dollar /percent /ampersand /quoteright
/parenleft /parenright /asterisk /plus /comma /hyphen /period /slash /zero /one
/two /three /four /five /six /seven /eight /nine /colon /semicolon
/less /equal /greater /question /at /A /B /C /D /E
/F /G /H /I /J /K /L /M /N /O
/P /Q /R /S /T /U /V /W /X /Y
/Z /bracketleft /backslash /bracketright /asciicircum /underscore /quoteleft /a /b /c
/d /e /f /g /h /i /j /k /l /m
/n /o /p /q /r /s /t /u /v /w
/x /y /z /braceleft /bar /braceright /asciitilde /.notdef /.notdef /.notdef
/.notdef /.notdef /.notdef /.notdef /.notdef /.notdef /.notdef /.notdef /.notdef /.notdef
/.notdef /.notdef /.notdef /.notdef /.notdef /.notdef /.notdef /.notdef /.notdef /.notdef
/.notdef /.notdef /.notdef /.notdef /.notdef /.notdef /.notdef /.notdef /.notdef /.notdef
/space /exclamdown /cent /sterling /currency /yen /brokenbar /section /dieresis /copyright
/ordfeminine /guillemotleft /logicalnot /hyphen /registered /macron /degree /plusminus /twosuperior /threesuperior
/acute /mu /paragraph /periodcentered /cedilla /onesuperior /ordmasculine /guillemotright /onequarter /onehalf
/threequarters /questiondown /Agrave /Aacute /Acircumflex /Atilde /Adieresis /Aring /AE /Ccedilla
/Egrave /Eacute /Ecircumflex /Edieresis /Igrave /Iacute /Icircumflex /Idieresis /Eth /Ntilde
/Ograve /Oacute /Ocircumflex /Otilde /Odieresis /multiply /Oslash /Ugrave /Uacute /Ucircumflex
/Udieresis /Yacute /Thorn /germandbls /agrave /aacute /acircumflex /atilde /adieresis /aring
/ae /ccedilla /egrave /eacute /ecircumflex /edieresis /igrave /iacute /icircumflex /idieresis
/eth /ntilde /ograve /oacute /ocircumflex /otilde /odieresis /divide /oslash /ugrave
/uacute /ucircumflex /udieresis /yacute /thorn /ydieresis] /isolatin1encoding exch def
/cp {closepath} bind def
/c {curveto} bind def
/f {fill} bind def
/a {arc} bind def
/ef {eofill} bind def
/ex {exch} bind def
/gr {grestore} bind def
/gs {gsave} bind def
/sa {save} bind def
/rs {restore} bind def
/l {lineto} bind def
/m {moveto} bind def
/rm {rmoveto} bind def
/n {newpath} bind def
/s {stroke} bind def
/sh {show} bind def
/slc {setlinecap} bind def
/slj {setlinejoin} bind def
/slw {setlinewidth} bind def
/srgb {setrgbcolor} bind def
/rot {rotate} bind def
/sc {scale} bind def
/sd {setdash} bind def
/ff {findfont} bind def
/sf {setfont} bind def
/scf {scalefont} bind def
/sw {stringwidth pop} bind def
/tr {translate} bind def

/ellipsedict 8 dict def
ellipsedict /mtrx matrix put
/ellipse
{ ellipsedict begin
   /endangle exch def
   /startangle exch def
   /yrad exch def
   /xrad exch def
   /y exch def
   /x exch def   /savematrix mtrx currentmatrix def
   x y tr xrad yrad sc
   0 0 1 startangle endangle arc
   savematrix setmatrix
   end
} def

/mergeprocs {
dup length
3 -1 roll
dup
length
dup
5 1 roll
3 -1 roll
add
array cvx
dup
3 -1 roll
0 exch
putinterval
dup
4 2 roll
putinterval
} bind def
/Times-Roman-latin1
    /Times-Roman findfont
    dup length dict begin
	{1 index /FID ne {def} {pop pop} ifelse} forall
	/Encoding isolatin1encoding def
    currentdict end
definefont pop
/Times-Italic-latin1
    /Times-Italic findfont
    dup length dict begin
	{1 index /FID ne {def} {pop pop} ifelse} forall
	/Encoding isolatin1encoding def
    currentdict end
definefont pop
/Times-Bold-latin1
    /Times-Bold findfont
    dup length dict begin
	{1 index /FID ne {def} {pop pop} ifelse} forall
	/Encoding isolatin1encoding def
    currentdict end
definefont pop
/Times-BoldItalic-latin1
    /Times-BoldItalic findfont
    dup length dict begin
	{1 index /FID ne {def} {pop pop} ifelse} forall
	/Encoding isolatin1encoding def
    currentdict end
definefont pop
/AvantGarde-Book-latin1
    /AvantGarde-Book findfont
    dup length dict begin
	{1 index /FID ne {def} {pop pop} ifelse} forall
	/Encoding isolatin1encoding def
    currentdict end
definefont pop
/AvantGarde-BookOblique-latin1
    /AvantGarde-BookOblique findfont
    dup length dict begin
	{1 index /FID ne {def} {pop pop} ifelse} forall
	/Encoding isolatin1encoding def
    currentdict end
definefont pop
/AvantGarde-Demi-latin1
    /AvantGarde-Demi findfont
    dup length dict begin
	{1 index /FID ne {def} {pop pop} ifelse} forall
	/Encoding isolatin1encoding def
    currentdict end
definefont pop
/AvantGarde-DemiOblique-latin1
    /AvantGarde-DemiOblique findfont
    dup length dict begin
	{1 index /FID ne {def} {pop pop} ifelse} forall
	/Encoding isolatin1encoding def
    currentdict end
definefont pop
/Bookman-Light-latin1
    /Bookman-Light findfont
    dup length dict begin
	{1 index /FID ne {def} {pop pop} ifelse} forall
	/Encoding isolatin1encoding def
    currentdict end
definefont pop
/Bookman-LightItalic-latin1
    /Bookman-LightItalic findfont
    dup length dict begin
	{1 index /FID ne {def} {pop pop} ifelse} forall
	/Encoding isolatin1encoding def
    currentdict end
definefont pop
/Bookman-Demi-latin1
    /Bookman-Demi findfont
    dup length dict begin
	{1 index /FID ne {def} {pop pop} ifelse} forall
	/Encoding isolatin1encoding def
    currentdict end
definefont pop
/Bookman-DemiItalic-latin1
    /Bookman-DemiItalic findfont
    dup length dict begin
	{1 index /FID ne {def} {pop pop} ifelse} forall
	/Encoding isolatin1encoding def
    currentdict end
definefont pop
/Courier-latin1
    /Courier findfont
    dup length dict begin
	{1 index /FID ne {def} {pop pop} ifelse} forall
	/Encoding isolatin1encoding def
    currentdict end
definefont pop
/Courier-Oblique-latin1
    /Courier-Oblique findfont
    dup length dict begin
	{1 index /FID ne {def} {pop pop} ifelse} forall
	/Encoding isolatin1encoding def
    currentdict end
definefont pop
/Courier-Bold-latin1
    /Courier-Bold findfont
    dup length dict begin
	{1 index /FID ne {def} {pop pop} ifelse} forall
	/Encoding isolatin1encoding def
    currentdict end
definefont pop
/Courier-BoldOblique-latin1
    /Courier-BoldOblique findfont
    dup length dict begin
	{1 index /FID ne {def} {pop pop} ifelse} forall
	/Encoding isolatin1encoding def
    currentdict end
definefont pop
/Helvetica-latin1
    /Helvetica findfont
    dup length dict begin
	{1 index /FID ne {def} {pop pop} ifelse} forall
	/Encoding isolatin1encoding def
    currentdict end
definefont pop
/Helvetica-Oblique-latin1
    /Helvetica-Oblique findfont
    dup length dict begin
	{1 index /FID ne {def} {pop pop} ifelse} forall
	/Encoding isolatin1encoding def
    currentdict end
definefont pop
/Helvetica-Bold-latin1
    /Helvetica-Bold findfont
    dup length dict begin
	{1 index /FID ne {def} {pop pop} ifelse} forall
	/Encoding isolatin1encoding def
    currentdict end
definefont pop
/Helvetica-BoldOblique-latin1
    /Helvetica-BoldOblique findfont
    dup length dict begin
	{1 index /FID ne {def} {pop pop} ifelse} forall
	/Encoding isolatin1encoding def
    currentdict end
definefont pop
/Helvetica-Narrow-latin1
    /Helvetica-Narrow findfont
    dup length dict begin
	{1 index /FID ne {def} {pop pop} ifelse} forall
	/Encoding isolatin1encoding def
    currentdict end
definefont pop
/Helvetica-Narrow-Oblique-latin1
    /Helvetica-Narrow-Oblique findfont
    dup length dict begin
	{1 index /FID ne {def} {pop pop} ifelse} forall
	/Encoding isolatin1encoding def
    currentdict end
definefont pop
/Helvetica-Narrow-Bold-latin1
    /Helvetica-Narrow-Bold findfont
    dup length dict begin
	{1 index /FID ne {def} {pop pop} ifelse} forall
	/Encoding isolatin1encoding def
    currentdict end
definefont pop
/Helvetica-Narrow-BoldOblique-latin1
    /Helvetica-Narrow-BoldOblique findfont
    dup length dict begin
	{1 index /FID ne {def} {pop pop} ifelse} forall
	/Encoding isolatin1encoding def
    currentdict end
definefont pop
/NewCenturySchoolbook-Roman-latin1
    /NewCenturySchoolbook-Roman findfont
    dup length dict begin
	{1 index /FID ne {def} {pop pop} ifelse} forall
	/Encoding isolatin1encoding def
    currentdict end
definefont pop
/NewCenturySchoolbook-Italic-latin1
    /NewCenturySchoolbook-Italic findfont
    dup length dict begin
	{1 index /FID ne {def} {pop pop} ifelse} forall
	/Encoding isolatin1encoding def
    currentdict end
definefont pop
/NewCenturySchoolbook-Bold-latin1
    /NewCenturySchoolbook-Bold findfont
    dup length dict begin
	{1 index /FID ne {def} {pop pop} ifelse} forall
	/Encoding isolatin1encoding def
    currentdict end
definefont pop
/NewCenturySchoolbook-BoldItalic-latin1
    /NewCenturySchoolbook-BoldItalic findfont
    dup length dict begin
	{1 index /FID ne {def} {pop pop} ifelse} forall
	/Encoding isolatin1encoding def
    currentdict end
definefont pop
/Palatino-Roman-latin1
    /Palatino-Roman findfont
    dup length dict begin
	{1 index /FID ne {def} {pop pop} ifelse} forall
	/Encoding isolatin1encoding def
    currentdict end
definefont pop
/Palatino-Italic-latin1
    /Palatino-Italic findfont
    dup length dict begin
	{1 index /FID ne {def} {pop pop} ifelse} forall
	/Encoding isolatin1encoding def
    currentdict end
definefont pop
/Palatino-Bold-latin1
    /Palatino-Bold findfont
    dup length dict begin
	{1 index /FID ne {def} {pop pop} ifelse} forall
	/Encoding isolatin1encoding def
    currentdict end
definefont pop
/Palatino-BoldItalic-latin1
    /Palatino-BoldItalic findfont
    dup length dict begin
	{1 index /FID ne {def} {pop pop} ifelse} forall
	/Encoding isolatin1encoding def
    currentdict end
definefont pop
/Symbol-latin1
    /Symbol findfont
definefont pop
/ZapfChancery-MediumItalic-latin1
    /ZapfChancery-MediumItalic findfont
    dup length dict begin
	{1 index /FID ne {def} {pop pop} ifelse} forall
	/Encoding isolatin1encoding def
    currentdict end
definefont pop
/ZapfDingbats-latin1
    /ZapfDingbats findfont
    dup length dict begin
	{1 index /FID ne {def} {pop pop} ifelse} forall
	/Encoding isolatin1encoding def
    currentdict end
definefont pop
28.346000 -28.346000 scale
11.085700 -16.201369 translate
%%EndProlog


0.100000 slw
[] 0 sd
1.000000 1.000000 1.000000 srgb
n 10.927300 -8.282360 m 10.927300 -6.882360 l 13.621831 -6.882360 l 13.621831 -8.282360 l f
0.000000 0.000000 0.000000 srgb
n 10.927300 -8.282360 m 10.927300 -6.882360 l 13.621831 -6.882360 l 13.621831 -8.282360 l cp s
/Helvetica-latin1 ff 0.700000 scf sf
(pi_pi) dup sw 2 div 12.274566 ex sub -7.282360 m gs 1 -1 sc sh gr
0.100000 slw
[] 0 sd
1.000000 1.000000 1.000000 srgb
n 15.512100 -1.729950 m 15.512100 -0.329950 l 26.889444 -0.329950 l 26.889444 -1.729950 l f
0.000000 0.000000 0.000000 srgb
n 15.512100 -1.729950 m 15.512100 -0.329950 l 26.889444 -0.329950 l 26.889444 -1.729950 l cp s
/Helvetica-latin1 ff 0.700000 scf sf
(pi_abstract_function_call) dup sw 2 div 21.200772 ex sub -0.729950 m gs 1 -1 sc sh gr
0.100000 slw
[] 0 sd
1.000000 1.000000 1.000000 srgb
n -0.499360 -1.729690 m -0.499360 -0.329690 l 7.710796 -0.329690 l 7.710796 -1.729690 l f
0.000000 0.000000 0.000000 srgb
n -0.499360 -1.729690 m -0.499360 -0.329690 l 7.710796 -0.329690 l 7.710796 -1.729690 l cp s
/Helvetica-latin1 ff 0.700000 scf sf
(pi_abstract_move) dup sw 2 div 3.605718 ex sub -0.729690 m gs 1 -1 sc sh gr
0.100000 slw
[] 0 sd
1.000000 1.000000 1.000000 srgb
n 14.822300 6.291200 m 14.822300 7.691200 l 18.041050 7.691200 l 18.041050 6.291200 l f
0.000000 0.000000 0.000000 srgb
n 14.822300 6.291200 m 14.822300 7.691200 l 18.041050 7.691200 l 18.041050 6.291200 l cp s
/Helvetica-latin1 ff 0.700000 scf sf
(pi_bpi) dup sw 2 div 16.431675 ex sub 7.291200 m gs 1 -1 sc sh gr
0.100000 slw
[] 0 sd
1.000000 1.000000 1.000000 srgb
n 5.177110 6.285600 m 5.177110 7.685600 l 9.998985 7.685600 l 9.998985 6.285600 l f
0.000000 0.000000 0.000000 srgb
n 5.177110 6.285600 m 5.177110 7.685600 l 9.998985 7.685600 l 9.998985 6.285600 l cp s
/Helvetica-latin1 ff 0.700000 scf sf
(pi_branch) dup sw 2 div 7.588048 ex sub 7.285600 m gs 1 -1 sc sh gr
0.100000 slw
[] 0 sd
1.000000 1.000000 1.000000 srgb
n 14.268200 -5.129160 m 14.268200 -3.729160 l 18.423669 -3.729160 l 18.423669 -5.129160 l f
0.000000 0.000000 0.000000 srgb
n 14.268200 -5.129160 m 14.268200 -3.729160 l 18.423669 -3.729160 l 18.423669 -5.129160 l cp s
/Helvetica-latin1 ff 0.700000 scf sf
(pi_leave) dup sw 2 div 16.345934 ex sub -4.129160 m gs 1 -1 sc sh gr
0.100000 slw
[] 0 sd
1.000000 1.000000 1.000000 srgb
n 7.352120 -5.107490 m 7.352120 -3.707490 l 10.235714 -3.707490 l 10.235714 -5.107490 l f
0.000000 0.000000 0.000000 srgb
n 7.352120 -5.107490 m 7.352120 -3.707490 l 10.235714 -3.707490 l 10.235714 -5.107490 l cp s
/Helvetica-latin1 ff 0.700000 scf sf
(pi_sp) dup sw 2 div 8.793917 ex sub -4.107490 m gs 1 -1 sc sh gr
0.100000 slw
[] 0 sd
1.000000 1.000000 1.000000 srgb
n 20.691200 2.143040 m 20.691200 3.543040 l 23.727137 3.543040 l 23.727137 2.143040 l f
0.000000 0.000000 0.000000 srgb
n 20.691200 2.143040 m 20.691200 3.543040 l 23.727137 3.543040 l 23.727137 2.143040 l cp s
/Helvetica-latin1 ff 0.700000 scf sf
(pi_tpi) dup sw 2 div 22.209169 ex sub 3.143040 m gs 1 -1 sc sh gr
0.100000 slw
[] 0 sd
0 slj
0 slc
n 12.274600 -5.970557 m 12.274600 -4.407490 l 10.235700 -4.407490 l s
0 slj
1.000000 1.000000 1.000000 srgb
n 12.674600 -5.970557 m 12.274600 -6.770557 l 11.874600 -5.970557 l ef
0.100000 slw
[] 0 sd
0 slj
0.000000 0.000000 0.000000 srgb
n 12.674600 -5.970557 m 12.274600 -6.770557 l 11.874600 -5.970557 l cp s
/Courier-latin1 ff 0.560000 scf sf
0.100000 slw
[] 0 sd
0 slj
0 slc
n 12.274600 -5.970557 m 12.274600 -4.429160 l 14.268200 -4.429160 l s
0 slj
1.000000 1.000000 1.000000 srgb
n 12.674600 -5.970557 m 12.274600 -6.770557 l 11.874600 -5.970557 l ef
0.100000 slw
[] 0 sd
0 slj
0.000000 0.000000 0.000000 srgb
n 12.674600 -5.970557 m 12.274600 -6.770557 l 11.874600 -5.970557 l cp s
/Courier-latin1 ff 0.560000 scf sf
0.100000 slw
[] 0 sd
0 slj
0 slc
n 12.274600 -5.970557 m 12.274600 -1.029690 l 7.710800 -1.029690 l s
0 slj
1.000000 1.000000 1.000000 srgb
n 12.674600 -5.970557 m 12.274600 -6.770557 l 11.874600 -5.970557 l ef
0.100000 slw
[] 0 sd
0 slj
0.000000 0.000000 0.000000 srgb
n 12.674600 -5.970557 m 12.274600 -6.770557 l 11.874600 -5.970557 l cp s
/Courier-latin1 ff 0.560000 scf sf
0.100000 slw
[] 0 sd
0 slj
0 slc
n 12.274600 -5.970557 m 12.274600 -1.029950 l 15.512100 -1.029950 l s
0 slj
1.000000 1.000000 1.000000 srgb
n 12.674600 -5.970557 m 12.274600 -6.770557 l 11.874600 -5.970557 l ef
0.100000 slw
[] 0 sd
0 slj
0.000000 0.000000 0.000000 srgb
n 12.674600 -5.970557 m 12.274600 -6.770557 l 11.874600 -5.970557 l cp s
/Courier-latin1 ff 0.560000 scf sf
0.100000 slw
[] 0 sd
0 slj
0 slc
n 12.274600 -5.970557 m 12.274600 6.985600 l 9.998980 6.985600 l s
0 slj
1.000000 1.000000 1.000000 srgb
n 12.674600 -5.970557 m 12.274600 -6.770557 l 11.874600 -5.970557 l ef
0.100000 slw
[] 0 sd
0 slj
0.000000 0.000000 0.000000 srgb
n 12.674600 -5.970557 m 12.274600 -6.770557 l 11.874600 -5.970557 l cp s
/Courier-latin1 ff 0.560000 scf sf
0.100000 slw
[] 0 sd
0 slj
0 slc
n 12.274600 -5.970557 m 12.274600 2.843040 l 20.691200 2.843040 l s
0 slj
1.000000 1.000000 1.000000 srgb
n 12.674600 -5.970557 m 12.274600 -6.770557 l 11.874600 -5.970557 l ef
0.100000 slw
[] 0 sd
0 slj
0.000000 0.000000 0.000000 srgb
n 12.674600 -5.970557 m 12.274600 -6.770557 l 11.874600 -5.970557 l cp s
/Courier-latin1 ff 0.560000 scf sf
0.100000 slw
[] 0 sd
1.000000 1.000000 1.000000 srgb
n -10.999400 1.469380 m -10.999400 2.869380 l -1.468931 2.869380 l -1.468931 1.469380 l f
0.000000 0.000000 0.000000 srgb
n -10.999400 1.469380 m -10.999400 2.869380 l -1.468931 2.869380 l -1.468931 1.469380 l cp s
/Helvetica-latin1 ff 0.700000 scf sf
(pi_abstract_move_st) dup sw 2 div -6.234166 ex sub 2.469380 m gs 1 -1 sc sh gr
0.100000 slw
[] 0 sd
1.000000 1.000000 1.000000 srgb
n -11.035700 3.839430 m -11.035700 5.239430 l -1.426325 5.239430 l -1.426325 3.839430 l f
0.000000 0.000000 0.000000 srgb
n -11.035700 3.839430 m -11.035700 5.239430 l -1.426325 5.239430 l -1.426325 3.839430 l cp s
/Helvetica-latin1 ff 0.700000 scf sf
(pi_abstract_move_dt) dup sw 2 div -6.231013 ex sub 4.839430 m gs 1 -1 sc sh gr
0.100000 slw
[] 0 sd
1.000000 1.000000 1.000000 srgb
n -4.080900 9.846700 m -4.080900 11.246700 l 4.735506 11.246700 l 4.735506 9.846700 l f
0.000000 0.000000 0.000000 srgb
n -4.080900 9.846700 m -4.080900 11.246700 l 4.735506 11.246700 l 4.735506 9.846700 l cp s
/Helvetica-latin1 ff 0.700000 scf sf
(pi_branch_multiple) dup sw 2 div 0.327303 ex sub 10.846700 m gs 1 -1 sc sh gr
0.100000 slw
[] 0 sd
1.000000 1.000000 1.000000 srgb
n -5.309000 12.290500 m -5.309000 13.690500 l 4.721469 13.690500 l 4.721469 12.290500 l f
0.000000 0.000000 0.000000 srgb
n -5.309000 12.290500 m -5.309000 13.690500 l 4.721469 13.690500 l 4.721469 12.290500 l cp s
/Helvetica-latin1 ff 0.700000 scf sf
(pi_conditional_branch) dup sw 2 div -0.293766 ex sub 13.290500 m gs 1 -1 sc sh gr
0.100000 slw
[] 0 sd
1.000000 1.000000 1.000000 srgb
n -5.782000 14.558400 m -5.782000 15.958400 l 4.782844 15.958400 l 4.782844 14.558400 l f
0.000000 0.000000 0.000000 srgb
n -5.782000 14.558400 m -5.782000 15.958400 l 4.782844 15.958400 l 4.782844 14.558400 l cp s
/Helvetica-latin1 ff 0.700000 scf sf
(pi_uconditional_branch) dup sw 2 div -0.499578 ex sub 15.558400 m gs 1 -1 sc sh gr
0.100000 slw
[] 0 sd
1.000000 1.000000 1.000000 srgb
n 27.622300 5.208690 m 27.622300 6.608690 l 31.444956 6.608690 l 31.444956 5.208690 l f
0.000000 0.000000 0.000000 srgb
n 27.622300 5.208690 m 27.622300 6.608690 l 31.444956 6.608690 l 31.444956 5.208690 l cp s
/Helvetica-latin1 ff 0.700000 scf sf
(pi_tstpi) dup sw 2 div 29.533628 ex sub 6.208690 m gs 1 -1 sc sh gr
0.100000 slw
[] 0 sd
1.000000 1.000000 1.000000 srgb
n 27.649900 8.201500 m 27.649900 9.601500 l 31.551462 9.601500 l 31.551462 8.201500 l f
0.000000 0.000000 0.000000 srgb
n 27.649900 8.201500 m 27.649900 9.601500 l 31.551462 9.601500 l 31.551462 8.201500 l cp s
/Helvetica-latin1 ff 0.700000 scf sf
(pi_tdtpi) dup sw 2 div 29.600681 ex sub 9.201500 m gs 1 -1 sc sh gr
0.100000 slw
[] 0 sd
1.000000 1.000000 1.000000 srgb
n 18.554800 11.414600 m 18.554800 12.814600 l 22.560269 12.814600 l 22.560269 11.414600 l f
0.000000 0.000000 0.000000 srgb
n 18.554800 11.414600 m 18.554800 12.814600 l 22.560269 12.814600 l 22.560269 11.414600 l cp s
/Helvetica-latin1 ff 0.700000 scf sf
(pi_bstpi) dup sw 2 div 20.557534 ex sub 12.414600 m gs 1 -1 sc sh gr
0.100000 slw
[] 0 sd
1.000000 1.000000 1.000000 srgb
n 18.629700 13.984100 m 18.629700 15.384100 l 22.714075 15.384100 l 22.714075 13.984100 l f
0.000000 0.000000 0.000000 srgb
n 18.629700 13.984100 m 18.629700 15.384100 l 22.714075 15.384100 l 22.714075 13.984100 l cp s
/Helvetica-latin1 ff 0.700000 scf sf
(pi_bdtpi) dup sw 2 div 20.671888 ex sub 14.984100 m gs 1 -1 sc sh gr
0.100000 slw
[] 0 sd
0 slj
0 slc
n 3.605720 0.582113 m 3.605720 2.169380 l -1.468930 2.169380 l s
0 slj
1.000000 1.000000 1.000000 srgb
n 4.005720 0.582113 m 3.605720 -0.217887 l 3.205720 0.582113 l ef
0.100000 slw
[] 0 sd
0 slj
0.000000 0.000000 0.000000 srgb
n 4.005720 0.582113 m 3.605720 -0.217887 l 3.205720 0.582113 l cp s
/Courier-latin1 ff 0.560000 scf sf
0.100000 slw
[] 0 sd
0 slj
0 slc
n 3.605720 0.582113 m 3.605720 4.539430 l -1.426325 4.539430 l s
0 slj
1.000000 1.000000 1.000000 srgb
n 4.005720 0.582113 m 3.605720 -0.217887 l 3.205720 0.582113 l ef
0.100000 slw
[] 0 sd
0 slj
0.000000 0.000000 0.000000 srgb
n 4.005720 0.582113 m 3.605720 -0.217887 l 3.205720 0.582113 l cp s
/Courier-latin1 ff 0.560000 scf sf
0.100000 slw
[] 0 sd
0 slj
0 slc
n 7.588050 8.597403 m 7.588050 10.546700 l 4.735510 10.546700 l s
0 slj
1.000000 1.000000 1.000000 srgb
n 7.988050 8.597403 m 7.588050 7.797403 l 7.188050 8.597403 l ef
0.100000 slw
[] 0 sd
0 slj
0.000000 0.000000 0.000000 srgb
n 7.988050 8.597403 m 7.588050 7.797403 l 7.188050 8.597403 l cp s
/Courier-latin1 ff 0.560000 scf sf
0.100000 slw
[] 0 sd
0 slj
0 slc
n 7.588050 8.597403 m 7.588050 12.990500 l 4.721470 12.990500 l s
0 slj
1.000000 1.000000 1.000000 srgb
n 7.988050 8.597403 m 7.588050 7.797403 l 7.188050 8.597403 l ef
0.100000 slw
[] 0 sd
0 slj
0.000000 0.000000 0.000000 srgb
n 7.988050 8.597403 m 7.588050 7.797403 l 7.188050 8.597403 l cp s
/Courier-latin1 ff 0.560000 scf sf
0.100000 slw
[] 0 sd
0 slj
0 slc
n 7.588050 8.597403 m 7.588050 15.258400 l 4.782840 15.258400 l s
0 slj
1.000000 1.000000 1.000000 srgb
n 7.988050 8.597403 m 7.588050 7.797403 l 7.188050 8.597403 l ef
0.100000 slw
[] 0 sd
0 slj
0.000000 0.000000 0.000000 srgb
n 7.988050 8.597403 m 7.588050 7.797403 l 7.188050 8.597403 l cp s
/Courier-latin1 ff 0.560000 scf sf
0.100000 slw
[] 0 sd
0 slj
0 slc
n 22.209200 4.454843 m 22.209200 5.908690 l 27.622300 5.908690 l s
0 slj
1.000000 1.000000 1.000000 srgb
n 22.609200 4.454843 m 22.209200 3.654843 l 21.809200 4.454843 l ef
0.100000 slw
[] 0 sd
0 slj
0.000000 0.000000 0.000000 srgb
n 22.609200 4.454843 m 22.209200 3.654843 l 21.809200 4.454843 l cp s
/Courier-latin1 ff 0.560000 scf sf
0.100000 slw
[] 0 sd
0 slj
0 slc
n 22.209200 4.454843 m 22.209200 8.901500 l 27.649900 8.901500 l s
0 slj
1.000000 1.000000 1.000000 srgb
n 22.609200 4.454843 m 22.209200 3.654843 l 21.809200 4.454843 l ef
0.100000 slw
[] 0 sd
0 slj
0.000000 0.000000 0.000000 srgb
n 22.609200 4.454843 m 22.209200 3.654843 l 21.809200 4.454843 l cp s
/Courier-latin1 ff 0.560000 scf sf
0.100000 slw
[] 0 sd
0 slj
0 slc
n 16.431700 8.603003 m 16.431700 12.114600 l 18.554800 12.114600 l s
0 slj
1.000000 1.000000 1.000000 srgb
n 16.831700 8.603003 m 16.431700 7.803003 l 16.031700 8.603003 l ef
0.100000 slw
[] 0 sd
0 slj
0.000000 0.000000 0.000000 srgb
n 16.831700 8.603003 m 16.431700 7.803003 l 16.031700 8.603003 l cp s
/Courier-latin1 ff 0.560000 scf sf
0.100000 slw
[] 0 sd
0 slj
0 slc
n 16.431700 8.603003 m 16.431700 14.684100 l 18.629700 14.684100 l s
0 slj
1.000000 1.000000 1.000000 srgb
n 16.831700 8.603003 m 16.431700 7.803003 l 16.031700 8.603003 l ef
0.100000 slw
[] 0 sd
0 slj
0.000000 0.000000 0.000000 srgb
n 16.831700 8.603003 m 16.431700 7.803003 l 16.031700 8.603003 l cp s
/Courier-latin1 ff 0.560000 scf sf
0.100000 slw
[] 0 sd
1.000000 1.000000 1.000000 srgb
n -9.443000 6.059220 m -9.443000 7.459220 l -1.597688 7.459220 l -1.597688 6.059220 l f
0.000000 0.000000 0.000000 srgb
n -9.443000 6.059220 m -9.443000 7.459220 l -1.597688 7.459220 l -1.597688 6.059220 l cp s
/Helvetica-latin1 ff 0.700000 scf sf
(pi_indirect_store) dup sw 2 div -5.520344 ex sub 7.059220 m gs 1 -1 sc sh gr
0.100000 slw
[] 0 sd
0 slj
0 slc
n 3.605720 0.582113 m 3.605720 6.759220 l -1.597690 6.759220 l s
0 slj
1.000000 1.000000 1.000000 srgb
n 4.005720 0.582113 m 3.605720 -0.217887 l 3.205720 0.582113 l ef
0.100000 slw
[] 0 sd
0 slj
0.000000 0.000000 0.000000 srgb
n 4.005720 0.582113 m 3.605720 -0.217887 l 3.205720 0.582113 l cp s
/Courier-latin1 ff 0.560000 scf sf
0.100000 slw
[] 0 sd
0 slj
0 slc
n 12.274600 -5.970557 m 12.274600 6.991200 l 14.822300 6.991200 l s
0 slj
1.000000 1.000000 1.000000 srgb
n 12.674600 -5.970557 m 12.274600 -6.770557 l 11.874600 -5.970557 l ef
0.100000 slw
[] 0 sd
0 slj
0.000000 0.000000 0.000000 srgb
n 12.674600 -5.970557 m 12.274600 -6.770557 l 11.874600 -5.970557 l cp s
/Courier-latin1 ff 0.560000 scf sf
showpage
