%!PS-Adobe-2.0 EPSF-2.0
%%Title: /home/jencek/projects/lestes/tla@twin/lestes--doc--0.0--patch-3/doc/lyx/backend_schema.dia
%%Creator: Dia v0.94
%%CreationDate: Tue May 24 01:30:51 2005
%%For: jencek
%%Orientation: Portrait
%%Magnification: 1.0000
%%BoundingBox: 0 0 2956 1335
%%BeginSetup
%%EndSetup
%%EndComments
%%BeginProlog
[ /.notdef /.notdef /.notdef /.notdef /.notdef /.notdef /.notdef /.notdef /.notdef /.notdef
/.notdef /.notdef /.notdef /.notdef /.notdef /.notdef /.notdef /.notdef /.notdef /.notdef
/.notdef /.notdef /.notdef /.notdef /.notdef /.notdef /.notdef /.notdef /.notdef /.notdef
/.notdef /.notdef /space /exclam /quotedbl /numbersign /dollar /percent /ampersand /quoteright
/parenleft /parenright /asterisk /plus /comma /hyphen /period /slash /zero /one
/two /three /four /five /six /seven /eight /nine /colon /semicolon
/less /equal /greater /question /at /A /B /C /D /E
/F /G /H /I /J /K /L /M /N /O
/P /Q /R /S /T /U /V /W /X /Y
/Z /bracketleft /backslash /bracketright /asciicircum /underscore /quoteleft /a /b /c
/d /e /f /g /h /i /j /k /l /m
/n /o /p /q /r /s /t /u /v /w
/x /y /z /braceleft /bar /braceright /asciitilde /.notdef /.notdef /.notdef
/.notdef /.notdef /.notdef /.notdef /.notdef /.notdef /.notdef /.notdef /.notdef /.notdef
/.notdef /.notdef /.notdef /.notdef /.notdef /.notdef /.notdef /.notdef /.notdef /.notdef
/.notdef /.notdef /.notdef /.notdef /.notdef /.notdef /.notdef /.notdef /.notdef /.notdef
/space /exclamdown /cent /sterling /currency /yen /brokenbar /section /dieresis /copyright
/ordfeminine /guillemotleft /logicalnot /hyphen /registered /macron /degree /plusminus /twosuperior /threesuperior
/acute /mu /paragraph /periodcentered /cedilla /onesuperior /ordmasculine /guillemotright /onequarter /onehalf
/threequarters /questiondown /Agrave /Aacute /Acircumflex /Atilde /Adieresis /Aring /AE /Ccedilla
/Egrave /Eacute /Ecircumflex /Edieresis /Igrave /Iacute /Icircumflex /Idieresis /Eth /Ntilde
/Ograve /Oacute /Ocircumflex /Otilde /Odieresis /multiply /Oslash /Ugrave /Uacute /Ucircumflex
/Udieresis /Yacute /Thorn /germandbls /agrave /aacute /acircumflex /atilde /adieresis /aring
/ae /ccedilla /egrave /eacute /ecircumflex /edieresis /igrave /iacute /icircumflex /idieresis
/eth /ntilde /ograve /oacute /ocircumflex /otilde /odieresis /divide /oslash /ugrave
/uacute /ucircumflex /udieresis /yacute /thorn /ydieresis] /isolatin1encoding exch def
/cp {closepath} bind def
/c {curveto} bind def
/f {fill} bind def
/a {arc} bind def
/ef {eofill} bind def
/ex {exch} bind def
/gr {grestore} bind def
/gs {gsave} bind def
/sa {save} bind def
/rs {restore} bind def
/l {lineto} bind def
/m {moveto} bind def
/rm {rmoveto} bind def
/n {newpath} bind def
/s {stroke} bind def
/sh {show} bind def
/slc {setlinecap} bind def
/slj {setlinejoin} bind def
/slw {setlinewidth} bind def
/srgb {setrgbcolor} bind def
/rot {rotate} bind def
/sc {scale} bind def
/sd {setdash} bind def
/ff {findfont} bind def
/sf {setfont} bind def
/scf {scalefont} bind def
/sw {stringwidth pop} bind def
/tr {translate} bind def

/ellipsedict 8 dict def
ellipsedict /mtrx matrix put
/ellipse
{ ellipsedict begin
   /endangle exch def
   /startangle exch def
   /yrad exch def
   /xrad exch def
   /y exch def
   /x exch def   /savematrix mtrx currentmatrix def
   x y tr xrad yrad sc
   0 0 1 startangle endangle arc
   savematrix setmatrix
   end
} def

/mergeprocs {
dup length
3 -1 roll
dup
length
dup
5 1 roll
3 -1 roll
add
array cvx
dup
3 -1 roll
0 exch
putinterval
dup
4 2 roll
putinterval
} bind def
/Times-Roman-latin1
    /Times-Roman findfont
    dup length dict begin
	{1 index /FID ne {def} {pop pop} ifelse} forall
	/Encoding isolatin1encoding def
    currentdict end
definefont pop
/Times-Italic-latin1
    /Times-Italic findfont
    dup length dict begin
	{1 index /FID ne {def} {pop pop} ifelse} forall
	/Encoding isolatin1encoding def
    currentdict end
definefont pop
/Times-Bold-latin1
    /Times-Bold findfont
    dup length dict begin
	{1 index /FID ne {def} {pop pop} ifelse} forall
	/Encoding isolatin1encoding def
    currentdict end
definefont pop
/Times-BoldItalic-latin1
    /Times-BoldItalic findfont
    dup length dict begin
	{1 index /FID ne {def} {pop pop} ifelse} forall
	/Encoding isolatin1encoding def
    currentdict end
definefont pop
/AvantGarde-Book-latin1
    /AvantGarde-Book findfont
    dup length dict begin
	{1 index /FID ne {def} {pop pop} ifelse} forall
	/Encoding isolatin1encoding def
    currentdict end
definefont pop
/AvantGarde-BookOblique-latin1
    /AvantGarde-BookOblique findfont
    dup length dict begin
	{1 index /FID ne {def} {pop pop} ifelse} forall
	/Encoding isolatin1encoding def
    currentdict end
definefont pop
/AvantGarde-Demi-latin1
    /AvantGarde-Demi findfont
    dup length dict begin
	{1 index /FID ne {def} {pop pop} ifelse} forall
	/Encoding isolatin1encoding def
    currentdict end
definefont pop
/AvantGarde-DemiOblique-latin1
    /AvantGarde-DemiOblique findfont
    dup length dict begin
	{1 index /FID ne {def} {pop pop} ifelse} forall
	/Encoding isolatin1encoding def
    currentdict end
definefont pop
/Bookman-Light-latin1
    /Bookman-Light findfont
    dup length dict begin
	{1 index /FID ne {def} {pop pop} ifelse} forall
	/Encoding isolatin1encoding def
    currentdict end
definefont pop
/Bookman-LightItalic-latin1
    /Bookman-LightItalic findfont
    dup length dict begin
	{1 index /FID ne {def} {pop pop} ifelse} forall
	/Encoding isolatin1encoding def
    currentdict end
definefont pop
/Bookman-Demi-latin1
    /Bookman-Demi findfont
    dup length dict begin
	{1 index /FID ne {def} {pop pop} ifelse} forall
	/Encoding isolatin1encoding def
    currentdict end
definefont pop
/Bookman-DemiItalic-latin1
    /Bookman-DemiItalic findfont
    dup length dict begin
	{1 index /FID ne {def} {pop pop} ifelse} forall
	/Encoding isolatin1encoding def
    currentdict end
definefont pop
/Courier-latin1
    /Courier findfont
    dup length dict begin
	{1 index /FID ne {def} {pop pop} ifelse} forall
	/Encoding isolatin1encoding def
    currentdict end
definefont pop
/Courier-Oblique-latin1
    /Courier-Oblique findfont
    dup length dict begin
	{1 index /FID ne {def} {pop pop} ifelse} forall
	/Encoding isolatin1encoding def
    currentdict end
definefont pop
/Courier-Bold-latin1
    /Courier-Bold findfont
    dup length dict begin
	{1 index /FID ne {def} {pop pop} ifelse} forall
	/Encoding isolatin1encoding def
    currentdict end
definefont pop
/Courier-BoldOblique-latin1
    /Courier-BoldOblique findfont
    dup length dict begin
	{1 index /FID ne {def} {pop pop} ifelse} forall
	/Encoding isolatin1encoding def
    currentdict end
definefont pop
/Helvetica-latin1
    /Helvetica findfont
    dup length dict begin
	{1 index /FID ne {def} {pop pop} ifelse} forall
	/Encoding isolatin1encoding def
    currentdict end
definefont pop
/Helvetica-Oblique-latin1
    /Helvetica-Oblique findfont
    dup length dict begin
	{1 index /FID ne {def} {pop pop} ifelse} forall
	/Encoding isolatin1encoding def
    currentdict end
definefont pop
/Helvetica-Bold-latin1
    /Helvetica-Bold findfont
    dup length dict begin
	{1 index /FID ne {def} {pop pop} ifelse} forall
	/Encoding isolatin1encoding def
    currentdict end
definefont pop
/Helvetica-BoldOblique-latin1
    /Helvetica-BoldOblique findfont
    dup length dict begin
	{1 index /FID ne {def} {pop pop} ifelse} forall
	/Encoding isolatin1encoding def
    currentdict end
definefont pop
/Helvetica-Narrow-latin1
    /Helvetica-Narrow findfont
    dup length dict begin
	{1 index /FID ne {def} {pop pop} ifelse} forall
	/Encoding isolatin1encoding def
    currentdict end
definefont pop
/Helvetica-Narrow-Oblique-latin1
    /Helvetica-Narrow-Oblique findfont
    dup length dict begin
	{1 index /FID ne {def} {pop pop} ifelse} forall
	/Encoding isolatin1encoding def
    currentdict end
definefont pop
/Helvetica-Narrow-Bold-latin1
    /Helvetica-Narrow-Bold findfont
    dup length dict begin
	{1 index /FID ne {def} {pop pop} ifelse} forall
	/Encoding isolatin1encoding def
    currentdict end
definefont pop
/Helvetica-Narrow-BoldOblique-latin1
    /Helvetica-Narrow-BoldOblique findfont
    dup length dict begin
	{1 index /FID ne {def} {pop pop} ifelse} forall
	/Encoding isolatin1encoding def
    currentdict end
definefont pop
/NewCenturySchoolbook-Roman-latin1
    /NewCenturySchoolbook-Roman findfont
    dup length dict begin
	{1 index /FID ne {def} {pop pop} ifelse} forall
	/Encoding isolatin1encoding def
    currentdict end
definefont pop
/NewCenturySchoolbook-Italic-latin1
    /NewCenturySchoolbook-Italic findfont
    dup length dict begin
	{1 index /FID ne {def} {pop pop} ifelse} forall
	/Encoding isolatin1encoding def
    currentdict end
definefont pop
/NewCenturySchoolbook-Bold-latin1
    /NewCenturySchoolbook-Bold findfont
    dup length dict begin
	{1 index /FID ne {def} {pop pop} ifelse} forall
	/Encoding isolatin1encoding def
    currentdict end
definefont pop
/NewCenturySchoolbook-BoldItalic-latin1
    /NewCenturySchoolbook-BoldItalic findfont
    dup length dict begin
	{1 index /FID ne {def} {pop pop} ifelse} forall
	/Encoding isolatin1encoding def
    currentdict end
definefont pop
/Palatino-Roman-latin1
    /Palatino-Roman findfont
    dup length dict begin
	{1 index /FID ne {def} {pop pop} ifelse} forall
	/Encoding isolatin1encoding def
    currentdict end
definefont pop
/Palatino-Italic-latin1
    /Palatino-Italic findfont
    dup length dict begin
	{1 index /FID ne {def} {pop pop} ifelse} forall
	/Encoding isolatin1encoding def
    currentdict end
definefont pop
/Palatino-Bold-latin1
    /Palatino-Bold findfont
    dup length dict begin
	{1 index /FID ne {def} {pop pop} ifelse} forall
	/Encoding isolatin1encoding def
    currentdict end
definefont pop
/Palatino-BoldItalic-latin1
    /Palatino-BoldItalic findfont
    dup length dict begin
	{1 index /FID ne {def} {pop pop} ifelse} forall
	/Encoding isolatin1encoding def
    currentdict end
definefont pop
/Symbol-latin1
    /Symbol findfont
definefont pop
/ZapfChancery-MediumItalic-latin1
    /ZapfChancery-MediumItalic findfont
    dup length dict begin
	{1 index /FID ne {def} {pop pop} ifelse} forall
	/Encoding isolatin1encoding def
    currentdict end
definefont pop
/ZapfDingbats-latin1
    /ZapfDingbats findfont
    dup length dict begin
	{1 index /FID ne {def} {pop pop} ifelse} forall
	/Encoding isolatin1encoding def
    currentdict end
definefont pop
28.346000 -28.346000 scale
43.201300 -52.992853 translate
%%EndProlog


1.000000 1.000000 1.000000 srgb
n -26.143600 6.004610 m -26.143600 41.648174 l 47.481014 41.648174 l 47.481014 6.004610 l f
0.200000 slw
[] 0 sd
[] 0 sd
0 slj
0.000000 0.000000 0.000000 srgb
n -26.143600 6.004610 m -26.143600 41.648174 l 47.481014 41.648174 l 47.481014 6.004610 l cp s
1.000000 1.000000 1.000000 srgb
n -13.127200 8.692020 m -13.127200 30.898526 l 46.066577 30.898526 l 46.066577 8.692020 l f
0.200000 slw
[1.000000] 0 sd
[0.500000] 0 sd
0 slj
0.000000 0.000000 0.000000 srgb
n -13.127200 8.692020 m -13.127200 30.898526 l 46.066577 30.898526 l 46.066577 8.692020 l cp s
0.150000 slw
[] 0 sd
[] 0 sd
0 slc
0 slj
0 slc
0 slj
[] 0 sd
1.000000 1.000000 1.000000 srgb
n -0.161404 11.926300 2.505076 1.875000 0 360 ellipse f
0.000000 0.000000 0.000000 srgb
n -0.161404 11.926300 2.505076 1.875000 0 360 ellipse cp s
/Helvetica-latin1 ff 0.560000 scf sf
(Function) dup sw 2 div -0.161404 ex sub 11.676300 m gs 1 -1 sc sh gr
(1) dup sw 2 div -0.161404 ex sub 12.476300 m gs 1 -1 sc sh gr
0.200000 slw
[] 0 sd
[] 0 sd
0 slc
n 2.343670 11.926300 m 3.242502 11.918211 l s
0 slj
1.000000 1.000000 1.000000 srgb
n 3.244752 12.168201 m 3.742482 11.913712 l 3.240253 11.668222 l ef
0.200000 slw
[] 0 sd
0 slj
0.000000 0.000000 0.000000 srgb
n 3.244752 12.168201 m 3.742482 11.913712 l 3.240253 11.668222 l cp s
0.150000 slw
[] 0 sd
[] 0 sd
0 slc
0 slj
0 slc
0 slj
[] 0 sd
1.000000 1.000000 1.000000 srgb
n -0.373574 17.230000 2.505076 1.875000 0 360 ellipse f
0.000000 0.000000 0.000000 srgb
n -0.373574 17.230000 2.505076 1.875000 0 360 ellipse cp s
/Helvetica-latin1 ff 0.560000 scf sf
(Function) dup sw 2 div -0.373574 ex sub 16.980000 m gs 1 -1 sc sh gr
(2) dup sw 2 div -0.373574 ex sub 17.780000 m gs 1 -1 sc sh gr
0.150000 slw
[] 0 sd
[] 0 sd
0 slc
0 slj
0 slc
0 slj
[] 0 sd
1.000000 1.000000 1.000000 srgb
n -0.373574 26.730000 2.505076 1.875000 0 360 ellipse f
0.000000 0.000000 0.000000 srgb
n -0.373574 26.730000 2.505076 1.875000 0 360 ellipse cp s
/Helvetica-latin1 ff 0.560000 scf sf
(Function) dup sw 2 div -0.373574 ex sub 26.480000 m gs 1 -1 sc sh gr
(N) dup sw 2 div -0.373574 ex sub 27.280000 m gs 1 -1 sc sh gr
0.200000 slw
[] 0 sd
[] 0 sd
0 slc
n 2.131500 17.230000 m 3.292948 17.188339 l s
0 slj
1.000000 1.000000 1.000000 srgb
n 3.301910 17.438178 m 3.792627 17.170416 l 3.283987 16.938500 l ef
0.200000 slw
[] 0 sd
0 slj
0.000000 0.000000 0.000000 srgb
n 3.301910 17.438178 m 3.792627 17.170416 l 3.283987 16.938500 l cp s
0.300000 slw
[0.200000] 0 sd
[0.600000] 0 sd
0 slc
n -2.149630 21.963200 m 44.894700 21.963200 l s
0.200000 slw
[] 0 sd
[] 0 sd
0 slc
0 slj
0 slc
0 slj
[] 0 sd
1.000000 1.000000 1.000000 srgb
n -11.771500 16.895700 m -5.012617 16.895700 l -5.012617 22.273877 l -11.771500 22.273877 l ef
0.000000 0.000000 0.000000 srgb
n -11.771500 16.895700 m -5.012617 16.895700 l -5.012617 22.273877 l -11.771500 22.273877 l cp s
/Helvetica-latin1 ff 0.560000 scf sf
(intercode) dup sw 2 div -8.392058 ex sub 18.934788 m gs 1 -1 sc sh gr
(structure) dup sw 2 div -8.392058 ex sub 19.734788 m gs 1 -1 sc sh gr
(preprocessing) dup sw 2 div -8.392058 ex sub 20.534788 m gs 1 -1 sc sh gr
0.200000 slw
[] 0 sd
[] 0 sd
0 slc
n -5.012620 19.584800 m -2.660390 11.945200 l s
0.200000 slw
[] 0 sd
[] 0 sd
0 slc
n -5.012620 19.584800 m -2.735370 17.485500 l s
0.200000 slw
[] 0 sd
[] 0 sd
0 slc
n -5.012620 19.584800 m -2.735370 26.113500 l s
0.150000 slw
[] 0 sd
[] 0 sd
0 slc
0 slj
0 slc
0 slj
[] 0 sd
1.000000 1.000000 1.000000 srgb
n 4.012460 9.450230 m 45.139185 9.450230 l 45.139185 14.318158 l 4.012460 14.318158 l ef
0.000000 0.000000 0.000000 srgb
n 4.012460 9.450230 m 45.139185 9.450230 l 45.139185 14.318158 l 4.012460 14.318158 l cp s
/Helvetica-latin1 ff 0.560000 scf sf
/Helvetica-latin1 ff 1.050000 scf sf
(Function body processor 1) 19.347300 10.508800 m gs 1 -1 sc sh gr
1.000000 1.000000 1.000000 srgb
n 4.740080 10.832700 m 4.740080 13.532700 l 9.740080 13.532700 l 9.740080 10.832700 l f
0.100000 slw
[] 0 sd
[] 0 sd
0 slj
0.000000 0.000000 0.000000 srgb
n 4.740080 10.832700 m 4.740080 13.532700 l 9.740080 13.532700 l 9.740080 10.832700 l cp s
/Helvetica-latin1 ff 0.560000 scf sf
(pseudoinstr.) dup sw 2 div 7.240080 ex sub 11.932700 m gs 1 -1 sc sh gr
(ordering) dup sw 2 div 7.240080 ex sub 12.732700 m gs 1 -1 sc sh gr
1.000000 1.000000 1.000000 srgb
n 11.481500 10.832700 m 11.481500 13.532700 l 16.881500 13.532700 l 16.881500 10.832700 l f
0.100000 slw
[] 0 sd
[] 0 sd
0 slj
0.000000 0.000000 0.000000 srgb
n 11.481500 10.832700 m 11.481500 13.532700 l 16.881500 13.532700 l 16.881500 10.832700 l cp s
/Helvetica-latin1 ff 0.560000 scf sf
(pi_pi to tm_pi ) dup sw 2 div 14.181500 ex sub 11.932700 m gs 1 -1 sc sh gr
(mapping) dup sw 2 div 14.181500 ex sub 12.732700 m gs 1 -1 sc sh gr
1.000000 1.000000 1.000000 srgb
n 18.643600 10.832700 m 18.643600 13.532700 l 22.793600 13.532700 l 22.793600 10.832700 l f
0.100000 slw
[] 0 sd
[] 0 sd
0 slj
0.000000 0.000000 0.000000 srgb
n 18.643600 10.832700 m 18.643600 13.532700 l 22.793600 13.532700 l 22.793600 10.832700 l cp s
/Helvetica-latin1 ff 0.560000 scf sf
(register) dup sw 2 div 20.718600 ex sub 11.932700 m gs 1 -1 sc sh gr
(allocation) dup sw 2 div 20.718600 ex sub 12.732700 m gs 1 -1 sc sh gr
1.000000 1.000000 1.000000 srgb
n 24.516000 10.832700 m 24.516000 13.532700 l 29.066000 13.532700 l 29.066000 10.832700 l f
0.100000 slw
[] 0 sd
[] 0 sd
0 slj
0.000000 0.000000 0.000000 srgb
n 24.516000 10.832700 m 24.516000 13.532700 l 29.066000 13.532700 l 29.066000 10.832700 l cp s
/Helvetica-latin1 ff 0.560000 scf sf
(spill-code) dup sw 2 div 26.791000 ex sub 11.932700 m gs 1 -1 sc sh gr
(generation) dup sw 2 div 26.791000 ex sub 12.732700 m gs 1 -1 sc sh gr
1.000000 1.000000 1.000000 srgb
n 30.798100 10.832700 m 30.798100 13.532700 l 37.948100 13.532700 l 37.948100 10.832700 l f
0.100000 slw
[] 0 sd
[] 0 sd
0 slj
0.000000 0.000000 0.000000 srgb
n 30.798100 10.832700 m 30.798100 13.532700 l 37.948100 13.532700 l 37.948100 10.832700 l cp s
/Helvetica-latin1 ff 0.560000 scf sf
(local memory ) dup sw 2 div 34.373100 ex sub 11.932700 m gs 1 -1 sc sh gr
(layout computation) dup sw 2 div 34.373100 ex sub 12.732700 m gs 1 -1 sc sh gr
1.000000 1.000000 1.000000 srgb
n 39.639100 10.832700 m 39.639100 13.532700 l 44.189100 13.532700 l 44.189100 10.832700 l f
0.100000 slw
[] 0 sd
[] 0 sd
0 slj
0.000000 0.000000 0.000000 srgb
n 39.639100 10.832700 m 39.639100 13.532700 l 44.189100 13.532700 l 44.189100 10.832700 l cp s
/Helvetica-latin1 ff 0.560000 scf sf
(asm code) dup sw 2 div 41.914100 ex sub 11.932700 m gs 1 -1 sc sh gr
(generation) dup sw 2 div 41.914100 ex sub 12.732700 m gs 1 -1 sc sh gr
0.150000 slw
[] 0 sd
[] 0 sd
0 slc
0 slj
0 slc
0 slj
[] 0 sd
1.000000 1.000000 1.000000 srgb
n 9.899910 11.889053 m 10.598470 11.889053 l 10.831323 11.889053 l 10.831323 11.656200 l 11.297030 12.121907 l 10.831323 12.587613 l 10.831323 12.354760 l 9.899910 12.354760 l ef
0.000000 0.000000 0.000000 srgb
n 9.899910 11.889053 m 10.598470 11.889053 l 10.831323 11.889053 l 10.831323 11.656200 l 11.297030 12.121907 l 10.831323 12.587613 l 10.831323 12.354760 l 9.899910 12.354760 l cp s
0 slc
0 slj
[] 0 sd
n 9.899910 11.889053 m 10.598470 11.889053 l 10.831323 11.889053 l 10.831323 11.656200 l 11.297030 12.121907 l 10.831323 12.587613 l 10.831323 12.354760 l 9.899910 12.354760 l cp s
0.150000 slw
[] 0 sd
[] 0 sd
0 slc
0 slj
0 slc
0 slj
[] 0 sd
1.000000 1.000000 1.000000 srgb
n 17.060000 11.889053 m 17.758560 11.889053 l 17.991413 11.889053 l 17.991413 11.656200 l 18.457120 12.121907 l 17.991413 12.587613 l 17.991413 12.354760 l 17.060000 12.354760 l ef
0.000000 0.000000 0.000000 srgb
n 17.060000 11.889053 m 17.758560 11.889053 l 17.991413 11.889053 l 17.991413 11.656200 l 18.457120 12.121907 l 17.991413 12.587613 l 17.991413 12.354760 l 17.060000 12.354760 l cp s
0 slc
0 slj
[] 0 sd
n 17.060000 11.889053 m 17.758560 11.889053 l 17.991413 11.889053 l 17.991413 11.656200 l 18.457120 12.121907 l 17.991413 12.587613 l 17.991413 12.354760 l 17.060000 12.354760 l cp s
0.150000 slw
[] 0 sd
[] 0 sd
0 slc
0 slj
0 slc
0 slj
[] 0 sd
1.000000 1.000000 1.000000 srgb
n 22.929900 11.889053 m 23.628460 11.889053 l 23.861313 11.889053 l 23.861313 11.656200 l 24.327020 12.121907 l 23.861313 12.587613 l 23.861313 12.354760 l 22.929900 12.354760 l ef
0.000000 0.000000 0.000000 srgb
n 22.929900 11.889053 m 23.628460 11.889053 l 23.861313 11.889053 l 23.861313 11.656200 l 24.327020 12.121907 l 23.861313 12.587613 l 23.861313 12.354760 l 22.929900 12.354760 l cp s
0 slc
0 slj
[] 0 sd
n 22.929900 11.889053 m 23.628460 11.889053 l 23.861313 11.889053 l 23.861313 11.656200 l 24.327020 12.121907 l 23.861313 12.587613 l 23.861313 12.354760 l 22.929900 12.354760 l cp s
0.150000 slw
[] 0 sd
[] 0 sd
0 slc
0 slj
0 slc
0 slj
[] 0 sd
1.000000 1.000000 1.000000 srgb
n 29.232800 11.889053 m 29.931360 11.889053 l 30.164213 11.889053 l 30.164213 11.656200 l 30.629920 12.121907 l 30.164213 12.587613 l 30.164213 12.354760 l 29.232800 12.354760 l ef
0.000000 0.000000 0.000000 srgb
n 29.232800 11.889053 m 29.931360 11.889053 l 30.164213 11.889053 l 30.164213 11.656200 l 30.629920 12.121907 l 30.164213 12.587613 l 30.164213 12.354760 l 29.232800 12.354760 l cp s
0 slc
0 slj
[] 0 sd
n 29.232800 11.889053 m 29.931360 11.889053 l 30.164213 11.889053 l 30.164213 11.656200 l 30.629920 12.121907 l 30.164213 12.587613 l 30.164213 12.354760 l 29.232800 12.354760 l cp s
0.150000 slw
[] 0 sd
[] 0 sd
0 slc
0 slj
0 slc
0 slj
[] 0 sd
1.000000 1.000000 1.000000 srgb
n 38.116200 11.889053 m 38.814760 11.889053 l 39.047613 11.889053 l 39.047613 11.656200 l 39.513320 12.121907 l 39.047613 12.587613 l 39.047613 12.354760 l 38.116200 12.354760 l ef
0.000000 0.000000 0.000000 srgb
n 38.116200 11.889053 m 38.814760 11.889053 l 39.047613 11.889053 l 39.047613 11.656200 l 39.513320 12.121907 l 39.047613 12.587613 l 39.047613 12.354760 l 38.116200 12.354760 l cp s
0 slc
0 slj
[] 0 sd
n 38.116200 11.889053 m 38.814760 11.889053 l 39.047613 11.889053 l 39.047613 11.656200 l 39.513320 12.121907 l 39.047613 12.587613 l 39.047613 12.354760 l 38.116200 12.354760 l cp s
0.150000 slw
[] 0 sd
[] 0 sd
0 slc
0 slj
0 slc
0 slj
[] 0 sd
1.000000 1.000000 1.000000 srgb
n 3.974310 14.769000 m 45.101035 14.769000 l 45.101035 19.636928 l 3.974310 19.636928 l ef
0.000000 0.000000 0.000000 srgb
n 3.974310 14.769000 m 45.101035 14.769000 l 45.101035 19.636928 l 3.974310 19.636928 l cp s
/Helvetica-latin1 ff 0.560000 scf sf
/Helvetica-latin1 ff 1.050000 scf sf
(Function body processor 2) 19.309100 15.827600 m gs 1 -1 sc sh gr
1.000000 1.000000 1.000000 srgb
n 4.701920 16.151500 m 4.701920 18.851500 l 9.701920 18.851500 l 9.701920 16.151500 l f
0.100000 slw
[] 0 sd
[] 0 sd
0 slj
0.000000 0.000000 0.000000 srgb
n 4.701920 16.151500 m 4.701920 18.851500 l 9.701920 18.851500 l 9.701920 16.151500 l cp s
/Helvetica-latin1 ff 0.560000 scf sf
(pseudoinstr.) dup sw 2 div 7.201920 ex sub 17.251500 m gs 1 -1 sc sh gr
(ordering) dup sw 2 div 7.201920 ex sub 18.051500 m gs 1 -1 sc sh gr
1.000000 1.000000 1.000000 srgb
n 11.443300 16.151500 m 11.443300 18.851500 l 16.843300 18.851500 l 16.843300 16.151500 l f
0.100000 slw
[] 0 sd
[] 0 sd
0 slj
0.000000 0.000000 0.000000 srgb
n 11.443300 16.151500 m 11.443300 18.851500 l 16.843300 18.851500 l 16.843300 16.151500 l cp s
/Helvetica-latin1 ff 0.560000 scf sf
(pi_pi to tm_pi ) dup sw 2 div 14.143300 ex sub 17.251500 m gs 1 -1 sc sh gr
(mapping) dup sw 2 div 14.143300 ex sub 18.051500 m gs 1 -1 sc sh gr
1.000000 1.000000 1.000000 srgb
n 18.605500 16.151500 m 18.605500 18.851500 l 22.755500 18.851500 l 22.755500 16.151500 l f
0.100000 slw
[] 0 sd
[] 0 sd
0 slj
0.000000 0.000000 0.000000 srgb
n 18.605500 16.151500 m 18.605500 18.851500 l 22.755500 18.851500 l 22.755500 16.151500 l cp s
/Helvetica-latin1 ff 0.560000 scf sf
(register) dup sw 2 div 20.680500 ex sub 17.251500 m gs 1 -1 sc sh gr
(allocation) dup sw 2 div 20.680500 ex sub 18.051500 m gs 1 -1 sc sh gr
1.000000 1.000000 1.000000 srgb
n 24.477900 16.151500 m 24.477900 18.851500 l 29.027900 18.851500 l 29.027900 16.151500 l f
0.100000 slw
[] 0 sd
[] 0 sd
0 slj
0.000000 0.000000 0.000000 srgb
n 24.477900 16.151500 m 24.477900 18.851500 l 29.027900 18.851500 l 29.027900 16.151500 l cp s
/Helvetica-latin1 ff 0.560000 scf sf
(spill-code) dup sw 2 div 26.752900 ex sub 17.251500 m gs 1 -1 sc sh gr
(generation) dup sw 2 div 26.752900 ex sub 18.051500 m gs 1 -1 sc sh gr
1.000000 1.000000 1.000000 srgb
n 30.759900 16.151500 m 30.759900 18.851500 l 37.909900 18.851500 l 37.909900 16.151500 l f
0.100000 slw
[] 0 sd
[] 0 sd
0 slj
0.000000 0.000000 0.000000 srgb
n 30.759900 16.151500 m 30.759900 18.851500 l 37.909900 18.851500 l 37.909900 16.151500 l cp s
/Helvetica-latin1 ff 0.560000 scf sf
(local memory ) dup sw 2 div 34.334900 ex sub 17.251500 m gs 1 -1 sc sh gr
(layout computation) dup sw 2 div 34.334900 ex sub 18.051500 m gs 1 -1 sc sh gr
1.000000 1.000000 1.000000 srgb
n 39.600900 16.151500 m 39.600900 18.851500 l 44.150900 18.851500 l 44.150900 16.151500 l f
0.100000 slw
[] 0 sd
[] 0 sd
0 slj
0.000000 0.000000 0.000000 srgb
n 39.600900 16.151500 m 39.600900 18.851500 l 44.150900 18.851500 l 44.150900 16.151500 l cp s
/Helvetica-latin1 ff 0.560000 scf sf
(asm code) dup sw 2 div 41.875900 ex sub 17.251500 m gs 1 -1 sc sh gr
(generation) dup sw 2 div 41.875900 ex sub 18.051500 m gs 1 -1 sc sh gr
0.150000 slw
[] 0 sd
[] 0 sd
0 slc
0 slj
0 slc
0 slj
[] 0 sd
1.000000 1.000000 1.000000 srgb
n 9.861750 17.207853 m 10.560310 17.207853 l 10.793163 17.207853 l 10.793163 16.975000 l 11.258870 17.440707 l 10.793163 17.906413 l 10.793163 17.673560 l 9.861750 17.673560 l ef
0.000000 0.000000 0.000000 srgb
n 9.861750 17.207853 m 10.560310 17.207853 l 10.793163 17.207853 l 10.793163 16.975000 l 11.258870 17.440707 l 10.793163 17.906413 l 10.793163 17.673560 l 9.861750 17.673560 l cp s
0 slc
0 slj
[] 0 sd
n 9.861750 17.207853 m 10.560310 17.207853 l 10.793163 17.207853 l 10.793163 16.975000 l 11.258870 17.440707 l 10.793163 17.906413 l 10.793163 17.673560 l 9.861750 17.673560 l cp s
0.150000 slw
[] 0 sd
[] 0 sd
0 slc
0 slj
0 slc
0 slj
[] 0 sd
1.000000 1.000000 1.000000 srgb
n 17.021900 17.207853 m 17.720460 17.207853 l 17.953313 17.207853 l 17.953313 16.975000 l 18.419020 17.440707 l 17.953313 17.906413 l 17.953313 17.673560 l 17.021900 17.673560 l ef
0.000000 0.000000 0.000000 srgb
n 17.021900 17.207853 m 17.720460 17.207853 l 17.953313 17.207853 l 17.953313 16.975000 l 18.419020 17.440707 l 17.953313 17.906413 l 17.953313 17.673560 l 17.021900 17.673560 l cp s
0 slc
0 slj
[] 0 sd
n 17.021900 17.207853 m 17.720460 17.207853 l 17.953313 17.207853 l 17.953313 16.975000 l 18.419020 17.440707 l 17.953313 17.906413 l 17.953313 17.673560 l 17.021900 17.673560 l cp s
0.150000 slw
[] 0 sd
[] 0 sd
0 slc
0 slj
0 slc
0 slj
[] 0 sd
1.000000 1.000000 1.000000 srgb
n 22.891700 17.207853 m 23.590260 17.207853 l 23.823113 17.207853 l 23.823113 16.975000 l 24.288820 17.440707 l 23.823113 17.906413 l 23.823113 17.673560 l 22.891700 17.673560 l ef
0.000000 0.000000 0.000000 srgb
n 22.891700 17.207853 m 23.590260 17.207853 l 23.823113 17.207853 l 23.823113 16.975000 l 24.288820 17.440707 l 23.823113 17.906413 l 23.823113 17.673560 l 22.891700 17.673560 l cp s
0 slc
0 slj
[] 0 sd
n 22.891700 17.207853 m 23.590260 17.207853 l 23.823113 17.207853 l 23.823113 16.975000 l 24.288820 17.440707 l 23.823113 17.906413 l 23.823113 17.673560 l 22.891700 17.673560 l cp s
0.150000 slw
[] 0 sd
[] 0 sd
0 slc
0 slj
0 slc
0 slj
[] 0 sd
1.000000 1.000000 1.000000 srgb
n 29.194600 17.207853 m 29.893160 17.207853 l 30.126013 17.207853 l 30.126013 16.975000 l 30.591720 17.440707 l 30.126013 17.906413 l 30.126013 17.673560 l 29.194600 17.673560 l ef
0.000000 0.000000 0.000000 srgb
n 29.194600 17.207853 m 29.893160 17.207853 l 30.126013 17.207853 l 30.126013 16.975000 l 30.591720 17.440707 l 30.126013 17.906413 l 30.126013 17.673560 l 29.194600 17.673560 l cp s
0 slc
0 slj
[] 0 sd
n 29.194600 17.207853 m 29.893160 17.207853 l 30.126013 17.207853 l 30.126013 16.975000 l 30.591720 17.440707 l 30.126013 17.906413 l 30.126013 17.673560 l 29.194600 17.673560 l cp s
0.150000 slw
[] 0 sd
[] 0 sd
0 slc
0 slj
0 slc
0 slj
[] 0 sd
1.000000 1.000000 1.000000 srgb
n 38.078100 17.207853 m 38.776660 17.207853 l 39.009513 17.207853 l 39.009513 16.975000 l 39.475220 17.440707 l 39.009513 17.906413 l 39.009513 17.673560 l 38.078100 17.673560 l ef
0.000000 0.000000 0.000000 srgb
n 38.078100 17.207853 m 38.776660 17.207853 l 39.009513 17.207853 l 39.009513 16.975000 l 39.475220 17.440707 l 39.009513 17.906413 l 39.009513 17.673560 l 38.078100 17.673560 l cp s
0 slc
0 slj
[] 0 sd
n 38.078100 17.207853 m 38.776660 17.207853 l 39.009513 17.207853 l 39.009513 16.975000 l 39.475220 17.440707 l 39.009513 17.906413 l 39.009513 17.673560 l 38.078100 17.673560 l cp s
0.200000 slw
[] 0 sd
[] 0 sd
0 slc
n 2.188270 26.913900 m 3.264933 26.913900 l s
0 slj
1.000000 1.000000 1.000000 srgb
n 3.264933 27.163900 m 3.764933 26.913900 l 3.264933 26.663900 l ef
0.200000 slw
[] 0 sd
0 slj
0.000000 0.000000 0.000000 srgb
n 3.264933 27.163900 m 3.764933 26.913900 l 3.264933 26.663900 l cp s
0.150000 slw
[] 0 sd
[] 0 sd
0 slc
0 slj
0 slc
0 slj
[] 0 sd
1.000000 1.000000 1.000000 srgb
n 3.928680 24.467500 m 45.055405 24.467500 l 45.055405 29.335428 l 3.928680 29.335428 l ef
0.000000 0.000000 0.000000 srgb
n 3.928680 24.467500 m 45.055405 24.467500 l 45.055405 29.335428 l 3.928680 29.335428 l cp s
/Helvetica-latin1 ff 0.560000 scf sf
/Helvetica-latin1 ff 1.050000 scf sf
(Function body processor N) 19.263500 25.526000 m gs 1 -1 sc sh gr
1.000000 1.000000 1.000000 srgb
n 4.656300 25.849900 m 4.656300 28.549900 l 9.656300 28.549900 l 9.656300 25.849900 l f
0.100000 slw
[] 0 sd
[] 0 sd
0 slj
0.000000 0.000000 0.000000 srgb
n 4.656300 25.849900 m 4.656300 28.549900 l 9.656300 28.549900 l 9.656300 25.849900 l cp s
/Helvetica-latin1 ff 0.560000 scf sf
(pseudoinstr.) dup sw 2 div 7.156300 ex sub 26.949900 m gs 1 -1 sc sh gr
(ordering) dup sw 2 div 7.156300 ex sub 27.749900 m gs 1 -1 sc sh gr
1.000000 1.000000 1.000000 srgb
n 11.397700 25.849900 m 11.397700 28.549900 l 16.797700 28.549900 l 16.797700 25.849900 l f
0.100000 slw
[] 0 sd
[] 0 sd
0 slj
0.000000 0.000000 0.000000 srgb
n 11.397700 25.849900 m 11.397700 28.549900 l 16.797700 28.549900 l 16.797700 25.849900 l cp s
/Helvetica-latin1 ff 0.560000 scf sf
(pi_pi to tm_pi ) dup sw 2 div 14.097700 ex sub 26.949900 m gs 1 -1 sc sh gr
(mapping) dup sw 2 div 14.097700 ex sub 27.749900 m gs 1 -1 sc sh gr
1.000000 1.000000 1.000000 srgb
n 18.559800 25.849900 m 18.559800 28.549900 l 22.709800 28.549900 l 22.709800 25.849900 l f
0.100000 slw
[] 0 sd
[] 0 sd
0 slj
0.000000 0.000000 0.000000 srgb
n 18.559800 25.849900 m 18.559800 28.549900 l 22.709800 28.549900 l 22.709800 25.849900 l cp s
/Helvetica-latin1 ff 0.560000 scf sf
(register) dup sw 2 div 20.634800 ex sub 26.949900 m gs 1 -1 sc sh gr
(allocation) dup sw 2 div 20.634800 ex sub 27.749900 m gs 1 -1 sc sh gr
1.000000 1.000000 1.000000 srgb
n 24.432300 25.849900 m 24.432300 28.549900 l 28.982300 28.549900 l 28.982300 25.849900 l f
0.100000 slw
[] 0 sd
[] 0 sd
0 slj
0.000000 0.000000 0.000000 srgb
n 24.432300 25.849900 m 24.432300 28.549900 l 28.982300 28.549900 l 28.982300 25.849900 l cp s
/Helvetica-latin1 ff 0.560000 scf sf
(spill-code) dup sw 2 div 26.707300 ex sub 26.949900 m gs 1 -1 sc sh gr
(generation) dup sw 2 div 26.707300 ex sub 27.749900 m gs 1 -1 sc sh gr
1.000000 1.000000 1.000000 srgb
n 30.714300 25.849900 m 30.714300 28.549900 l 37.864300 28.549900 l 37.864300 25.849900 l f
0.100000 slw
[] 0 sd
[] 0 sd
0 slj
0.000000 0.000000 0.000000 srgb
n 30.714300 25.849900 m 30.714300 28.549900 l 37.864300 28.549900 l 37.864300 25.849900 l cp s
/Helvetica-latin1 ff 0.560000 scf sf
(local memory ) dup sw 2 div 34.289300 ex sub 26.949900 m gs 1 -1 sc sh gr
(layout computation) dup sw 2 div 34.289300 ex sub 27.749900 m gs 1 -1 sc sh gr
1.000000 1.000000 1.000000 srgb
n 39.555300 25.849900 m 39.555300 28.549900 l 44.105300 28.549900 l 44.105300 25.849900 l f
0.100000 slw
[] 0 sd
[] 0 sd
0 slj
0.000000 0.000000 0.000000 srgb
n 39.555300 25.849900 m 39.555300 28.549900 l 44.105300 28.549900 l 44.105300 25.849900 l cp s
/Helvetica-latin1 ff 0.560000 scf sf
(asm code) dup sw 2 div 41.830300 ex sub 26.949900 m gs 1 -1 sc sh gr
(generation) dup sw 2 div 41.830300 ex sub 27.749900 m gs 1 -1 sc sh gr
0.150000 slw
[] 0 sd
[] 0 sd
0 slc
0 slj
0 slc
0 slj
[] 0 sd
1.000000 1.000000 1.000000 srgb
n 9.816130 26.906353 m 10.514690 26.906353 l 10.747543 26.906353 l 10.747543 26.673500 l 11.213250 27.139207 l 10.747543 27.604913 l 10.747543 27.372060 l 9.816130 27.372060 l ef
0.000000 0.000000 0.000000 srgb
n 9.816130 26.906353 m 10.514690 26.906353 l 10.747543 26.906353 l 10.747543 26.673500 l 11.213250 27.139207 l 10.747543 27.604913 l 10.747543 27.372060 l 9.816130 27.372060 l cp s
0 slc
0 slj
[] 0 sd
n 9.816130 26.906353 m 10.514690 26.906353 l 10.747543 26.906353 l 10.747543 26.673500 l 11.213250 27.139207 l 10.747543 27.604913 l 10.747543 27.372060 l 9.816130 27.372060 l cp s
0.150000 slw
[] 0 sd
[] 0 sd
0 slc
0 slj
0 slc
0 slj
[] 0 sd
1.000000 1.000000 1.000000 srgb
n 16.976200 26.906353 m 17.674760 26.906353 l 17.907613 26.906353 l 17.907613 26.673500 l 18.373320 27.139207 l 17.907613 27.604913 l 17.907613 27.372060 l 16.976200 27.372060 l ef
0.000000 0.000000 0.000000 srgb
n 16.976200 26.906353 m 17.674760 26.906353 l 17.907613 26.906353 l 17.907613 26.673500 l 18.373320 27.139207 l 17.907613 27.604913 l 17.907613 27.372060 l 16.976200 27.372060 l cp s
0 slc
0 slj
[] 0 sd
n 16.976200 26.906353 m 17.674760 26.906353 l 17.907613 26.906353 l 17.907613 26.673500 l 18.373320 27.139207 l 17.907613 27.604913 l 17.907613 27.372060 l 16.976200 27.372060 l cp s
0.150000 slw
[] 0 sd
[] 0 sd
0 slc
0 slj
0 slc
0 slj
[] 0 sd
1.000000 1.000000 1.000000 srgb
n 22.846100 26.906353 m 23.544660 26.906353 l 23.777513 26.906353 l 23.777513 26.673500 l 24.243220 27.139207 l 23.777513 27.604913 l 23.777513 27.372060 l 22.846100 27.372060 l ef
0.000000 0.000000 0.000000 srgb
n 22.846100 26.906353 m 23.544660 26.906353 l 23.777513 26.906353 l 23.777513 26.673500 l 24.243220 27.139207 l 23.777513 27.604913 l 23.777513 27.372060 l 22.846100 27.372060 l cp s
0 slc
0 slj
[] 0 sd
n 22.846100 26.906353 m 23.544660 26.906353 l 23.777513 26.906353 l 23.777513 26.673500 l 24.243220 27.139207 l 23.777513 27.604913 l 23.777513 27.372060 l 22.846100 27.372060 l cp s
0.150000 slw
[] 0 sd
[] 0 sd
0 slc
0 slj
0 slc
0 slj
[] 0 sd
1.000000 1.000000 1.000000 srgb
n 29.149000 26.906353 m 29.847560 26.906353 l 30.080413 26.906353 l 30.080413 26.673500 l 30.546120 27.139207 l 30.080413 27.604913 l 30.080413 27.372060 l 29.149000 27.372060 l ef
0.000000 0.000000 0.000000 srgb
n 29.149000 26.906353 m 29.847560 26.906353 l 30.080413 26.906353 l 30.080413 26.673500 l 30.546120 27.139207 l 30.080413 27.604913 l 30.080413 27.372060 l 29.149000 27.372060 l cp s
0 slc
0 slj
[] 0 sd
n 29.149000 26.906353 m 29.847560 26.906353 l 30.080413 26.906353 l 30.080413 26.673500 l 30.546120 27.139207 l 30.080413 27.604913 l 30.080413 27.372060 l 29.149000 27.372060 l cp s
0.150000 slw
[] 0 sd
[] 0 sd
0 slc
0 slj
0 slc
0 slj
[] 0 sd
1.000000 1.000000 1.000000 srgb
n 38.032500 26.906353 m 38.731060 26.906353 l 38.963913 26.906353 l 38.963913 26.673500 l 39.429620 27.139207 l 38.963913 27.604913 l 38.963913 27.372060 l 38.032500 27.372060 l ef
0.000000 0.000000 0.000000 srgb
n 38.032500 26.906353 m 38.731060 26.906353 l 38.963913 26.906353 l 38.963913 26.673500 l 39.429620 27.139207 l 38.963913 27.604913 l 38.963913 27.372060 l 38.032500 27.372060 l cp s
0 slc
0 slj
[] 0 sd
n 38.032500 26.906353 m 38.731060 26.906353 l 38.963913 26.906353 l 38.963913 26.673500 l 39.429620 27.139207 l 38.963913 27.604913 l 38.963913 27.372060 l 38.032500 27.372060 l cp s
0.150000 slw
[] 0 sd
[] 0 sd
0 slc
0 slj
0 slc
0 slj
[] 0 sd
1.000000 1.000000 1.000000 srgb
n -16.782109 19.689613 3.040791 2.573613 0 360 ellipse f
0.000000 0.000000 0.000000 srgb
n -16.782109 19.689613 3.040791 2.573613 0 360 ellipse cp s
/Helvetica-latin1 ff 0.560000 scf sf
(translation) dup sw 2 div -16.782109 ex sub 19.039613 m gs 1 -1 sc sh gr
(unit) dup sw 2 div -16.782109 ex sub 19.839613 m gs 1 -1 sc sh gr
(data) dup sw 2 div -16.782109 ex sub 20.639613 m gs 1 -1 sc sh gr
0.200000 slw
[] 0 sd
[] 0 sd
0 slc
n -13.741400 19.689600 m -12.513465 19.646678 l s
0 slj
1.000000 1.000000 1.000000 srgb
n -12.504732 19.896525 m -12.013770 19.629211 l -12.522198 19.396831 l ef
0.200000 slw
[] 0 sd
0 slj
0.000000 0.000000 0.000000 srgb
n -12.504732 19.896525 m -12.013770 19.629211 l -12.522198 19.396831 l cp s
/Helvetica-latin1 ff 1.400000 scf sf
(Backend) 6.458980 7.984810 m gs 1 -1 sc sh gr
0.200000 slw
[] 0 sd
[] 0 sd
0 slc
0 slj
0 slc
0 slj
[] 0 sd
1.000000 1.000000 1.000000 srgb
n 24.081323 33.351838 m 24.081323 31.776946 l 23.687600 31.776946 l 24.475046 30.989500 l 25.262492 31.776946 l 24.868769 31.776946 l 24.868769 33.351838 l 25.262492 33.351838 l 24.475046 34.139284 l 23.687600 33.351838 l ef
0.000000 0.000000 0.000000 srgb
n 24.081323 33.351838 m 24.081323 31.776946 l 23.687600 31.776946 l 24.475046 30.989500 l 25.262492 31.776946 l 24.868769 31.776946 l 24.868769 33.351838 l 25.262492 33.351838 l 24.475046 34.139284 l 23.687600 33.351838 l cp s
0.020000 slw
0 slc
0 slj
[] 0 sd
n 24.081323 33.351838 m 24.081323 31.776946 l 23.687600 31.776946 l 24.475046 30.989500 l 25.262492 31.776946 l 24.868769 31.776946 l 24.868769 33.351838 l 25.262492 33.351838 l 24.475046 34.139284 l 23.687600 33.351838 l cp s
1.000000 1.000000 1.000000 srgb
n -16.168200 34.505300 m -16.168200 52.892853 l 5.260371 52.892853 l 5.260371 34.505300 l f
0.200000 slw
[] 0 sd
[] 0 sd
0 slj
0.000000 0.000000 0.000000 srgb
n -16.168200 34.505300 m -16.168200 52.892853 l 5.260371 52.892853 l 5.260371 34.505300 l cp s
0.200000 slw
[] 0 sd
[] 0 sd
0 slc
0 slj
0 slc
0 slj
[] 0 sd
1.000000 1.000000 1.000000 srgb
n -14.491100 36.309700 m -7.732217 36.309700 l -7.732217 41.687877 l -14.491100 41.687877 l ef
0.000000 0.000000 0.000000 srgb
n -14.491100 36.309700 m -7.732217 36.309700 l -7.732217 41.687877 l -14.491100 41.687877 l cp s
/Helvetica-latin1 ff 0.560000 scf sf
(cpu) dup sw 2 div -11.111658 ex sub 38.748788 m gs 1 -1 sc sh gr
(description) dup sw 2 div -11.111658 ex sub 39.548788 m gs 1 -1 sc sh gr
0.200000 slw
[] 0 sd
[] 0 sd
0 slc
0 slj
0 slc
0 slj
[] 0 sd
1.000000 1.000000 1.000000 srgb
n -4.440390 36.239000 m 3.818493 36.239000 l 3.818493 41.648194 l -4.440390 41.648194 l ef
0.000000 0.000000 0.000000 srgb
n -4.440390 36.239000 m 3.818493 36.239000 l 3.818493 41.648194 l -4.440390 41.648194 l cp s
/Helvetica-latin1 ff 0.560000 scf sf
(target machine) dup sw 2 div -0.310948 ex sub 38.293597 m gs 1 -1 sc sh gr
(pseudoinstruction) dup sw 2 div -0.310948 ex sub 39.093597 m gs 1 -1 sc sh gr
( patterns) dup sw 2 div -0.310948 ex sub 39.893597 m gs 1 -1 sc sh gr
0.200000 slw
[] 0 sd
[] 0 sd
0 slc
0 slj
0 slc
0 slj
[] 0 sd
1.000000 1.000000 1.000000 srgb
n -14.491100 43.028200 m -7.732217 43.028200 l -7.732217 48.406377 l -14.491100 48.406377 l ef
0.000000 0.000000 0.000000 srgb
n -14.491100 43.028200 m -7.732217 43.028200 l -7.732217 48.406377 l -14.491100 48.406377 l cp s
/Helvetica-latin1 ff 0.560000 scf sf
(asm) dup sw 2 div -11.111658 ex sub 45.067288 m gs 1 -1 sc sh gr
(language) dup sw 2 div -11.111658 ex sub 45.867288 m gs 1 -1 sc sh gr
(description) dup sw 2 div -11.111658 ex sub 46.667288 m gs 1 -1 sc sh gr
0.200000 slw
[] 0 sd
[] 0 sd
0 slc
0 slj
0 slc
0 slj
[] 0 sd
1.000000 1.000000 1.000000 srgb
n -4.448650 42.886800 m 3.987418 42.886800 l 3.987418 48.264977 l -4.448650 48.264977 l ef
0.000000 0.000000 0.000000 srgb
n -4.448650 42.886800 m 3.987418 42.886800 l 3.987418 48.264977 l -4.448650 48.264977 l cp s
/Helvetica-latin1 ff 0.560000 scf sf
(supported) dup sw 2 div -0.230616 ex sub 44.925888 m gs 1 -1 sc sh gr
(builtin) dup sw 2 div -0.230616 ex sub 45.725888 m gs 1 -1 sc sh gr
(types) dup sw 2 div -0.230616 ex sub 46.525888 m gs 1 -1 sc sh gr
0.300000 slw
[0.200000] 0 sd
[0.600000] 0 sd
0 slc
n -14.087500 50.786900 m 3.350920 50.771200 l s
/Helvetica-latin1 ff 1.050000 scf sf
(Target machine description) -11.854200 35.778300 m gs 1 -1 sc sh gr
0.200000 slw
[] 0 sd
[] 0 sd
0 slc
0 slj
0 slc
0 slj
[] 0 sd
1.000000 1.000000 1.000000 srgb
n 6.391940 35.230173 m 7.806367 35.230173 l 7.806367 34.576000 l 9.220794 35.884345 l 7.806367 37.192690 l 7.806367 36.538518 l 6.391940 36.538518 l ef
0.000000 0.000000 0.000000 srgb
n 6.391940 35.230173 m 7.806367 35.230173 l 7.806367 34.576000 l 9.220794 35.884345 l 7.806367 37.192690 l 7.806367 36.538518 l 6.391940 36.538518 l cp s
0.020000 slw
0 slc
0 slj
[] 0 sd
n 6.391940 35.230173 m 7.806367 35.230173 l 7.806367 34.576000 l 9.220794 35.884345 l 7.806367 37.192690 l 7.806367 36.538518 l 6.391940 36.538518 l cp s
0.200000 slw
[] 0 sd
[] 0 sd
0 slc
0 slj
0 slc
0 slj
[] 0 sd
1.000000 1.000000 1.000000 srgb
n -17.304134 35.110717 m -18.749967 35.110717 l -18.749967 34.387800 l -20.195800 35.833633 l -18.749967 37.279466 l -18.749967 36.556550 l -17.304134 36.556550 l ef
0.000000 0.000000 0.000000 srgb
n -17.304134 35.110717 m -18.749967 35.110717 l -18.749967 34.387800 l -20.195800 35.833633 l -18.749967 37.279466 l -18.749967 36.556550 l -17.304134 36.556550 l cp s
0.020000 slw
0 slc
0 slj
[] 0 sd
n -17.304134 35.110717 m -18.749967 35.110717 l -18.749967 34.387800 l -20.195800 35.833633 l -18.749967 37.279466 l -18.749967 36.556550 l -17.304134 36.556550 l cp s
0.200000 slw
[] 0 sd
[] 0 sd
0 slc
0 slj
0 slc
0 slj
[] 0 sd
1.000000 1.000000 1.000000 srgb
n -6.355587 33.868790 m -6.355587 32.560445 l -7.045120 32.560445 l -5.666054 31.252100 l -4.286987 32.560445 l -4.976520 32.560445 l -4.976520 33.868790 l ef
0.000000 0.000000 0.000000 srgb
n -6.355587 33.868790 m -6.355587 32.560445 l -7.045120 32.560445 l -5.666054 31.252100 l -4.286987 32.560445 l -4.976520 32.560445 l -4.976520 33.868790 l cp s
0.020000 slw
0 slc
0 slj
[] 0 sd
n -6.355587 33.868790 m -6.355587 32.560445 l -7.045120 32.560445 l -5.666054 31.252100 l -4.286987 32.560445 l -4.976520 32.560445 l -4.976520 33.868790 l cp s
0.200000 slw
[] 0 sd
[] 0 sd
0 slc
0 slj
0 slc
0 slj
[] 0 sd
1.000000 1.000000 1.000000 srgb
n -19.583000 26.342973 m -17.168361 26.342973 l -17.168361 25.688800 l -14.753721 26.997145 l -17.168361 28.305490 l -17.168361 27.651318 l -19.583000 27.651318 l ef
0.000000 0.000000 0.000000 srgb
n -19.583000 26.342973 m -17.168361 26.342973 l -17.168361 25.688800 l -14.753721 26.997145 l -17.168361 28.305490 l -17.168361 27.651318 l -19.583000 27.651318 l cp s
0.020000 slw
0 slc
0 slj
[] 0 sd
n -19.583000 26.342973 m -17.168361 26.342973 l -17.168361 25.688800 l -14.753721 26.997145 l -17.168361 28.305490 l -17.168361 27.651318 l -19.583000 27.651318 l cp s
1.000000 1.000000 1.000000 srgb
n 10.069500 34.434600 m 10.069500 41.082408 l 38.570207 41.082408 l 38.570207 34.434600 l f
0.200000 slw
[1.000000] 0 sd
[0.500000] 0 sd
0 slj
0.000000 0.000000 0.000000 srgb
n 10.069500 34.434600 m 10.069500 41.082408 l 38.570207 41.082408 l 38.570207 34.434600 l cp s
0.200000 slw
[] 0 sd
[] 0 sd
0 slc
0 slj
0 slc
0 slj
[] 0 sd
1.000000 1.000000 1.000000 srgb
n 11.534400 35.531800 m 17.212335 35.531800 l 17.212335 38.819353 l 11.534400 38.819353 l ef
0.000000 0.000000 0.000000 srgb
n 11.534400 35.531800 m 17.212335 35.531800 l 17.212335 38.819353 l 11.534400 38.819353 l cp s
/Helvetica-latin1 ff 0.560000 scf sf
(name) dup sw 2 div 14.373367 ex sub 36.925577 m gs 1 -1 sc sh gr
(mangler) dup sw 2 div 14.373367 ex sub 37.725577 m gs 1 -1 sc sh gr
0.200000 slw
[] 0 sd
[] 0 sd
0 slc
0 slj
0 slc
0 slj
[] 0 sd
1.000000 1.000000 1.000000 srgb
n 18.111500 35.531800 m 23.789435 35.531800 l 23.789435 38.819353 l 18.111500 38.819353 l ef
0.000000 0.000000 0.000000 srgb
n 18.111500 35.531800 m 23.789435 35.531800 l 23.789435 38.819353 l 18.111500 38.819353 l cp s
/Helvetica-latin1 ff 0.560000 scf sf
(symbol) dup sw 2 div 20.950467 ex sub 36.925577 m gs 1 -1 sc sh gr
(register) dup sw 2 div 20.950467 ex sub 37.725577 m gs 1 -1 sc sh gr
0.200000 slw
[] 0 sd
[] 0 sd
0 slc
0 slj
0 slc
0 slj
[] 0 sd
1.000000 1.000000 1.000000 srgb
n 31.124200 35.531800 m 36.802135 35.531800 l 36.802135 38.819353 l 31.124200 38.819353 l ef
0.000000 0.000000 0.000000 srgb
n 31.124200 35.531800 m 36.802135 35.531800 l 36.802135 38.819353 l 31.124200 38.819353 l cp s
/Helvetica-latin1 ff 0.560000 scf sf
(label) dup sw 2 div 33.963167 ex sub 36.925577 m gs 1 -1 sc sh gr
(register) dup sw 2 div 33.963167 ex sub 37.725577 m gs 1 -1 sc sh gr
0.200000 slw
[] 0 sd
[] 0 sd
0 slc
0 slj
0 slc
0 slj
[] 0 sd
1.000000 1.000000 1.000000 srgb
n 24.688500 35.531800 m 30.366435 35.531800 l 30.366435 38.838907 l 24.688500 38.838907 l ef
0.000000 0.000000 0.000000 srgb
n 24.688500 35.531800 m 30.366435 35.531800 l 30.366435 38.838907 l 24.688500 38.838907 l cp s
/Helvetica-latin1 ff 0.560000 scf sf
(memory) dup sw 2 div 27.527467 ex sub 36.935353 m gs 1 -1 sc sh gr
(allocators) dup sw 2 div 27.527467 ex sub 37.735353 m gs 1 -1 sc sh gr
0.300000 slw
[0.200000] 0 sd
[0.600000] 0 sd
0 slc
n 11.696000 39.950900 m 36.988000 39.966500 l s
1.000000 1.000000 1.000000 srgb
n -30.000300 14.741400 m -30.000300 37.829253 l -21.098956 37.829253 l -21.098956 14.741400 l f
0.200000 slw
[] 0 sd
[] 0 sd
0 slj
0.000000 0.000000 0.000000 srgb
n -30.000300 14.741400 m -30.000300 37.829253 l -21.098956 37.829253 l -21.098956 14.741400 l cp s
0.200000 slw
[] 0 sd
[] 0 sd
0 slc
0 slj
0 slc
0 slj
[] 0 sd
1.000000 1.000000 1.000000 srgb
n -28.900100 16.291600 m -22.249096 16.291600 l -22.249096 22.992612 l -28.900100 22.992612 l ef
0.000000 0.000000 0.000000 srgb
n -28.900100 16.291600 m -22.249096 16.291600 l -22.249096 22.992612 l -28.900100 22.992612 l cp s
/Helvetica-latin1 ff 0.560000 scf sf
(backend) dup sw 2 div -25.574598 ex sub 18.992106 m gs 1 -1 sc sh gr
(data) dup sw 2 div -25.574598 ex sub 19.792106 m gs 1 -1 sc sh gr
(builder) dup sw 2 div -25.574598 ex sub 20.592106 m gs 1 -1 sc sh gr
0.200000 slw
[] 0 sd
[] 0 sd
0 slc
0 slj
0 slc
0 slj
[] 0 sd
1.000000 1.000000 1.000000 srgb
n -28.920800 24.554200 m -22.269796 24.554200 l -22.269796 28.989046 l -28.920800 28.989046 l ef
0.000000 0.000000 0.000000 srgb
n -28.920800 24.554200 m -22.269796 24.554200 l -22.269796 28.989046 l -28.920800 28.989046 l cp s
/Helvetica-latin1 ff 0.560000 scf sf
(type info) dup sw 2 div -25.595298 ex sub 26.921623 m gs 1 -1 sc sh gr
0.300000 slw
[0.200000] 0 sd
[0.600000] 0 sd
0 slc
n -28.670800 36.190800 m -22.169800 36.190800 l s
/Helvetica-latin1 ff 1.050000 scf sf
(Interfaces) -28.150000 15.841500 m gs 1 -1 sc sh gr
0.200000 slw
[] 0 sd
[] 0 sd
0 slc
0 slj
0 slc
0 slj
[] 0 sd
1.000000 1.000000 1.000000 srgb
n -28.991500 30.120600 m -22.290488 30.120600 l -22.290488 34.461008 l -28.991500 34.461008 l ef
0.000000 0.000000 0.000000 srgb
n -28.991500 30.120600 m -22.290488 30.120600 l -22.290488 34.461008 l -28.991500 34.461008 l cp s
/Helvetica-latin1 ff 0.560000 scf sf
(memory ) dup sw 2 div -25.640994 ex sub 32.040804 m gs 1 -1 sc sh gr
(allocation) dup sw 2 div -25.640994 ex sub 32.840804 m gs 1 -1 sc sh gr
0.200000 slw
[] 0 sd
[] 0 sd
0 slc
n -22.249100 19.642100 m -20.494013 19.692166 l s
0 slj
1.000000 1.000000 1.000000 srgb
n -20.501141 19.942065 m -19.994216 19.706424 l -20.486884 19.442268 l ef
0.200000 slw
[] 0 sd
0 slj
0.000000 0.000000 0.000000 srgb
n -20.501141 19.942065 m -19.994216 19.706424 l -20.486884 19.442268 l cp s
0.200000 slw
[] 0 sd
[] 0 sd
0 slc
0 slj
0 slc
0 slj
[] 0 sd
1.000000 1.000000 1.000000 srgb
n -31.345330 23.253712 m -33.289777 23.253712 l -33.289777 22.767600 l -34.262000 23.739823 l -33.289777 24.712047 l -33.289777 24.225935 l -31.345330 24.225935 l -31.345330 24.712047 l -30.373106 23.739823 l -31.345330 22.767600 l ef
0.000000 0.000000 0.000000 srgb
n -31.345330 23.253712 m -33.289777 23.253712 l -33.289777 22.767600 l -34.262000 23.739823 l -33.289777 24.712047 l -33.289777 24.225935 l -31.345330 24.225935 l -31.345330 24.712047 l -30.373106 23.739823 l -31.345330 22.767600 l cp s
0.020000 slw
0 slc
0 slj
[] 0 sd
n -31.345330 23.253712 m -33.289777 23.253712 l -33.289777 22.767600 l -34.262000 23.739823 l -33.289777 24.712047 l -33.289777 24.225935 l -31.345330 24.225935 l -31.345330 24.712047 l -30.373106 23.739823 l -31.345330 22.767600 l cp s
1.000000 1.000000 1.000000 srgb
n -43.101300 10.212000 m -43.101300 37.362000 l -34.496703 37.362000 l -34.496703 10.212000 l f
0.200000 slw
[] 0 sd
[] 0 sd
0 slj
0.000000 0.000000 0.000000 srgb
n -43.101300 10.212000 m -43.101300 37.362000 l -34.496703 37.362000 l -34.496703 10.212000 l cp s
/Helvetica-latin1 ff 1.400000 scf sf
(Frontend) -41.860900 24.129200 m gs 1 -1 sc sh gr
1.000000 1.000000 1.000000 srgb
n 50.403300 6.513930 m 50.403300 29.813930 l 60.953300 29.813930 l 60.953300 6.513930 l f
0.200000 slw
[] 0 sd
[] 0 sd
0 slj
0.000000 0.000000 0.000000 srgb
n 50.403300 6.513930 m 50.403300 29.813930 l 60.953300 29.813930 l 60.953300 6.513930 l cp s
/Helvetica-latin1 ff 0.700000 scf sf
(.data) 51.380700 9.504610 m gs 1 -1 sc sh gr
/Helvetica-latin1 ff 0.700000 scf sf
(.text) 51.490700 11.654600 m gs 1 -1 sc sh gr
/Helvetica-latin1 ff 0.700000 scf sf
(glob_var: dw 0) 52.340700 10.504600 m gs 1 -1 sc sh gr
0.300000 slw
[0.200000] 0 sd
[0.600000] 0 sd
0 slc
n 53.780700 19.204600 m 53.780700 21.354600 l s
/Helvetica-latin1 ff 1.050000 scf sf
(asm file) 53.330700 7.604610 m gs 1 -1 sc sh gr
/Helvetica-latin1 ff 0.700000 scf sf
(leave) 52.940700 27.427100 m gs 1 -1 sc sh gr
(ret) 52.940700 28.427100 m gs 1 -1 sc sh gr
/Helvetica-latin1 ff 0.700000 scf sf
(_Z9functionNEv:) 52.340700 23.477100 m gs 1 -1 sc sh gr
0.200000 slw
[0.600000] 0 sd
[0.400000] 0 sd
0 slc
n 53.980700 23.877100 m 53.980700 26.427100 l s
/Helvetica-latin1 ff 0.700000 scf sf
(_Z9function1Ev:) 52.140700 12.804600 m gs 1 -1 sc sh gr
/Helvetica-latin1 ff 0.700000 scf sf
(leave) 52.740700 16.754600 m gs 1 -1 sc sh gr
(ret) 52.740700 17.754600 m gs 1 -1 sc sh gr
0.200000 slw
[0.400000] 0 sd
[0.400000] 0 sd
0 slc
n 53.780700 13.204600 m 53.780700 15.754600 l s
0.200000 slw
[] 0 sd
[] 0 sd
0 slc
n 45.139200 11.884200 m 51.085569 13.603602 l s
0 slj
1.000000 1.000000 1.000000 srgb
n 51.016126 13.843764 m 51.565893 13.742488 l 51.155013 13.363440 l ef
0.200000 slw
[] 0 sd
0 slj
0.000000 0.000000 0.000000 srgb
n 51.016126 13.843764 m 51.565893 13.742488 l 51.155013 13.363440 l cp s
0.200000 slw
[] 0 sd
[] 0 sd
0 slc
n 45.101000 17.203000 m 51.170071 18.368170 l s
0 slj
1.000000 1.000000 1.000000 srgb
n 51.122936 18.613686 m 51.661104 18.462441 l 51.217206 18.122654 l ef
0.200000 slw
[] 0 sd
0 slj
0.000000 0.000000 0.000000 srgb
n 51.122936 18.613686 m 51.661104 18.462441 l 51.217206 18.122654 l cp s
0.200000 slw
[] 0 sd
[] 0 sd
0 slc
n 45.055400 26.901400 m 51.247422 24.742798 l s
0 slj
1.000000 1.000000 1.000000 srgb
n 51.329717 24.978864 m 51.719556 24.578207 l 51.165127 24.506731 l ef
0.200000 slw
[] 0 sd
0 slj
0.000000 0.000000 0.000000 srgb
n 51.329717 24.978864 m 51.719556 24.578207 l 51.165127 24.506731 l cp s
0.200000 slw
[] 0 sd
[] 0 sd
0 slc
n 40.468063 29.668059 8.310061 8.310061 6.124132 103.201795 ellipse s
0.200000 slw
[] 0 sd
[] 0 sd
0 slc
n -14.280543 22.464164 63.511266 63.511266 352.117954 7.546001 ellipse s
0.200000 slw
[] 0 sd
[] 0 sd
0 slc
n 52.215335 13.894389 3.638164 3.638164 177.476088 250.641542 ellipse s
0 slj
1.000000 1.000000 1.000000 srgb
n 51.029168 10.711129 m 51.507796 10.422311 l 50.989565 10.212700 l ef
0.200000 slw
[] 0 sd
0 slj
0.000000 0.000000 0.000000 srgb
n 51.029168 10.711129 m 51.507796 10.422311 l 50.989565 10.212700 l cp s
showpage
