%!PS-Adobe-2.0 EPSF-2.0
%%Title: /home/ps/les/doc/doc/lyx/ss_postkrement.dia
%%Creator: Dia v0.93
%%CreationDate: Fri May 20 18:27:02 2005
%%For: ps
%%Orientation: Portrait
%%Magnification: 1.0000
%%BoundingBox: 0 0 766 531
%%BeginSetup
%%EndSetup
%%EndComments
%%BeginProlog
[ /.notdef /.notdef /.notdef /.notdef /.notdef /.notdef /.notdef /.notdef /.notdef /.notdef
/.notdef /.notdef /.notdef /.notdef /.notdef /.notdef /.notdef /.notdef /.notdef /.notdef
/.notdef /.notdef /.notdef /.notdef /.notdef /.notdef /.notdef /.notdef /.notdef /.notdef
/.notdef /.notdef /space /exclam /quotedbl /numbersign /dollar /percent /ampersand /quoteright
/parenleft /parenright /asterisk /plus /comma /hyphen /period /slash /zero /one
/two /three /four /five /six /seven /eight /nine /colon /semicolon
/less /equal /greater /question /at /A /B /C /D /E
/F /G /H /I /J /K /L /M /N /O
/P /Q /R /S /T /U /V /W /X /Y
/Z /bracketleft /backslash /bracketright /asciicircum /underscore /quoteleft /a /b /c
/d /e /f /g /h /i /j /k /l /m
/n /o /p /q /r /s /t /u /v /w
/x /y /z /braceleft /bar /braceright /asciitilde /.notdef /.notdef /.notdef
/.notdef /.notdef /.notdef /.notdef /.notdef /.notdef /.notdef /.notdef /.notdef /.notdef
/.notdef /.notdef /.notdef /.notdef /.notdef /.notdef /.notdef /.notdef /.notdef /.notdef
/.notdef /.notdef /.notdef /.notdef /.notdef /.notdef /.notdef /.notdef /.notdef /.notdef
/space /exclamdown /cent /sterling /currency /yen /brokenbar /section /dieresis /copyright
/ordfeminine /guillemotleft /logicalnot /hyphen /registered /macron /degree /plusminus /twosuperior /threesuperior
/acute /mu /paragraph /periodcentered /cedilla /onesuperior /ordmasculine /guillemotright /onequarter /onehalf
/threequarters /questiondown /Agrave /Aacute /Acircumflex /Atilde /Adieresis /Aring /AE /Ccedilla
/Egrave /Eacute /Ecircumflex /Edieresis /Igrave /Iacute /Icircumflex /Idieresis /Eth /Ntilde
/Ograve /Oacute /Ocircumflex /Otilde /Odieresis /multiply /Oslash /Ugrave /Uacute /Ucircumflex
/Udieresis /Yacute /Thorn /germandbls /agrave /aacute /acircumflex /atilde /adieresis /aring
/ae /ccedilla /egrave /eacute /ecircumflex /edieresis /igrave /iacute /icircumflex /idieresis
/eth /ntilde /ograve /oacute /ocircumflex /otilde /odieresis /divide /oslash /ugrave
/uacute /ucircumflex /udieresis /yacute /thorn /ydieresis] /isolatin1encoding exch def
/cp {closepath} bind def
/c {curveto} bind def
/f {fill} bind def
/a {arc} bind def
/ef {eofill} bind def
/ex {exch} bind def
/gr {grestore} bind def
/gs {gsave} bind def
/sa {save} bind def
/rs {restore} bind def
/l {lineto} bind def
/m {moveto} bind def
/rm {rmoveto} bind def
/n {newpath} bind def
/s {stroke} bind def
/sh {show} bind def
/slc {setlinecap} bind def
/slj {setlinejoin} bind def
/slw {setlinewidth} bind def
/srgb {setrgbcolor} bind def
/rot {rotate} bind def
/sc {scale} bind def
/sd {setdash} bind def
/ff {findfont} bind def
/sf {setfont} bind def
/scf {scalefont} bind def
/sw {stringwidth pop} bind def
/tr {translate} bind def

/ellipsedict 8 dict def
ellipsedict /mtrx matrix put
/ellipse
{ ellipsedict begin
   /endangle exch def
   /startangle exch def
   /yrad exch def
   /xrad exch def
   /y exch def
   /x exch def   /savematrix mtrx currentmatrix def
   x y tr xrad yrad sc
   0 0 1 startangle endangle arc
   savematrix setmatrix
   end
} def

/mergeprocs {
dup length
3 -1 roll
dup
length
dup
5 1 roll
3 -1 roll
add
array cvx
dup
3 -1 roll
0 exch
putinterval
dup
4 2 roll
putinterval
} bind def
/Times-Roman-latin1
    /Times-Roman findfont
    dup length dict begin
	{1 index /FID ne {def} {pop pop} ifelse} forall
	/Encoding isolatin1encoding def
    currentdict end
definefont pop
/Times-Italic-latin1
    /Times-Italic findfont
    dup length dict begin
	{1 index /FID ne {def} {pop pop} ifelse} forall
	/Encoding isolatin1encoding def
    currentdict end
definefont pop
/Times-Bold-latin1
    /Times-Bold findfont
    dup length dict begin
	{1 index /FID ne {def} {pop pop} ifelse} forall
	/Encoding isolatin1encoding def
    currentdict end
definefont pop
/Times-BoldItalic-latin1
    /Times-BoldItalic findfont
    dup length dict begin
	{1 index /FID ne {def} {pop pop} ifelse} forall
	/Encoding isolatin1encoding def
    currentdict end
definefont pop
/AvantGarde-Book-latin1
    /AvantGarde-Book findfont
    dup length dict begin
	{1 index /FID ne {def} {pop pop} ifelse} forall
	/Encoding isolatin1encoding def
    currentdict end
definefont pop
/AvantGarde-BookOblique-latin1
    /AvantGarde-BookOblique findfont
    dup length dict begin
	{1 index /FID ne {def} {pop pop} ifelse} forall
	/Encoding isolatin1encoding def
    currentdict end
definefont pop
/AvantGarde-Demi-latin1
    /AvantGarde-Demi findfont
    dup length dict begin
	{1 index /FID ne {def} {pop pop} ifelse} forall
	/Encoding isolatin1encoding def
    currentdict end
definefont pop
/AvantGarde-DemiOblique-latin1
    /AvantGarde-DemiOblique findfont
    dup length dict begin
	{1 index /FID ne {def} {pop pop} ifelse} forall
	/Encoding isolatin1encoding def
    currentdict end
definefont pop
/Bookman-Light-latin1
    /Bookman-Light findfont
    dup length dict begin
	{1 index /FID ne {def} {pop pop} ifelse} forall
	/Encoding isolatin1encoding def
    currentdict end
definefont pop
/Bookman-LightItalic-latin1
    /Bookman-LightItalic findfont
    dup length dict begin
	{1 index /FID ne {def} {pop pop} ifelse} forall
	/Encoding isolatin1encoding def
    currentdict end
definefont pop
/Bookman-Demi-latin1
    /Bookman-Demi findfont
    dup length dict begin
	{1 index /FID ne {def} {pop pop} ifelse} forall
	/Encoding isolatin1encoding def
    currentdict end
definefont pop
/Bookman-DemiItalic-latin1
    /Bookman-DemiItalic findfont
    dup length dict begin
	{1 index /FID ne {def} {pop pop} ifelse} forall
	/Encoding isolatin1encoding def
    currentdict end
definefont pop
/Courier-latin1
    /Courier findfont
    dup length dict begin
	{1 index /FID ne {def} {pop pop} ifelse} forall
	/Encoding isolatin1encoding def
    currentdict end
definefont pop
/Courier-Oblique-latin1
    /Courier-Oblique findfont
    dup length dict begin
	{1 index /FID ne {def} {pop pop} ifelse} forall
	/Encoding isolatin1encoding def
    currentdict end
definefont pop
/Courier-Bold-latin1
    /Courier-Bold findfont
    dup length dict begin
	{1 index /FID ne {def} {pop pop} ifelse} forall
	/Encoding isolatin1encoding def
    currentdict end
definefont pop
/Courier-BoldOblique-latin1
    /Courier-BoldOblique findfont
    dup length dict begin
	{1 index /FID ne {def} {pop pop} ifelse} forall
	/Encoding isolatin1encoding def
    currentdict end
definefont pop
/Helvetica-latin1
    /Helvetica findfont
    dup length dict begin
	{1 index /FID ne {def} {pop pop} ifelse} forall
	/Encoding isolatin1encoding def
    currentdict end
definefont pop
/Helvetica-Oblique-latin1
    /Helvetica-Oblique findfont
    dup length dict begin
	{1 index /FID ne {def} {pop pop} ifelse} forall
	/Encoding isolatin1encoding def
    currentdict end
definefont pop
/Helvetica-Bold-latin1
    /Helvetica-Bold findfont
    dup length dict begin
	{1 index /FID ne {def} {pop pop} ifelse} forall
	/Encoding isolatin1encoding def
    currentdict end
definefont pop
/Helvetica-BoldOblique-latin1
    /Helvetica-BoldOblique findfont
    dup length dict begin
	{1 index /FID ne {def} {pop pop} ifelse} forall
	/Encoding isolatin1encoding def
    currentdict end
definefont pop
/Helvetica-Narrow-latin1
    /Helvetica-Narrow findfont
    dup length dict begin
	{1 index /FID ne {def} {pop pop} ifelse} forall
	/Encoding isolatin1encoding def
    currentdict end
definefont pop
/Helvetica-Narrow-Oblique-latin1
    /Helvetica-Narrow-Oblique findfont
    dup length dict begin
	{1 index /FID ne {def} {pop pop} ifelse} forall
	/Encoding isolatin1encoding def
    currentdict end
definefont pop
/Helvetica-Narrow-Bold-latin1
    /Helvetica-Narrow-Bold findfont
    dup length dict begin
	{1 index /FID ne {def} {pop pop} ifelse} forall
	/Encoding isolatin1encoding def
    currentdict end
definefont pop
/Helvetica-Narrow-BoldOblique-latin1
    /Helvetica-Narrow-BoldOblique findfont
    dup length dict begin
	{1 index /FID ne {def} {pop pop} ifelse} forall
	/Encoding isolatin1encoding def
    currentdict end
definefont pop
/NewCenturySchoolbook-Roman-latin1
    /NewCenturySchoolbook-Roman findfont
    dup length dict begin
	{1 index /FID ne {def} {pop pop} ifelse} forall
	/Encoding isolatin1encoding def
    currentdict end
definefont pop
/NewCenturySchoolbook-Italic-latin1
    /NewCenturySchoolbook-Italic findfont
    dup length dict begin
	{1 index /FID ne {def} {pop pop} ifelse} forall
	/Encoding isolatin1encoding def
    currentdict end
definefont pop
/NewCenturySchoolbook-Bold-latin1
    /NewCenturySchoolbook-Bold findfont
    dup length dict begin
	{1 index /FID ne {def} {pop pop} ifelse} forall
	/Encoding isolatin1encoding def
    currentdict end
definefont pop
/NewCenturySchoolbook-BoldItalic-latin1
    /NewCenturySchoolbook-BoldItalic findfont
    dup length dict begin
	{1 index /FID ne {def} {pop pop} ifelse} forall
	/Encoding isolatin1encoding def
    currentdict end
definefont pop
/Palatino-Roman-latin1
    /Palatino-Roman findfont
    dup length dict begin
	{1 index /FID ne {def} {pop pop} ifelse} forall
	/Encoding isolatin1encoding def
    currentdict end
definefont pop
/Palatino-Italic-latin1
    /Palatino-Italic findfont
    dup length dict begin
	{1 index /FID ne {def} {pop pop} ifelse} forall
	/Encoding isolatin1encoding def
    currentdict end
definefont pop
/Palatino-Bold-latin1
    /Palatino-Bold findfont
    dup length dict begin
	{1 index /FID ne {def} {pop pop} ifelse} forall
	/Encoding isolatin1encoding def
    currentdict end
definefont pop
/Palatino-BoldItalic-latin1
    /Palatino-BoldItalic findfont
    dup length dict begin
	{1 index /FID ne {def} {pop pop} ifelse} forall
	/Encoding isolatin1encoding def
    currentdict end
definefont pop
/Symbol-latin1
    /Symbol findfont
definefont pop
/ZapfChancery-MediumItalic-latin1
    /ZapfChancery-MediumItalic findfont
    dup length dict begin
	{1 index /FID ne {def} {pop pop} ifelse} forall
	/Encoding isolatin1encoding def
    currentdict end
definefont pop
/ZapfDingbats-latin1
    /ZapfDingbats findfont
    dup length dict begin
	{1 index /FID ne {def} {pop pop} ifelse} forall
	/Encoding isolatin1encoding def
    currentdict end
definefont pop
28.346000 -28.346000 scale
-6.950000 -25.650000 translate
%%EndProlog


0.100000 slw
[] 0 sd
1.000000 1.000000 1.000000 srgb
n 19.000000 9.000000 m 19.000000 10.400000 l 23.650000 10.400000 l 23.650000 9.000000 l f
0.000000 0.000000 0.000000 srgb
n 19.000000 9.000000 m 19.000000 10.400000 l 23.650000 10.400000 l 23.650000 9.000000 l cp s
/Helvetica-latin1 ff 0.700000 scf sf
(ss_assign) dup sw 2 div 21.325000 ex sub 10.000000 m gs 1 -1 sc sh gr
1.000000 1.000000 1.000000 srgb
n 19.000000 10.400000 m 19.000000 13.000000 l 23.650000 13.000000 l 23.650000 10.400000 l f
0.000000 0.000000 0.000000 srgb
n 19.000000 10.400000 m 19.000000 13.000000 l 23.650000 13.000000 l 23.650000 10.400000 l cp s
/Courier-latin1 ff 0.560000 scf sf
(+left) 19.150000 11.100000 m gs 1 -1 sc sh gr
/Courier-latin1 ff 0.560000 scf sf
(+right) 19.150000 11.900000 m gs 1 -1 sc sh gr
/Courier-latin1 ff 0.560000 scf sf
(+...) 19.150000 12.700000 m gs 1 -1 sc sh gr
1.000000 1.000000 1.000000 srgb
n 19.000000 13.000000 m 19.000000 13.400000 l 23.650000 13.400000 l 23.650000 13.000000 l f
0.000000 0.000000 0.000000 srgb
n 19.000000 13.000000 m 19.000000 13.400000 l 23.650000 13.400000 l 23.650000 13.000000 l cp s
0.100000 slw
[] 0 sd
0 slj
0 slc
n 17.088197 17.000000 m 15.775000 17.000000 l 15.775000 8.900000 l 13.550000 8.900000 l s
0 slj
1.000000 1.000000 1.000000 srgb
n 17.088197 17.400000 m 17.888197 17.000000 l 17.088197 16.600000 l f
0.100000 slw
[] 0 sd
0 slj
0.000000 0.000000 0.000000 srgb
n 17.088197 17.400000 m 17.888197 17.000000 l 17.088197 16.600000 l cp s
/Courier-latin1 ff 0.560000 scf sf
0.100000 slw
[] 0 sd
1.000000 1.000000 1.000000 srgb
n 18.000000 17.000000 m 18.000000 18.400000 l 22.100000 18.400000 l 22.100000 17.000000 l f
0.000000 0.000000 0.000000 srgb
n 18.000000 17.000000 m 18.000000 18.400000 l 22.100000 18.400000 l 22.100000 17.000000 l cp s
/Helvetica-latin1 ff 0.700000 scf sf
(ss_get) dup sw 2 div 20.050000 ex sub 18.000000 m gs 1 -1 sc sh gr
1.000000 1.000000 1.000000 srgb
n 18.000000 18.400000 m 18.000000 20.200000 l 22.100000 20.200000 l 22.100000 18.400000 l f
0.000000 0.000000 0.000000 srgb
n 18.000000 18.400000 m 18.000000 20.200000 l 22.100000 20.200000 l 22.100000 18.400000 l cp s
/Courier-latin1 ff 0.560000 scf sf
(+expresion) 18.150000 19.100000 m gs 1 -1 sc sh gr
/Courier-latin1 ff 0.560000 scf sf
(+...) 18.150000 19.900000 m gs 1 -1 sc sh gr
1.000000 1.000000 1.000000 srgb
n 18.000000 20.200000 m 18.000000 20.600000 l 22.100000 20.600000 l 22.100000 20.200000 l f
0.000000 0.000000 0.000000 srgb
n 18.000000 20.200000 m 18.000000 20.600000 l 22.100000 20.600000 l 22.100000 20.200000 l cp s
0.100000 slw
[] 0 sd
1.000000 1.000000 1.000000 srgb
n 12.000000 22.000000 m 12.000000 23.400000 l 17.850000 23.400000 l 17.850000 22.000000 l f
0.000000 0.000000 0.000000 srgb
n 12.000000 22.000000 m 12.000000 23.400000 l 17.850000 23.400000 l 17.850000 22.000000 l cp s
/Helvetica-latin1 ff 0.700000 scf sf
(ss_var_ref) dup sw 2 div 14.925000 ex sub 23.000000 m gs 1 -1 sc sh gr
1.000000 1.000000 1.000000 srgb
n 12.000000 23.400000 m 12.000000 25.200000 l 17.850000 25.200000 l 17.850000 23.400000 l f
0.000000 0.000000 0.000000 srgb
n 12.000000 23.400000 m 12.000000 25.200000 l 17.850000 25.200000 l 17.850000 23.400000 l cp s
/Courier-latin1 ff 0.560000 scf sf
(+declaration\(i\)) 12.150000 24.100000 m gs 1 -1 sc sh gr
/Courier-latin1 ff 0.560000 scf sf
(+...) 12.150000 24.900000 m gs 1 -1 sc sh gr
1.000000 1.000000 1.000000 srgb
n 12.000000 25.200000 m 12.000000 25.600000 l 17.850000 25.600000 l 17.850000 25.200000 l f
0.000000 0.000000 0.000000 srgb
n 12.000000 25.200000 m 12.000000 25.600000 l 17.850000 25.600000 l 17.850000 25.200000 l cp s
0.100000 slw
[] 0 sd
1.000000 1.000000 1.000000 srgb
n 7.000000 7.000000 m 7.000000 8.400000 l 13.550000 8.400000 l 13.550000 7.000000 l f
0.000000 0.000000 0.000000 srgb
n 7.000000 7.000000 m 7.000000 8.400000 l 13.550000 8.400000 l 13.550000 7.000000 l cp s
/Helvetica-latin1 ff 0.700000 scf sf
(ss_expr_stmt) dup sw 2 div 10.275000 ex sub 8.000000 m gs 1 -1 sc sh gr
1.000000 1.000000 1.000000 srgb
n 7.000000 8.400000 m 7.000000 10.200000 l 13.550000 10.200000 l 13.550000 8.400000 l f
0.000000 0.000000 0.000000 srgb
n 7.000000 8.400000 m 7.000000 10.200000 l 13.550000 10.200000 l 13.550000 8.400000 l cp s
/Courier-latin1 ff 0.560000 scf sf
(+expression \(i++\)) 7.150000 9.100000 m gs 1 -1 sc sh gr
/Courier-latin1 ff 0.560000 scf sf
(+...) 7.150000 9.900000 m gs 1 -1 sc sh gr
1.000000 1.000000 1.000000 srgb
n 7.000000 10.200000 m 7.000000 10.600000 l 13.550000 10.600000 l 13.550000 10.200000 l f
0.000000 0.000000 0.000000 srgb
n 7.000000 10.200000 m 7.000000 10.600000 l 13.550000 10.600000 l 13.550000 10.200000 l cp s
0.100000 slw
[] 0 sd
0 slj
0 slc
n 14.925000 21.088197 m 14.925000 18.900000 l 18.000000 18.900000 l s
0 slj
1.000000 1.000000 1.000000 srgb
n 14.525000 21.088197 m 14.925000 21.888197 l 15.325000 21.088197 l f
0.100000 slw
[] 0 sd
0 slj
0.000000 0.000000 0.000000 srgb
n 14.525000 21.088197 m 14.925000 21.888197 l 15.325000 21.088197 l cp s
/Courier-latin1 ff 0.560000 scf sf
0.100000 slw
[] 0 sd
0 slj
0 slc
n 12.000000 21.088197 m 12.000000 10.900000 l 19.000000 10.900000 l s
0 slj
1.000000 1.000000 1.000000 srgb
n 11.600000 21.088197 m 12.000000 21.888197 l 12.400000 21.088197 l f
0.100000 slw
[] 0 sd
0 slj
0.000000 0.000000 0.000000 srgb
n 11.600000 21.088197 m 12.000000 21.888197 l 12.400000 21.088197 l cp s
/Courier-latin1 ff 0.560000 scf sf
0.100000 slw
[] 0 sd
1.000000 1.000000 1.000000 srgb
n 25.000000 14.000000 m 25.000000 15.400000 l 28.550000 15.400000 l 28.550000 14.000000 l f
0.000000 0.000000 0.000000 srgb
n 25.000000 14.000000 m 25.000000 15.400000 l 28.550000 15.400000 l 28.550000 14.000000 l cp s
/Helvetica-latin1 ff 0.700000 scf sf
(ss_add) dup sw 2 div 26.775000 ex sub 15.000000 m gs 1 -1 sc sh gr
1.000000 1.000000 1.000000 srgb
n 25.000000 15.400000 m 25.000000 18.000000 l 28.550000 18.000000 l 28.550000 15.400000 l f
0.000000 0.000000 0.000000 srgb
n 25.000000 15.400000 m 25.000000 18.000000 l 28.550000 18.000000 l 28.550000 15.400000 l cp s
/Courier-latin1 ff 0.560000 scf sf
(+left) 25.150000 16.100000 m gs 1 -1 sc sh gr
/Courier-latin1 ff 0.560000 scf sf
(+right) 25.150000 16.900000 m gs 1 -1 sc sh gr
/Courier-latin1 ff 0.560000 scf sf
(+...) 25.150000 17.700000 m gs 1 -1 sc sh gr
1.000000 1.000000 1.000000 srgb
n 25.000000 18.000000 m 25.000000 18.400000 l 28.550000 18.400000 l 28.550000 18.000000 l f
0.000000 0.000000 0.000000 srgb
n 25.000000 18.000000 m 25.000000 18.400000 l 28.550000 18.400000 l 28.550000 18.000000 l cp s
0.100000 slw
[] 0 sd
1.000000 1.000000 1.000000 srgb
n 27.000000 22.000000 m 27.000000 23.400000 l 33.900000 23.400000 l 33.900000 22.000000 l f
0.000000 0.000000 0.000000 srgb
n 27.000000 22.000000 m 27.000000 23.400000 l 33.900000 23.400000 l 33.900000 22.000000 l cp s
/Helvetica-latin1 ff 0.700000 scf sf
(ss_literal) dup sw 2 div 30.450000 ex sub 23.000000 m gs 1 -1 sc sh gr
1.000000 1.000000 1.000000 srgb
n 27.000000 23.400000 m 27.000000 25.200000 l 33.900000 25.200000 l 33.900000 23.400000 l f
0.000000 0.000000 0.000000 srgb
n 27.000000 23.400000 m 27.000000 25.200000 l 33.900000 25.200000 l 33.900000 23.400000 l cp s
/Courier-latin1 ff 0.560000 scf sf
(+literal_info\("1"\)) 27.150000 24.100000 m gs 1 -1 sc sh gr
/Courier-latin1 ff 0.560000 scf sf
(+...) 27.150000 24.900000 m gs 1 -1 sc sh gr
1.000000 1.000000 1.000000 srgb
n 27.000000 25.200000 m 27.000000 25.600000 l 33.900000 25.600000 l 33.900000 25.200000 l f
0.000000 0.000000 0.000000 srgb
n 27.000000 25.200000 m 27.000000 25.600000 l 33.900000 25.600000 l 33.900000 25.200000 l cp s
0.100000 slw
[] 0 sd
0 slj
0 slc
n 30.450000 21.088197 m 30.450000 15.900000 l 28.550000 15.900000 l s
0 slj
1.000000 1.000000 1.000000 srgb
n 30.050000 21.088197 m 30.450000 21.888197 l 30.850000 21.088197 l f
0.100000 slw
[] 0 sd
0 slj
0.000000 0.000000 0.000000 srgb
n 30.050000 21.088197 m 30.450000 21.888197 l 30.850000 21.088197 l cp s
/Courier-latin1 ff 0.560000 scf sf
0.100000 slw
[] 0 sd
0 slj
0 slc
n 23.011803 17.700000 m 23.550000 17.700000 l 23.550000 16.700000 l 25.000000 16.700000 l s
0 slj
1.000000 1.000000 1.000000 srgb
n 23.011803 17.300000 m 22.211803 17.700000 l 23.011803 18.100000 l f
0.100000 slw
[] 0 sd
0 slj
0.000000 0.000000 0.000000 srgb
n 23.011803 17.300000 m 22.211803 17.700000 l 23.011803 18.100000 l cp s
/Courier-latin1 ff 0.560000 scf sf
0.100000 slw
[] 0 sd
0 slj
0 slc
n 26.775000 13.088197 m 26.775000 11.700000 l 23.650000 11.700000 l s
0 slj
1.000000 1.000000 1.000000 srgb
n 26.375000 13.088197 m 26.775000 13.888197 l 27.175000 13.088197 l f
0.100000 slw
[] 0 sd
0 slj
0.000000 0.000000 0.000000 srgb
n 26.375000 13.088197 m 26.775000 13.888197 l 27.175000 13.088197 l cp s
/Courier-latin1 ff 0.560000 scf sf
showpage
