%!PS-Adobe-2.0 EPSF-2.0
%%Title: parser_overview.dia
%%Creator: Dia v0.94
%%CreationDate: Thu May 26 01:00:15 2005
%%For: thomr9am
%%Orientation: Portrait
%%Magnification: 1.0000
%%BoundingBox: 0 0 995 583
%%BeginSetup
%%EndSetup
%%EndComments
%%BeginProlog
[ /.notdef /.notdef /.notdef /.notdef /.notdef /.notdef /.notdef /.notdef /.notdef /.notdef
/.notdef /.notdef /.notdef /.notdef /.notdef /.notdef /.notdef /.notdef /.notdef /.notdef
/.notdef /.notdef /.notdef /.notdef /.notdef /.notdef /.notdef /.notdef /.notdef /.notdef
/.notdef /.notdef /space /exclam /quotedbl /numbersign /dollar /percent /ampersand /quoteright
/parenleft /parenright /asterisk /plus /comma /hyphen /period /slash /zero /one
/two /three /four /five /six /seven /eight /nine /colon /semicolon
/less /equal /greater /question /at /A /B /C /D /E
/F /G /H /I /J /K /L /M /N /O
/P /Q /R /S /T /U /V /W /X /Y
/Z /bracketleft /backslash /bracketright /asciicircum /underscore /quoteleft /a /b /c
/d /e /f /g /h /i /j /k /l /m
/n /o /p /q /r /s /t /u /v /w
/x /y /z /braceleft /bar /braceright /asciitilde /.notdef /.notdef /.notdef
/.notdef /.notdef /.notdef /.notdef /.notdef /.notdef /.notdef /.notdef /.notdef /.notdef
/.notdef /.notdef /.notdef /.notdef /.notdef /.notdef /.notdef /.notdef /.notdef /.notdef
/.notdef /.notdef /.notdef /.notdef /.notdef /.notdef /.notdef /.notdef /.notdef /.notdef
/space /exclamdown /cent /sterling /currency /yen /brokenbar /section /dieresis /copyright
/ordfeminine /guillemotleft /logicalnot /hyphen /registered /macron /degree /plusminus /twosuperior /threesuperior
/acute /mu /paragraph /periodcentered /cedilla /onesuperior /ordmasculine /guillemotright /onequarter /onehalf
/threequarters /questiondown /Agrave /Aacute /Acircumflex /Atilde /Adieresis /Aring /AE /Ccedilla
/Egrave /Eacute /Ecircumflex /Edieresis /Igrave /Iacute /Icircumflex /Idieresis /Eth /Ntilde
/Ograve /Oacute /Ocircumflex /Otilde /Odieresis /multiply /Oslash /Ugrave /Uacute /Ucircumflex
/Udieresis /Yacute /Thorn /germandbls /agrave /aacute /acircumflex /atilde /adieresis /aring
/ae /ccedilla /egrave /eacute /ecircumflex /edieresis /igrave /iacute /icircumflex /idieresis
/eth /ntilde /ograve /oacute /ocircumflex /otilde /odieresis /divide /oslash /ugrave
/uacute /ucircumflex /udieresis /yacute /thorn /ydieresis] /isolatin1encoding exch def
/cp {closepath} bind def
/c {curveto} bind def
/f {fill} bind def
/a {arc} bind def
/ef {eofill} bind def
/ex {exch} bind def
/gr {grestore} bind def
/gs {gsave} bind def
/sa {save} bind def
/rs {restore} bind def
/l {lineto} bind def
/m {moveto} bind def
/rm {rmoveto} bind def
/n {newpath} bind def
/s {stroke} bind def
/sh {show} bind def
/slc {setlinecap} bind def
/slj {setlinejoin} bind def
/slw {setlinewidth} bind def
/srgb {setrgbcolor} bind def
/rot {rotate} bind def
/sc {scale} bind def
/sd {setdash} bind def
/ff {findfont} bind def
/sf {setfont} bind def
/scf {scalefont} bind def
/sw {stringwidth pop} bind def
/tr {translate} bind def

/ellipsedict 8 dict def
ellipsedict /mtrx matrix put
/ellipse
{ ellipsedict begin
   /endangle exch def
   /startangle exch def
   /yrad exch def
   /xrad exch def
   /y exch def
   /x exch def   /savematrix mtrx currentmatrix def
   x y tr xrad yrad sc
   0 0 1 startangle endangle arc
   savematrix setmatrix
   end
} def

/mergeprocs {
dup length
3 -1 roll
dup
length
dup
5 1 roll
3 -1 roll
add
array cvx
dup
3 -1 roll
0 exch
putinterval
dup
4 2 roll
putinterval
} bind def
/Times-Roman-latin1
    /Times-Roman findfont
    dup length dict begin
	{1 index /FID ne {def} {pop pop} ifelse} forall
	/Encoding isolatin1encoding def
    currentdict end
definefont pop
/Times-Italic-latin1
    /Times-Italic findfont
    dup length dict begin
	{1 index /FID ne {def} {pop pop} ifelse} forall
	/Encoding isolatin1encoding def
    currentdict end
definefont pop
/Times-Bold-latin1
    /Times-Bold findfont
    dup length dict begin
	{1 index /FID ne {def} {pop pop} ifelse} forall
	/Encoding isolatin1encoding def
    currentdict end
definefont pop
/Times-BoldItalic-latin1
    /Times-BoldItalic findfont
    dup length dict begin
	{1 index /FID ne {def} {pop pop} ifelse} forall
	/Encoding isolatin1encoding def
    currentdict end
definefont pop
/AvantGarde-Book-latin1
    /AvantGarde-Book findfont
    dup length dict begin
	{1 index /FID ne {def} {pop pop} ifelse} forall
	/Encoding isolatin1encoding def
    currentdict end
definefont pop
/AvantGarde-BookOblique-latin1
    /AvantGarde-BookOblique findfont
    dup length dict begin
	{1 index /FID ne {def} {pop pop} ifelse} forall
	/Encoding isolatin1encoding def
    currentdict end
definefont pop
/AvantGarde-Demi-latin1
    /AvantGarde-Demi findfont
    dup length dict begin
	{1 index /FID ne {def} {pop pop} ifelse} forall
	/Encoding isolatin1encoding def
    currentdict end
definefont pop
/AvantGarde-DemiOblique-latin1
    /AvantGarde-DemiOblique findfont
    dup length dict begin
	{1 index /FID ne {def} {pop pop} ifelse} forall
	/Encoding isolatin1encoding def
    currentdict end
definefont pop
/Bookman-Light-latin1
    /Bookman-Light findfont
    dup length dict begin
	{1 index /FID ne {def} {pop pop} ifelse} forall
	/Encoding isolatin1encoding def
    currentdict end
definefont pop
/Bookman-LightItalic-latin1
    /Bookman-LightItalic findfont
    dup length dict begin
	{1 index /FID ne {def} {pop pop} ifelse} forall
	/Encoding isolatin1encoding def
    currentdict end
definefont pop
/Bookman-Demi-latin1
    /Bookman-Demi findfont
    dup length dict begin
	{1 index /FID ne {def} {pop pop} ifelse} forall
	/Encoding isolatin1encoding def
    currentdict end
definefont pop
/Bookman-DemiItalic-latin1
    /Bookman-DemiItalic findfont
    dup length dict begin
	{1 index /FID ne {def} {pop pop} ifelse} forall
	/Encoding isolatin1encoding def
    currentdict end
definefont pop
/Courier-latin1
    /Courier findfont
    dup length dict begin
	{1 index /FID ne {def} {pop pop} ifelse} forall
	/Encoding isolatin1encoding def
    currentdict end
definefont pop
/Courier-Oblique-latin1
    /Courier-Oblique findfont
    dup length dict begin
	{1 index /FID ne {def} {pop pop} ifelse} forall
	/Encoding isolatin1encoding def
    currentdict end
definefont pop
/Courier-Bold-latin1
    /Courier-Bold findfont
    dup length dict begin
	{1 index /FID ne {def} {pop pop} ifelse} forall
	/Encoding isolatin1encoding def
    currentdict end
definefont pop
/Courier-BoldOblique-latin1
    /Courier-BoldOblique findfont
    dup length dict begin
	{1 index /FID ne {def} {pop pop} ifelse} forall
	/Encoding isolatin1encoding def
    currentdict end
definefont pop
/Helvetica-latin1
    /Helvetica findfont
    dup length dict begin
	{1 index /FID ne {def} {pop pop} ifelse} forall
	/Encoding isolatin1encoding def
    currentdict end
definefont pop
/Helvetica-Oblique-latin1
    /Helvetica-Oblique findfont
    dup length dict begin
	{1 index /FID ne {def} {pop pop} ifelse} forall
	/Encoding isolatin1encoding def
    currentdict end
definefont pop
/Helvetica-Bold-latin1
    /Helvetica-Bold findfont
    dup length dict begin
	{1 index /FID ne {def} {pop pop} ifelse} forall
	/Encoding isolatin1encoding def
    currentdict end
definefont pop
/Helvetica-BoldOblique-latin1
    /Helvetica-BoldOblique findfont
    dup length dict begin
	{1 index /FID ne {def} {pop pop} ifelse} forall
	/Encoding isolatin1encoding def
    currentdict end
definefont pop
/Helvetica-Narrow-latin1
    /Helvetica-Narrow findfont
    dup length dict begin
	{1 index /FID ne {def} {pop pop} ifelse} forall
	/Encoding isolatin1encoding def
    currentdict end
definefont pop
/Helvetica-Narrow-Oblique-latin1
    /Helvetica-Narrow-Oblique findfont
    dup length dict begin
	{1 index /FID ne {def} {pop pop} ifelse} forall
	/Encoding isolatin1encoding def
    currentdict end
definefont pop
/Helvetica-Narrow-Bold-latin1
    /Helvetica-Narrow-Bold findfont
    dup length dict begin
	{1 index /FID ne {def} {pop pop} ifelse} forall
	/Encoding isolatin1encoding def
    currentdict end
definefont pop
/Helvetica-Narrow-BoldOblique-latin1
    /Helvetica-Narrow-BoldOblique findfont
    dup length dict begin
	{1 index /FID ne {def} {pop pop} ifelse} forall
	/Encoding isolatin1encoding def
    currentdict end
definefont pop
/NewCenturySchoolbook-Roman-latin1
    /NewCenturySchoolbook-Roman findfont
    dup length dict begin
	{1 index /FID ne {def} {pop pop} ifelse} forall
	/Encoding isolatin1encoding def
    currentdict end
definefont pop
/NewCenturySchoolbook-Italic-latin1
    /NewCenturySchoolbook-Italic findfont
    dup length dict begin
	{1 index /FID ne {def} {pop pop} ifelse} forall
	/Encoding isolatin1encoding def
    currentdict end
definefont pop
/NewCenturySchoolbook-Bold-latin1
    /NewCenturySchoolbook-Bold findfont
    dup length dict begin
	{1 index /FID ne {def} {pop pop} ifelse} forall
	/Encoding isolatin1encoding def
    currentdict end
definefont pop
/NewCenturySchoolbook-BoldItalic-latin1
    /NewCenturySchoolbook-BoldItalic findfont
    dup length dict begin
	{1 index /FID ne {def} {pop pop} ifelse} forall
	/Encoding isolatin1encoding def
    currentdict end
definefont pop
/Palatino-Roman-latin1
    /Palatino-Roman findfont
    dup length dict begin
	{1 index /FID ne {def} {pop pop} ifelse} forall
	/Encoding isolatin1encoding def
    currentdict end
definefont pop
/Palatino-Italic-latin1
    /Palatino-Italic findfont
    dup length dict begin
	{1 index /FID ne {def} {pop pop} ifelse} forall
	/Encoding isolatin1encoding def
    currentdict end
definefont pop
/Palatino-Bold-latin1
    /Palatino-Bold findfont
    dup length dict begin
	{1 index /FID ne {def} {pop pop} ifelse} forall
	/Encoding isolatin1encoding def
    currentdict end
definefont pop
/Palatino-BoldItalic-latin1
    /Palatino-BoldItalic findfont
    dup length dict begin
	{1 index /FID ne {def} {pop pop} ifelse} forall
	/Encoding isolatin1encoding def
    currentdict end
definefont pop
/Symbol-latin1
    /Symbol findfont
definefont pop
/ZapfChancery-MediumItalic-latin1
    /ZapfChancery-MediumItalic findfont
    dup length dict begin
	{1 index /FID ne {def} {pop pop} ifelse} forall
	/Encoding isolatin1encoding def
    currentdict end
definefont pop
/ZapfDingbats-latin1
    /ZapfDingbats findfont
    dup length dict begin
	{1 index /FID ne {def} {pop pop} ifelse} forall
	/Encoding isolatin1encoding def
    currentdict end
definefont pop
28.346000 -28.346000 scale
-7.950000 -28.448138 translate
%%EndProlog


1.000000 1.000000 1.000000 srgb
n 8.000000 11.000000 m 8.000000 13.000000 l 15.000000 13.000000 l 15.000000 11.000000 l f
0.100000 slw
[] 0 sd
[] 0 sd
0 slj
0.000000 0.000000 0.000000 srgb
n 8.000000 11.000000 m 8.000000 13.000000 l 15.000000 13.000000 l 15.000000 11.000000 l cp s
/Helvetica-latin1 ff 0.700000 scf sf
(Preprocessor) dup sw 2 div 11.500000 ex sub 12.232812 m gs 1 -1 sc sh gr
1.000000 1.000000 1.000000 srgb
n 8.000000 18.000000 m 8.000000 24.000000 l 19.000000 24.000000 l 19.000000 18.000000 l f
0.100000 slw
[] 0 sd
[] 0 sd
0 slj
0.000000 0.000000 0.000000 srgb
n 8.000000 18.000000 m 8.000000 24.000000 l 19.000000 24.000000 l 19.000000 18.000000 l cp s
/Helvetica-latin1 ff 0.700000 scf sf
(Manager        ) dup sw 18.550000 ex sub 19.732813 m gs 1 -1 sc sh gr
1.000000 1.000000 1.000000 srgb
n 21.000000 18.000000 m 21.000000 21.000000 l 25.000000 21.000000 l 25.000000 18.000000 l f
0.100000 slw
[] 0 sd
[] 0 sd
0 slj
0.000000 0.000000 0.000000 srgb
n 21.000000 18.000000 m 21.000000 21.000000 l 25.000000 21.000000 l 25.000000 18.000000 l cp s
/Helvetica-latin1 ff 0.700000 scf sf
(Hinter) dup sw 2 div 23.000000 ex sub 19.732813 m gs 1 -1 sc sh gr
1.000000 1.000000 1.000000 srgb
n 40.000000 17.000000 m 40.000000 21.000000 l 43.000000 21.000000 l 43.000000 17.000000 l f
0.100000 slw
[] 0 sd
[] 0 sd
0 slj
0.000000 0.000000 0.000000 srgb
n 40.000000 17.000000 m 40.000000 21.000000 l 43.000000 21.000000 l 43.000000 17.000000 l cp s
/Helvetica-latin1 ff 0.700000 scf sf
(SA) dup sw 2 div 41.500000 ex sub 19.232813 m gs 1 -1 sc sh gr
0.200000 slw
[] 0 sd
[] 0 sd
0 slc
n 11.000000 14.100000 m 11.000000 13.000000 l s
0 slj
n 10.600000 14.100000 m 11.000000 14.900000 l 11.400000 14.100000 l ef
0.200000 slw
[] 0 sd
[] 0 sd
0 slc
n 11.000000 10.100000 m 11.000000 8.000000 l s
0 slj
n 10.600000 10.100000 m 11.000000 10.900000 l 11.400000 10.100000 l ef
1.000000 1.000000 1.000000 srgb
n 29.000000 22.000000 m 29.000000 24.100000 l 43.000000 24.100000 l 43.000000 22.000000 l f
0.100000 slw
[] 0 sd
[] 0 sd
0 slj
0.000000 0.000000 0.000000 srgb
n 29.000000 22.000000 m 29.000000 24.100000 l 43.000000 24.100000 l 43.000000 22.000000 l cp s
/Helvetica-latin1 ff 0.700000 scf sf
(Declaration tables) dup sw 2 div 36.000000 ex sub 23.282812 m gs 1 -1 sc sh gr
/Helvetica-latin1 ff 0.700000 scf sf
(Input) 12.000000 9.000000 m gs 1 -1 sc sh gr
/Helvetica-latin1 ff 0.560000 scf sf
1.000000 1.000000 1.000000 srgb
n 27.000000 10.000000 m 27.000000 21.000000 l 38.000000 21.000000 l 38.000000 10.000000 l f
0.100000 slw
[] 0 sd
[] 0 sd
0 slj
0.000000 0.000000 0.000000 srgb
n 27.000000 10.000000 m 27.000000 21.000000 l 38.000000 21.000000 l 38.000000 10.000000 l cp s
/Helvetica-latin1 ff 0.700000 scf sf
0.100000 slw
[1.000000] 0 sd
[0.300000] 0 sd
0 slj
0 slc
n 31.000000 18.000000 m 31.000000 16.000000 l 23.000000 16.000000 l 23.000000 17.513197 l s
[] 0 sd
0 slj
0 slc
n 23.000000 17.888197 m 22.750000 17.388197 l 23.000000 17.513197 l 23.250000 17.388197 l ef
n 23.000000 17.888197 m 22.750000 17.388197 l 23.000000 17.513197 l 23.250000 17.388197 l cp s
0.100000 slw
[] 0 sd
[] 0 sd
0 slj
0 slc
n 29.000000 23.050000 m 23.000000 23.050000 l 23.000000 21.486803 l s
[] 0 sd
0 slj
0 slc
n 23.000000 21.111803 m 23.250000 21.611803 l 23.000000 21.486803 l 22.750000 21.611803 l ef
n 23.000000 21.111803 m 23.250000 21.611803 l 23.000000 21.486803 l 22.750000 21.611803 l cp s
0.752941 0.752941 0.752941 srgb
n 8.000000 15.000000 m 8.000000 17.000000 l 15.000000 17.000000 l 15.000000 15.000000 l f
0.100000 slw
[0.200000] 0 sd
[0.200000] 0 sd
0 slj
0.000000 0.000000 0.000000 srgb
n 8.000000 15.000000 m 8.000000 17.000000 l 15.000000 17.000000 l 15.000000 15.000000 l cp s
/Helvetica-latin1 ff 0.700000 scf sf
(Prefixer \(opt.\)) dup sw 2 div 11.500000 ex sub 16.232813 m gs 1 -1 sc sh gr
0.200000 slw
[] 0 sd
[] 0 sd
0 slj
0 slc
n 11.000000 17.000000 m 11.000000 17.000000 l 11.000000 20.100000 l s
0 slj
n 10.600000 20.100000 m 11.000000 20.900000 l 11.400000 20.100000 l ef
1.000000 1.000000 1.000000 srgb
n 9.000000 21.000000 m 9.000000 23.000000 l 17.000000 23.000000 l 17.000000 21.000000 l f
0.100000 slw
[] 0 sd
[] 0 sd
0 slj
0.000000 0.000000 0.000000 srgb
n 9.000000 21.000000 m 9.000000 23.000000 l 17.000000 23.000000 l 17.000000 21.000000 l cp s
/Helvetica-latin1 ff 0.700000 scf sf
(Token buffer) dup sw 2 div 13.000000 ex sub 22.232813 m gs 1 -1 sc sh gr
0.200000 slw
[] 0 sd
[] 0 sd
0 slj
0 slc
n 25.000000 19.500000 m 26.000000 19.500000 l 26.000000 19.000000 l 28.100000 19.000000 l s
0 slj
n 28.100000 19.400000 m 28.900000 19.000000 l 28.100000 18.600000 l ef
0.200000 slw
[] 0 sd
[] 0 sd
0 slj
0 slc
n 17.000000 22.000000 m 18.000000 22.000000 l 18.000000 19.500000 l 20.100000 19.500000 l s
0 slj
n 20.100000 19.900000 m 20.900000 19.500000 l 20.100000 19.100000 l ef
/Times-Roman-latin1 ff 1.400000 scf sf
(Syntactic) dup sw 2 div 21.000000 ex sub 11.000000 m gs 1 -1 sc sh gr
(analyzer) dup sw 2 div 21.000000 ex sub 13.000000 m gs 1 -1 sc sh gr
0.100000 slw
[1.000000] 0 sd
[0.300000] 0 sd
0 slj
0 slc
n 31.000000 18.000000 m 31.000000 15.000000 l 18.000000 15.000000 l 18.000000 17.513197 l s
[] 0 sd
0 slj
0 slc
n 18.000000 17.888197 m 17.750000 17.388197 l 18.000000 17.513197 l 18.250000 17.388197 l ef
n 18.000000 17.888197 m 17.750000 17.388197 l 18.000000 17.513197 l 18.250000 17.388197 l cp s
1.000000 1.000000 1.000000 srgb
n 33.000000 11.000000 m 33.000000 13.000000 l 37.000000 13.000000 l 37.000000 11.000000 l f
0.100000 slw
[] 0 sd
[] 0 sd
0 slj
0.000000 0.000000 0.000000 srgb
n 33.000000 11.000000 m 33.000000 13.000000 l 37.000000 13.000000 l 37.000000 11.000000 l cp s
/Helvetica-latin1 ff 0.560000 scf sf
1.000000 1.000000 1.000000 srgb
n 29.000000 18.000000 m 29.000000 20.000000 l 37.000000 20.000000 l 37.000000 18.000000 l f
0.100000 slw
[] 0 sd
[] 0 sd
0 slj
0.000000 0.000000 0.000000 srgb
n 29.000000 18.000000 m 29.000000 20.000000 l 37.000000 20.000000 l 37.000000 18.000000 l cp s
/Helvetica-latin1 ff 0.700000 scf sf
(Parser code) dup sw 2 div 33.000000 ex sub 19.232813 m gs 1 -1 sc sh gr
1.000000 1.000000 1.000000 srgb
n 33.000000 15.000000 m 33.000000 17.000000 l 37.000000 17.000000 l 37.000000 15.000000 l f
0.100000 slw
[] 0 sd
[] 0 sd
0 slj
0.000000 0.000000 0.000000 srgb
n 33.000000 15.000000 m 33.000000 17.000000 l 37.000000 17.000000 l 37.000000 15.000000 l cp s
/Helvetica-latin1 ff 0.560000 scf sf
1.000000 1.000000 1.000000 srgb
n 33.000000 13.000000 m 33.000000 15.000000 l 37.000000 15.000000 l 37.000000 13.000000 l f
0.100000 slw
[] 0 sd
[] 0 sd
0 slj
0.000000 0.000000 0.000000 srgb
n 33.000000 13.000000 m 33.000000 15.000000 l 37.000000 15.000000 l 37.000000 13.000000 l cp s
/Helvetica-latin1 ff 0.560000 scf sf
0.200000 slw
[] 0 sd
[] 0 sd
0 slc
n 39.100000 19.000000 m 37.000000 19.000000 l s
0 slj
n 39.100000 19.400000 m 39.900000 19.000000 l 39.100000 18.600000 l ef
/Helvetica-latin1 ff 0.700000 scf sf
(Stack of) 28.000000 12.000000 m gs 1 -1 sc sh gr
(parsers) 28.000000 13.000000 m gs 1 -1 sc sh gr
showpage
