%!PS-Adobe-2.0 EPSF-2.0
%%Title: page012.dia
%%Creator: Dia v0.91
%%CreationDate: Sun Mar 13 16:25:51 2005
%%For: jikos
%%Orientation: Portrait
%%Magnification: 1.0000
%%BoundingBox: 0 0 837 607
%%BeginSetup
%%EndSetup
%%EndComments
%%BeginProlog
[ /.notdef /.notdef /.notdef /.notdef /.notdef /.notdef /.notdef /.notdef /.notdef /.notdef
/.notdef /.notdef /.notdef /.notdef /.notdef /.notdef /.notdef /.notdef /.notdef /.notdef
/.notdef /.notdef /.notdef /.notdef /.notdef /.notdef /.notdef /.notdef /.notdef /.notdef
/.notdef /.notdef /space /exclam /quotedbl /numbersign /dollar /percent /ampersand /quoteright
/parenleft /parenright /asterisk /plus /comma /hyphen /period /slash /zero /one
/two /three /four /five /six /seven /eight /nine /colon /semicolon
/less /equal /greater /question /at /A /B /C /D /E
/F /G /H /I /J /K /L /M /N /O
/P /Q /R /S /T /U /V /W /X /Y
/Z /bracketleft /backslash /bracketright /asciicircum /underscore /quoteleft /a /b /c
/d /e /f /g /h /i /j /k /l /m
/n /o /p /q /r /s /t /u /v /w
/x /y /z /braceleft /bar /braceright /asciitilde /.notdef /.notdef /.notdef
/.notdef /.notdef /.notdef /.notdef /.notdef /.notdef /.notdef /.notdef /.notdef /.notdef
/.notdef /.notdef /.notdef /.notdef /.notdef /.notdef /.notdef /.notdef /.notdef /.notdef
/.notdef /.notdef /.notdef /.notdef /.notdef /.notdef /.notdef /.notdef /.notdef /.notdef
/space /exclamdown /cent /sterling /currency /yen /brokenbar /section /dieresis /copyright
/ordfeminine /guillemotleft /logicalnot /hyphen /registered /macron /degree /plusminus /twosuperior /threesuperior
/acute /mu /paragraph /periodcentered /cedilla /onesuperior /ordmasculine /guillemotright /onequarter /onehalf
/threequarters /questiondown /Agrave /Aacute /Acircumflex /Atilde /Adieresis /Aring /AE /Ccedilla
/Egrave /Eacute /Ecircumflex /Edieresis /Igrave /Iacute /Icircumflex /Idieresis /Eth /Ntilde
/Ograve /Oacute /Ocircumflex /Otilde /Odieresis /multiply /Oslash /Ugrave /Uacute /Ucircumflex
/Udieresis /Yacute /Thorn /germandbls /agrave /aacute /acircumflex /atilde /adieresis /aring
/ae /ccedilla /egrave /eacute /ecircumflex /edieresis /igrave /iacute /icircumflex /idieresis
/eth /ntilde /ograve /oacute /ocircumflex /otilde /odieresis /divide /oslash /ugrave
/uacute /ucircumflex /udieresis /yacute /thorn /ydieresis] /isolatin1encoding exch def
/cp {closepath} bind def
/c {curveto} bind def
/f {fill} bind def
/a {arc} bind def
/ef {eofill} bind def
/ex {exch} bind def
/gr {grestore} bind def
/gs {gsave} bind def
/sa {save} bind def
/rs {restore} bind def
/l {lineto} bind def
/m {moveto} bind def
/rm {rmoveto} bind def
/n {newpath} bind def
/s {stroke} bind def
/sh {show} bind def
/slc {setlinecap} bind def
/slj {setlinejoin} bind def
/slw {setlinewidth} bind def
/srgb {setrgbcolor} bind def
/rot {rotate} bind def
/sc {scale} bind def
/sd {setdash} bind def
/ff {findfont} bind def
/sf {setfont} bind def
/scf {scalefont} bind def
/sw {stringwidth pop} bind def
/tr {translate} bind def

/ellipsedict 8 dict def
ellipsedict /mtrx matrix put
/ellipse
{ ellipsedict begin
   /endangle exch def
   /startangle exch def
   /yrad exch def
   /xrad exch def
   /y exch def
   /x exch def   /savematrix mtrx currentmatrix def
   x y tr xrad yrad sc
   0 0 1 startangle endangle arc
   savematrix setmatrix
   end
} def

/mergeprocs {
dup length
3 -1 roll
dup
length
dup
5 1 roll
3 -1 roll
add
array cvx
dup
3 -1 roll
0 exch
putinterval
dup
4 2 roll
putinterval
} bind def
/dpi_x 300 def
/dpi_y 300 def
/conicto {
    /to_y exch def
    /to_x exch def
    /conic_cntrl_y exch def
    /conic_cntrl_x exch def
    currentpoint
    /p0_y exch def
    /p0_x exch def
    /p1_x p0_x conic_cntrl_x p0_x sub 2 3 div mul add def
    /p1_y p0_y conic_cntrl_y p0_y sub 2 3 div mul add def
    /p2_x p1_x to_x p0_x sub 1 3 div mul add def
    /p2_y p1_y to_y p0_y sub 1 3 div mul add def
    p1_x p1_y p2_x p2_y to_x to_y curveto
} bind def
/start_ol { gsave 1.1 dpi_x div dup scale} bind def
/end_ol { closepath fill grestore } bind def
28.346000 -28.346000 scale
-1.550000 -23.050000 translate
%%EndProlog


0.100000 slw
[] 0 sd
1.000000 1.000000 1.000000 srgb
n 10.800000 1.700000 m 10.800000 3.100000 l 13.500000 3.100000 l 13.500000 1.700000 l f
0.000000 0.000000 0.000000 srgb
n 10.800000 1.700000 m 10.800000 3.100000 l 13.500000 3.100000 l 13.500000 1.700000 l cp s
gsave 11.413400 2.700000 translate 0.035278 -0.035278 scale
start_ol
2240 0 moveto
3072 0 lineto
3072 4356 lineto
2240 4356 lineto
2240 3072 lineto
1986 3072 1823 3072 1672 3072 curveto
788 3072 256 2469 256 1459 curveto
256 581 670 0 1296 0 curveto
1648 0 1927 170 2240 574 curveto
2240 0 lineto
2240 1104 moveto
2023 790 1839 651 1623 651 curveto
1314 651 1152 960 1152 1557 curveto
1152 2229 1369 2559 1802 2559 curveto
1899 2559 2029 2543 2240 2511 curveto
2240 1104 lineto
end_ol grestore 
gsave 11.879067 2.700000 translate 0.035278 -0.035278 scale
start_ol
2897 752 moveto
2540 619 2275 564 2010 564 curveto
1751 564 1549 625 1400 741 curveto
1215 889 1129 1060 1083 1408 curveto
2897 1408 lineto
2886 2582 2511 3072 1624 3072 curveto
760 3072 207 2497 207 1605 curveto
207 604 835 0 1872 0 curveto
2212 0 2534 52 2897 173 curveto
2897 752 lineto
1077 1856 moveto
1146 2340 1313 2554 1630 2554 curveto
1935 2554 2068 2345 2079 1856 curveto
1077 1856 lineto
end_ol grestore 
gsave 12.302400 2.700000 translate 0.035278 -0.035278 scale
start_ol
2960 703 moveto
2620 601 2332 553 2108 553 curveto
1468 553 1088 922 1088 1552 curveto
1088 2182 1405 2513 2021 2513 curveto
2246 2513 2505 2470 2937 2363 curveto
2937 2951 lineto
2591 3037 2297 3072 1969 3072 curveto
788 3072 192 2556 192 1547 curveto
192 560 810 0 1902 0 curveto
2209 0 2555 46 2960 138 curveto
2960 703 lineto
end_ol grestore 
gsave 12.725733 2.700000 translate 0.035278 -0.035278 scale
start_ol
384 0 moveto
1216 0 lineto
1216 4441 lineto
384 4441 lineto
384 0 lineto
end_ol grestore 
1.000000 1.000000 1.000000 srgb
n 10.800000 3.100000 m 10.800000 4.900000 l 13.500000 4.900000 l 13.500000 3.100000 l f
0.000000 0.000000 0.000000 srgb
n 10.800000 3.100000 m 10.800000 4.900000 l 13.500000 4.900000 l 13.500000 3.100000 l cp s
gsave 10.950000 3.850000 translate 0.035278 -0.035278 scale
start_ol
1216 221 moveto
1536 221 lineto
1536 1216 lineto
2527 1216 lineto
2527 1536 lineto
1536 1536 lineto
1536 2531 lineto
1216 2531 lineto
1216 1536 lineto
221 1536 lineto
221 1216 lineto
1216 1216 lineto
1216 221 lineto
end_ol grestore 
gsave 11.314067 3.850000 translate 0.035278 -0.035278 scale
start_ol
659 2332 moveto
991 2332 lineto
1106 3553 lineto
548 3553 lineto
659 2332 lineto
1769 2332 moveto
2101 2332 lineto
2212 3553 lineto
1659 3553 lineto
1769 2332 lineto
end_ol grestore 
gsave 11.678133 3.850000 translate 0.035278 -0.035278 scale
start_ol
384 193 moveto
732 60 1039 0 1387 0 curveto
2043 0 2432 266 2432 720 curveto
2432 1039 2232 1222 1737 1344 curveto
1287 1458 lineto
977 1536 832 1650 832 1811 curveto
832 2034 1021 2156 1368 2156 curveto
1584 2156 1759 2121 1926 2043 curveto
1980 1658 lineto
2259 1658 lineto
2259 2271 lineto
1977 2381 1709 2432 1368 2432 curveto
715 2432 384 2205 384 1756 curveto
384 1428 600 1232 1115 1106 curveto
1575 988 lineto
1878 914 1984 822 1984 639 curveto
1984 403 1803 281 1458 281 curveto
1246 281 1033 324 720 437 curveto
662 827 lineto
384 827 lineto
384 193 lineto
end_ol grestore 
gsave 12.042200 3.850000 translate 0.035278 -0.035278 scale
start_ol
359 0 moveto
2525 0 lineto
2525 276 lineto
1664 276 lineto
1664 2432 lineto
359 2432 lineto
359 2151 lineto
1216 2151 lineto
1216 276 lineto
359 276 lineto
359 0 lineto
1216 3008 moveto
1728 3008 lineto
1728 3584 lineto
1216 3584 lineto
1216 3008 lineto
end_ol grestore 
gsave 12.406267 3.850000 translate 0.035278 -0.035278 scale
start_ol
172 0 moveto
1144 0 lineto
1144 268 lineto
896 268 lineto
896 1537 lineto
1116 1916 1318 2086 1553 2086 curveto
1796 2086 1920 1898 1920 1528 curveto
1920 268 lineto
1700 268 lineto
1700 0 lineto
2649 0 lineto
2649 268 lineto
2368 268 lineto
2368 1572 lineto
2368 2138 2136 2432 1686 2432 curveto
1374 2432 1139 2277 896 1912 curveto
896 2432 lineto
172 2432 lineto
172 2086 lineto
448 2086 lineto
448 268 lineto
172 268 lineto
172 0 lineto
end_ol grestore 
gsave 12.770333 3.850000 translate 0.035278 -0.035278 scale
start_ol
659 2332 moveto
991 2332 lineto
1106 3553 lineto
548 3553 lineto
659 2332 lineto
1769 2332 moveto
2101 2332 lineto
2212 3553 lineto
1659 3553 lineto
1769 2332 lineto
end_ol grestore 
gsave 10.950000 4.650000 translate 0.035278 -0.035278 scale
start_ol
1216 221 moveto
1536 221 lineto
1536 1216 lineto
2527 1216 lineto
2527 1536 lineto
1536 1536 lineto
1536 2531 lineto
1216 2531 lineto
1216 1536 lineto
221 1536 lineto
221 1216 lineto
1216 1216 lineto
1216 221 lineto
end_ol grestore 
gsave 11.314067 4.650000 translate 0.035278 -0.035278 scale
start_ol
2330 505 moveto
2058 382 1869 332 1703 332 curveto
1418 332 1344 455 1344 922 curveto
1344 2112 lineto
2302 2112 lineto
2302 2368 lineto
1344 2368 lineto
1344 2976 lineto
896 2976 lineto
896 2368 lineto
269 2368 lineto
269 2112 lineto
896 2112 lineto
896 723 lineto
896 206 1090 0 1571 0 curveto
1840 0 2066 60 2330 194 curveto
2330 505 lineto
end_ol grestore 
gsave 11.678133 4.650000 translate 0.035278 -0.035278 scale
start_ol
1157 0 moveto
1309 0 lineto
1064 -640 lineto
617 -640 lineto
617 -896 lineto
1696 -896 lineto
1696 -640 lineto
1364 -640 lineto
1608 -27 lineto
2474 2151 lineto
2640 2151 lineto
2640 2432 lineto
1816 2432 lineto
1816 2151 lineto
2175 2151 lineto
1475 413 lineto
1470 413 lineto
770 2151 lineto
1129 2151 lineto
1129 2432 lineto
124 2432 lineto
124 2151 lineto
290 2151 lineto
1157 0 lineto
end_ol grestore 
gsave 12.042200 4.650000 translate 0.035278 -0.035278 scale
start_ol
832 -640 moveto
832 0 lineto
1064 0 1217 0 1356 0 curveto
2065 0 2496 496 2496 1313 curveto
2496 1989 2169 2432 1679 2432 curveto
1353 2432 1102 2270 832 1892 curveto
832 2432 lineto
108 2432 lineto
108 2073 lineto
384 2073 lineto
384 -640 lineto
108 -640 lineto
108 -896 lineto
1405 -896 lineto
1405 -640 lineto
832 -640 lineto
832 1577 moveto
1069 1922 1286 2073 1551 2073 curveto
1882 2073 2048 1810 2048 1289 curveto
2048 616 1830 332 1324 332 curveto
1206 332 1064 345 832 379 curveto
832 1577 lineto
end_ol grestore 
gsave 12.406267 4.650000 translate 0.035278 -0.035278 scale
start_ol
2484 1152 moveto
2484 1280 lineto
2484 2045 2147 2432 1484 2432 curveto
756 2432 276 1958 276 1246 curveto
276 497 793 0 1576 0 curveto
1889 0 2147 60 2419 194 curveto
2419 521 lineto
2120 389 1885 332 1636 332 curveto
1387 332 1193 389 1046 507 curveto
871 648 793 814 751 1152 curveto
2484 1152 lineto
756 1408 moveto
802 1895 1046 2156 1452 2156 curveto
1825 2156 2014 1938 2014 1502 curveto
2014 1408 lineto
756 1408 lineto
end_ol grestore 
0.100000 slw
[] 0 sd
1.000000 1.000000 1.000000 srgb
n 7.000000 9.200000 m 7.000000 10.600000 l 10.750000 10.600000 l 10.750000 9.200000 l f
0.000000 0.000000 0.000000 srgb
n 7.000000 9.200000 m 7.000000 10.600000 l 10.750000 10.600000 l 10.750000 9.200000 l cp s
gsave 7.397567 10.200000 translate 0.035278 -0.035278 scale
start_ol
448 0 moveto
1280 0 lineto
1280 2554 lineto
1798 2554 lineto
1798 3072 lineto
1280 3072 lineto
1280 3323 lineto
1280 3757 1401 3968 1643 3968 curveto
1752 3968 1885 3940 2046 3877 curveto
2046 4406 lineto
1856 4457 1700 4480 1533 4480 curveto
815 4480 448 4081 448 3295 curveto
448 3072 lineto
125 3072 lineto
125 2554 lineto
448 2554 lineto
448 0 lineto
end_ol grestore 
gsave 7.651567 10.200000 translate 0.035278 -0.035278 scale
start_ol
2240 0 moveto
3072 0 lineto
3072 3072 lineto
2240 3072 lineto
2240 1124 lineto
1966 796 1759 657 1535 657 curveto
1294 657 1216 785 1216 1163 curveto
1216 3072 lineto
384 3072 lineto
384 963 lineto
384 325 661 0 1199 0 curveto
1589 0 1895 170 2240 573 curveto
2240 0 lineto
end_ol grestore 
gsave 8.117233 10.200000 translate 0.035278 -0.035278 scale
start_ol
384 0 moveto
1216 0 lineto
1216 1948 lineto
1501 2270 1727 2415 1965 2415 curveto
2221 2415 2304 2287 2304 1909 curveto
2304 0 lineto
3136 0 lineto
3136 2125 lineto
3136 2752 2855 3072 2304 3072 curveto
1900 3072 1579 2899 1216 2490 curveto
1216 3072 lineto
384 3072 lineto
384 0 lineto
end_ol grestore 
gsave 8.582900 10.200000 translate 0.035278 -0.035278 scale
start_ol
2960 703 moveto
2620 601 2332 553 2108 553 curveto
1468 553 1088 922 1088 1552 curveto
1088 2182 1405 2513 2021 2513 curveto
2246 2513 2505 2470 2937 2363 curveto
2937 2951 lineto
2591 3037 2297 3072 1969 3072 curveto
788 3072 192 2556 192 1547 curveto
192 560 810 0 1902 0 curveto
2209 0 2555 46 2960 138 curveto
2960 703 lineto
end_ol grestore 
gsave 9.006233 10.200000 translate 0.035278 -0.035278 scale
start_ol
1856 574 moveto
1752 546 1654 535 1580 535 curveto
1338 535 1280 641 1280 1087 curveto
1280 2554 lineto
1833 2554 lineto
1833 3072 lineto
1280 3072 lineto
1280 3688 lineto
448 3590 lineto
448 3072 lineto
172 3072 lineto
172 2554 lineto
448 2554 lineto
448 981 lineto
448 329 741 0 1327 0 curveto
1471 0 1638 22 1856 67 curveto
1856 574 lineto
end_ol grestore 
gsave 9.260233 10.200000 translate 0.035278 -0.035278 scale
start_ol
384 0 moveto
1216 0 lineto
1216 3072 lineto
384 3072 lineto
384 0 lineto
384 3584 moveto
1216 3584 lineto
1216 4288 lineto
384 4288 lineto
384 3584 lineto
end_ol grestore 
gsave 9.471900 10.200000 translate 0.035278 -0.035278 scale
start_ol
1757 3072 moveto
803 3072 192 2474 192 1536 curveto
192 609 803 0 1745 0 curveto
2717 0 3328 592 3328 1541 curveto
3328 2474 2711 3072 1757 3072 curveto
1757 2554 moveto
2172 2554 2432 2163 2432 1541 curveto
2432 909 2172 518 1757 518 curveto
1348 518 1088 914 1088 1536 curveto
1088 2163 1348 2554 1757 2554 curveto
end_ol grestore 
gsave 9.937567 10.200000 translate 0.035278 -0.035278 scale
start_ol
384 0 moveto
1216 0 lineto
1216 1948 lineto
1501 2270 1727 2415 1965 2415 curveto
2221 2415 2304 2287 2304 1909 curveto
2304 0 lineto
3136 0 lineto
3136 2125 lineto
3136 2752 2855 3072 2304 3072 curveto
1900 3072 1579 2899 1216 2490 curveto
1216 3072 lineto
384 3072 lineto
384 0 lineto
end_ol grestore 
1.000000 1.000000 1.000000 srgb
n 7.000000 10.600000 m 7.000000 12.400000 l 10.750000 12.400000 l 10.750000 10.600000 l f
0.000000 0.000000 0.000000 srgb
n 7.000000 10.600000 m 7.000000 12.400000 l 10.750000 12.400000 l 10.750000 10.600000 l cp s
gsave 7.150000 11.350000 translate 0.035278 -0.035278 scale
start_ol
1216 221 moveto
1536 221 lineto
1536 1216 lineto
2527 1216 lineto
2527 1536 lineto
1536 1536 lineto
1536 2531 lineto
1216 2531 lineto
1216 1536 lineto
221 1536 lineto
221 1216 lineto
1216 1216 lineto
1216 221 lineto
end_ol grestore 
gsave 7.514067 11.350000 translate 0.035278 -0.035278 scale
start_ol
1216 1529 moveto
1419 1889 1635 2045 1925 2045 curveto
2022 2045 2100 2023 2188 1965 curveto
2234 1556 lineto
2515 1556 lineto
2515 2292 lineto
2345 2387 2183 2432 1999 2432 curveto
1704 2432 1483 2281 1216 1907 curveto
1216 2432 lineto
187 2432 lineto
187 2045 lineto
768 2045 lineto
768 276 lineto
187 276 lineto
187 0 lineto
2050 0 lineto
2050 276 lineto
1216 276 lineto
1216 1529 lineto
end_ol grestore 
gsave 7.878133 11.350000 translate 0.035278 -0.035278 scale
start_ol
2484 1152 moveto
2484 1280 lineto
2484 2045 2147 2432 1484 2432 curveto
756 2432 276 1958 276 1246 curveto
276 497 793 0 1576 0 curveto
1889 0 2147 60 2419 194 curveto
2419 521 lineto
2120 389 1885 332 1636 332 curveto
1387 332 1193 389 1046 507 curveto
871 648 793 814 751 1152 curveto
2484 1152 lineto
756 1408 moveto
802 1895 1046 2156 1452 2156 curveto
1825 2156 2014 1938 2014 1502 curveto
2014 1408 lineto
756 1408 lineto
end_ol grestore 
gsave 8.242200 11.350000 translate 0.035278 -0.035278 scale
start_ol
2330 505 moveto
2058 382 1869 332 1703 332 curveto
1418 332 1344 455 1344 922 curveto
1344 2112 lineto
2302 2112 lineto
2302 2368 lineto
1344 2368 lineto
1344 2976 lineto
896 2976 lineto
896 2368 lineto
269 2368 lineto
269 2112 lineto
896 2112 lineto
896 723 lineto
896 206 1090 0 1571 0 curveto
1840 0 2066 60 2330 194 curveto
2330 505 lineto
end_ol grestore 
gsave 8.606267 11.350000 translate 0.035278 -0.035278 scale
start_ol
1671 2432 moveto
1671 2159 lineto
1920 2159 lineto
1920 895 lineto
1694 515 1496 350 1260 350 curveto
1021 350 896 538 896 904 curveto
896 2432 lineto
172 2432 lineto
172 2159 lineto
448 2159 lineto
448 855 lineto
448 294 683 0 1131 0 curveto
1445 0 1675 155 1920 520 curveto
1920 0 lineto
2644 0 lineto
2644 350 lineto
2368 350 lineto
2368 2432 lineto
1671 2432 lineto
end_ol grestore 
gsave 8.970333 11.350000 translate 0.035278 -0.035278 scale
start_ol
1216 1529 moveto
1419 1889 1635 2045 1925 2045 curveto
2022 2045 2100 2023 2188 1965 curveto
2234 1556 lineto
2515 1556 lineto
2515 2292 lineto
2345 2387 2183 2432 1999 2432 curveto
1704 2432 1483 2281 1216 1907 curveto
1216 2432 lineto
187 2432 lineto
187 2045 lineto
768 2045 lineto
768 276 lineto
187 276 lineto
187 0 lineto
2050 0 lineto
2050 276 lineto
1216 276 lineto
1216 1529 lineto
end_ol grestore 
gsave 9.334400 11.350000 translate 0.035278 -0.035278 scale
start_ol
172 0 moveto
1144 0 lineto
1144 268 lineto
896 268 lineto
896 1537 lineto
1116 1916 1318 2086 1553 2086 curveto
1796 2086 1920 1898 1920 1528 curveto
1920 268 lineto
1700 268 lineto
1700 0 lineto
2649 0 lineto
2649 268 lineto
2368 268 lineto
2368 1572 lineto
2368 2138 2136 2432 1686 2432 curveto
1374 2432 1139 2277 896 1912 curveto
896 2432 lineto
172 2432 lineto
172 2086 lineto
448 2086 lineto
448 268 lineto
172 268 lineto
172 0 lineto
end_ol grestore 
gsave 9.698467 11.350000 translate 0.035278 -0.035278 scale
start_ol
384 193 moveto
732 60 1039 0 1387 0 curveto
2043 0 2432 266 2432 720 curveto
2432 1039 2232 1222 1737 1344 curveto
1287 1458 lineto
977 1536 832 1650 832 1811 curveto
832 2034 1021 2156 1368 2156 curveto
1584 2156 1759 2121 1926 2043 curveto
1980 1658 lineto
2259 1658 lineto
2259 2271 lineto
1977 2381 1709 2432 1368 2432 curveto
715 2432 384 2205 384 1756 curveto
384 1428 600 1232 1115 1106 curveto
1575 988 lineto
1878 914 1984 822 1984 639 curveto
1984 403 1803 281 1458 281 curveto
1246 281 1033 324 720 437 curveto
662 827 lineto
384 827 lineto
384 193 lineto
end_ol grestore 
gsave 7.150000 12.150000 translate 0.035278 -0.035278 scale
start_ol
1216 221 moveto
1536 221 lineto
1536 1216 lineto
2527 1216 lineto
2527 1536 lineto
1536 1536 lineto
1536 2531 lineto
1216 2531 lineto
1216 1536 lineto
221 1536 lineto
221 1216 lineto
1216 1216 lineto
1216 221 lineto
end_ol grestore 
gsave 7.514067 12.150000 translate 0.035278 -0.035278 scale
start_ol
1903 0 moveto
2608 0 lineto
2608 332 lineto
2304 332 lineto
2304 1801 lineto
2304 2263 2099 2432 1534 2432 curveto
1167 2432 845 2368 487 2225 curveto
487 1762 lineto
750 1762 lineto
805 2030 lineto
1057 2116 1225 2151 1389 2151 curveto
1697 2151 1856 2034 1856 1805 curveto
1856 1451 lineto
1668 1451 lineto
723 1451 320 1219 320 679 curveto
320 263 609 0 1072 0 curveto
1352 0 1581 96 1856 321 curveto
1903 0 lineto
1856 660 moveto
1627 431 1431 332 1193 332 curveto
913 332 768 462 768 708 curveto
768 1058 1039 1192 1735 1192 curveto
1856 1192 lineto
1856 660 lineto
end_ol grestore 
gsave 7.878133 12.150000 translate 0.035278 -0.035278 scale
start_ol
1216 1529 moveto
1419 1889 1635 2045 1925 2045 curveto
2022 2045 2100 2023 2188 1965 curveto
2234 1556 lineto
2515 1556 lineto
2515 2292 lineto
2345 2387 2183 2432 1999 2432 curveto
1704 2432 1483 2281 1216 1907 curveto
1216 2432 lineto
187 2432 lineto
187 2045 lineto
768 2045 lineto
768 276 lineto
187 276 lineto
187 0 lineto
2050 0 lineto
2050 276 lineto
1216 276 lineto
1216 1529 lineto
end_ol grestore 
gsave 8.242200 12.150000 translate 0.035278 -0.035278 scale
start_ol
476 -56 moveto
290 -178 192 -319 192 -464 curveto
192 -791 540 -960 1217 -960 curveto
2060 -960 2496 -703 2496 -200 curveto
2496 155 2262 332 1803 332 curveto
998 332 lineto
756 332 640 370 640 445 curveto
640 503 687 562 793 637 curveto
893 704 lineto
1012 704 1105 704 1198 704 curveto
1834 704 2304 1072 2304 1568 curveto
2304 1775 2229 1945 2055 2156 curveto
2492 2156 lineto
2620 2432 lineto
1693 2432 lineto
1535 2432 1393 2432 1214 2432 curveto
597 2432 192 2084 192 1555 curveto
192 1225 354 1007 726 813 curveto
647 742 lineto
467 588 384 456 384 328 curveto
384 209 450 116 602 28 curveto
476 -56 lineto
798 0 moveto
1604 0 lineto
1900 0 2048 -93 2048 -284 curveto
2048 -538 1747 -704 1275 -704 curveto
858 -704 640 -596 640 -391 curveto
640 -274 675 -171 747 -73 curveto
798 0 lineto
1251 2156 moveto
1606 2156 1856 1905 1856 1547 curveto
1856 1202 1606 960 1240 960 curveto
885 960 640 1193 640 1533 curveto
640 1892 895 2156 1251 2156 curveto
end_ol grestore 
gsave 8.606267 12.150000 translate 0.035278 -0.035278 scale
start_ol
1671 2432 moveto
1671 2159 lineto
1920 2159 lineto
1920 895 lineto
1694 515 1496 350 1260 350 curveto
1021 350 896 538 896 904 curveto
896 2432 lineto
172 2432 lineto
172 2159 lineto
448 2159 lineto
448 855 lineto
448 294 683 0 1131 0 curveto
1445 0 1675 155 1920 520 curveto
1920 0 lineto
2644 0 lineto
2644 350 lineto
2368 350 lineto
2368 2432 lineto
1671 2432 lineto
end_ol grestore 
gsave 8.970333 12.150000 translate 0.035278 -0.035278 scale
start_ol
90 0 moveto
811 0 lineto
811 268 lineto
640 268 lineto
640 1505 lineto
797 1912 921 2086 1064 2086 curveto
1164 2086 1216 1966 1216 1738 curveto
1216 0 lineto
1752 0 lineto
1752 268 lineto
1600 268 lineto
1600 1505 lineto
1600 1590 1672 1778 1752 1898 curveto
1833 2023 1913 2086 1977 2086 curveto
2065 2086 2112 1934 2112 1639 curveto
2112 0 lineto
2662 0 lineto
2662 268 lineto
2496 268 lineto
2496 1822 lineto
2496 2223 2359 2432 2095 2432 curveto
1875 2432 1722 2281 1587 1916 curveto
1543 2277 1423 2432 1192 2432 curveto
973 2432 859 2327 640 1916 curveto
640 2432 lineto
90 2432 lineto
90 2086 lineto
256 2086 lineto
256 268 lineto
90 268 lineto
90 0 lineto
end_ol grestore 
gsave 9.334400 12.150000 translate 0.035278 -0.035278 scale
start_ol
2484 1152 moveto
2484 1280 lineto
2484 2045 2147 2432 1484 2432 curveto
756 2432 276 1958 276 1246 curveto
276 497 793 0 1576 0 curveto
1889 0 2147 60 2419 194 curveto
2419 521 lineto
2120 389 1885 332 1636 332 curveto
1387 332 1193 389 1046 507 curveto
871 648 793 814 751 1152 curveto
2484 1152 lineto
756 1408 moveto
802 1895 1046 2156 1452 2156 curveto
1825 2156 2014 1938 2014 1502 curveto
2014 1408 lineto
756 1408 lineto
end_ol grestore 
gsave 9.698467 12.150000 translate 0.035278 -0.035278 scale
start_ol
172 0 moveto
1144 0 lineto
1144 268 lineto
896 268 lineto
896 1537 lineto
1116 1916 1318 2086 1553 2086 curveto
1796 2086 1920 1898 1920 1528 curveto
1920 268 lineto
1700 268 lineto
1700 0 lineto
2649 0 lineto
2649 268 lineto
2368 268 lineto
2368 1572 lineto
2368 2138 2136 2432 1686 2432 curveto
1374 2432 1139 2277 896 1912 curveto
896 2432 lineto
172 2432 lineto
172 2086 lineto
448 2086 lineto
448 268 lineto
172 268 lineto
172 0 lineto
end_ol grestore 
gsave 10.062533 12.150000 translate 0.035278 -0.035278 scale
start_ol
2330 505 moveto
2058 382 1869 332 1703 332 curveto
1418 332 1344 455 1344 922 curveto
1344 2112 lineto
2302 2112 lineto
2302 2368 lineto
1344 2368 lineto
1344 2976 lineto
896 2976 lineto
896 2368 lineto
269 2368 lineto
269 2112 lineto
896 2112 lineto
896 723 lineto
896 206 1090 0 1571 0 curveto
1840 0 2066 60 2330 194 curveto
2330 505 lineto
end_ol grestore 
0.100000 slw
[] 0 sd
1.000000 1.000000 1.000000 srgb
n 1.600000 8.900000 m 1.600000 10.300000 l 4.600000 10.300000 l 4.600000 8.900000 l f
0.000000 0.000000 0.000000 srgb
n 1.600000 8.900000 m 1.600000 10.300000 l 4.600000 10.300000 l 4.600000 8.900000 l cp s
gsave 1.868100 9.900000 translate 0.035278 -0.035278 scale
start_ol
2240 0 moveto
3072 0 lineto
3072 4356 lineto
2240 4356 lineto
2240 3072 lineto
1986 3072 1823 3072 1672 3072 curveto
788 3072 256 2469 256 1459 curveto
256 581 670 0 1296 0 curveto
1648 0 1927 170 2240 574 curveto
2240 0 lineto
2240 1104 moveto
2023 790 1839 651 1623 651 curveto
1314 651 1152 960 1152 1557 curveto
1152 2229 1369 2559 1802 2559 curveto
1899 2559 2029 2543 2240 2511 curveto
2240 1104 lineto
end_ol grestore 
gsave 2.333767 9.900000 translate 0.035278 -0.035278 scale
start_ol
1757 3072 moveto
803 3072 192 2474 192 1536 curveto
192 609 803 0 1745 0 curveto
2717 0 3328 592 3328 1541 curveto
3328 2474 2711 3072 1757 3072 curveto
1757 2554 moveto
2172 2554 2432 2163 2432 1541 curveto
2432 909 2172 518 1757 518 curveto
1348 518 1088 914 1088 1536 curveto
1088 2163 1348 2554 1757 2554 curveto
end_ol grestore 
gsave 2.799433 9.900000 translate 0.035278 -0.035278 scale
start_ol
2240 0 moveto
3072 0 lineto
3072 3072 lineto
2240 3072 lineto
2240 1124 lineto
1966 796 1759 657 1535 657 curveto
1294 657 1216 785 1216 1163 curveto
1216 3072 lineto
384 3072 lineto
384 963 lineto
384 325 661 0 1199 0 curveto
1589 0 1895 170 2240 573 curveto
2240 0 lineto
end_ol grestore 
gsave 3.265100 9.900000 translate 0.035278 -0.035278 scale
start_ol
1216 0 moveto
1501 0 1679 0 1839 0 curveto
2770 0 3328 603 3328 1613 curveto
3328 2491 2895 3072 2239 3072 curveto
1860 3072 1553 2899 1216 2490 curveto
1216 4356 lineto
384 4356 lineto
384 0 lineto
1216 0 lineto
1216 1968 moveto
1457 2282 1667 2421 1908 2421 curveto
2251 2421 2432 2112 2432 1515 curveto
2432 843 2191 513 1710 513 curveto
1601 513 1451 529 1216 561 curveto
1216 1968 lineto
end_ol grestore 
gsave 3.730767 9.900000 translate 0.035278 -0.035278 scale
start_ol
384 0 moveto
1216 0 lineto
1216 4441 lineto
384 4441 lineto
384 0 lineto
end_ol grestore 
gsave 3.942433 9.900000 translate 0.035278 -0.035278 scale
start_ol
2897 752 moveto
2540 619 2275 564 2010 564 curveto
1751 564 1549 625 1400 741 curveto
1215 889 1129 1060 1083 1408 curveto
2897 1408 lineto
2886 2582 2511 3072 1624 3072 curveto
760 3072 207 2497 207 1605 curveto
207 604 835 0 1872 0 curveto
2212 0 2534 52 2897 173 curveto
2897 752 lineto
1077 1856 moveto
1146 2340 1313 2554 1630 2554 curveto
1935 2554 2068 2345 2079 1856 curveto
1077 1856 lineto
end_ol grestore 
1.000000 1.000000 1.000000 srgb
n 1.600000 10.300000 m 1.600000 11.300000 l 4.600000 11.300000 l 4.600000 10.300000 l f
0.000000 0.000000 0.000000 srgb
n 1.600000 10.300000 m 1.600000 11.300000 l 4.600000 11.300000 l 4.600000 10.300000 l cp s
gsave 1.750000 11.050000 translate 0.035278 -0.035278 scale
start_ol
1216 221 moveto
1536 221 lineto
1536 1216 lineto
2527 1216 lineto
2527 1536 lineto
1536 1536 lineto
1536 2531 lineto
1216 2531 lineto
1216 1536 lineto
221 1536 lineto
221 1216 lineto
1216 1216 lineto
1216 221 lineto
end_ol grestore 
gsave 2.114067 11.050000 translate 0.035278 -0.035278 scale
start_ol
733 1024 moveto
1852 1024 lineto
2074 276 lineto
1723 276 lineto
1723 0 lineto
2705 0 lineto
2705 276 lineto
2539 276 lineto
1594 3328 lineto
1170 3328 lineto
221 276 lineto
55 276 lineto
55 0 lineto
834 0 lineto
834 276 lineto
511 276 lineto
733 1024 lineto
825 1280 moveto
1295 2794 lineto
1299 2794 lineto
1765 1280 lineto
825 1280 lineto
end_ol grestore 
1.000000 1.000000 1.000000 srgb
n 1.600000 11.300000 m 1.600000 11.700000 l 4.600000 11.700000 l 4.600000 11.300000 l f
0.000000 0.000000 0.000000 srgb
n 1.600000 11.300000 m 1.600000 11.700000 l 4.600000 11.700000 l 4.600000 11.300000 l cp s
0.100000 slw
[] 0 sd
1.000000 1.000000 1.000000 srgb
n 4.600000 15.550000 m 4.600000 16.950000 l 6.950000 16.950000 l 6.950000 15.550000 l f
0.000000 0.000000 0.000000 srgb
n 4.600000 15.550000 m 4.600000 16.950000 l 6.950000 16.950000 l 6.950000 15.550000 l cp s
gsave 5.038400 16.550000 translate 0.035278 -0.035278 scale
start_ol
2240 0 moveto
3072 0 lineto
3072 4356 lineto
2240 4356 lineto
2240 3072 lineto
1986 3072 1823 3072 1672 3072 curveto
788 3072 256 2469 256 1459 curveto
256 581 670 0 1296 0 curveto
1648 0 1927 170 2240 574 curveto
2240 0 lineto
2240 1104 moveto
2023 790 1839 651 1623 651 curveto
1314 651 1152 960 1152 1557 curveto
1152 2229 1369 2559 1802 2559 curveto
1899 2559 2029 2543 2240 2511 curveto
2240 1104 lineto
end_ol grestore 
gsave 5.504067 16.550000 translate 0.035278 -0.035278 scale
start_ol
2897 752 moveto
2540 619 2275 564 2010 564 curveto
1751 564 1549 625 1400 741 curveto
1215 889 1129 1060 1083 1408 curveto
2897 1408 lineto
2886 2582 2511 3072 1624 3072 curveto
760 3072 207 2497 207 1605 curveto
207 604 835 0 1872 0 curveto
2212 0 2534 52 2897 173 curveto
2897 752 lineto
1077 1856 moveto
1146 2340 1313 2554 1630 2554 curveto
1935 2554 2068 2345 2079 1856 curveto
1077 1856 lineto
end_ol grestore 
gsave 5.927400 16.550000 translate 0.035278 -0.035278 scale
start_ol
2960 703 moveto
2620 601 2332 553 2108 553 curveto
1468 553 1088 922 1088 1552 curveto
1088 2182 1405 2513 2021 2513 curveto
2246 2513 2505 2470 2937 2363 curveto
2937 2951 lineto
2591 3037 2297 3072 1969 3072 curveto
788 3072 192 2556 192 1547 curveto
192 560 810 0 1902 0 curveto
2209 0 2555 46 2960 138 curveto
2960 703 lineto
end_ol grestore 
gsave 6.350733 16.550000 translate 0.035278 -0.035278 scale
start_ol
384 0 moveto
1216 0 lineto
1216 4441 lineto
384 4441 lineto
384 0 lineto
end_ol grestore 
1.000000 1.000000 1.000000 srgb
n 4.600000 16.950000 m 4.600000 18.750000 l 6.950000 18.750000 l 6.950000 16.950000 l f
0.000000 0.000000 0.000000 srgb
n 4.600000 16.950000 m 4.600000 18.750000 l 6.950000 18.750000 l 6.950000 16.950000 l cp s
gsave 4.750000 17.700000 translate 0.035278 -0.035278 scale
start_ol
1216 221 moveto
1536 221 lineto
1536 1216 lineto
2527 1216 lineto
2527 1536 lineto
1536 1536 lineto
1536 2531 lineto
1216 2531 lineto
1216 1536 lineto
221 1536 lineto
221 1216 lineto
1216 1216 lineto
1216 221 lineto
end_ol grestore 
gsave 5.114067 17.700000 translate 0.035278 -0.035278 scale
start_ol
659 2332 moveto
991 2332 lineto
1106 3553 lineto
548 3553 lineto
659 2332 lineto
1769 2332 moveto
2101 2332 lineto
2212 3553 lineto
1659 3553 lineto
1769 2332 lineto
end_ol grestore 
gsave 5.478133 17.700000 translate 0.035278 -0.035278 scale
start_ol
134 0 moveto
986 0 lineto
986 275 lineto
760 275 lineto
1327 996 lineto
1898 275 lineto
1673 275 lineto
1673 0 lineto
2677 0 lineto
2677 275 lineto
2410 275 lineto
1668 1216 lineto
2415 2152 lineto
2677 2152 lineto
2677 2432 lineto
1862 2432 lineto
1862 2152 lineto
2097 2152 lineto
1511 1413 lineto
922 2152 lineto
1120 2152 lineto
1120 2432 lineto
134 2432 lineto
134 2152 lineto
410 2152 lineto
1157 1216 lineto
410 275 lineto
134 275 lineto
134 0 lineto
end_ol grestore 
gsave 5.842200 17.700000 translate 0.035278 -0.035278 scale
start_ol
659 2332 moveto
991 2332 lineto
1106 3553 lineto
548 3553 lineto
659 2332 lineto
1769 2332 moveto
2101 2332 lineto
2212 3553 lineto
1659 3553 lineto
1769 2332 lineto
end_ol grestore 
gsave 4.750000 18.500000 translate 0.035278 -0.035278 scale
start_ol
1216 221 moveto
1536 221 lineto
1536 1216 lineto
2527 1216 lineto
2527 1536 lineto
1536 1536 lineto
1536 2531 lineto
1216 2531 lineto
1216 1536 lineto
221 1536 lineto
221 1216 lineto
1216 1216 lineto
1216 221 lineto
end_ol grestore 
gsave 5.114067 18.500000 translate 0.035278 -0.035278 scale
start_ol
2330 505 moveto
2058 382 1869 332 1703 332 curveto
1418 332 1344 455 1344 922 curveto
1344 2112 lineto
2302 2112 lineto
2302 2368 lineto
1344 2368 lineto
1344 2976 lineto
896 2976 lineto
896 2368 lineto
269 2368 lineto
269 2112 lineto
896 2112 lineto
896 723 lineto
896 206 1090 0 1571 0 curveto
1840 0 2066 60 2330 194 curveto
2330 505 lineto
end_ol grestore 
gsave 5.478133 18.500000 translate 0.035278 -0.035278 scale
start_ol
1157 0 moveto
1309 0 lineto
1064 -640 lineto
617 -640 lineto
617 -896 lineto
1696 -896 lineto
1696 -640 lineto
1364 -640 lineto
1608 -27 lineto
2474 2151 lineto
2640 2151 lineto
2640 2432 lineto
1816 2432 lineto
1816 2151 lineto
2175 2151 lineto
1475 413 lineto
1470 413 lineto
770 2151 lineto
1129 2151 lineto
1129 2432 lineto
124 2432 lineto
124 2151 lineto
290 2151 lineto
1157 0 lineto
end_ol grestore 
gsave 5.842200 18.500000 translate 0.035278 -0.035278 scale
start_ol
832 -640 moveto
832 0 lineto
1064 0 1217 0 1356 0 curveto
2065 0 2496 496 2496 1313 curveto
2496 1989 2169 2432 1679 2432 curveto
1353 2432 1102 2270 832 1892 curveto
832 2432 lineto
108 2432 lineto
108 2073 lineto
384 2073 lineto
384 -640 lineto
108 -640 lineto
108 -896 lineto
1405 -896 lineto
1405 -640 lineto
832 -640 lineto
832 1577 moveto
1069 1922 1286 2073 1551 2073 curveto
1882 2073 2048 1810 2048 1289 curveto
2048 616 1830 332 1324 332 curveto
1206 332 1064 345 832 379 curveto
832 1577 lineto
end_ol grestore 
gsave 6.206267 18.500000 translate 0.035278 -0.035278 scale
start_ol
2484 1152 moveto
2484 1280 lineto
2484 2045 2147 2432 1484 2432 curveto
756 2432 276 1958 276 1246 curveto
276 497 793 0 1576 0 curveto
1889 0 2147 60 2419 194 curveto
2419 521 lineto
2120 389 1885 332 1636 332 curveto
1387 332 1193 389 1046 507 curveto
871 648 793 814 751 1152 curveto
2484 1152 lineto
756 1408 moveto
802 1895 1046 2156 1452 2156 curveto
1825 2156 2014 1938 2014 1502 curveto
2014 1408 lineto
756 1408 lineto
end_ol grestore 
0.100000 slw
[] 0 sd
1.000000 1.000000 1.000000 srgb
n 4.600000 19.800000 m 4.600000 21.200000 l 6.950000 21.200000 l 6.950000 19.800000 l f
0.000000 0.000000 0.000000 srgb
n 4.600000 19.800000 m 4.600000 21.200000 l 6.950000 21.200000 l 6.950000 19.800000 l cp s
gsave 5.038400 20.800000 translate 0.035278 -0.035278 scale
start_ol
2240 0 moveto
3072 0 lineto
3072 4356 lineto
2240 4356 lineto
2240 3072 lineto
1986 3072 1823 3072 1672 3072 curveto
788 3072 256 2469 256 1459 curveto
256 581 670 0 1296 0 curveto
1648 0 1927 170 2240 574 curveto
2240 0 lineto
2240 1104 moveto
2023 790 1839 651 1623 651 curveto
1314 651 1152 960 1152 1557 curveto
1152 2229 1369 2559 1802 2559 curveto
1899 2559 2029 2543 2240 2511 curveto
2240 1104 lineto
end_ol grestore 
gsave 5.504067 20.800000 translate 0.035278 -0.035278 scale
start_ol
2897 752 moveto
2540 619 2275 564 2010 564 curveto
1751 564 1549 625 1400 741 curveto
1215 889 1129 1060 1083 1408 curveto
2897 1408 lineto
2886 2582 2511 3072 1624 3072 curveto
760 3072 207 2497 207 1605 curveto
207 604 835 0 1872 0 curveto
2212 0 2534 52 2897 173 curveto
2897 752 lineto
1077 1856 moveto
1146 2340 1313 2554 1630 2554 curveto
1935 2554 2068 2345 2079 1856 curveto
1077 1856 lineto
end_ol grestore 
gsave 5.927400 20.800000 translate 0.035278 -0.035278 scale
start_ol
2960 703 moveto
2620 601 2332 553 2108 553 curveto
1468 553 1088 922 1088 1552 curveto
1088 2182 1405 2513 2021 2513 curveto
2246 2513 2505 2470 2937 2363 curveto
2937 2951 lineto
2591 3037 2297 3072 1969 3072 curveto
788 3072 192 2556 192 1547 curveto
192 560 810 0 1902 0 curveto
2209 0 2555 46 2960 138 curveto
2960 703 lineto
end_ol grestore 
gsave 6.350733 20.800000 translate 0.035278 -0.035278 scale
start_ol
384 0 moveto
1216 0 lineto
1216 4441 lineto
384 4441 lineto
384 0 lineto
end_ol grestore 
1.000000 1.000000 1.000000 srgb
n 4.600000 21.200000 m 4.600000 23.000000 l 6.950000 23.000000 l 6.950000 21.200000 l f
0.000000 0.000000 0.000000 srgb
n 4.600000 21.200000 m 4.600000 23.000000 l 6.950000 23.000000 l 6.950000 21.200000 l cp s
gsave 4.750000 21.950000 translate 0.035278 -0.035278 scale
start_ol
1216 221 moveto
1536 221 lineto
1536 1216 lineto
2527 1216 lineto
2527 1536 lineto
1536 1536 lineto
1536 2531 lineto
1216 2531 lineto
1216 1536 lineto
221 1536 lineto
221 1216 lineto
1216 1216 lineto
1216 221 lineto
end_ol grestore 
gsave 5.114067 21.950000 translate 0.035278 -0.035278 scale
start_ol
659 2332 moveto
991 2332 lineto
1106 3553 lineto
548 3553 lineto
659 2332 lineto
1769 2332 moveto
2101 2332 lineto
2212 3553 lineto
1659 3553 lineto
1769 2332 lineto
end_ol grestore 
gsave 5.478133 21.950000 translate 0.035278 -0.035278 scale
start_ol
1157 0 moveto
1309 0 lineto
1064 -640 lineto
617 -640 lineto
617 -896 lineto
1696 -896 lineto
1696 -640 lineto
1364 -640 lineto
1608 -27 lineto
2474 2151 lineto
2640 2151 lineto
2640 2432 lineto
1816 2432 lineto
1816 2151 lineto
2175 2151 lineto
1475 413 lineto
1470 413 lineto
770 2151 lineto
1129 2151 lineto
1129 2432 lineto
124 2432 lineto
124 2151 lineto
290 2151 lineto
1157 0 lineto
end_ol grestore 
gsave 5.842200 21.950000 translate 0.035278 -0.035278 scale
start_ol
659 2332 moveto
991 2332 lineto
1106 3553 lineto
548 3553 lineto
659 2332 lineto
1769 2332 moveto
2101 2332 lineto
2212 3553 lineto
1659 3553 lineto
1769 2332 lineto
end_ol grestore 
gsave 4.750000 22.750000 translate 0.035278 -0.035278 scale
start_ol
1216 221 moveto
1536 221 lineto
1536 1216 lineto
2527 1216 lineto
2527 1536 lineto
1536 1536 lineto
1536 2531 lineto
1216 2531 lineto
1216 1536 lineto
221 1536 lineto
221 1216 lineto
1216 1216 lineto
1216 221 lineto
end_ol grestore 
gsave 5.114067 22.750000 translate 0.035278 -0.035278 scale
start_ol
2330 505 moveto
2058 382 1869 332 1703 332 curveto
1418 332 1344 455 1344 922 curveto
1344 2112 lineto
2302 2112 lineto
2302 2368 lineto
1344 2368 lineto
1344 2976 lineto
896 2976 lineto
896 2368 lineto
269 2368 lineto
269 2112 lineto
896 2112 lineto
896 723 lineto
896 206 1090 0 1571 0 curveto
1840 0 2066 60 2330 194 curveto
2330 505 lineto
end_ol grestore 
gsave 5.478133 22.750000 translate 0.035278 -0.035278 scale
start_ol
1157 0 moveto
1309 0 lineto
1064 -640 lineto
617 -640 lineto
617 -896 lineto
1696 -896 lineto
1696 -640 lineto
1364 -640 lineto
1608 -27 lineto
2474 2151 lineto
2640 2151 lineto
2640 2432 lineto
1816 2432 lineto
1816 2151 lineto
2175 2151 lineto
1475 413 lineto
1470 413 lineto
770 2151 lineto
1129 2151 lineto
1129 2432 lineto
124 2432 lineto
124 2151 lineto
290 2151 lineto
1157 0 lineto
end_ol grestore 
gsave 5.842200 22.750000 translate 0.035278 -0.035278 scale
start_ol
832 -640 moveto
832 0 lineto
1064 0 1217 0 1356 0 curveto
2065 0 2496 496 2496 1313 curveto
2496 1989 2169 2432 1679 2432 curveto
1353 2432 1102 2270 832 1892 curveto
832 2432 lineto
108 2432 lineto
108 2073 lineto
384 2073 lineto
384 -640 lineto
108 -640 lineto
108 -896 lineto
1405 -896 lineto
1405 -640 lineto
832 -640 lineto
832 1577 moveto
1069 1922 1286 2073 1551 2073 curveto
1882 2073 2048 1810 2048 1289 curveto
2048 616 1830 332 1324 332 curveto
1206 332 1064 345 832 379 curveto
832 1577 lineto
end_ol grestore 
gsave 6.206267 22.750000 translate 0.035278 -0.035278 scale
start_ol
2484 1152 moveto
2484 1280 lineto
2484 2045 2147 2432 1484 2432 curveto
756 2432 276 1958 276 1246 curveto
276 497 793 0 1576 0 curveto
1889 0 2147 60 2419 194 curveto
2419 521 lineto
2120 389 1885 332 1636 332 curveto
1387 332 1193 389 1046 507 curveto
871 648 793 814 751 1152 curveto
2484 1152 lineto
756 1408 moveto
802 1895 1046 2156 1452 2156 curveto
1825 2156 2014 1938 2014 1502 curveto
2014 1408 lineto
756 1408 lineto
end_ol grestore 
0.100000 slw
[] 0 sd
1.000000 1.000000 1.000000 srgb
n 14.600000 6.700000 m 14.600000 8.100000 l 17.300000 8.100000 l 17.300000 6.700000 l f
0.000000 0.000000 0.000000 srgb
n 14.600000 6.700000 m 14.600000 8.100000 l 17.300000 8.100000 l 17.300000 6.700000 l cp s
gsave 15.425067 7.700000 translate 0.035278 -0.035278 scale
start_ol
1515 0 moveto
2379 0 lineto
3773 4160 lineto
3133 4160 lineto
2085 1053 lineto
996 4160 lineto
69 4160 lineto
1515 0 lineto
end_ol grestore 
gsave 15.933067 7.700000 translate 0.035278 -0.035278 scale
start_ol
512 0 moveto
1344 0 lineto
1344 1728 lineto
1997 1728 lineto
3118 0 lineto
4073 0 lineto
2743 1972 lineto
3289 2245 3520 2591 3520 3143 curveto
3520 3819 3112 4160 2301 4160 curveto
512 4160 lineto
512 0 lineto
1344 2304 moveto
1344 3590 lineto
1880 3590 lineto
2428 3590 2688 3410 2688 3028 curveto
2688 2557 2373 2304 1781 2304 curveto
1344 2304 lineto
end_ol grestore 
1.000000 1.000000 1.000000 srgb
n 14.600000 8.100000 m 14.600000 9.100000 l 17.300000 9.100000 l 17.300000 8.100000 l f
0.000000 0.000000 0.000000 srgb
n 14.600000 8.100000 m 14.600000 9.100000 l 17.300000 9.100000 l 17.300000 8.100000 l cp s
gsave 14.750000 8.850000 translate 0.035278 -0.035278 scale
start_ol
1216 221 moveto
1536 221 lineto
1536 1216 lineto
2527 1216 lineto
2527 1536 lineto
1536 1536 lineto
1536 2531 lineto
1216 2531 lineto
1216 1536 lineto
221 1536 lineto
221 1216 lineto
1216 1216 lineto
1216 221 lineto
end_ol grestore 
gsave 15.114067 8.850000 translate 0.035278 -0.035278 scale
start_ol
2330 505 moveto
2058 382 1869 332 1703 332 curveto
1418 332 1344 455 1344 922 curveto
1344 2112 lineto
2302 2112 lineto
2302 2368 lineto
1344 2368 lineto
1344 2976 lineto
896 2976 lineto
896 2368 lineto
269 2368 lineto
269 2112 lineto
896 2112 lineto
896 723 lineto
896 206 1090 0 1571 0 curveto
1840 0 2066 60 2330 194 curveto
2330 505 lineto
end_ol grestore 
gsave 15.478133 8.850000 translate 0.035278 -0.035278 scale
start_ol
1157 0 moveto
1309 0 lineto
1064 -640 lineto
617 -640 lineto
617 -896 lineto
1696 -896 lineto
1696 -640 lineto
1364 -640 lineto
1608 -27 lineto
2474 2151 lineto
2640 2151 lineto
2640 2432 lineto
1816 2432 lineto
1816 2151 lineto
2175 2151 lineto
1475 413 lineto
1470 413 lineto
770 2151 lineto
1129 2151 lineto
1129 2432 lineto
124 2432 lineto
124 2151 lineto
290 2151 lineto
1157 0 lineto
end_ol grestore 
gsave 15.842200 8.850000 translate 0.035278 -0.035278 scale
start_ol
832 -640 moveto
832 0 lineto
1064 0 1217 0 1356 0 curveto
2065 0 2496 496 2496 1313 curveto
2496 1989 2169 2432 1679 2432 curveto
1353 2432 1102 2270 832 1892 curveto
832 2432 lineto
108 2432 lineto
108 2073 lineto
384 2073 lineto
384 -640 lineto
108 -640 lineto
108 -896 lineto
1405 -896 lineto
1405 -640 lineto
832 -640 lineto
832 1577 moveto
1069 1922 1286 2073 1551 2073 curveto
1882 2073 2048 1810 2048 1289 curveto
2048 616 1830 332 1324 332 curveto
1206 332 1064 345 832 379 curveto
832 1577 lineto
end_ol grestore 
gsave 16.206267 8.850000 translate 0.035278 -0.035278 scale
start_ol
2484 1152 moveto
2484 1280 lineto
2484 2045 2147 2432 1484 2432 curveto
756 2432 276 1958 276 1246 curveto
276 497 793 0 1576 0 curveto
1889 0 2147 60 2419 194 curveto
2419 521 lineto
2120 389 1885 332 1636 332 curveto
1387 332 1193 389 1046 507 curveto
871 648 793 814 751 1152 curveto
2484 1152 lineto
756 1408 moveto
802 1895 1046 2156 1452 2156 curveto
1825 2156 2014 1938 2014 1502 curveto
2014 1408 lineto
756 1408 lineto
end_ol grestore 
gsave 16.570333 8.850000 translate 0.035278 -0.035278 scale
start_ol
733 1024 moveto
1852 1024 lineto
2074 276 lineto
1723 276 lineto
1723 0 lineto
2705 0 lineto
2705 276 lineto
2539 276 lineto
1594 3328 lineto
1170 3328 lineto
221 276 lineto
55 276 lineto
55 0 lineto
834 0 lineto
834 276 lineto
511 276 lineto
733 1024 lineto
825 1280 moveto
1295 2794 lineto
1299 2794 lineto
1765 1280 lineto
825 1280 lineto
end_ol grestore 
0.100000 slw
[] 0 sd
1.000000 1.000000 1.000000 srgb
n 18.390000 6.730000 m 18.390000 8.130000 l 21.090000 8.130000 l 21.090000 6.730000 l f
0.000000 0.000000 0.000000 srgb
n 18.390000 6.730000 m 18.390000 8.130000 l 21.090000 8.130000 l 21.090000 6.730000 l cp s
gsave 19.215067 7.730000 translate 0.035278 -0.035278 scale
start_ol
1515 0 moveto
2379 0 lineto
3773 4160 lineto
3133 4160 lineto
2085 1053 lineto
996 4160 lineto
69 4160 lineto
1515 0 lineto
end_ol grestore 
gsave 19.723067 7.730000 translate 0.035278 -0.035278 scale
start_ol
512 0 moveto
1344 0 lineto
1344 1728 lineto
1997 1728 lineto
3118 0 lineto
4073 0 lineto
2743 1972 lineto
3289 2245 3520 2591 3520 3143 curveto
3520 3819 3112 4160 2301 4160 curveto
512 4160 lineto
512 0 lineto
1344 2304 moveto
1344 3590 lineto
1880 3590 lineto
2428 3590 2688 3410 2688 3028 curveto
2688 2557 2373 2304 1781 2304 curveto
1344 2304 lineto
end_ol grestore 
1.000000 1.000000 1.000000 srgb
n 18.390000 8.130000 m 18.390000 9.130000 l 21.090000 9.130000 l 21.090000 8.130000 l f
0.000000 0.000000 0.000000 srgb
n 18.390000 8.130000 m 18.390000 9.130000 l 21.090000 9.130000 l 21.090000 8.130000 l cp s
gsave 18.540000 8.880000 translate 0.035278 -0.035278 scale
start_ol
1216 221 moveto
1536 221 lineto
1536 1216 lineto
2527 1216 lineto
2527 1536 lineto
1536 1536 lineto
1536 2531 lineto
1216 2531 lineto
1216 1536 lineto
221 1536 lineto
221 1216 lineto
1216 1216 lineto
1216 221 lineto
end_ol grestore 
gsave 18.904067 8.880000 translate 0.035278 -0.035278 scale
start_ol
2330 505 moveto
2058 382 1869 332 1703 332 curveto
1418 332 1344 455 1344 922 curveto
1344 2112 lineto
2302 2112 lineto
2302 2368 lineto
1344 2368 lineto
1344 2976 lineto
896 2976 lineto
896 2368 lineto
269 2368 lineto
269 2112 lineto
896 2112 lineto
896 723 lineto
896 206 1090 0 1571 0 curveto
1840 0 2066 60 2330 194 curveto
2330 505 lineto
end_ol grestore 
gsave 19.268133 8.880000 translate 0.035278 -0.035278 scale
start_ol
1157 0 moveto
1309 0 lineto
1064 -640 lineto
617 -640 lineto
617 -896 lineto
1696 -896 lineto
1696 -640 lineto
1364 -640 lineto
1608 -27 lineto
2474 2151 lineto
2640 2151 lineto
2640 2432 lineto
1816 2432 lineto
1816 2151 lineto
2175 2151 lineto
1475 413 lineto
1470 413 lineto
770 2151 lineto
1129 2151 lineto
1129 2432 lineto
124 2432 lineto
124 2151 lineto
290 2151 lineto
1157 0 lineto
end_ol grestore 
gsave 19.632200 8.880000 translate 0.035278 -0.035278 scale
start_ol
832 -640 moveto
832 0 lineto
1064 0 1217 0 1356 0 curveto
2065 0 2496 496 2496 1313 curveto
2496 1989 2169 2432 1679 2432 curveto
1353 2432 1102 2270 832 1892 curveto
832 2432 lineto
108 2432 lineto
108 2073 lineto
384 2073 lineto
384 -640 lineto
108 -640 lineto
108 -896 lineto
1405 -896 lineto
1405 -640 lineto
832 -640 lineto
832 1577 moveto
1069 1922 1286 2073 1551 2073 curveto
1882 2073 2048 1810 2048 1289 curveto
2048 616 1830 332 1324 332 curveto
1206 332 1064 345 832 379 curveto
832 1577 lineto
end_ol grestore 
gsave 19.996267 8.880000 translate 0.035278 -0.035278 scale
start_ol
2484 1152 moveto
2484 1280 lineto
2484 2045 2147 2432 1484 2432 curveto
756 2432 276 1958 276 1246 curveto
276 497 793 0 1576 0 curveto
1889 0 2147 60 2419 194 curveto
2419 521 lineto
2120 389 1885 332 1636 332 curveto
1387 332 1193 389 1046 507 curveto
871 648 793 814 751 1152 curveto
2484 1152 lineto
756 1408 moveto
802 1895 1046 2156 1452 2156 curveto
1825 2156 2014 1938 2014 1502 curveto
2014 1408 lineto
756 1408 lineto
end_ol grestore 
gsave 20.360333 8.880000 translate 0.035278 -0.035278 scale
start_ol
733 1024 moveto
1852 1024 lineto
2074 276 lineto
1723 276 lineto
1723 0 lineto
2705 0 lineto
2705 276 lineto
2539 276 lineto
1594 3328 lineto
1170 3328 lineto
221 276 lineto
55 276 lineto
55 0 lineto
834 0 lineto
834 276 lineto
511 276 lineto
733 1024 lineto
825 1280 moveto
1295 2794 lineto
1299 2794 lineto
1765 1280 lineto
825 1280 lineto
end_ol grestore 
0.100000 slw
[] 0 sd
1.000000 1.000000 1.000000 srgb
n 23.100000 6.300000 m 23.100000 7.700000 l 25.450000 7.700000 l 25.450000 6.300000 l f
0.000000 0.000000 0.000000 srgb
n 23.100000 6.300000 m 23.100000 7.700000 l 25.450000 7.700000 l 25.450000 6.300000 l cp s
gsave 23.551100 7.300000 translate 0.035278 -0.035278 scale
start_ol
294 896 moveto
3070 896 lineto
3070 1408 lineto
294 1408 lineto
294 896 lineto
294 1984 moveto
3070 1984 lineto
3070 2496 lineto
294 2496 lineto
294 1984 lineto
end_ol grestore 
gsave 23.999833 7.300000 translate 0.035278 -0.035278 scale
start_ol
256 144 moveto
698 81 lineto
1082 23 1318 0 1599 0 curveto
2953 0 3584 380 3584 1189 curveto
3584 1776 3273 2080 2356 2401 curveto
1878 2564 lineto
1555 2683 lineto
1180 2819 1088 2906 1088 3134 curveto
1088 3471 1325 3590 1983 3590 curveto
2422 3590 2798 3531 3300 3375 curveto
3300 4016 lineto
2840 4114 2421 4160 1961 4160 curveto
815 4160 256 3796 256 3058 curveto
256 2487 526 2232 1483 1885 curveto
1942 1722 lineto
2327 1586 lineto
2550 1505 2688 1325 2688 1108 curveto
2688 755 2371 576 1737 576 curveto
1276 576 850 651 256 834 curveto
256 144 lineto
end_ol grestore 
gsave 24.507833 7.300000 translate 0.035278 -0.035278 scale
start_ol
512 0 moveto
3665 0 lineto
3665 593 lineto
1344 593 lineto
1344 1856 lineto
3222 1856 lineto
3222 2432 lineto
1344 2432 lineto
1344 3590 lineto
3533 3590 lineto
3533 4160 lineto
512 4160 lineto
512 0 lineto
end_ol grestore 
1.000000 1.000000 1.000000 srgb
n 23.100000 7.700000 m 23.100000 9.500000 l 25.450000 9.500000 l 25.450000 7.700000 l f
0.000000 0.000000 0.000000 srgb
n 23.100000 7.700000 m 23.100000 9.500000 l 25.450000 9.500000 l 25.450000 7.700000 l cp s
gsave 23.250000 8.450000 translate 0.035278 -0.035278 scale
start_ol
1216 221 moveto
1536 221 lineto
1536 1216 lineto
2527 1216 lineto
2527 1536 lineto
1536 1536 lineto
1536 2531 lineto
1216 2531 lineto
1216 1536 lineto
221 1536 lineto
221 1216 lineto
1216 1216 lineto
1216 221 lineto
end_ol grestore 
gsave 23.614067 8.450000 translate 0.035278 -0.035278 scale
start_ol
1920 3264 moveto
1920 2377 lineto
1702 2414 1527 2432 1395 2432 curveto
683 2432 256 1940 256 1119 curveto
256 448 590 0 1090 0 curveto
1410 0 1656 162 1920 541 curveto
1920 0 lineto
2644 0 lineto
2644 364 lineto
2368 364 lineto
2368 3520 lineto
1352 3520 lineto
1352 3264 lineto
1920 3264 lineto
1920 855 moveto
1683 510 1466 364 1201 364 curveto
870 364 704 622 704 1148 curveto
704 1816 922 2100 1428 2100 curveto
1541 2100 1707 2083 1920 2048 curveto
1920 855 lineto
end_ol grestore 
gsave 23.978133 8.450000 translate 0.035278 -0.035278 scale
start_ol
2484 1152 moveto
2484 1280 lineto
2484 2045 2147 2432 1484 2432 curveto
756 2432 276 1958 276 1246 curveto
276 497 793 0 1576 0 curveto
1889 0 2147 60 2419 194 curveto
2419 521 lineto
2120 389 1885 332 1636 332 curveto
1387 332 1193 389 1046 507 curveto
871 648 793 814 751 1152 curveto
2484 1152 lineto
756 1408 moveto
802 1895 1046 2156 1452 2156 curveto
1825 2156 2014 1938 2014 1502 curveto
2014 1408 lineto
756 1408 lineto
end_ol grestore 
gsave 24.342200 8.450000 translate 0.035278 -0.035278 scale
start_ol
384 193 moveto
732 60 1039 0 1387 0 curveto
2043 0 2432 266 2432 720 curveto
2432 1039 2232 1222 1737 1344 curveto
1287 1458 lineto
977 1536 832 1650 832 1811 curveto
832 2034 1021 2156 1368 2156 curveto
1584 2156 1759 2121 1926 2043 curveto
1980 1658 lineto
2259 1658 lineto
2259 2271 lineto
1977 2381 1709 2432 1368 2432 curveto
715 2432 384 2205 384 1756 curveto
384 1428 600 1232 1115 1106 curveto
1575 988 lineto
1878 914 1984 822 1984 639 curveto
1984 403 1803 281 1458 281 curveto
1246 281 1033 324 720 437 curveto
662 827 lineto
384 827 lineto
384 193 lineto
end_ol grestore 
gsave 24.706267 8.450000 translate 0.035278 -0.035278 scale
start_ol
2330 505 moveto
2058 382 1869 332 1703 332 curveto
1418 332 1344 455 1344 922 curveto
1344 2112 lineto
2302 2112 lineto
2302 2368 lineto
1344 2368 lineto
1344 2976 lineto
896 2976 lineto
896 2368 lineto
269 2368 lineto
269 2112 lineto
896 2112 lineto
896 723 lineto
896 206 1090 0 1571 0 curveto
1840 0 2066 60 2330 194 curveto
2330 505 lineto
end_ol grestore 
gsave 23.250000 9.250000 translate 0.035278 -0.035278 scale
start_ol
1216 221 moveto
1536 221 lineto
1536 1216 lineto
2527 1216 lineto
2527 1536 lineto
1536 1536 lineto
1536 2531 lineto
1216 2531 lineto
1216 1536 lineto
221 1536 lineto
221 1216 lineto
1216 1216 lineto
1216 221 lineto
end_ol grestore 
gsave 23.614067 9.250000 translate 0.035278 -0.035278 scale
start_ol
384 193 moveto
732 60 1039 0 1387 0 curveto
2043 0 2432 266 2432 720 curveto
2432 1039 2232 1222 1737 1344 curveto
1287 1458 lineto
977 1536 832 1650 832 1811 curveto
832 2034 1021 2156 1368 2156 curveto
1584 2156 1759 2121 1926 2043 curveto
1980 1658 lineto
2259 1658 lineto
2259 2271 lineto
1977 2381 1709 2432 1368 2432 curveto
715 2432 384 2205 384 1756 curveto
384 1428 600 1232 1115 1106 curveto
1575 988 lineto
1878 914 1984 822 1984 639 curveto
1984 403 1803 281 1458 281 curveto
1246 281 1033 324 720 437 curveto
662 827 lineto
384 827 lineto
384 193 lineto
end_ol grestore 
gsave 23.978133 9.250000 translate 0.035278 -0.035278 scale
start_ol
1216 1529 moveto
1419 1889 1635 2045 1925 2045 curveto
2022 2045 2100 2023 2188 1965 curveto
2234 1556 lineto
2515 1556 lineto
2515 2292 lineto
2345 2387 2183 2432 1999 2432 curveto
1704 2432 1483 2281 1216 1907 curveto
1216 2432 lineto
187 2432 lineto
187 2045 lineto
768 2045 lineto
768 276 lineto
187 276 lineto
187 0 lineto
2050 0 lineto
2050 276 lineto
1216 276 lineto
1216 1529 lineto
end_ol grestore 
gsave 24.342200 9.250000 translate 0.035278 -0.035278 scale
start_ol
2275 496 moveto
2012 379 1810 332 1598 332 curveto
1077 332 768 669 768 1235 curveto
768 1797 1044 2156 1482 2156 curveto
1597 2156 1717 2130 1897 2061 curveto
1966 1572 lineto
2247 1572 lineto
2247 2308 lineto
2003 2395 1773 2432 1510 2432 curveto
760 2432 320 1993 320 1242 curveto
320 478 783 0 1527 0 curveto
1817 0 2048 51 2275 157 curveto
2275 496 lineto
end_ol grestore 
0.100000 slw
[] 0 sd
1.000000 1.000000 1.000000 srgb
n 25.400000 10.600000 m 25.400000 12.000000 l 28.350000 12.000000 l 28.350000 10.600000 l f
0.000000 0.000000 0.000000 srgb
n 25.400000 10.600000 m 25.400000 12.000000 l 28.350000 12.000000 l 28.350000 10.600000 l cp s
gsave 25.672733 11.600000 translate 0.035278 -0.035278 scale
start_ol
448 0 moveto
1280 0 lineto
1280 2554 lineto
1798 2554 lineto
1798 3072 lineto
1280 3072 lineto
1280 3323 lineto
1280 3757 1401 3968 1643 3968 curveto
1752 3968 1885 3940 2046 3877 curveto
2046 4406 lineto
1856 4457 1700 4480 1533 4480 curveto
815 4480 448 4081 448 3295 curveto
448 3072 lineto
125 3072 lineto
125 2554 lineto
448 2554 lineto
448 0 lineto
end_ol grestore 
gsave 25.926733 11.600000 translate 0.035278 -0.035278 scale
start_ol
2240 0 moveto
3072 0 lineto
3072 3072 lineto
2240 3072 lineto
2240 1124 lineto
1966 796 1759 657 1535 657 curveto
1294 657 1216 785 1216 1163 curveto
1216 3072 lineto
384 3072 lineto
384 963 lineto
384 325 661 0 1199 0 curveto
1589 0 1895 170 2240 573 curveto
2240 0 lineto
end_ol grestore 
gsave 26.392400 11.600000 translate 0.035278 -0.035278 scale
start_ol
384 0 moveto
1216 0 lineto
1216 1948 lineto
1501 2270 1727 2415 1965 2415 curveto
2221 2415 2304 2287 2304 1909 curveto
2304 0 lineto
3136 0 lineto
3136 2125 lineto
3136 2752 2855 3072 2304 3072 curveto
1900 3072 1579 2899 1216 2490 curveto
1216 3072 lineto
384 3072 lineto
384 0 lineto
end_ol grestore 
gsave 26.858067 11.600000 translate 0.035278 -0.035278 scale
start_ol
2960 703 moveto
2620 601 2332 553 2108 553 curveto
1468 553 1088 922 1088 1552 curveto
1088 2182 1405 2513 2021 2513 curveto
2246 2513 2505 2470 2937 2363 curveto
2937 2951 lineto
2591 3037 2297 3072 1969 3072 curveto
788 3072 192 2556 192 1547 curveto
192 560 810 0 1902 0 curveto
2209 0 2555 46 2960 138 curveto
2960 703 lineto
end_ol grestore 
gsave 27.281400 11.600000 translate 0.035278 -0.035278 scale
start_ol
3034 564 moveto
2999 564 2947 564 2919 564 curveto
2763 564 2688 667 2688 869 curveto
2688 2142 lineto
2688 2760 2299 3072 1532 3072 curveto
1162 3072 832 3003 473 2859 curveto
473 2302 lineto
822 2479 1097 2559 1378 2559 curveto
1699 2559 1856 2415 1856 2115 curveto
1856 1853 lineto
1635 1853 lineto
675 1853 192 1520 192 853 curveto
192 344 555 0 1084 0 curveto
1407 0 1635 121 1856 425 curveto
1892 425 lineto
2010 134 2217 0 2566 0 curveto
2714 0 2844 24 3051 79 curveto
3034 564 lineto
1856 826 moveto
1726 644 1591 564 1413 564 curveto
1186 564 1024 724 1024 944 curveto
1024 1254 1240 1409 1672 1409 curveto
1856 1409 lineto
1856 826 lineto
end_ol grestore 
gsave 27.704733 11.600000 translate 0.035278 -0.035278 scale
start_ol
384 0 moveto
1216 0 lineto
1216 4441 lineto
384 4441 lineto
384 0 lineto
end_ol grestore 
gsave 27.916400 11.600000 translate 0.035278 -0.035278 scale
start_ol
384 0 moveto
1216 0 lineto
1216 4441 lineto
384 4441 lineto
384 0 lineto
end_ol grestore 
1.000000 1.000000 1.000000 srgb
n 25.400000 12.000000 m 25.400000 14.600000 l 28.350000 14.600000 l 28.350000 12.000000 l f
0.000000 0.000000 0.000000 srgb
n 25.400000 12.000000 m 25.400000 14.600000 l 28.350000 14.600000 l 28.350000 12.000000 l cp s
gsave 25.550000 12.750000 translate 0.035278 -0.035278 scale
start_ol
1216 221 moveto
1536 221 lineto
1536 1216 lineto
2527 1216 lineto
2527 1536 lineto
1536 1536 lineto
1536 2531 lineto
1216 2531 lineto
1216 1536 lineto
221 1536 lineto
221 1216 lineto
1216 1216 lineto
1216 221 lineto
end_ol grestore 
gsave 25.914067 12.750000 translate 0.035278 -0.035278 scale
start_ol
1920 3264 moveto
1920 2377 lineto
1702 2414 1527 2432 1395 2432 curveto
683 2432 256 1940 256 1119 curveto
256 448 590 0 1090 0 curveto
1410 0 1656 162 1920 541 curveto
1920 0 lineto
2644 0 lineto
2644 364 lineto
2368 364 lineto
2368 3520 lineto
1352 3520 lineto
1352 3264 lineto
1920 3264 lineto
1920 855 moveto
1683 510 1466 364 1201 364 curveto
870 364 704 622 704 1148 curveto
704 1816 922 2100 1428 2100 curveto
1541 2100 1707 2083 1920 2048 curveto
1920 855 lineto
end_ol grestore 
gsave 26.278133 12.750000 translate 0.035278 -0.035278 scale
start_ol
2484 1152 moveto
2484 1280 lineto
2484 2045 2147 2432 1484 2432 curveto
756 2432 276 1958 276 1246 curveto
276 497 793 0 1576 0 curveto
1889 0 2147 60 2419 194 curveto
2419 521 lineto
2120 389 1885 332 1636 332 curveto
1387 332 1193 389 1046 507 curveto
871 648 793 814 751 1152 curveto
2484 1152 lineto
756 1408 moveto
802 1895 1046 2156 1452 2156 curveto
1825 2156 2014 1938 2014 1502 curveto
2014 1408 lineto
756 1408 lineto
end_ol grestore 
gsave 26.642200 12.750000 translate 0.035278 -0.035278 scale
start_ol
2275 496 moveto
2012 379 1810 332 1598 332 curveto
1077 332 768 669 768 1235 curveto
768 1797 1044 2156 1482 2156 curveto
1597 2156 1717 2130 1897 2061 curveto
1966 1572 lineto
2247 1572 lineto
2247 2308 lineto
2003 2395 1773 2432 1510 2432 curveto
760 2432 320 1993 320 1242 curveto
320 478 783 0 1527 0 curveto
1817 0 2048 51 2275 157 curveto
2275 496 lineto
end_ol grestore 
gsave 27.006267 12.750000 translate 0.035278 -0.035278 scale
start_ol
340 0 moveto
2498 0 lineto
2498 276 lineto
1664 276 lineto
1664 3520 lineto
340 3520 lineto
340 3264 lineto
1216 3264 lineto
1216 276 lineto
340 276 lineto
340 0 lineto
end_ol grestore 
gsave 25.550000 13.550000 translate 0.035278 -0.035278 scale
start_ol
1216 221 moveto
1536 221 lineto
1536 1216 lineto
2527 1216 lineto
2527 1536 lineto
1536 1536 lineto
1536 2531 lineto
1216 2531 lineto
1216 1536 lineto
221 1536 lineto
221 1216 lineto
1216 1216 lineto
1216 221 lineto
end_ol grestore 
gsave 25.914067 13.550000 translate 0.035278 -0.035278 scale
start_ol
2330 505 moveto
2058 382 1869 332 1703 332 curveto
1418 332 1344 455 1344 922 curveto
1344 2112 lineto
2302 2112 lineto
2302 2368 lineto
1344 2368 lineto
1344 2976 lineto
896 2976 lineto
896 2368 lineto
269 2368 lineto
269 2112 lineto
896 2112 lineto
896 723 lineto
896 206 1090 0 1571 0 curveto
1840 0 2066 60 2330 194 curveto
2330 505 lineto
end_ol grestore 
gsave 26.278133 13.550000 translate 0.035278 -0.035278 scale
start_ol
1157 0 moveto
1309 0 lineto
1064 -640 lineto
617 -640 lineto
617 -896 lineto
1696 -896 lineto
1696 -640 lineto
1364 -640 lineto
1608 -27 lineto
2474 2151 lineto
2640 2151 lineto
2640 2432 lineto
1816 2432 lineto
1816 2151 lineto
2175 2151 lineto
1475 413 lineto
1470 413 lineto
770 2151 lineto
1129 2151 lineto
1129 2432 lineto
124 2432 lineto
124 2151 lineto
290 2151 lineto
1157 0 lineto
end_ol grestore 
gsave 26.642200 13.550000 translate 0.035278 -0.035278 scale
start_ol
832 -640 moveto
832 0 lineto
1064 0 1217 0 1356 0 curveto
2065 0 2496 496 2496 1313 curveto
2496 1989 2169 2432 1679 2432 curveto
1353 2432 1102 2270 832 1892 curveto
832 2432 lineto
108 2432 lineto
108 2073 lineto
384 2073 lineto
384 -640 lineto
108 -640 lineto
108 -896 lineto
1405 -896 lineto
1405 -640 lineto
832 -640 lineto
832 1577 moveto
1069 1922 1286 2073 1551 2073 curveto
1882 2073 2048 1810 2048 1289 curveto
2048 616 1830 332 1324 332 curveto
1206 332 1064 345 832 379 curveto
832 1577 lineto
end_ol grestore 
gsave 27.006267 13.550000 translate 0.035278 -0.035278 scale
start_ol
2484 1152 moveto
2484 1280 lineto
2484 2045 2147 2432 1484 2432 curveto
756 2432 276 1958 276 1246 curveto
276 497 793 0 1576 0 curveto
1889 0 2147 60 2419 194 curveto
2419 521 lineto
2120 389 1885 332 1636 332 curveto
1387 332 1193 389 1046 507 curveto
871 648 793 814 751 1152 curveto
2484 1152 lineto
756 1408 moveto
802 1895 1046 2156 1452 2156 curveto
1825 2156 2014 1938 2014 1502 curveto
2014 1408 lineto
756 1408 lineto
end_ol grestore 
gsave 25.550000 14.350000 translate 0.035278 -0.035278 scale
start_ol
1216 221 moveto
1536 221 lineto
1536 1216 lineto
2527 1216 lineto
2527 1536 lineto
1536 1536 lineto
1536 2531 lineto
1216 2531 lineto
1216 1536 lineto
221 1536 lineto
221 1216 lineto
1216 1216 lineto
1216 221 lineto
end_ol grestore 
gsave 25.914067 14.350000 translate 0.035278 -0.035278 scale
start_ol
1903 0 moveto
2608 0 lineto
2608 332 lineto
2304 332 lineto
2304 1801 lineto
2304 2263 2099 2432 1534 2432 curveto
1167 2432 845 2368 487 2225 curveto
487 1762 lineto
750 1762 lineto
805 2030 lineto
1057 2116 1225 2151 1389 2151 curveto
1697 2151 1856 2034 1856 1805 curveto
1856 1451 lineto
1668 1451 lineto
723 1451 320 1219 320 679 curveto
320 263 609 0 1072 0 curveto
1352 0 1581 96 1856 321 curveto
1903 0 lineto
1856 660 moveto
1627 431 1431 332 1193 332 curveto
913 332 768 462 768 708 curveto
768 1058 1039 1192 1735 1192 curveto
1856 1192 lineto
1856 660 lineto
end_ol grestore 
gsave 26.278133 14.350000 translate 0.035278 -0.035278 scale
start_ol
1216 1529 moveto
1419 1889 1635 2045 1925 2045 curveto
2022 2045 2100 2023 2188 1965 curveto
2234 1556 lineto
2515 1556 lineto
2515 2292 lineto
2345 2387 2183 2432 1999 2432 curveto
1704 2432 1483 2281 1216 1907 curveto
1216 2432 lineto
187 2432 lineto
187 2045 lineto
768 2045 lineto
768 276 lineto
187 276 lineto
187 0 lineto
2050 0 lineto
2050 276 lineto
1216 276 lineto
1216 1529 lineto
end_ol grestore 
gsave 26.642200 14.350000 translate 0.035278 -0.035278 scale
start_ol
476 -56 moveto
290 -178 192 -319 192 -464 curveto
192 -791 540 -960 1217 -960 curveto
2060 -960 2496 -703 2496 -200 curveto
2496 155 2262 332 1803 332 curveto
998 332 lineto
756 332 640 370 640 445 curveto
640 503 687 562 793 637 curveto
893 704 lineto
1012 704 1105 704 1198 704 curveto
1834 704 2304 1072 2304 1568 curveto
2304 1775 2229 1945 2055 2156 curveto
2492 2156 lineto
2620 2432 lineto
1693 2432 lineto
1535 2432 1393 2432 1214 2432 curveto
597 2432 192 2084 192 1555 curveto
192 1225 354 1007 726 813 curveto
647 742 lineto
467 588 384 456 384 328 curveto
384 209 450 116 602 28 curveto
476 -56 lineto
798 0 moveto
1604 0 lineto
1900 0 2048 -93 2048 -284 curveto
2048 -538 1747 -704 1275 -704 curveto
858 -704 640 -596 640 -391 curveto
640 -274 675 -171 747 -73 curveto
798 0 lineto
1251 2156 moveto
1606 2156 1856 1905 1856 1547 curveto
1856 1202 1606 960 1240 960 curveto
885 960 640 1193 640 1533 curveto
640 1892 895 2156 1251 2156 curveto
end_ol grestore 
gsave 27.006267 14.350000 translate 0.035278 -0.035278 scale
start_ol
384 193 moveto
732 60 1039 0 1387 0 curveto
2043 0 2432 266 2432 720 curveto
2432 1039 2232 1222 1737 1344 curveto
1287 1458 lineto
977 1536 832 1650 832 1811 curveto
832 2034 1021 2156 1368 2156 curveto
1584 2156 1759 2121 1926 2043 curveto
1980 1658 lineto
2259 1658 lineto
2259 2271 lineto
1977 2381 1709 2432 1368 2432 curveto
715 2432 384 2205 384 1756 curveto
384 1428 600 1232 1115 1106 curveto
1575 988 lineto
1878 914 1984 822 1984 639 curveto
1984 403 1803 281 1458 281 curveto
1246 281 1033 324 720 437 curveto
662 827 lineto
384 827 lineto
384 193 lineto
end_ol grestore 
1.000000 1.000000 1.000000 srgb
n 25.400000 14.600000 m 25.400000 15.000000 l 28.350000 15.000000 l 28.350000 14.600000 l f
0.000000 0.000000 0.000000 srgb
n 25.400000 14.600000 m 25.400000 15.000000 l 28.350000 15.000000 l 28.350000 14.600000 l cp s
0.100000 slw
[] 0 sd
1.000000 1.000000 1.000000 srgb
n 4.700000 12.600000 m 4.700000 14.000000 l 5.800000 14.000000 l 5.800000 12.600000 l f
0.000000 0.000000 0.000000 srgb
n 4.700000 12.600000 m 4.700000 14.000000 l 5.800000 14.000000 l 5.800000 12.600000 l cp s
gsave 5.000233 13.600000 translate 0.035278 -0.035278 scale
start_ol
1515 0 moveto
2379 0 lineto
3773 4160 lineto
3133 4160 lineto
2085 1053 lineto
996 4160 lineto
69 4160 lineto
1515 0 lineto
end_ol grestore 
0.100000 slw
[] 0 sd
1.000000 1.000000 1.000000 srgb
n 21.890000 16.980000 m 21.890000 18.380000 l 22.990000 18.380000 l 22.990000 16.980000 l f
0.000000 0.000000 0.000000 srgb
n 21.890000 16.980000 m 21.890000 18.380000 l 22.990000 18.380000 l 22.990000 16.980000 l cp s
gsave 22.190233 17.980000 translate 0.035278 -0.035278 scale
start_ol
1515 0 moveto
2379 0 lineto
3773 4160 lineto
3133 4160 lineto
2085 1053 lineto
996 4160 lineto
69 4160 lineto
1515 0 lineto
end_ol grestore 
0.100000 slw
[] 0 sd
1.000000 1.000000 1.000000 srgb
n 28.300000 15.100000 m 28.300000 16.500000 l 31.000000 16.500000 l 31.000000 15.100000 l f
0.000000 0.000000 0.000000 srgb
n 28.300000 15.100000 m 28.300000 16.500000 l 31.000000 16.500000 l 31.000000 15.100000 l cp s
gsave 29.082733 16.100000 translate 0.035278 -0.035278 scale
start_ol
2269 1141 moveto
2039 797 1843 648 1613 648 curveto
1284 648 1112 969 1112 1588 curveto
1112 2287 1342 2636 1803 2636 curveto
1907 2636 2045 2619 2269 2579 curveto
2269 1141 lineto
2269 241 moveto
2269 -326 2010 -576 1405 -576 curveto
1100 -576 783 -503 346 -339 curveto
346 -934 lineto
789 -1085 1146 -1152 1521 -1152 curveto
2160 -1152 2644 -942 2892 -557 curveto
3053 -314 3105 15 3105 728 curveto
3105 3072 lineto
2269 3072 lineto
1999 3072 1826 3072 1665 3072 curveto
772 3072 219 2468 219 1490 curveto
219 607 657 0 1296 0 curveto
1659 0 1947 172 2269 579 curveto
2269 241 lineto
end_ol grestore 
gsave 29.548400 16.100000 translate 0.035278 -0.035278 scale
start_ol
2897 752 moveto
2540 619 2275 564 2010 564 curveto
1751 564 1549 625 1400 741 curveto
1215 889 1129 1060 1083 1408 curveto
2897 1408 lineto
2886 2582 2511 3072 1624 3072 curveto
760 3072 207 2497 207 1605 curveto
207 604 835 0 1872 0 curveto
2212 0 2534 52 2897 173 curveto
2897 752 lineto
1077 1856 moveto
1146 2340 1313 2554 1630 2554 curveto
1935 2554 2068 2345 2079 1856 curveto
1077 1856 lineto
end_ol grestore 
gsave 29.971733 16.100000 translate 0.035278 -0.035278 scale
start_ol
1856 574 moveto
1752 546 1654 535 1580 535 curveto
1338 535 1280 641 1280 1087 curveto
1280 2554 lineto
1833 2554 lineto
1833 3072 lineto
1280 3072 lineto
1280 3688 lineto
448 3590 lineto
448 3072 lineto
172 3072 lineto
172 2554 lineto
448 2554 lineto
448 981 lineto
448 329 741 0 1327 0 curveto
1471 0 1638 22 1856 67 curveto
1856 574 lineto
end_ol grestore 
1.000000 1.000000 1.000000 srgb
n 28.300000 16.500000 m 28.300000 17.500000 l 31.000000 17.500000 l 31.000000 16.500000 l f
0.000000 0.000000 0.000000 srgb
n 28.300000 16.500000 m 28.300000 17.500000 l 31.000000 17.500000 l 31.000000 16.500000 l cp s
gsave 28.450000 17.250000 translate 0.035278 -0.035278 scale
start_ol
1216 221 moveto
1536 221 lineto
1536 1216 lineto
2527 1216 lineto
2527 1536 lineto
1536 1536 lineto
1536 2531 lineto
1216 2531 lineto
1216 1536 lineto
221 1536 lineto
221 1216 lineto
1216 1216 lineto
1216 221 lineto
end_ol grestore 
gsave 28.814067 17.250000 translate 0.035278 -0.035278 scale
start_ol
2330 505 moveto
2058 382 1869 332 1703 332 curveto
1418 332 1344 455 1344 922 curveto
1344 2112 lineto
2302 2112 lineto
2302 2368 lineto
1344 2368 lineto
1344 2976 lineto
896 2976 lineto
896 2368 lineto
269 2368 lineto
269 2112 lineto
896 2112 lineto
896 723 lineto
896 206 1090 0 1571 0 curveto
1840 0 2066 60 2330 194 curveto
2330 505 lineto
end_ol grestore 
gsave 29.178133 17.250000 translate 0.035278 -0.035278 scale
start_ol
1157 0 moveto
1309 0 lineto
1064 -640 lineto
617 -640 lineto
617 -896 lineto
1696 -896 lineto
1696 -640 lineto
1364 -640 lineto
1608 -27 lineto
2474 2151 lineto
2640 2151 lineto
2640 2432 lineto
1816 2432 lineto
1816 2151 lineto
2175 2151 lineto
1475 413 lineto
1470 413 lineto
770 2151 lineto
1129 2151 lineto
1129 2432 lineto
124 2432 lineto
124 2151 lineto
290 2151 lineto
1157 0 lineto
end_ol grestore 
gsave 29.542200 17.250000 translate 0.035278 -0.035278 scale
start_ol
832 -640 moveto
832 0 lineto
1064 0 1217 0 1356 0 curveto
2065 0 2496 496 2496 1313 curveto
2496 1989 2169 2432 1679 2432 curveto
1353 2432 1102 2270 832 1892 curveto
832 2432 lineto
108 2432 lineto
108 2073 lineto
384 2073 lineto
384 -640 lineto
108 -640 lineto
108 -896 lineto
1405 -896 lineto
1405 -640 lineto
832 -640 lineto
832 1577 moveto
1069 1922 1286 2073 1551 2073 curveto
1882 2073 2048 1810 2048 1289 curveto
2048 616 1830 332 1324 332 curveto
1206 332 1064 345 832 379 curveto
832 1577 lineto
end_ol grestore 
gsave 29.906267 17.250000 translate 0.035278 -0.035278 scale
start_ol
2484 1152 moveto
2484 1280 lineto
2484 2045 2147 2432 1484 2432 curveto
756 2432 276 1958 276 1246 curveto
276 497 793 0 1576 0 curveto
1889 0 2147 60 2419 194 curveto
2419 521 lineto
2120 389 1885 332 1636 332 curveto
1387 332 1193 389 1046 507 curveto
871 648 793 814 751 1152 curveto
2484 1152 lineto
756 1408 moveto
802 1895 1046 2156 1452 2156 curveto
1825 2156 2014 1938 2014 1502 curveto
2014 1408 lineto
756 1408 lineto
end_ol grestore 
gsave 30.270333 17.250000 translate 0.035278 -0.035278 scale
start_ol
733 1024 moveto
1852 1024 lineto
2074 276 lineto
1723 276 lineto
1723 0 lineto
2705 0 lineto
2705 276 lineto
2539 276 lineto
1594 3328 lineto
1170 3328 lineto
221 276 lineto
55 276 lineto
55 0 lineto
834 0 lineto
834 276 lineto
511 276 lineto
733 1024 lineto
825 1280 moveto
1295 2794 lineto
1299 2794 lineto
1765 1280 lineto
825 1280 lineto
end_ol grestore 
1.000000 1.000000 1.000000 srgb
n 28.300000 17.500000 m 28.300000 17.900000 l 31.000000 17.900000 l 31.000000 17.500000 l f
0.000000 0.000000 0.000000 srgb
n 28.300000 17.500000 m 28.300000 17.900000 l 31.000000 17.900000 l 31.000000 17.500000 l cp s
0.100000 slw
[] 0 sd
[] 0 sd
0 slc
n 12.150000 4.900000 m 9.359723 8.563570 l s
0 slj
n 9.041508 8.321208 m 8.875000 9.200000 l 9.677938 8.805931 l f
0.100000 slw
[] 0 sd
[] 0 sd
0 slc
n 6.900000 10.800000 m 5.400000 10.800000 l s
0 slj
n 5.400000 10.400000 m 4.600000 10.800000 l 5.400000 11.200000 l f
0.100000 slw
[] 0 sd
[] 0 sd
0 slc
n 6.443658 10.707859 2.962223 2.962223 34.836765 88.723744 ellipse s
0 slj
n 6.694309 13.314529 m 5.800000 13.300000 l 6.324962 14.024165 l f
0.100000 slw
[] 0 sd
[] 0 sd
0 slj
0 slc
n 4.700000 13.300000 m 4.700000 13.300000 l 3.100000 13.300000 l 3.100000 12.500000 l s
0 slj
n 3.500000 12.500000 m 3.100000 11.700000 l 2.700000 12.500000 l f
0.100000 slw
[] 0 sd
[] 0 sd
0 slj
0 slc
n 4.600000 17.450000 m 4.600000 17.500000 l 3.100000 17.500000 l 3.100000 12.500000 l s
0 slj
n 3.500000 12.500000 m 3.100000 11.700000 l 2.700000 12.500000 l f
0.100000 slw
[] 0 sd
[] 0 sd
0 slj
0 slc
n 4.600000 21.700000 m 4.600000 21.700000 l 3.100000 21.700000 l 3.100000 12.500000 l s
0 slj
n 3.500000 12.500000 m 3.100000 11.700000 l 2.700000 12.500000 l f
0.100000 slw
[] 0 sd
[] 0 sd
0 slj
0 slc
n 15.950000 9.100000 m 15.950000 14.500000 l 5.775000 14.500000 l 5.775000 14.750000 l s
0 slj
n 5.375000 14.750000 m 5.775000 15.550000 l 6.175000 14.750000 l f
0.100000 slw
[] 0 sd
[] 0 sd
0 slj
0 slc
n 19.600000 9.000000 m 19.600000 18.900000 l 5.775000 18.900000 l 5.775000 19.000000 l s
0 slj
n 5.375000 19.000000 m 5.775000 19.800000 l 6.175000 19.000000 l f
0.100000 slw
[] 0 sd
[] 0 sd
0 slc
n 22.440000 16.980000 m 27.500005 16.997270 l s
0 slj
n 27.498639 17.397267 m 28.300000 17.000000 l 27.501370 16.597272 l f
0.100000 slw
[] 0 sd
[] 0 sd
0 slc
n 25.400000 14.100000 m 23.013381 16.422116 l s
0 slj
n 22.734439 16.135426 m 22.440000 16.980000 l 23.292323 16.708806 l f
0.100000 slw
[] 0 sd
[] 0 sd
0 slc
n 28.300000 17.900000 m 16.601521 9.564242 l s
0 slj
n 16.833642 9.238481 m 15.950000 9.100000 l 16.369400 9.890002 l f
0.100000 slw
[] 0 sd
[] 0 sd
0 slj
0 slc
n 25.400000 12.500000 m 14.450000 12.500000 l 14.450000 3.600000 l 14.300000 3.600000 l s
0 slj
n 14.300000 3.200000 m 13.500000 3.600000 l 14.300000 4.000000 l f
0.100000 slw
[] 0 sd
[] 0 sd
0 slc
n 18.674317 8.046238 8.534449 8.534449 37.995145 153.546450 ellipse s
0 slj
n 11.407509 11.706367 m 10.750000 11.100000 l 10.659412 11.989828 l f
showpage
