%!PS-Adobe-2.0 EPSF-2.0
%%Title: /home/ps/les/doc/doc/lyx/compiler_overview.dia
%%Creator: Dia v0.93
%%CreationDate: Sun May 22 21:46:28 2005
%%For: ps
%%Orientation: Portrait
%%Magnification: 1.0000
%%BoundingBox: 0 0 1137 561
%%BeginSetup
%%EndSetup
%%EndComments
%%BeginProlog
[ /.notdef /.notdef /.notdef /.notdef /.notdef /.notdef /.notdef /.notdef /.notdef /.notdef
/.notdef /.notdef /.notdef /.notdef /.notdef /.notdef /.notdef /.notdef /.notdef /.notdef
/.notdef /.notdef /.notdef /.notdef /.notdef /.notdef /.notdef /.notdef /.notdef /.notdef
/.notdef /.notdef /space /exclam /quotedbl /numbersign /dollar /percent /ampersand /quoteright
/parenleft /parenright /asterisk /plus /comma /hyphen /period /slash /zero /one
/two /three /four /five /six /seven /eight /nine /colon /semicolon
/less /equal /greater /question /at /A /B /C /D /E
/F /G /H /I /J /K /L /M /N /O
/P /Q /R /S /T /U /V /W /X /Y
/Z /bracketleft /backslash /bracketright /asciicircum /underscore /quoteleft /a /b /c
/d /e /f /g /h /i /j /k /l /m
/n /o /p /q /r /s /t /u /v /w
/x /y /z /braceleft /bar /braceright /asciitilde /.notdef /.notdef /.notdef
/.notdef /.notdef /.notdef /.notdef /.notdef /.notdef /.notdef /.notdef /.notdef /.notdef
/.notdef /.notdef /.notdef /.notdef /.notdef /.notdef /.notdef /.notdef /.notdef /.notdef
/.notdef /.notdef /.notdef /.notdef /.notdef /.notdef /.notdef /.notdef /.notdef /.notdef
/space /exclamdown /cent /sterling /currency /yen /brokenbar /section /dieresis /copyright
/ordfeminine /guillemotleft /logicalnot /hyphen /registered /macron /degree /plusminus /twosuperior /threesuperior
/acute /mu /paragraph /periodcentered /cedilla /onesuperior /ordmasculine /guillemotright /onequarter /onehalf
/threequarters /questiondown /Agrave /Aacute /Acircumflex /Atilde /Adieresis /Aring /AE /Ccedilla
/Egrave /Eacute /Ecircumflex /Edieresis /Igrave /Iacute /Icircumflex /Idieresis /Eth /Ntilde
/Ograve /Oacute /Ocircumflex /Otilde /Odieresis /multiply /Oslash /Ugrave /Uacute /Ucircumflex
/Udieresis /Yacute /Thorn /germandbls /agrave /aacute /acircumflex /atilde /adieresis /aring
/ae /ccedilla /egrave /eacute /ecircumflex /edieresis /igrave /iacute /icircumflex /idieresis
/eth /ntilde /ograve /oacute /ocircumflex /otilde /odieresis /divide /oslash /ugrave
/uacute /ucircumflex /udieresis /yacute /thorn /ydieresis] /isolatin1encoding exch def
/cp {closepath} bind def
/c {curveto} bind def
/f {fill} bind def
/a {arc} bind def
/ef {eofill} bind def
/ex {exch} bind def
/gr {grestore} bind def
/gs {gsave} bind def
/sa {save} bind def
/rs {restore} bind def
/l {lineto} bind def
/m {moveto} bind def
/rm {rmoveto} bind def
/n {newpath} bind def
/s {stroke} bind def
/sh {show} bind def
/slc {setlinecap} bind def
/slj {setlinejoin} bind def
/slw {setlinewidth} bind def
/srgb {setrgbcolor} bind def
/rot {rotate} bind def
/sc {scale} bind def
/sd {setdash} bind def
/ff {findfont} bind def
/sf {setfont} bind def
/scf {scalefont} bind def
/sw {stringwidth pop} bind def
/tr {translate} bind def

/ellipsedict 8 dict def
ellipsedict /mtrx matrix put
/ellipse
{ ellipsedict begin
   /endangle exch def
   /startangle exch def
   /yrad exch def
   /xrad exch def
   /y exch def
   /x exch def   /savematrix mtrx currentmatrix def
   x y tr xrad yrad sc
   0 0 1 startangle endangle arc
   savematrix setmatrix
   end
} def

/mergeprocs {
dup length
3 -1 roll
dup
length
dup
5 1 roll
3 -1 roll
add
array cvx
dup
3 -1 roll
0 exch
putinterval
dup
4 2 roll
putinterval
} bind def
/Times-Roman-latin1
    /Times-Roman findfont
    dup length dict begin
	{1 index /FID ne {def} {pop pop} ifelse} forall
	/Encoding isolatin1encoding def
    currentdict end
definefont pop
/Times-Italic-latin1
    /Times-Italic findfont
    dup length dict begin
	{1 index /FID ne {def} {pop pop} ifelse} forall
	/Encoding isolatin1encoding def
    currentdict end
definefont pop
/Times-Bold-latin1
    /Times-Bold findfont
    dup length dict begin
	{1 index /FID ne {def} {pop pop} ifelse} forall
	/Encoding isolatin1encoding def
    currentdict end
definefont pop
/Times-BoldItalic-latin1
    /Times-BoldItalic findfont
    dup length dict begin
	{1 index /FID ne {def} {pop pop} ifelse} forall
	/Encoding isolatin1encoding def
    currentdict end
definefont pop
/AvantGarde-Book-latin1
    /AvantGarde-Book findfont
    dup length dict begin
	{1 index /FID ne {def} {pop pop} ifelse} forall
	/Encoding isolatin1encoding def
    currentdict end
definefont pop
/AvantGarde-BookOblique-latin1
    /AvantGarde-BookOblique findfont
    dup length dict begin
	{1 index /FID ne {def} {pop pop} ifelse} forall
	/Encoding isolatin1encoding def
    currentdict end
definefont pop
/AvantGarde-Demi-latin1
    /AvantGarde-Demi findfont
    dup length dict begin
	{1 index /FID ne {def} {pop pop} ifelse} forall
	/Encoding isolatin1encoding def
    currentdict end
definefont pop
/AvantGarde-DemiOblique-latin1
    /AvantGarde-DemiOblique findfont
    dup length dict begin
	{1 index /FID ne {def} {pop pop} ifelse} forall
	/Encoding isolatin1encoding def
    currentdict end
definefont pop
/Bookman-Light-latin1
    /Bookman-Light findfont
    dup length dict begin
	{1 index /FID ne {def} {pop pop} ifelse} forall
	/Encoding isolatin1encoding def
    currentdict end
definefont pop
/Bookman-LightItalic-latin1
    /Bookman-LightItalic findfont
    dup length dict begin
	{1 index /FID ne {def} {pop pop} ifelse} forall
	/Encoding isolatin1encoding def
    currentdict end
definefont pop
/Bookman-Demi-latin1
    /Bookman-Demi findfont
    dup length dict begin
	{1 index /FID ne {def} {pop pop} ifelse} forall
	/Encoding isolatin1encoding def
    currentdict end
definefont pop
/Bookman-DemiItalic-latin1
    /Bookman-DemiItalic findfont
    dup length dict begin
	{1 index /FID ne {def} {pop pop} ifelse} forall
	/Encoding isolatin1encoding def
    currentdict end
definefont pop
/Courier-latin1
    /Courier findfont
    dup length dict begin
	{1 index /FID ne {def} {pop pop} ifelse} forall
	/Encoding isolatin1encoding def
    currentdict end
definefont pop
/Courier-Oblique-latin1
    /Courier-Oblique findfont
    dup length dict begin
	{1 index /FID ne {def} {pop pop} ifelse} forall
	/Encoding isolatin1encoding def
    currentdict end
definefont pop
/Courier-Bold-latin1
    /Courier-Bold findfont
    dup length dict begin
	{1 index /FID ne {def} {pop pop} ifelse} forall
	/Encoding isolatin1encoding def
    currentdict end
definefont pop
/Courier-BoldOblique-latin1
    /Courier-BoldOblique findfont
    dup length dict begin
	{1 index /FID ne {def} {pop pop} ifelse} forall
	/Encoding isolatin1encoding def
    currentdict end
definefont pop
/Helvetica-latin1
    /Helvetica findfont
    dup length dict begin
	{1 index /FID ne {def} {pop pop} ifelse} forall
	/Encoding isolatin1encoding def
    currentdict end
definefont pop
/Helvetica-Oblique-latin1
    /Helvetica-Oblique findfont
    dup length dict begin
	{1 index /FID ne {def} {pop pop} ifelse} forall
	/Encoding isolatin1encoding def
    currentdict end
definefont pop
/Helvetica-Bold-latin1
    /Helvetica-Bold findfont
    dup length dict begin
	{1 index /FID ne {def} {pop pop} ifelse} forall
	/Encoding isolatin1encoding def
    currentdict end
definefont pop
/Helvetica-BoldOblique-latin1
    /Helvetica-BoldOblique findfont
    dup length dict begin
	{1 index /FID ne {def} {pop pop} ifelse} forall
	/Encoding isolatin1encoding def
    currentdict end
definefont pop
/Helvetica-Narrow-latin1
    /Helvetica-Narrow findfont
    dup length dict begin
	{1 index /FID ne {def} {pop pop} ifelse} forall
	/Encoding isolatin1encoding def
    currentdict end
definefont pop
/Helvetica-Narrow-Oblique-latin1
    /Helvetica-Narrow-Oblique findfont
    dup length dict begin
	{1 index /FID ne {def} {pop pop} ifelse} forall
	/Encoding isolatin1encoding def
    currentdict end
definefont pop
/Helvetica-Narrow-Bold-latin1
    /Helvetica-Narrow-Bold findfont
    dup length dict begin
	{1 index /FID ne {def} {pop pop} ifelse} forall
	/Encoding isolatin1encoding def
    currentdict end
definefont pop
/Helvetica-Narrow-BoldOblique-latin1
    /Helvetica-Narrow-BoldOblique findfont
    dup length dict begin
	{1 index /FID ne {def} {pop pop} ifelse} forall
	/Encoding isolatin1encoding def
    currentdict end
definefont pop
/NewCenturySchoolbook-Roman-latin1
    /NewCenturySchoolbook-Roman findfont
    dup length dict begin
	{1 index /FID ne {def} {pop pop} ifelse} forall
	/Encoding isolatin1encoding def
    currentdict end
definefont pop
/NewCenturySchoolbook-Italic-latin1
    /NewCenturySchoolbook-Italic findfont
    dup length dict begin
	{1 index /FID ne {def} {pop pop} ifelse} forall
	/Encoding isolatin1encoding def
    currentdict end
definefont pop
/NewCenturySchoolbook-Bold-latin1
    /NewCenturySchoolbook-Bold findfont
    dup length dict begin
	{1 index /FID ne {def} {pop pop} ifelse} forall
	/Encoding isolatin1encoding def
    currentdict end
definefont pop
/NewCenturySchoolbook-BoldItalic-latin1
    /NewCenturySchoolbook-BoldItalic findfont
    dup length dict begin
	{1 index /FID ne {def} {pop pop} ifelse} forall
	/Encoding isolatin1encoding def
    currentdict end
definefont pop
/Palatino-Roman-latin1
    /Palatino-Roman findfont
    dup length dict begin
	{1 index /FID ne {def} {pop pop} ifelse} forall
	/Encoding isolatin1encoding def
    currentdict end
definefont pop
/Palatino-Italic-latin1
    /Palatino-Italic findfont
    dup length dict begin
	{1 index /FID ne {def} {pop pop} ifelse} forall
	/Encoding isolatin1encoding def
    currentdict end
definefont pop
/Palatino-Bold-latin1
    /Palatino-Bold findfont
    dup length dict begin
	{1 index /FID ne {def} {pop pop} ifelse} forall
	/Encoding isolatin1encoding def
    currentdict end
definefont pop
/Palatino-BoldItalic-latin1
    /Palatino-BoldItalic findfont
    dup length dict begin
	{1 index /FID ne {def} {pop pop} ifelse} forall
	/Encoding isolatin1encoding def
    currentdict end
definefont pop
/Symbol-latin1
    /Symbol findfont
definefont pop
/ZapfChancery-MediumItalic-latin1
    /ZapfChancery-MediumItalic findfont
    dup length dict begin
	{1 index /FID ne {def} {pop pop} ifelse} forall
	/Encoding isolatin1encoding def
    currentdict end
definefont pop
/ZapfDingbats-latin1
    /ZapfDingbats findfont
    dup length dict begin
	{1 index /FID ne {def} {pop pop} ifelse} forall
	/Encoding isolatin1encoding def
    currentdict end
definefont pop
28.346000 -28.346000 scale
-1.282806 -27.915400 translate
%%EndProlog


0.100000 slw
[] 0 sd
[] 0 sd
0 slc
0.000000 0.000000 0.000000 srgb
n 12.774694 19.552621 m 17.625900 24.765400 l s
0 slj
n 12.957704 19.382306 m 12.434063 19.186602 l 12.591685 19.722937 l f
1.000000 1.000000 1.000000 srgb
n 5.489010 17.064500 m 5.489010 19.164500 l 8.139010 19.164500 l 8.139010 17.064500 l f
0.100000 slw
[] 0 sd
[] 0 sd
0 slj
0.000000 0.000000 0.000000 srgb
n 5.489010 17.064500 m 5.489010 19.164500 l 8.139010 19.164500 l 8.139010 17.064500 l cp s
/Helvetica-latin1 ff 0.700000 scf sf
(LEX) dup sw 2 div 6.814010 ex sub 18.464500 m gs 1 -1 sc sh gr
1.000000 1.000000 1.000000 srgb
n 10.800000 17.050000 m 10.800000 19.150000 l 14.000000 19.150000 l 14.000000 17.050000 l f
0.100000 slw
[] 0 sd
[] 0 sd
0 slj
0.000000 0.000000 0.000000 srgb
n 10.800000 17.050000 m 10.800000 19.150000 l 14.000000 19.150000 l 14.000000 17.050000 l cp s
/Helvetica-latin1 ff 0.700000 scf sf
(HINT) dup sw 2 div 12.400000 ex sub 18.450000 m gs 1 -1 sc sh gr
1.000000 1.000000 1.000000 srgb
n 17.000000 17.000000 m 17.000000 19.100000 l 19.800000 19.100000 l 19.800000 17.000000 l f
0.100000 slw
[] 0 sd
[] 0 sd
0 slj
0.000000 0.000000 0.000000 srgb
n 17.000000 17.000000 m 17.000000 19.100000 l 19.800000 19.100000 l 19.800000 17.000000 l cp s
/Helvetica-latin1 ff 0.700000 scf sf
(SYN) dup sw 2 div 18.400000 ex sub 18.400000 m gs 1 -1 sc sh gr
1.000000 1.000000 1.000000 srgb
n 22.189400 16.935500 m 22.189400 19.035500 l 24.989400 19.035500 l 24.989400 16.935500 l f
0.100000 slw
[] 0 sd
[] 0 sd
0 slj
0.000000 0.000000 0.000000 srgb
n 22.189400 16.935500 m 22.189400 19.035500 l 24.989400 19.035500 l 24.989400 16.935500 l cp s
/Helvetica-latin1 ff 0.700000 scf sf
(SA) dup sw 2 div 23.589400 ex sub 18.335500 m gs 1 -1 sc sh gr
1.000000 1.000000 1.000000 srgb
n 27.403200 16.896800 m 27.403200 18.996800 l 31.103200 18.996800 l 31.103200 16.896800 l f
0.100000 slw
[] 0 sd
[] 0 sd
0 slj
0.000000 0.000000 0.000000 srgb
n 27.403200 16.896800 m 27.403200 18.996800 l 31.103200 18.996800 l 31.103200 16.896800 l cp s
/Helvetica-latin1 ff 0.700000 scf sf
(SS2PI) dup sw 2 div 29.253200 ex sub 18.296800 m gs 1 -1 sc sh gr
1.000000 1.000000 1.000000 srgb
n 33.125500 16.835500 m 33.125500 18.935500 l 37.675500 18.935500 l 37.675500 16.835500 l f
0.100000 slw
[] 0 sd
[] 0 sd
0 slj
0.000000 0.000000 0.000000 srgb
n 33.125500 16.835500 m 33.125500 18.935500 l 37.675500 18.935500 l 37.675500 16.835500 l cp s
/Helvetica-latin1 ff 0.700000 scf sf
(Backend) dup sw 2 div 35.400500 ex sub 18.235500 m gs 1 -1 sc sh gr
0.200000 slw
[] 0 sd
[] 0 sd
0 slc
n 9.900013 18.104904 m 8.139010 18.114500 l s
0 slj
n 9.902193 18.504898 m 10.700001 18.100545 l 9.897834 17.704910 l f
0.200000 slw
[] 0 sd
[] 0 sd
0 slc
n 16.100125 18.064998 m 14.000000 18.100000 l s
0 slj
n 16.106791 18.464942 m 16.900014 18.051666 l 16.093459 17.665053 l f
0.200000 slw
[] 0 sd
[] 0 sd
0 slc
n 21.289728 18.009786 m 19.800000 18.050000 l s
0 slj
n 21.300521 18.409640 m 22.089436 17.988198 l 21.278934 17.609932 l f
0.200000 slw
[] 0 sd
[] 0 sd
0 slc
n 26.503316 17.961228 m 24.989400 17.985500 l s
0 slj
n 26.509728 18.361176 m 27.303213 17.948403 l 26.496903 17.561279 l f
0.200000 slw
[] 0 sd
[] 0 sd
0 slc
n 32.225913 17.912768 m 31.103200 17.946800 l s
0 slj
n 32.238032 18.312585 m 33.025546 17.888530 l 32.213794 17.512952 l f
0.200000 slw
[] 0 sd
[] 0 sd
0 slc
n 4.589016 18.111322 m 1.383158 18.100000 l s
0 slj
n 4.587603 18.511319 m 5.389011 18.114147 l 4.590428 17.711324 l f
0.200000 slw
[] 0 sd
[] 0 sd
0 slc
n 40.383202 17.858856 m 37.675500 17.885500 l s
0 slj
n 40.387138 18.258836 m 41.183163 17.850984 l 40.379266 17.458875 l f
0.100000 slw
[1.000000] 0 sd
[0.300000] 0 sd
0 slj
0 slc
n 17.700000 17.000000 m 17.700000 15.053000 l 12.400000 15.053000 l 12.400000 16.563197 l s
[] 0 sd
0 slj
0 slc
n 12.400000 16.938197 m 12.150000 16.438197 l 12.400000 16.563197 l 12.650000 16.438197 l f
n 12.400000 16.938197 m 12.150000 16.438197 l 12.400000 16.563197 l 12.650000 16.438197 l cp s
0.100000 slw
[0.300000] 0 sd
[0.300000] 0 sd
0 slj
0 slc
n 23.589400 16.935500 m 23.589400 14.025000 l 11.600000 14.025000 l 11.600000 16.563197 l s
[] 0 sd
0 slj
0 slc
n 11.600000 16.938197 m 11.350000 16.438197 l 11.600000 16.563197 l 11.850000 16.438197 l f
n 11.600000 16.938197 m 11.350000 16.438197 l 11.600000 16.563197 l 11.850000 16.438197 l cp s
1.000000 1.000000 1.000000 srgb
n 17.625900 24.765400 m 17.625900 27.865400 l 23.325900 27.865400 l 23.325900 24.765400 l f
0.100000 slw
[] 0 sd
[] 0 sd
0 slj
0.000000 0.000000 0.000000 srgb
n 17.625900 24.765400 m 17.625900 27.865400 l 23.325900 27.865400 l 23.325900 24.765400 l cp s
/Helvetica-latin1 ff 0.700000 scf sf
(Declaration) dup sw 2 div 20.475900 ex sub 26.165400 m gs 1 -1 sc sh gr
(tables) dup sw 2 div 20.475900 ex sub 27.165400 m gs 1 -1 sc sh gr
0.100000 slw
[] 0 sd
[] 0 sd
0 slc
n 23.433934 19.563070 m 22.056366 24.237830 l s
0 slj
n 23.673739 19.633737 m 23.575267 19.083461 l 23.194130 19.492404 l f
0 slj
n 21.816561 24.167163 m 21.915033 24.717439 l 22.296170 24.308496 l f
0.100000 slw
[] 0 sd
[] 0 sd
0 slc
n 27.967871 19.412327 m 23.325900 24.765400 l s
0 slj
n 28.156747 19.576113 m 28.295443 19.034575 l 27.778995 19.248542 l f
0.100000 slw
[] 0 sd
[] 0 sd
0 slc
n 32.669421 19.242896 m 23.325900 25.540400 l s
0 slj
n 32.809147 19.450204 m 33.084038 18.963445 l 32.529696 19.035587 l f
/Helvetica-latin1 ff 0.700000 scf sf
(source) 1.716070 17.206900 m gs 1 -1 sc sh gr
/Helvetica-latin1 ff 0.700000 scf sf
(Controlflow) 15.321400 13.297300 m gs 1 -1 sc sh gr
0.100000 slw
[0.200000] 0 sd
[0.200000] 0 sd
0 slc
n 31.500000 10.000000 m 31.483800 25.447300 l s
/Helvetica-latin1 ff 0.700000 scf sf
(Frontend) dup sw 2 div 20.000000 ex sub 9.000000 m gs 1 -1 sc sh gr
0.100000 slw
[0.200000] 0 sd
[0.200000] 0 sd
0 slc
n 31.000000 9.500000 m 9.550000 9.500000 l s
0 slj
n 9.550000 9.250000 m 9.050000 9.500000 l 9.550000 9.750000 l f
1.000000 1.000000 1.000000 srgb
n 31.000000 9.000000 m 31.000000 10.000000 l 32.000000 10.000000 l 32.000000 9.000000 l f
0.100000 slw
[] 0 sd
[] 0 sd
0 slj
0.000000 0.000000 0.000000 srgb
n 31.000000 9.000000 m 31.000000 10.000000 l 32.000000 10.000000 l 32.000000 9.000000 l cp s
0.100000 slw
[0.200000] 0 sd
[0.200000] 0 sd
0 slc
n 32.000000 9.500000 m 38.450000 9.500000 l s
0 slj
n 38.450000 9.750000 m 38.950000 9.500000 l 38.450000 9.250000 l f
/Helvetica-latin1 ff 0.700000 scf sf
(Backend) dup sw 2 div 35.400000 ex sub 9.000000 m gs 1 -1 sc sh gr
/Helvetica-latin1 ff 0.700000 scf sf
(ASM) 38.343158 17.030000 m gs 1 -1 sc sh gr
showpage
