%!PS-Adobe-2.0 EPSF-2.0
%%Title: deconstruct.dia
%%Creator: Dia v0.94
%%CreationDate: Thu May 26 12:25:03 2005
%%For: sandp9am
%%Orientation: Portrait
%%Magnification: 1.0000
%%BoundingBox: 0 0 1446 570
%%BeginSetup
%%EndSetup
%%EndComments
%%BeginProlog
[ /.notdef /.notdef /.notdef /.notdef /.notdef /.notdef /.notdef /.notdef /.notdef /.notdef
/.notdef /.notdef /.notdef /.notdef /.notdef /.notdef /.notdef /.notdef /.notdef /.notdef
/.notdef /.notdef /.notdef /.notdef /.notdef /.notdef /.notdef /.notdef /.notdef /.notdef
/.notdef /.notdef /space /exclam /quotedbl /numbersign /dollar /percent /ampersand /quoteright
/parenleft /parenright /asterisk /plus /comma /hyphen /period /slash /zero /one
/two /three /four /five /six /seven /eight /nine /colon /semicolon
/less /equal /greater /question /at /A /B /C /D /E
/F /G /H /I /J /K /L /M /N /O
/P /Q /R /S /T /U /V /W /X /Y
/Z /bracketleft /backslash /bracketright /asciicircum /underscore /quoteleft /a /b /c
/d /e /f /g /h /i /j /k /l /m
/n /o /p /q /r /s /t /u /v /w
/x /y /z /braceleft /bar /braceright /asciitilde /.notdef /.notdef /.notdef
/.notdef /.notdef /.notdef /.notdef /.notdef /.notdef /.notdef /.notdef /.notdef /.notdef
/.notdef /.notdef /.notdef /.notdef /.notdef /.notdef /.notdef /.notdef /.notdef /.notdef
/.notdef /.notdef /.notdef /.notdef /.notdef /.notdef /.notdef /.notdef /.notdef /.notdef
/space /exclamdown /cent /sterling /currency /yen /brokenbar /section /dieresis /copyright
/ordfeminine /guillemotleft /logicalnot /hyphen /registered /macron /degree /plusminus /twosuperior /threesuperior
/acute /mu /paragraph /periodcentered /cedilla /onesuperior /ordmasculine /guillemotright /onequarter /onehalf
/threequarters /questiondown /Agrave /Aacute /Acircumflex /Atilde /Adieresis /Aring /AE /Ccedilla
/Egrave /Eacute /Ecircumflex /Edieresis /Igrave /Iacute /Icircumflex /Idieresis /Eth /Ntilde
/Ograve /Oacute /Ocircumflex /Otilde /Odieresis /multiply /Oslash /Ugrave /Uacute /Ucircumflex
/Udieresis /Yacute /Thorn /germandbls /agrave /aacute /acircumflex /atilde /adieresis /aring
/ae /ccedilla /egrave /eacute /ecircumflex /edieresis /igrave /iacute /icircumflex /idieresis
/eth /ntilde /ograve /oacute /ocircumflex /otilde /odieresis /divide /oslash /ugrave
/uacute /ucircumflex /udieresis /yacute /thorn /ydieresis] /isolatin1encoding exch def
/cp {closepath} bind def
/c {curveto} bind def
/f {fill} bind def
/a {arc} bind def
/ef {eofill} bind def
/ex {exch} bind def
/gr {grestore} bind def
/gs {gsave} bind def
/sa {save} bind def
/rs {restore} bind def
/l {lineto} bind def
/m {moveto} bind def
/rm {rmoveto} bind def
/n {newpath} bind def
/s {stroke} bind def
/sh {show} bind def
/slc {setlinecap} bind def
/slj {setlinejoin} bind def
/slw {setlinewidth} bind def
/srgb {setrgbcolor} bind def
/rot {rotate} bind def
/sc {scale} bind def
/sd {setdash} bind def
/ff {findfont} bind def
/sf {setfont} bind def
/scf {scalefont} bind def
/sw {stringwidth pop} bind def
/tr {translate} bind def

/ellipsedict 8 dict def
ellipsedict /mtrx matrix put
/ellipse
{ ellipsedict begin
   /endangle exch def
   /startangle exch def
   /yrad exch def
   /xrad exch def
   /y exch def
   /x exch def   /savematrix mtrx currentmatrix def
   x y tr xrad yrad sc
   0 0 1 startangle endangle arc
   savematrix setmatrix
   end
} def

/mergeprocs {
dup length
3 -1 roll
dup
length
dup
5 1 roll
3 -1 roll
add
array cvx
dup
3 -1 roll
0 exch
putinterval
dup
4 2 roll
putinterval
} bind def
/Times-Roman-latin1
    /Times-Roman findfont
    dup length dict begin
	{1 index /FID ne {def} {pop pop} ifelse} forall
	/Encoding isolatin1encoding def
    currentdict end
definefont pop
/Times-Italic-latin1
    /Times-Italic findfont
    dup length dict begin
	{1 index /FID ne {def} {pop pop} ifelse} forall
	/Encoding isolatin1encoding def
    currentdict end
definefont pop
/Times-Bold-latin1
    /Times-Bold findfont
    dup length dict begin
	{1 index /FID ne {def} {pop pop} ifelse} forall
	/Encoding isolatin1encoding def
    currentdict end
definefont pop
/Times-BoldItalic-latin1
    /Times-BoldItalic findfont
    dup length dict begin
	{1 index /FID ne {def} {pop pop} ifelse} forall
	/Encoding isolatin1encoding def
    currentdict end
definefont pop
/AvantGarde-Book-latin1
    /AvantGarde-Book findfont
    dup length dict begin
	{1 index /FID ne {def} {pop pop} ifelse} forall
	/Encoding isolatin1encoding def
    currentdict end
definefont pop
/AvantGarde-BookOblique-latin1
    /AvantGarde-BookOblique findfont
    dup length dict begin
	{1 index /FID ne {def} {pop pop} ifelse} forall
	/Encoding isolatin1encoding def
    currentdict end
definefont pop
/AvantGarde-Demi-latin1
    /AvantGarde-Demi findfont
    dup length dict begin
	{1 index /FID ne {def} {pop pop} ifelse} forall
	/Encoding isolatin1encoding def
    currentdict end
definefont pop
/AvantGarde-DemiOblique-latin1
    /AvantGarde-DemiOblique findfont
    dup length dict begin
	{1 index /FID ne {def} {pop pop} ifelse} forall
	/Encoding isolatin1encoding def
    currentdict end
definefont pop
/Bookman-Light-latin1
    /Bookman-Light findfont
    dup length dict begin
	{1 index /FID ne {def} {pop pop} ifelse} forall
	/Encoding isolatin1encoding def
    currentdict end
definefont pop
/Bookman-LightItalic-latin1
    /Bookman-LightItalic findfont
    dup length dict begin
	{1 index /FID ne {def} {pop pop} ifelse} forall
	/Encoding isolatin1encoding def
    currentdict end
definefont pop
/Bookman-Demi-latin1
    /Bookman-Demi findfont
    dup length dict begin
	{1 index /FID ne {def} {pop pop} ifelse} forall
	/Encoding isolatin1encoding def
    currentdict end
definefont pop
/Bookman-DemiItalic-latin1
    /Bookman-DemiItalic findfont
    dup length dict begin
	{1 index /FID ne {def} {pop pop} ifelse} forall
	/Encoding isolatin1encoding def
    currentdict end
definefont pop
/Courier-latin1
    /Courier findfont
    dup length dict begin
	{1 index /FID ne {def} {pop pop} ifelse} forall
	/Encoding isolatin1encoding def
    currentdict end
definefont pop
/Courier-Oblique-latin1
    /Courier-Oblique findfont
    dup length dict begin
	{1 index /FID ne {def} {pop pop} ifelse} forall
	/Encoding isolatin1encoding def
    currentdict end
definefont pop
/Courier-Bold-latin1
    /Courier-Bold findfont
    dup length dict begin
	{1 index /FID ne {def} {pop pop} ifelse} forall
	/Encoding isolatin1encoding def
    currentdict end
definefont pop
/Courier-BoldOblique-latin1
    /Courier-BoldOblique findfont
    dup length dict begin
	{1 index /FID ne {def} {pop pop} ifelse} forall
	/Encoding isolatin1encoding def
    currentdict end
definefont pop
/Helvetica-latin1
    /Helvetica findfont
    dup length dict begin
	{1 index /FID ne {def} {pop pop} ifelse} forall
	/Encoding isolatin1encoding def
    currentdict end
definefont pop
/Helvetica-Oblique-latin1
    /Helvetica-Oblique findfont
    dup length dict begin
	{1 index /FID ne {def} {pop pop} ifelse} forall
	/Encoding isolatin1encoding def
    currentdict end
definefont pop
/Helvetica-Bold-latin1
    /Helvetica-Bold findfont
    dup length dict begin
	{1 index /FID ne {def} {pop pop} ifelse} forall
	/Encoding isolatin1encoding def
    currentdict end
definefont pop
/Helvetica-BoldOblique-latin1
    /Helvetica-BoldOblique findfont
    dup length dict begin
	{1 index /FID ne {def} {pop pop} ifelse} forall
	/Encoding isolatin1encoding def
    currentdict end
definefont pop
/Helvetica-Narrow-latin1
    /Helvetica-Narrow findfont
    dup length dict begin
	{1 index /FID ne {def} {pop pop} ifelse} forall
	/Encoding isolatin1encoding def
    currentdict end
definefont pop
/Helvetica-Narrow-Oblique-latin1
    /Helvetica-Narrow-Oblique findfont
    dup length dict begin
	{1 index /FID ne {def} {pop pop} ifelse} forall
	/Encoding isolatin1encoding def
    currentdict end
definefont pop
/Helvetica-Narrow-Bold-latin1
    /Helvetica-Narrow-Bold findfont
    dup length dict begin
	{1 index /FID ne {def} {pop pop} ifelse} forall
	/Encoding isolatin1encoding def
    currentdict end
definefont pop
/Helvetica-Narrow-BoldOblique-latin1
    /Helvetica-Narrow-BoldOblique findfont
    dup length dict begin
	{1 index /FID ne {def} {pop pop} ifelse} forall
	/Encoding isolatin1encoding def
    currentdict end
definefont pop
/NewCenturySchoolbook-Roman-latin1
    /NewCenturySchoolbook-Roman findfont
    dup length dict begin
	{1 index /FID ne {def} {pop pop} ifelse} forall
	/Encoding isolatin1encoding def
    currentdict end
definefont pop
/NewCenturySchoolbook-Italic-latin1
    /NewCenturySchoolbook-Italic findfont
    dup length dict begin
	{1 index /FID ne {def} {pop pop} ifelse} forall
	/Encoding isolatin1encoding def
    currentdict end
definefont pop
/NewCenturySchoolbook-Bold-latin1
    /NewCenturySchoolbook-Bold findfont
    dup length dict begin
	{1 index /FID ne {def} {pop pop} ifelse} forall
	/Encoding isolatin1encoding def
    currentdict end
definefont pop
/NewCenturySchoolbook-BoldItalic-latin1
    /NewCenturySchoolbook-BoldItalic findfont
    dup length dict begin
	{1 index /FID ne {def} {pop pop} ifelse} forall
	/Encoding isolatin1encoding def
    currentdict end
definefont pop
/Palatino-Roman-latin1
    /Palatino-Roman findfont
    dup length dict begin
	{1 index /FID ne {def} {pop pop} ifelse} forall
	/Encoding isolatin1encoding def
    currentdict end
definefont pop
/Palatino-Italic-latin1
    /Palatino-Italic findfont
    dup length dict begin
	{1 index /FID ne {def} {pop pop} ifelse} forall
	/Encoding isolatin1encoding def
    currentdict end
definefont pop
/Palatino-Bold-latin1
    /Palatino-Bold findfont
    dup length dict begin
	{1 index /FID ne {def} {pop pop} ifelse} forall
	/Encoding isolatin1encoding def
    currentdict end
definefont pop
/Palatino-BoldItalic-latin1
    /Palatino-BoldItalic findfont
    dup length dict begin
	{1 index /FID ne {def} {pop pop} ifelse} forall
	/Encoding isolatin1encoding def
    currentdict end
definefont pop
/Symbol-latin1
    /Symbol findfont
definefont pop
/ZapfChancery-MediumItalic-latin1
    /ZapfChancery-MediumItalic findfont
    dup length dict begin
	{1 index /FID ne {def} {pop pop} ifelse} forall
	/Encoding isolatin1encoding def
    currentdict end
definefont pop
/ZapfDingbats-latin1
    /ZapfDingbats findfont
    dup length dict begin
	{1 index /FID ne {def} {pop pop} ifelse} forall
	/Encoding isolatin1encoding def
    currentdict end
definefont pop
28.346000 -28.346000 scale
-4.135520 -13.316213 translate
%%EndProlog


/Helvetica-latin1 ff 0.560000 scf sf
/Helvetica-latin1 ff 0.560000 scf sf
1.000000 1.000000 1.000000 srgb
n 4.185520 -3.513570 m 4.185520 -0.413570 l 12.288645 -0.413570 l 12.288645 -3.513570 l f
0.100000 slw
[] 0 sd
[] 0 sd
0 slj
0.000000 0.000000 0.000000 srgb
n 4.185520 -3.513570 m 4.185520 -0.413570 l 12.288645 -0.413570 l 12.288645 -3.513570 l cp s
/Helvetica-latin1 ff 0.700000 scf sf
(sa_deconstruct) dup sw 2 div 8.237082 ex sub -2.230758 m gs 1 -1 sc sh gr
(spse) dup sw 2 div 8.237082 ex sub -1.230758 m gs 1 -1 sc sh gr
0.100000 slw
[] 0 sd
[] 0 sd
0 slc
0 slj
0 slc
0 slj
[] 0 sd
1.000000 1.000000 1.000000 srgb
n 8.063970 3.272510 m 8.063970 7.502629 l 16.819262 7.502629 l 16.819262 3.272510 l f
0.000000 0.000000 0.000000 srgb
n 8.063970 3.272510 m 8.063970 7.502629 l 16.819262 7.502629 l 16.819262 3.272510 l cp s
0 slc
0 slj
[] 0 sd
n 8.939499 3.272510 m 8.939499 7.502629 l s
0 slc
0 slj
[] 0 sd
n 8.063970 3.695522 m 16.819262 3.695522 l s
/Helvetica-latin1 ff 0.700000 scf sf
(or_or_functional) dup sw 2 div 12.879381 ex sub 5.331888 m gs 1 -1 sc sh gr
(concrete) dup sw 2 div 12.879381 ex sub 6.331888 m gs 1 -1 sc sh gr
1.000000 1.000000 1.000000 srgb
n 15.426200 -3.266420 m 15.426200 -1.166420 l 24.720731 -1.166420 l 24.720731 -3.266420 l f
0.100000 slw
[] 0 sd
[] 0 sd
0 slj
0.000000 0.000000 0.000000 srgb
n 15.426200 -3.266420 m 15.426200 -1.166420 l 24.720731 -1.166420 l 24.720731 -3.266420 l cp s
/Helvetica-latin1 ff 0.700000 scf sf
(overload resolution) dup sw 2 div 20.073466 ex sub -1.983607 m gs 1 -1 sc sh gr
0.100000 slw
[1.000000] 0 sd
[0.300000] 0 sd
0 slj
0 slc
n 10.254600 -6.717830 m 10.254600 -5.115700 l 10.262900 -5.115700 l 10.262900 -4.000373 l s
[] 0 sd
0 slj
0 slc
n 10.262900 -3.625373 m 10.012900 -4.125373 l 10.262900 -4.000373 l 10.512900 -4.125373 l ef
n 10.262900 -3.625373 m 10.012900 -4.125373 l 10.262900 -4.000373 l 10.512900 -4.125373 l cp s
0.100000 slw
[0.300000] 0 sd
[0.300000] 0 sd
0 slj
0 slc
n 4.704600 11.765900 m 4.704600 11.765900 l 10.217797 11.765900 l s
[] 0 sd
0 slj
0 slc
n 10.592797 11.765900 m 10.092797 12.015900 l 10.217797 11.765900 l 10.092797 11.515900 l ef
n 10.592797 11.765900 m 10.092797 12.015900 l 10.217797 11.765900 l 10.092797 11.515900 l cp s
/Helvetica-latin1 ff 0.700000 scf sf
(Controlflow) 5.274600 12.895900 m gs 1 -1 sc sh gr
0.200000 slw
[] 0 sd
[] 0 sd
0 slc
n 9.804600 9.515900 m 4.704600 9.515900 l s
0 slj
n 9.804600 9.915900 m 10.604600 9.515900 l 9.804600 9.115900 l ef
/Helvetica-latin1 ff 0.700000 scf sf
(Dataflow) 5.724600 10.545900 m gs 1 -1 sc sh gr
0.200000 slw
[] 0 sd
[] 0 sd
0 slc
n 10.260434 0.486428 m 10.252800 3.272510 l s
0 slj
n 10.660432 0.487524 m 10.262626 -0.313569 l 9.860435 0.485332 l ef
0.100000 slw
[1.000000] 0 sd
[0.300000] 0 sd
0 slj
0 slc
n 4.185520 -3.513570 m 4.185520 -6.008610 l 6.211310 -6.008610 l 6.211310 -4.000373 l s
[] 0 sd
0 slj
0 slc
n 6.211310 -3.625373 m 5.961310 -4.125373 l 6.211310 -4.000373 l 6.461310 -4.125373 l ef
n 6.211310 -3.625373 m 5.961310 -4.125373 l 6.211310 -4.000373 l 6.461310 -4.125373 l cp s
0.100000 slw
[0.300000] 0 sd
[0.300000] 0 sd
0 slj
0 slc
n 12.288600 -2.738570 m 13.857400 -2.738570 l 13.857400 -2.741420 l 14.939397 -2.741420 l s
[] 0 sd
0 slj
0 slc
n 15.314397 -2.741420 m 14.814397 -2.491420 l 14.939397 -2.741420 l 14.814397 -2.991420 l ef
n 15.314397 -2.741420 m 14.814397 -2.491420 l 14.939397 -2.741420 l 14.814397 -2.991420 l cp s
0.100000 slw
[0.300000] 0 sd
[0.300000] 0 sd
0 slj
0 slc
n 17.749833 -1.166420 m 17.749833 1.053045 l 12.441600 1.053045 l 12.441600 2.785707 l s
[] 0 sd
0 slj
0 slc
n 12.441600 3.160707 m 12.191600 2.660707 l 12.441600 2.785707 l 12.691600 2.660707 l ef
n 12.441600 3.160707 m 12.191600 2.660707 l 12.441600 2.785707 l 12.691600 2.660707 l cp s
0.100000 slw
[] 0 sd
[] 0 sd
0 slc
0 slj
0 slc
0 slj
[] 0 sd
1.000000 1.000000 1.000000 srgb
n 46.316900 0.832900 m 46.316900 5.063019 l 55.072192 5.063019 l 55.072192 0.832900 l f
0.000000 0.000000 0.000000 srgb
n 46.316900 0.832900 m 46.316900 5.063019 l 55.072192 5.063019 l 55.072192 0.832900 l cp s
0 slc
0 slj
[] 0 sd
n 47.192429 0.832900 m 47.192429 5.063019 l s
0 slc
0 slj
[] 0 sd
n 46.316900 1.255912 m 55.072192 1.255912 l s
/Helvetica-latin1 ff 0.700000 scf sf
(or_or_functional) dup sw 2 div 51.132311 ex sub 2.892278 m gs 1 -1 sc sh gr
(concrete) dup sw 2 div 51.132311 ex sub 3.892278 m gs 1 -1 sc sh gr
1.000000 1.000000 1.000000 srgb
n 31.405200 6.254110 m 31.405200 9.354110 l 40.672388 9.354110 l 40.672388 6.254110 l f
0.100000 slw
[] 0 sd
[] 0 sd
0 slj
0.000000 0.000000 0.000000 srgb
n 31.405200 6.254110 m 31.405200 9.354110 l 40.672388 9.354110 l 40.672388 6.254110 l cp s
/Helvetica-latin1 ff 0.700000 scf sf
(or_builtin) dup sw 2 div 36.038794 ex sub 7.536923 m gs 1 -1 sc sh gr
(expression_creator) dup sw 2 div 36.038794 ex sub 8.536922 m gs 1 -1 sc sh gr
1.000000 1.000000 1.000000 srgb
n 35.843100 1.897860 m 35.843100 3.997860 l 43.302475 3.997860 l 43.302475 1.897860 l f
0.100000 slw
[] 0 sd
[] 0 sd
0 slj
0.000000 0.000000 0.000000 srgb
n 35.843100 1.897860 m 35.843100 3.997860 l 43.302475 3.997860 l 43.302475 1.897860 l cp s
/Helvetica-latin1 ff 0.700000 scf sf
(or_decl_helper) dup sw 2 div 39.572787 ex sub 3.180673 m gs 1 -1 sc sh gr
1.000000 1.000000 1.000000 srgb
n 32.132900 -3.064640 m 32.132900 -0.964640 l 41.427431 -0.964640 l 41.427431 -3.064640 l f
0.100000 slw
[] 0 sd
[] 0 sd
0 slj
0.000000 0.000000 0.000000 srgb
n 32.132900 -3.064640 m 32.132900 -0.964640 l 41.427431 -0.964640 l 41.427431 -3.064640 l cp s
/Helvetica-latin1 ff 0.700000 scf sf
(or_funcall_creator) dup sw 2 div 36.780166 ex sub -1.781827 m gs 1 -1 sc sh gr
0.100000 slw
[] 0 sd
[] 0 sd
0 slc
0 slj
0 slc
0 slj
[] 0 sd
1.000000 1.000000 1.000000 srgb
n 25.007900 2.617110 m 25.007900 4.625006 l 32.588713 4.625006 l 32.588713 2.617110 l f
0.000000 0.000000 0.000000 srgb
n 25.007900 2.617110 m 25.007900 4.625006 l 32.588713 4.625006 l 32.588713 2.617110 l cp s
0 slc
0 slj
[] 0 sd
n 25.765981 2.617110 m 25.765981 4.625006 l s
0 slc
0 slj
[] 0 sd
n 25.007900 2.817900 m 32.588713 2.817900 l s
/Helvetica-latin1 ff 0.700000 scf sf
(ss_expression) dup sw 2 div 29.177347 ex sub 3.954266 m gs 1 -1 sc sh gr
0.100000 slw
[1.000000] 0 sd
[0.300000] 0 sd
0 slj
0 slc
n 46.316900 2.947959 m 44.809650 2.947959 l 44.809650 2.947860 l 43.789203 2.947860 l s
[] 0 sd
0 slj
0 slc
n 43.414203 2.947860 m 43.914203 2.697860 l 43.789203 2.947860 l 43.914203 3.197860 l ef
n 43.414203 2.947860 m 43.914203 2.697860 l 43.789203 2.947860 l 43.914203 3.197860 l cp s
0.100000 slw
[0.300000] 0 sd
[0.300000] 0 sd
0 slj
0 slc
n 39.572700 3.997860 m 39.572700 5.125990 l 36.038800 5.125990 l 36.038800 5.767307 l s
[] 0 sd
0 slj
0 slc
n 36.038800 6.142307 m 35.788800 5.642307 l 36.038800 5.767307 l 36.288800 5.642307 l ef
n 36.038800 6.142307 m 35.788800 5.642307 l 36.038800 5.767307 l 36.288800 5.642307 l cp s
0.100000 slw
[0.300000] 0 sd
[0.300000] 0 sd
0 slj
0 slc
n 39.572700 1.897860 m 39.572700 0.466613 l 36.780200 0.466613 l 36.780200 -0.477834 l s
[] 0 sd
0 slj
0 slc
n 36.780200 -0.852834 m 37.030200 -0.352834 l 36.780200 -0.477834 l 36.530200 -0.352834 l ef
n 36.780200 -0.852834 m 37.030200 -0.352834 l 36.780200 -0.477834 l 36.530200 -0.352834 l cp s
0.200000 slw
[] 0 sd
[] 0 sd
0 slc
n 29.411564 1.958394 m 32.132900 -0.964637 l s
0 slj
n 29.118801 1.685832 m 28.866440 2.543919 l 29.704327 2.230955 l ef
0.200000 slw
[] 0 sd
[] 0 sd
0 slc
n 29.561526 5.101964 m 31.405200 6.254110 l s
0 slj
n 29.773506 4.762753 m 28.883103 4.678005 l 29.349547 5.441176 l ef
0.200000 slw
[] 0 sd
[] 0 sd
0 slj
0 slc
n 50.694546 5.963019 m 50.694546 11.554100 l 26.903103 11.554100 l 26.903103 4.625006 l s
0 slj
n 51.094546 5.963019 m 50.694546 5.163019 l 50.294546 5.963019 l ef
0.200000 slw
[] 0 sd
[] 0 sd
0 slc
n 8.270575 -5.530454 m 8.237080 -3.513570 l s
0 slj
n 8.670520 -5.523812 m 8.283859 -6.330344 l 7.870630 -5.537096 l ef
showpage
