%!PS-Adobe-2.0 EPSF-2.0
%%Title: /home/ps/les/doc/doc/lyx/ss2pi_whilestmt.dia
%%Creator: Dia v0.93
%%CreationDate: Mon May 23 17:10:09 2005
%%For: ps
%%Orientation: Portrait
%%Magnification: 1.0000
%%BoundingBox: 0 0 1338 573
%%BeginSetup
%%EndSetup
%%EndComments
%%BeginProlog
[ /.notdef /.notdef /.notdef /.notdef /.notdef /.notdef /.notdef /.notdef /.notdef /.notdef
/.notdef /.notdef /.notdef /.notdef /.notdef /.notdef /.notdef /.notdef /.notdef /.notdef
/.notdef /.notdef /.notdef /.notdef /.notdef /.notdef /.notdef /.notdef /.notdef /.notdef
/.notdef /.notdef /space /exclam /quotedbl /numbersign /dollar /percent /ampersand /quoteright
/parenleft /parenright /asterisk /plus /comma /hyphen /period /slash /zero /one
/two /three /four /five /six /seven /eight /nine /colon /semicolon
/less /equal /greater /question /at /A /B /C /D /E
/F /G /H /I /J /K /L /M /N /O
/P /Q /R /S /T /U /V /W /X /Y
/Z /bracketleft /backslash /bracketright /asciicircum /underscore /quoteleft /a /b /c
/d /e /f /g /h /i /j /k /l /m
/n /o /p /q /r /s /t /u /v /w
/x /y /z /braceleft /bar /braceright /asciitilde /.notdef /.notdef /.notdef
/.notdef /.notdef /.notdef /.notdef /.notdef /.notdef /.notdef /.notdef /.notdef /.notdef
/.notdef /.notdef /.notdef /.notdef /.notdef /.notdef /.notdef /.notdef /.notdef /.notdef
/.notdef /.notdef /.notdef /.notdef /.notdef /.notdef /.notdef /.notdef /.notdef /.notdef
/space /exclamdown /cent /sterling /currency /yen /brokenbar /section /dieresis /copyright
/ordfeminine /guillemotleft /logicalnot /hyphen /registered /macron /degree /plusminus /twosuperior /threesuperior
/acute /mu /paragraph /periodcentered /cedilla /onesuperior /ordmasculine /guillemotright /onequarter /onehalf
/threequarters /questiondown /Agrave /Aacute /Acircumflex /Atilde /Adieresis /Aring /AE /Ccedilla
/Egrave /Eacute /Ecircumflex /Edieresis /Igrave /Iacute /Icircumflex /Idieresis /Eth /Ntilde
/Ograve /Oacute /Ocircumflex /Otilde /Odieresis /multiply /Oslash /Ugrave /Uacute /Ucircumflex
/Udieresis /Yacute /Thorn /germandbls /agrave /aacute /acircumflex /atilde /adieresis /aring
/ae /ccedilla /egrave /eacute /ecircumflex /edieresis /igrave /iacute /icircumflex /idieresis
/eth /ntilde /ograve /oacute /ocircumflex /otilde /odieresis /divide /oslash /ugrave
/uacute /ucircumflex /udieresis /yacute /thorn /ydieresis] /isolatin1encoding exch def
/cp {closepath} bind def
/c {curveto} bind def
/f {fill} bind def
/a {arc} bind def
/ef {eofill} bind def
/ex {exch} bind def
/gr {grestore} bind def
/gs {gsave} bind def
/sa {save} bind def
/rs {restore} bind def
/l {lineto} bind def
/m {moveto} bind def
/rm {rmoveto} bind def
/n {newpath} bind def
/s {stroke} bind def
/sh {show} bind def
/slc {setlinecap} bind def
/slj {setlinejoin} bind def
/slw {setlinewidth} bind def
/srgb {setrgbcolor} bind def
/rot {rotate} bind def
/sc {scale} bind def
/sd {setdash} bind def
/ff {findfont} bind def
/sf {setfont} bind def
/scf {scalefont} bind def
/sw {stringwidth pop} bind def
/tr {translate} bind def

/ellipsedict 8 dict def
ellipsedict /mtrx matrix put
/ellipse
{ ellipsedict begin
   /endangle exch def
   /startangle exch def
   /yrad exch def
   /xrad exch def
   /y exch def
   /x exch def   /savematrix mtrx currentmatrix def
   x y tr xrad yrad sc
   0 0 1 startangle endangle arc
   savematrix setmatrix
   end
} def

/mergeprocs {
dup length
3 -1 roll
dup
length
dup
5 1 roll
3 -1 roll
add
array cvx
dup
3 -1 roll
0 exch
putinterval
dup
4 2 roll
putinterval
} bind def
/Times-Roman-latin1
    /Times-Roman findfont
    dup length dict begin
	{1 index /FID ne {def} {pop pop} ifelse} forall
	/Encoding isolatin1encoding def
    currentdict end
definefont pop
/Times-Italic-latin1
    /Times-Italic findfont
    dup length dict begin
	{1 index /FID ne {def} {pop pop} ifelse} forall
	/Encoding isolatin1encoding def
    currentdict end
definefont pop
/Times-Bold-latin1
    /Times-Bold findfont
    dup length dict begin
	{1 index /FID ne {def} {pop pop} ifelse} forall
	/Encoding isolatin1encoding def
    currentdict end
definefont pop
/Times-BoldItalic-latin1
    /Times-BoldItalic findfont
    dup length dict begin
	{1 index /FID ne {def} {pop pop} ifelse} forall
	/Encoding isolatin1encoding def
    currentdict end
definefont pop
/AvantGarde-Book-latin1
    /AvantGarde-Book findfont
    dup length dict begin
	{1 index /FID ne {def} {pop pop} ifelse} forall
	/Encoding isolatin1encoding def
    currentdict end
definefont pop
/AvantGarde-BookOblique-latin1
    /AvantGarde-BookOblique findfont
    dup length dict begin
	{1 index /FID ne {def} {pop pop} ifelse} forall
	/Encoding isolatin1encoding def
    currentdict end
definefont pop
/AvantGarde-Demi-latin1
    /AvantGarde-Demi findfont
    dup length dict begin
	{1 index /FID ne {def} {pop pop} ifelse} forall
	/Encoding isolatin1encoding def
    currentdict end
definefont pop
/AvantGarde-DemiOblique-latin1
    /AvantGarde-DemiOblique findfont
    dup length dict begin
	{1 index /FID ne {def} {pop pop} ifelse} forall
	/Encoding isolatin1encoding def
    currentdict end
definefont pop
/Bookman-Light-latin1
    /Bookman-Light findfont
    dup length dict begin
	{1 index /FID ne {def} {pop pop} ifelse} forall
	/Encoding isolatin1encoding def
    currentdict end
definefont pop
/Bookman-LightItalic-latin1
    /Bookman-LightItalic findfont
    dup length dict begin
	{1 index /FID ne {def} {pop pop} ifelse} forall
	/Encoding isolatin1encoding def
    currentdict end
definefont pop
/Bookman-Demi-latin1
    /Bookman-Demi findfont
    dup length dict begin
	{1 index /FID ne {def} {pop pop} ifelse} forall
	/Encoding isolatin1encoding def
    currentdict end
definefont pop
/Bookman-DemiItalic-latin1
    /Bookman-DemiItalic findfont
    dup length dict begin
	{1 index /FID ne {def} {pop pop} ifelse} forall
	/Encoding isolatin1encoding def
    currentdict end
definefont pop
/Courier-latin1
    /Courier findfont
    dup length dict begin
	{1 index /FID ne {def} {pop pop} ifelse} forall
	/Encoding isolatin1encoding def
    currentdict end
definefont pop
/Courier-Oblique-latin1
    /Courier-Oblique findfont
    dup length dict begin
	{1 index /FID ne {def} {pop pop} ifelse} forall
	/Encoding isolatin1encoding def
    currentdict end
definefont pop
/Courier-Bold-latin1
    /Courier-Bold findfont
    dup length dict begin
	{1 index /FID ne {def} {pop pop} ifelse} forall
	/Encoding isolatin1encoding def
    currentdict end
definefont pop
/Courier-BoldOblique-latin1
    /Courier-BoldOblique findfont
    dup length dict begin
	{1 index /FID ne {def} {pop pop} ifelse} forall
	/Encoding isolatin1encoding def
    currentdict end
definefont pop
/Helvetica-latin1
    /Helvetica findfont
    dup length dict begin
	{1 index /FID ne {def} {pop pop} ifelse} forall
	/Encoding isolatin1encoding def
    currentdict end
definefont pop
/Helvetica-Oblique-latin1
    /Helvetica-Oblique findfont
    dup length dict begin
	{1 index /FID ne {def} {pop pop} ifelse} forall
	/Encoding isolatin1encoding def
    currentdict end
definefont pop
/Helvetica-Bold-latin1
    /Helvetica-Bold findfont
    dup length dict begin
	{1 index /FID ne {def} {pop pop} ifelse} forall
	/Encoding isolatin1encoding def
    currentdict end
definefont pop
/Helvetica-BoldOblique-latin1
    /Helvetica-BoldOblique findfont
    dup length dict begin
	{1 index /FID ne {def} {pop pop} ifelse} forall
	/Encoding isolatin1encoding def
    currentdict end
definefont pop
/Helvetica-Narrow-latin1
    /Helvetica-Narrow findfont
    dup length dict begin
	{1 index /FID ne {def} {pop pop} ifelse} forall
	/Encoding isolatin1encoding def
    currentdict end
definefont pop
/Helvetica-Narrow-Oblique-latin1
    /Helvetica-Narrow-Oblique findfont
    dup length dict begin
	{1 index /FID ne {def} {pop pop} ifelse} forall
	/Encoding isolatin1encoding def
    currentdict end
definefont pop
/Helvetica-Narrow-Bold-latin1
    /Helvetica-Narrow-Bold findfont
    dup length dict begin
	{1 index /FID ne {def} {pop pop} ifelse} forall
	/Encoding isolatin1encoding def
    currentdict end
definefont pop
/Helvetica-Narrow-BoldOblique-latin1
    /Helvetica-Narrow-BoldOblique findfont
    dup length dict begin
	{1 index /FID ne {def} {pop pop} ifelse} forall
	/Encoding isolatin1encoding def
    currentdict end
definefont pop
/NewCenturySchoolbook-Roman-latin1
    /NewCenturySchoolbook-Roman findfont
    dup length dict begin
	{1 index /FID ne {def} {pop pop} ifelse} forall
	/Encoding isolatin1encoding def
    currentdict end
definefont pop
/NewCenturySchoolbook-Italic-latin1
    /NewCenturySchoolbook-Italic findfont
    dup length dict begin
	{1 index /FID ne {def} {pop pop} ifelse} forall
	/Encoding isolatin1encoding def
    currentdict end
definefont pop
/NewCenturySchoolbook-Bold-latin1
    /NewCenturySchoolbook-Bold findfont
    dup length dict begin
	{1 index /FID ne {def} {pop pop} ifelse} forall
	/Encoding isolatin1encoding def
    currentdict end
definefont pop
/NewCenturySchoolbook-BoldItalic-latin1
    /NewCenturySchoolbook-BoldItalic findfont
    dup length dict begin
	{1 index /FID ne {def} {pop pop} ifelse} forall
	/Encoding isolatin1encoding def
    currentdict end
definefont pop
/Palatino-Roman-latin1
    /Palatino-Roman findfont
    dup length dict begin
	{1 index /FID ne {def} {pop pop} ifelse} forall
	/Encoding isolatin1encoding def
    currentdict end
definefont pop
/Palatino-Italic-latin1
    /Palatino-Italic findfont
    dup length dict begin
	{1 index /FID ne {def} {pop pop} ifelse} forall
	/Encoding isolatin1encoding def
    currentdict end
definefont pop
/Palatino-Bold-latin1
    /Palatino-Bold findfont
    dup length dict begin
	{1 index /FID ne {def} {pop pop} ifelse} forall
	/Encoding isolatin1encoding def
    currentdict end
definefont pop
/Palatino-BoldItalic-latin1
    /Palatino-BoldItalic findfont
    dup length dict begin
	{1 index /FID ne {def} {pop pop} ifelse} forall
	/Encoding isolatin1encoding def
    currentdict end
definefont pop
/Symbol-latin1
    /Symbol findfont
definefont pop
/ZapfChancery-MediumItalic-latin1
    /ZapfChancery-MediumItalic findfont
    dup length dict begin
	{1 index /FID ne {def} {pop pop} ifelse} forall
	/Encoding isolatin1encoding def
    currentdict end
definefont pop
/ZapfDingbats-latin1
    /ZapfDingbats findfont
    dup length dict begin
	{1 index /FID ne {def} {pop pop} ifelse} forall
	/Encoding isolatin1encoding def
    currentdict end
definefont pop
28.346000 -28.346000 scale
9.749687 -21.592250 translate
%%EndProlog


0.100000 slw
[] 0 sd
1.000000 1.000000 1.000000 srgb
n -9.699687 1.442250 m 36.800313 1.442250 l 37.400313 2.042250 l 37.400313 21.542250 l -9.699687 21.542250 l f
0.000000 0.000000 0.000000 srgb
n -9.699687 1.442250 m 36.800313 1.442250 l 37.400313 2.042250 l 37.400313 21.542250 l -9.699687 21.542250 l cp s
0.050000 slw
n 36.800313 1.442250 m 36.800313 2.042250 l 37.400313 2.042250 l s
/Courier-latin1 ff 1.680000 scf sf
(       ss layer              pi layer) -9.349687 3.742250 m gs 1 -1 sc sh gr
(    {) -9.349687 6.142250 m gs 1 -1 sc sh gr
(      while\(i\)                 bf DSP1   ) -9.349687 8.542250 m gs 1 -1 sc sh gr
(           {                     ...) -9.349687 10.942250 m gs 1 -1 sc sh gr
(                                ) -9.349687 13.342250 m gs 1 -1 sc sh gr
(           }                   ba PSPw      ) -9.349687 15.742250 m gs 1 -1 sc sh gr
(    }) -9.349687 18.142250 m gs 1 -1 sc sh gr
(                                          ) -9.349687 20.542250 m gs 1 -1 sc sh gr
0.100000 slw
[] 0 sd
[] 0 sd
0 slc
0 slj
0 slc
0 slj
[] 0 sd
1.000000 1.000000 1.000000 srgb
n -7.784025 4.685653 m -7.408137 4.685653 l -6.280472 5.110855 -5.716639 5.323456 -5.716639 5.748658 c -5.716639 6.173860 -6.092527 6.386461 -7.408137 6.811663 c -7.784025 6.811663 l -8.911690 6.386461 -9.475522 6.173860 -9.475522 5.748658 c -9.475522 5.323456 -9.099634 5.110855 -7.784025 4.685653 c f
0.000000 0.000000 0.000000 srgb
n -7.784025 4.685653 m -7.408137 4.685653 l -6.280472 5.110855 -5.716639 5.323456 -5.716639 5.748658 c -5.716639 6.173860 -6.092527 6.386461 -7.408137 6.811663 c -7.784025 6.811663 l -8.911690 6.386461 -9.475522 6.173860 -9.475522 5.748658 c -9.475522 5.323456 -9.099634 5.110855 -7.784025 4.685653 c s
/Helvetica-latin1 ff 0.700000 scf sf
(PSP1) dup sw 2 div -7.596081 ex sub 6.098658 m gs 1 -1 sc sh gr
0.100000 slw
[] 0 sd
[] 0 sd
0 slc
0 slj
0 slc
0 slj
[] 0 sd
1.000000 1.000000 1.000000 srgb
n -7.649007 16.335362 m -7.266869 16.335362 l -6.120454 16.760564 -5.547246 16.973165 -5.547246 17.398367 c -5.547246 17.823569 -5.929385 18.036170 -7.266869 18.461372 c -7.649007 18.461372 l -8.795422 18.036170 -9.368630 17.823569 -9.368630 17.398367 c -9.368630 16.973165 -8.986491 16.760564 -7.649007 16.335362 c f
0.000000 0.000000 0.000000 srgb
n -7.649007 16.335362 m -7.266869 16.335362 l -6.120454 16.760564 -5.547246 16.973165 -5.547246 17.398367 c -5.547246 17.823569 -5.929385 18.036170 -7.266869 18.461372 c -7.649007 18.461372 l -8.795422 18.036170 -9.368630 17.823569 -9.368630 17.398367 c -9.368630 16.973165 -8.986491 16.760564 -7.649007 16.335362 c s
/Helvetica-latin1 ff 0.700000 scf sf
(DSP1) dup sw 2 div -7.457938 ex sub 17.748367 m gs 1 -1 sc sh gr
0.100000 slw
[] 0 sd
[] 0 sd
0 slc
0 slj
0 slc
0 slj
[] 0 sd
1.000000 1.000000 1.000000 srgb
n -2.408661 16.376784 m -2.026523 16.376784 l -0.880108 16.801986 -0.306900 17.014587 -0.306900 17.439789 c -0.306900 17.864991 -0.689039 18.077592 -2.026523 18.502794 c -2.408661 18.502794 l -3.555076 18.077592 -4.128284 17.864991 -4.128284 17.439789 c -4.128284 17.014587 -3.746146 16.801986 -2.408661 16.376784 c f
0.000000 0.000000 0.000000 srgb
n -2.408661 16.376784 m -2.026523 16.376784 l -0.880108 16.801986 -0.306900 17.014587 -0.306900 17.439789 c -0.306900 17.864991 -0.689039 18.077592 -2.026523 18.502794 c -2.408661 18.502794 l -3.555076 18.077592 -4.128284 17.864991 -4.128284 17.439789 c -4.128284 17.014587 -3.746146 16.801986 -2.408661 16.376784 c s
/Helvetica-latin1 ff 0.700000 scf sf
(NSP1) dup sw 2 div -2.217592 ex sub 17.789789 m gs 1 -1 sc sh gr
0.100000 slw
[] 0 sd
[] 0 sd
0 slc
0 slj
0 slc
0 slj
[] 0 sd
1.000000 1.000000 1.000000 srgb
n -1.178944 9.333979 m -0.803055 9.333979 l 0.324610 9.759181 0.888442 9.971782 0.888442 10.396984 c 0.888442 10.822186 0.512554 11.034787 -0.803055 11.459989 c -1.178944 11.459989 l -2.306609 11.034787 -2.870441 10.822186 -2.870441 10.396984 c -2.870441 9.971782 -2.494553 9.759181 -1.178944 9.333979 c f
0.000000 0.000000 0.000000 srgb
n -1.178944 9.333979 m -0.803055 9.333979 l 0.324610 9.759181 0.888442 9.971782 0.888442 10.396984 c 0.888442 10.822186 0.512554 11.034787 -0.803055 11.459989 c -1.178944 11.459989 l -2.306609 11.034787 -2.870441 10.822186 -2.870441 10.396984 c -2.870441 9.971782 -2.494553 9.759181 -1.178944 9.333979 c s
/Helvetica-latin1 ff 0.700000 scf sf
(PSP2) dup sw 2 div -0.990999 ex sub 10.746984 m gs 1 -1 sc sh gr
0.100000 slw
[] 0 sd
[] 0 sd
0 slc
0 slj
0 slc
0 slj
[] 0 sd
1.000000 1.000000 1.000000 srgb
n -0.585047 14.142979 m -0.202909 14.142979 l 0.943506 14.568181 1.516714 14.780782 1.516714 15.205984 c 1.516714 15.631186 1.134575 15.843787 -0.202909 16.268989 c -0.585047 16.268989 l -1.731462 15.843787 -2.304670 15.631186 -2.304670 15.205984 c -2.304670 14.780782 -1.922531 14.568181 -0.585047 14.142979 c f
0.000000 0.000000 0.000000 srgb
n -0.585047 14.142979 m -0.202909 14.142979 l 0.943506 14.568181 1.516714 14.780782 1.516714 15.205984 c 1.516714 15.631186 1.134575 15.843787 -0.202909 16.268989 c -0.585047 16.268989 l -1.731462 15.843787 -2.304670 15.631186 -2.304670 15.205984 c -2.304670 14.780782 -1.922531 14.568181 -0.585047 14.142979 c s
/Helvetica-latin1 ff 0.700000 scf sf
(DSP2) dup sw 2 div -0.393978 ex sub 15.555984 m gs 1 -1 sc sh gr
0.100000 slw
[] 0 sd
[] 0 sd
0 slc
0 slj
0 slc
0 slj
[] 0 sd
1.000000 1.000000 1.000000 srgb
n 4.511843 14.355143 m 4.893982 14.355143 l 6.040397 14.780345 6.613604 14.992946 6.613604 15.418148 c 6.613604 15.843350 6.231466 16.055951 4.893982 16.481153 c 4.511843 16.481153 l 3.365428 16.055951 2.792221 15.843350 2.792221 15.418148 c 2.792221 14.992946 3.174359 14.780345 4.511843 14.355143 c f
0.000000 0.000000 0.000000 srgb
n 4.511843 14.355143 m 4.893982 14.355143 l 6.040397 14.780345 6.613604 14.992946 6.613604 15.418148 c 6.613604 15.843350 6.231466 16.055951 4.893982 16.481153 c 4.511843 16.481153 l 3.365428 16.055951 2.792221 15.843350 2.792221 15.418148 c 2.792221 14.992946 3.174359 14.780345 4.511843 14.355143 c s
/Helvetica-latin1 ff 0.700000 scf sf
(NSP2) dup sw 2 div 4.702912 ex sub 15.768148 m gs 1 -1 sc sh gr
0.100000 slw
[] 0 sd
[] 0 sd
0 slc
0 slj
0 slc
0 slj
[] 0 sd
1.000000 1.000000 1.000000 srgb
n -6.350975 6.858730 m -5.956337 6.858730 l -4.772422 7.283932 -4.180464 7.496533 -4.180464 7.921735 c -4.180464 8.346937 -4.575103 8.559538 -5.956337 8.984740 c -6.350975 8.984740 l -7.534890 8.559538 -8.126848 8.346937 -8.126848 7.921735 c -8.126848 7.496533 -7.732210 7.283932 -6.350975 6.858730 c f
0.000000 0.000000 0.000000 srgb
n -6.350975 6.858730 m -5.956337 6.858730 l -4.772422 7.283932 -4.180464 7.496533 -4.180464 7.921735 c -4.180464 8.346937 -4.575103 8.559538 -5.956337 8.984740 c -6.350975 8.984740 l -7.534890 8.559538 -8.126848 8.346937 -8.126848 7.921735 c -8.126848 7.496533 -7.732210 7.283932 -6.350975 6.858730 c s
/Helvetica-latin1 ff 0.700000 scf sf
(PSPw) dup sw 2 div -6.153656 ex sub 8.271735 m gs 1 -1 sc sh gr
0.100000 slw
[] 0 sd
[] 0 sd
0 slc
0 slj
0 slc
0 slj
[] 0 sd
1.000000 1.000000 1.000000 srgb
n 6.779775 6.838006 m 7.180663 6.838006 l 8.383329 7.263208 8.984661 7.475809 8.984661 7.901011 c 8.984661 8.326213 8.583773 8.538814 7.180663 8.964016 c 6.779775 8.964016 l 5.577110 8.538814 4.975778 8.326213 4.975778 7.901011 c 4.975778 7.475809 5.376666 7.263208 6.779775 6.838006 c f
0.000000 0.000000 0.000000 srgb
n 6.779775 6.838006 m 7.180663 6.838006 l 8.383329 7.263208 8.984661 7.475809 8.984661 7.901011 c 8.984661 8.326213 8.583773 8.538814 7.180663 8.964016 c 6.779775 8.964016 l 5.577110 8.538814 4.975778 8.326213 4.975778 7.901011 c 4.975778 7.475809 5.376666 7.263208 6.779775 6.838006 c s
/Helvetica-latin1 ff 0.700000 scf sf
(NSPw) dup sw 2 div 6.980219 ex sub 8.251011 m gs 1 -1 sc sh gr
0.100000 slw
[] 0 sd
[] 0 sd
0 slc
0 slj
0 slc
0 slj
[] 0 sd
1.000000 1.000000 1.000000 srgb
n 18.664109 7.041615 m 19.058747 7.041615 l 20.242663 7.466817 20.834620 7.679418 20.834620 8.104620 c 20.834620 8.529822 20.439982 8.742423 19.058747 9.167625 c 18.664109 9.167625 l 17.480194 8.742423 16.888237 8.529822 16.888237 8.104620 c 16.888237 7.679418 17.282875 7.466817 18.664109 7.041615 c f
0.000000 0.000000 0.000000 srgb
n 18.664109 7.041615 m 19.058747 7.041615 l 20.242663 7.466817 20.834620 7.679418 20.834620 8.104620 c 20.834620 8.529822 20.439982 8.742423 19.058747 9.167625 c 18.664109 9.167625 l 17.480194 8.742423 16.888237 8.529822 16.888237 8.104620 c 16.888237 7.679418 17.282875 7.466817 18.664109 7.041615 c s
/Helvetica-latin1 ff 0.700000 scf sf
(PSPw) dup sw 2 div 18.861428 ex sub 8.454620 m gs 1 -1 sc sh gr
0.100000 slw
[] 0 sd
[] 0 sd
0 slc
0 slj
0 slc
0 slj
[] 0 sd
1.000000 1.000000 1.000000 srgb
n 31.560855 6.825847 m 31.961743 6.825847 l 33.164408 7.251049 33.765740 7.463650 33.765740 7.888852 c 33.765740 8.314054 33.364852 8.526655 31.961743 8.951857 c 31.560855 8.951857 l 30.358189 8.526655 29.756857 8.314054 29.756857 7.888852 c 29.756857 7.463650 30.157745 7.251049 31.560855 6.825847 c f
0.000000 0.000000 0.000000 srgb
n 31.560855 6.825847 m 31.961743 6.825847 l 33.164408 7.251049 33.765740 7.463650 33.765740 7.888852 c 33.765740 8.314054 33.364852 8.526655 31.961743 8.951857 c 31.560855 8.951857 l 30.358189 8.526655 29.756857 8.314054 29.756857 7.888852 c 29.756857 7.463650 30.157745 7.251049 31.560855 6.825847 c s
/Helvetica-latin1 ff 0.700000 scf sf
(NSPw) dup sw 2 div 31.761299 ex sub 8.238852 m gs 1 -1 sc sh gr
0.100000 slw
[] 0 sd
[] 0 sd
0 slc
0 slj
0 slc
0 slj
[] 0 sd
1.000000 1.000000 1.000000 srgb
n 18.738152 14.092995 m 19.120290 14.092995 l 20.266705 14.518197 20.839913 14.730798 20.839913 15.156000 c 20.839913 15.581202 20.457774 15.793803 19.120290 16.219005 c 18.738152 16.219005 l 17.591737 15.793803 17.018529 15.581202 17.018529 15.156000 c 17.018529 14.730798 17.400668 14.518197 18.738152 14.092995 c f
0.000000 0.000000 0.000000 srgb
n 18.738152 14.092995 m 19.120290 14.092995 l 20.266705 14.518197 20.839913 14.730798 20.839913 15.156000 c 20.839913 15.581202 20.457774 15.793803 19.120290 16.219005 c 18.738152 16.219005 l 17.591737 15.793803 17.018529 15.581202 17.018529 15.156000 c 17.018529 14.730798 17.400668 14.518197 18.738152 14.092995 c s
/Helvetica-latin1 ff 0.700000 scf sf
(NSP2) dup sw 2 div 18.929221 ex sub 15.506000 m gs 1 -1 sc sh gr
0.100000 slw
[] 0 sd
[] 0 sd
0 slc
0 slj
0 slc
0 slj
[] 0 sd
1.000000 1.000000 1.000000 srgb
n 31.626554 13.977222 m 32.008692 13.977222 l 33.155107 14.402424 33.728315 14.615025 33.728315 15.040227 c 33.728315 15.465429 33.346176 15.678030 32.008692 16.103232 c 31.626554 16.103232 l 30.480139 15.678030 29.906931 15.465429 29.906931 15.040227 c 29.906931 14.615025 30.289069 14.402424 31.626554 13.977222 c f
0.000000 0.000000 0.000000 srgb
n 31.626554 13.977222 m 32.008692 13.977222 l 33.155107 14.402424 33.728315 14.615025 33.728315 15.040227 c 33.728315 15.465429 33.346176 15.678030 32.008692 16.103232 c 31.626554 16.103232 l 30.480139 15.678030 29.906931 15.465429 29.906931 15.040227 c 29.906931 14.615025 30.289069 14.402424 31.626554 13.977222 c s
/Helvetica-latin1 ff 0.700000 scf sf
(DSP1) dup sw 2 div 31.817623 ex sub 15.390227 m gs 1 -1 sc sh gr
0.100000 slw
[] 0 sd
[] 0 sd
0 slc
0 slj
0 slc
0 slj
[] 0 sd
1.000000 1.000000 1.000000 srgb
n 11.205652 8.703070 m 12.690801 8.703070 l 12.690801 7.200241 l 14.175949 10.205899 l 12.690801 13.211557 l 12.690801 11.708728 l 11.205652 11.708728 l f
0.000000 0.000000 0.000000 srgb
n 11.205652 8.703070 m 12.690801 8.703070 l 12.690801 7.200241 l 14.175949 10.205899 l 12.690801 13.211557 l 12.690801 11.708728 l 11.205652 11.708728 l cp s
0.010000 slw
0 slc
0 slj
[] 0 sd
n 11.205652 8.703070 m 12.690801 8.703070 l 12.690801 7.200241 l 14.175949 10.205899 l 12.690801 13.211557 l 12.690801 11.708728 l 11.205652 11.708728 l cp s
showpage
