<?xml version="1.0" encoding="UTF-8"?>
<dia:diagram xmlns:dia="http://www.lysator.liu.se/~alla/dia/">
  <dia:diagramdata>
    <dia:attribute name="background">
      <dia:color val="#ffffff"/>
    </dia:attribute>
    <dia:attribute name="pagebreak">
      <dia:color val="#000099"/>
    </dia:attribute>
    <dia:attribute name="paper">
      <dia:composite type="paper">
        <dia:attribute name="name">
          <dia:string>#A4#</dia:string>
        </dia:attribute>
        <dia:attribute name="tmargin">
          <dia:real val="2.8222"/>
        </dia:attribute>
        <dia:attribute name="bmargin">
          <dia:real val="2.8222"/>
        </dia:attribute>
        <dia:attribute name="lmargin">
          <dia:real val="2.8222"/>
        </dia:attribute>
        <dia:attribute name="rmargin">
          <dia:real val="2.8222"/>
        </dia:attribute>
        <dia:attribute name="is_portrait">
          <dia:boolean val="true"/>
        </dia:attribute>
        <dia:attribute name="scaling">
          <dia:real val="1"/>
        </dia:attribute>
        <dia:attribute name="fitto">
          <dia:boolean val="false"/>
        </dia:attribute>
      </dia:composite>
    </dia:attribute>
    <dia:attribute name="grid">
      <dia:composite type="grid">
        <dia:attribute name="width_x">
          <dia:real val="1"/>
        </dia:attribute>
        <dia:attribute name="width_y">
          <dia:real val="1"/>
        </dia:attribute>
        <dia:attribute name="visible_x">
          <dia:int val="1"/>
        </dia:attribute>
        <dia:attribute name="visible_y">
          <dia:int val="1"/>
        </dia:attribute>
        <dia:composite type="color"/>
      </dia:composite>
    </dia:attribute>
    <dia:attribute name="color">
      <dia:color val="#d8e5e5"/>
    </dia:attribute>
    <dia:attribute name="guides">
      <dia:composite type="guides">
        <dia:attribute name="hguides"/>
        <dia:attribute name="vguides"/>
      </dia:composite>
    </dia:attribute>
  </dia:diagramdata>
  <dia:layer name="Background" visible="true">
    <dia:object type="Standard - Line" version="0" id="O0">
      <dia:attribute name="obj_pos">
        <dia:point val="6.49,34.465"/>
      </dia:attribute>
      <dia:attribute name="obj_bb">
        <dia:rectangle val="4.45309,31.8005;6.55947,34.5345"/>
      </dia:attribute>
      <dia:attribute name="conn_endpoints">
        <dia:point val="6.49,34.465"/>
        <dia:point val="4.89444,32.1234"/>
      </dia:attribute>
      <dia:attribute name="numcp">
        <dia:int val="1"/>
      </dia:attribute>
      <dia:attribute name="end_arrow">
        <dia:enum val="22"/>
      </dia:attribute>
      <dia:attribute name="end_arrow_length">
        <dia:real val="0.5"/>
      </dia:attribute>
      <dia:attribute name="end_arrow_width">
        <dia:real val="0.5"/>
      </dia:attribute>
      <dia:connections>
        <dia:connection handle="0" to="O3" connection="0"/>
        <dia:connection handle="1" to="O1" connection="1"/>
      </dia:connections>
    </dia:object>
    <dia:object type="SDL - Service" version="0" id="O1">
      <dia:attribute name="obj_pos">
        <dia:point val="3.64,29.9974"/>
      </dia:attribute>
      <dia:attribute name="obj_bb">
        <dia:rectangle val="3.59,29.9474;6.19888,32.1734"/>
      </dia:attribute>
      <dia:attribute name="elem_corner">
        <dia:point val="3.64,29.9974"/>
      </dia:attribute>
      <dia:attribute name="elem_width">
        <dia:real val="2.50888"/>
      </dia:attribute>
      <dia:attribute name="elem_height">
        <dia:real val="2.12601"/>
      </dia:attribute>
      <dia:attribute name="line_width">
        <dia:real val="0.1"/>
      </dia:attribute>
      <dia:attribute name="line_colour">
        <dia:color val="#000000"/>
      </dia:attribute>
      <dia:attribute name="fill_colour">
        <dia:color val="#ffffff"/>
      </dia:attribute>
      <dia:attribute name="show_background">
        <dia:boolean val="true"/>
      </dia:attribute>
      <dia:attribute name="line_style">
        <dia:enum val="0"/>
        <dia:real val="1"/>
      </dia:attribute>
      <dia:attribute name="text">
        <dia:composite type="text">
          <dia:attribute name="string">
            <dia:string>#SP#</dia:string>
          </dia:attribute>
          <dia:attribute name="font">
            <dia:font family="sans" style="0" name="Helvetica"/>
          </dia:attribute>
          <dia:attribute name="height">
            <dia:real val="1"/>
          </dia:attribute>
          <dia:attribute name="pos">
            <dia:point val="4.89444,31.3104"/>
          </dia:attribute>
          <dia:attribute name="color">
            <dia:color val="#000000"/>
          </dia:attribute>
          <dia:attribute name="alignment">
            <dia:enum val="1"/>
          </dia:attribute>
        </dia:composite>
      </dia:attribute>
      <dia:attribute name="flip_horizontal">
        <dia:boolean val="false"/>
      </dia:attribute>
      <dia:attribute name="flip_vertical">
        <dia:boolean val="false"/>
      </dia:attribute>
    </dia:object>
    <dia:object type="SDL - Service" version="0" id="O2">
      <dia:attribute name="obj_pos">
        <dia:point val="11.64,29.9974"/>
      </dia:attribute>
      <dia:attribute name="obj_bb">
        <dia:rectangle val="11.59,29.9474;14.1989,32.1734"/>
      </dia:attribute>
      <dia:attribute name="elem_corner">
        <dia:point val="11.64,29.9974"/>
      </dia:attribute>
      <dia:attribute name="elem_width">
        <dia:real val="2.50888"/>
      </dia:attribute>
      <dia:attribute name="elem_height">
        <dia:real val="2.12601"/>
      </dia:attribute>
      <dia:attribute name="line_width">
        <dia:real val="0.1"/>
      </dia:attribute>
      <dia:attribute name="line_colour">
        <dia:color val="#000000"/>
      </dia:attribute>
      <dia:attribute name="fill_colour">
        <dia:color val="#ffffff"/>
      </dia:attribute>
      <dia:attribute name="show_background">
        <dia:boolean val="true"/>
      </dia:attribute>
      <dia:attribute name="line_style">
        <dia:enum val="0"/>
        <dia:real val="1"/>
      </dia:attribute>
      <dia:attribute name="text">
        <dia:composite type="text">
          <dia:attribute name="string">
            <dia:string>#SP#</dia:string>
          </dia:attribute>
          <dia:attribute name="font">
            <dia:font family="sans" style="0" name="Helvetica"/>
          </dia:attribute>
          <dia:attribute name="height">
            <dia:real val="1"/>
          </dia:attribute>
          <dia:attribute name="pos">
            <dia:point val="12.8944,31.3104"/>
          </dia:attribute>
          <dia:attribute name="color">
            <dia:color val="#000000"/>
          </dia:attribute>
          <dia:attribute name="alignment">
            <dia:enum val="1"/>
          </dia:attribute>
        </dia:composite>
      </dia:attribute>
      <dia:attribute name="flip_horizontal">
        <dia:boolean val="false"/>
      </dia:attribute>
      <dia:attribute name="flip_vertical">
        <dia:boolean val="false"/>
      </dia:attribute>
    </dia:object>
    <dia:object type="UML - Note" version="0" id="O3">
      <dia:attribute name="obj_pos">
        <dia:point val="6.49,34.465"/>
      </dia:attribute>
      <dia:attribute name="obj_bb">
        <dia:rectangle val="6.44,34.415;11.94,37.415"/>
      </dia:attribute>
      <dia:attribute name="elem_corner">
        <dia:point val="6.49,34.465"/>
      </dia:attribute>
      <dia:attribute name="elem_width">
        <dia:real val="5.4"/>
      </dia:attribute>
      <dia:attribute name="elem_height">
        <dia:real val="2.9"/>
      </dia:attribute>
      <dia:attribute name="line_colour">
        <dia:color val="#000000"/>
      </dia:attribute>
      <dia:attribute name="fill_colour">
        <dia:color val="#ffffff"/>
      </dia:attribute>
      <dia:attribute name="text">
        <dia:composite type="text">
          <dia:attribute name="string">
            <dia:string>#expression
statement#</dia:string>
          </dia:attribute>
          <dia:attribute name="font">
            <dia:font family="monospace" style="0" name="Courier"/>
          </dia:attribute>
          <dia:attribute name="height">
            <dia:real val="1"/>
          </dia:attribute>
          <dia:attribute name="pos">
            <dia:point val="6.84,35.865"/>
          </dia:attribute>
          <dia:attribute name="color">
            <dia:color val="#000000"/>
          </dia:attribute>
          <dia:attribute name="alignment">
            <dia:enum val="0"/>
          </dia:attribute>
        </dia:composite>
      </dia:attribute>
    </dia:object>
    <dia:object type="Standard - Line" version="0" id="O4">
      <dia:attribute name="obj_pos">
        <dia:point val="11.89,34.465"/>
      </dia:attribute>
      <dia:attribute name="obj_bb">
        <dia:rectangle val="11.8243,31.8804;13.3737,34.5307"/>
      </dia:attribute>
      <dia:attribute name="conn_endpoints">
        <dia:point val="11.89,34.465"/>
        <dia:point val="12.8944,32.1234"/>
      </dia:attribute>
      <dia:attribute name="numcp">
        <dia:int val="1"/>
      </dia:attribute>
      <dia:attribute name="end_arrow">
        <dia:enum val="22"/>
      </dia:attribute>
      <dia:attribute name="end_arrow_length">
        <dia:real val="0.5"/>
      </dia:attribute>
      <dia:attribute name="end_arrow_width">
        <dia:real val="0.5"/>
      </dia:attribute>
      <dia:connections>
        <dia:connection handle="0" to="O3" connection="2"/>
        <dia:connection handle="1" to="O2" connection="1"/>
      </dia:connections>
    </dia:object>
    <dia:object type="Standard - Line" version="0" id="O5">
      <dia:attribute name="obj_pos">
        <dia:point val="24.19,34.2826"/>
      </dia:attribute>
      <dia:attribute name="obj_bb">
        <dia:rectangle val="22.0745,31.8373;24.2603,34.3529"/>
      </dia:attribute>
      <dia:attribute name="conn_endpoints">
        <dia:point val="24.19,34.2826"/>
        <dia:point val="22.4944,32.191"/>
      </dia:attribute>
      <dia:attribute name="numcp">
        <dia:int val="1"/>
      </dia:attribute>
      <dia:attribute name="end_arrow">
        <dia:enum val="22"/>
      </dia:attribute>
      <dia:attribute name="end_arrow_length">
        <dia:real val="0.5"/>
      </dia:attribute>
      <dia:attribute name="end_arrow_width">
        <dia:real val="0.5"/>
      </dia:attribute>
      <dia:connections>
        <dia:connection handle="0" to="O8" connection="0"/>
        <dia:connection handle="1" to="O6" connection="1"/>
      </dia:connections>
    </dia:object>
    <dia:object type="SDL - Service" version="0" id="O6">
      <dia:attribute name="obj_pos">
        <dia:point val="21.24,30.065"/>
      </dia:attribute>
      <dia:attribute name="obj_bb">
        <dia:rectangle val="21.19,30.015;23.7989,32.241"/>
      </dia:attribute>
      <dia:attribute name="elem_corner">
        <dia:point val="21.24,30.065"/>
      </dia:attribute>
      <dia:attribute name="elem_width">
        <dia:real val="2.50888"/>
      </dia:attribute>
      <dia:attribute name="elem_height">
        <dia:real val="2.12601"/>
      </dia:attribute>
      <dia:attribute name="line_width">
        <dia:real val="0.1"/>
      </dia:attribute>
      <dia:attribute name="line_colour">
        <dia:color val="#000000"/>
      </dia:attribute>
      <dia:attribute name="fill_colour">
        <dia:color val="#ffffff"/>
      </dia:attribute>
      <dia:attribute name="show_background">
        <dia:boolean val="true"/>
      </dia:attribute>
      <dia:attribute name="line_style">
        <dia:enum val="0"/>
        <dia:real val="1"/>
      </dia:attribute>
      <dia:attribute name="text">
        <dia:composite type="text">
          <dia:attribute name="string">
            <dia:string>#SP#</dia:string>
          </dia:attribute>
          <dia:attribute name="font">
            <dia:font family="sans" style="0" name="Helvetica"/>
          </dia:attribute>
          <dia:attribute name="height">
            <dia:real val="1"/>
          </dia:attribute>
          <dia:attribute name="pos">
            <dia:point val="22.4944,31.378"/>
          </dia:attribute>
          <dia:attribute name="color">
            <dia:color val="#000000"/>
          </dia:attribute>
          <dia:attribute name="alignment">
            <dia:enum val="1"/>
          </dia:attribute>
        </dia:composite>
      </dia:attribute>
      <dia:attribute name="flip_horizontal">
        <dia:boolean val="false"/>
      </dia:attribute>
      <dia:attribute name="flip_vertical">
        <dia:boolean val="false"/>
      </dia:attribute>
    </dia:object>
    <dia:object type="SDL - Service" version="0" id="O7">
      <dia:attribute name="obj_pos">
        <dia:point val="29.09,30.065"/>
      </dia:attribute>
      <dia:attribute name="obj_bb">
        <dia:rectangle val="29.04,30.015;31.6489,32.241"/>
      </dia:attribute>
      <dia:attribute name="elem_corner">
        <dia:point val="29.09,30.065"/>
      </dia:attribute>
      <dia:attribute name="elem_width">
        <dia:real val="2.50888"/>
      </dia:attribute>
      <dia:attribute name="elem_height">
        <dia:real val="2.12601"/>
      </dia:attribute>
      <dia:attribute name="line_width">
        <dia:real val="0.1"/>
      </dia:attribute>
      <dia:attribute name="line_colour">
        <dia:color val="#000000"/>
      </dia:attribute>
      <dia:attribute name="fill_colour">
        <dia:color val="#ffffff"/>
      </dia:attribute>
      <dia:attribute name="show_background">
        <dia:boolean val="true"/>
      </dia:attribute>
      <dia:attribute name="line_style">
        <dia:enum val="0"/>
        <dia:real val="1"/>
      </dia:attribute>
      <dia:attribute name="text">
        <dia:composite type="text">
          <dia:attribute name="string">
            <dia:string>#SP#</dia:string>
          </dia:attribute>
          <dia:attribute name="font">
            <dia:font family="sans" style="0" name="Helvetica"/>
          </dia:attribute>
          <dia:attribute name="height">
            <dia:real val="1"/>
          </dia:attribute>
          <dia:attribute name="pos">
            <dia:point val="30.3444,31.378"/>
          </dia:attribute>
          <dia:attribute name="color">
            <dia:color val="#000000"/>
          </dia:attribute>
          <dia:attribute name="alignment">
            <dia:enum val="1"/>
          </dia:attribute>
        </dia:composite>
      </dia:attribute>
      <dia:attribute name="flip_horizontal">
        <dia:boolean val="false"/>
      </dia:attribute>
      <dia:attribute name="flip_vertical">
        <dia:boolean val="false"/>
      </dia:attribute>
    </dia:object>
    <dia:object type="UML - Note" version="0" id="O8">
      <dia:attribute name="obj_pos">
        <dia:point val="24.19,34.2826"/>
      </dia:attribute>
      <dia:attribute name="obj_bb">
        <dia:rectangle val="24.14,34.2326;29.19,36.2326"/>
      </dia:attribute>
      <dia:attribute name="elem_corner">
        <dia:point val="24.19,34.2826"/>
      </dia:attribute>
      <dia:attribute name="elem_width">
        <dia:real val="4.95"/>
      </dia:attribute>
      <dia:attribute name="elem_height">
        <dia:real val="1.9"/>
      </dia:attribute>
      <dia:attribute name="line_colour">
        <dia:color val="#000000"/>
      </dia:attribute>
      <dia:attribute name="fill_colour">
        <dia:color val="#ffffff"/>
      </dia:attribute>
      <dia:attribute name="text">
        <dia:composite type="text">
          <dia:attribute name="string">
            <dia:string>#statement#</dia:string>
          </dia:attribute>
          <dia:attribute name="font">
            <dia:font family="monospace" style="0" name="Courier"/>
          </dia:attribute>
          <dia:attribute name="height">
            <dia:real val="1"/>
          </dia:attribute>
          <dia:attribute name="pos">
            <dia:point val="24.54,35.6826"/>
          </dia:attribute>
          <dia:attribute name="color">
            <dia:color val="#000000"/>
          </dia:attribute>
          <dia:attribute name="alignment">
            <dia:enum val="0"/>
          </dia:attribute>
        </dia:composite>
      </dia:attribute>
    </dia:object>
    <dia:object type="Standard - Line" version="0" id="O9">
      <dia:attribute name="obj_pos">
        <dia:point val="29.14,34.2826"/>
      </dia:attribute>
      <dia:attribute name="obj_bb">
        <dia:rectangle val="29.0717,31.8982;30.8027,34.3509"/>
      </dia:attribute>
      <dia:attribute name="conn_endpoints">
        <dia:point val="29.14,34.2826"/>
        <dia:point val="30.3444,32.191"/>
      </dia:attribute>
      <dia:attribute name="numcp">
        <dia:int val="1"/>
      </dia:attribute>
      <dia:attribute name="end_arrow">
        <dia:enum val="22"/>
      </dia:attribute>
      <dia:attribute name="end_arrow_length">
        <dia:real val="0.5"/>
      </dia:attribute>
      <dia:attribute name="end_arrow_width">
        <dia:real val="0.5"/>
      </dia:attribute>
      <dia:connections>
        <dia:connection handle="0" to="O8" connection="2"/>
        <dia:connection handle="1" to="O7" connection="1"/>
      </dia:connections>
    </dia:object>
    <dia:object type="Standard - Line" version="0" id="O10">
      <dia:attribute name="obj_pos">
        <dia:point val="11.64,31.0604"/>
      </dia:attribute>
      <dia:attribute name="obj_bb">
        <dia:rectangle val="6.04888,30.5604;11.74,31.5604"/>
      </dia:attribute>
      <dia:attribute name="conn_endpoints">
        <dia:point val="11.64,31.0604"/>
        <dia:point val="6.14888,31.0604"/>
      </dia:attribute>
      <dia:attribute name="numcp">
        <dia:int val="1"/>
      </dia:attribute>
      <dia:attribute name="line_width">
        <dia:real val="0.2"/>
      </dia:attribute>
      <dia:attribute name="start_arrow">
        <dia:enum val="3"/>
      </dia:attribute>
      <dia:attribute name="start_arrow_length">
        <dia:real val="0.5"/>
      </dia:attribute>
      <dia:attribute name="start_arrow_width">
        <dia:real val="0.5"/>
      </dia:attribute>
      <dia:attribute name="end_arrow">
        <dia:enum val="3"/>
      </dia:attribute>
      <dia:attribute name="end_arrow_length">
        <dia:real val="0.5"/>
      </dia:attribute>
      <dia:attribute name="end_arrow_width">
        <dia:real val="0.5"/>
      </dia:attribute>
      <dia:connections>
        <dia:connection handle="0" to="O2" connection="3"/>
        <dia:connection handle="1" to="O1" connection="2"/>
      </dia:connections>
    </dia:object>
    <dia:object type="Standard - Line" version="0" id="O11">
      <dia:attribute name="obj_pos">
        <dia:point val="29.09,31.128"/>
      </dia:attribute>
      <dia:attribute name="obj_bb">
        <dia:rectangle val="23.6489,30.628;29.19,31.628"/>
      </dia:attribute>
      <dia:attribute name="conn_endpoints">
        <dia:point val="29.09,31.128"/>
        <dia:point val="23.7489,31.128"/>
      </dia:attribute>
      <dia:attribute name="numcp">
        <dia:int val="1"/>
      </dia:attribute>
      <dia:attribute name="line_width">
        <dia:real val="0.2"/>
      </dia:attribute>
      <dia:attribute name="start_arrow">
        <dia:enum val="3"/>
      </dia:attribute>
      <dia:attribute name="start_arrow_length">
        <dia:real val="0.5"/>
      </dia:attribute>
      <dia:attribute name="start_arrow_width">
        <dia:real val="0.5"/>
      </dia:attribute>
      <dia:attribute name="end_arrow">
        <dia:enum val="3"/>
      </dia:attribute>
      <dia:attribute name="end_arrow_length">
        <dia:real val="0.5"/>
      </dia:attribute>
      <dia:attribute name="end_arrow_width">
        <dia:real val="0.5"/>
      </dia:attribute>
      <dia:connections>
        <dia:connection handle="0" to="O7" connection="3"/>
        <dia:connection handle="1" to="O6" connection="2"/>
      </dia:connections>
    </dia:object>
    <dia:object type="Standard - Line" version="0" id="O12">
      <dia:attribute name="obj_pos">
        <dia:point val="21.24,31.128"/>
      </dia:attribute>
      <dia:attribute name="obj_bb">
        <dia:rectangle val="14.0441,30.5595;21.3448,31.6289"/>
      </dia:attribute>
      <dia:attribute name="conn_endpoints">
        <dia:point val="21.24,31.128"/>
        <dia:point val="14.1489,31.0604"/>
      </dia:attribute>
      <dia:attribute name="numcp">
        <dia:int val="1"/>
      </dia:attribute>
      <dia:attribute name="line_width">
        <dia:real val="0.2"/>
      </dia:attribute>
      <dia:attribute name="start_arrow">
        <dia:enum val="3"/>
      </dia:attribute>
      <dia:attribute name="start_arrow_length">
        <dia:real val="0.5"/>
      </dia:attribute>
      <dia:attribute name="start_arrow_width">
        <dia:real val="0.5"/>
      </dia:attribute>
      <dia:attribute name="end_arrow">
        <dia:enum val="3"/>
      </dia:attribute>
      <dia:attribute name="end_arrow_length">
        <dia:real val="0.5"/>
      </dia:attribute>
      <dia:attribute name="end_arrow_width">
        <dia:real val="0.5"/>
      </dia:attribute>
      <dia:connections>
        <dia:connection handle="0" to="O6" connection="3"/>
        <dia:connection handle="1" to="O2" connection="2"/>
      </dia:connections>
    </dia:object>
    <dia:object type="Standard - Text" version="0" id="O13">
      <dia:attribute name="obj_pos">
        <dia:point val="6.2,33.1"/>
      </dia:attribute>
      <dia:attribute name="obj_bb">
        <dia:rectangle val="6.2,32.35;7.35,33.55"/>
      </dia:attribute>
      <dia:attribute name="text">
        <dia:composite type="text">
          <dia:attribute name="string">
            <dia:string>#psp#</dia:string>
          </dia:attribute>
          <dia:attribute name="font">
            <dia:font family="sans" style="0" name="Helvetica"/>
          </dia:attribute>
          <dia:attribute name="height">
            <dia:real val="1"/>
          </dia:attribute>
          <dia:attribute name="pos">
            <dia:point val="6.2,33.1"/>
          </dia:attribute>
          <dia:attribute name="color">
            <dia:color val="#000000"/>
          </dia:attribute>
          <dia:attribute name="alignment">
            <dia:enum val="0"/>
          </dia:attribute>
        </dia:composite>
      </dia:attribute>
    </dia:object>
    <dia:object type="Standard - Text" version="0" id="O14">
      <dia:attribute name="obj_pos">
        <dia:point val="23.785,33.515"/>
      </dia:attribute>
      <dia:attribute name="obj_bb">
        <dia:rectangle val="23.785,32.765;24.935,33.965"/>
      </dia:attribute>
      <dia:attribute name="text">
        <dia:composite type="text">
          <dia:attribute name="string">
            <dia:string>#psp#</dia:string>
          </dia:attribute>
          <dia:attribute name="font">
            <dia:font family="sans" style="0" name="Helvetica"/>
          </dia:attribute>
          <dia:attribute name="height">
            <dia:real val="1"/>
          </dia:attribute>
          <dia:attribute name="pos">
            <dia:point val="23.785,33.515"/>
          </dia:attribute>
          <dia:attribute name="color">
            <dia:color val="#000000"/>
          </dia:attribute>
          <dia:attribute name="alignment">
            <dia:enum val="0"/>
          </dia:attribute>
        </dia:composite>
      </dia:attribute>
    </dia:object>
    <dia:object type="Standard - Text" version="0" id="O15">
      <dia:attribute name="obj_pos">
        <dia:point val="10.935,33.115"/>
      </dia:attribute>
      <dia:attribute name="obj_bb">
        <dia:rectangle val="10.935,32.365;12.085,33.565"/>
      </dia:attribute>
      <dia:attribute name="text">
        <dia:composite type="text">
          <dia:attribute name="string">
            <dia:string>#nsp#</dia:string>
          </dia:attribute>
          <dia:attribute name="font">
            <dia:font family="sans" style="0" name="Helvetica"/>
          </dia:attribute>
          <dia:attribute name="height">
            <dia:real val="1"/>
          </dia:attribute>
          <dia:attribute name="pos">
            <dia:point val="10.935,33.115"/>
          </dia:attribute>
          <dia:attribute name="color">
            <dia:color val="#000000"/>
          </dia:attribute>
          <dia:attribute name="alignment">
            <dia:enum val="0"/>
          </dia:attribute>
        </dia:composite>
      </dia:attribute>
    </dia:object>
    <dia:object type="Standard - Text" version="0" id="O16">
      <dia:attribute name="obj_pos">
        <dia:point val="28.335,33.665"/>
      </dia:attribute>
      <dia:attribute name="obj_bb">
        <dia:rectangle val="28.335,32.915;29.485,34.115"/>
      </dia:attribute>
      <dia:attribute name="text">
        <dia:composite type="text">
          <dia:attribute name="string">
            <dia:string>#nsp#</dia:string>
          </dia:attribute>
          <dia:attribute name="font">
            <dia:font family="sans" style="0" name="Helvetica"/>
          </dia:attribute>
          <dia:attribute name="height">
            <dia:real val="1"/>
          </dia:attribute>
          <dia:attribute name="pos">
            <dia:point val="28.335,33.665"/>
          </dia:attribute>
          <dia:attribute name="color">
            <dia:color val="#000000"/>
          </dia:attribute>
          <dia:attribute name="alignment">
            <dia:enum val="0"/>
          </dia:attribute>
        </dia:composite>
      </dia:attribute>
    </dia:object>
    <dia:object type="UML - Note" version="0" id="O17">
      <dia:attribute name="obj_pos">
        <dia:point val="14.635,34.515"/>
      </dia:attribute>
      <dia:attribute name="obj_bb">
        <dia:rectangle val="14.585,34.465;21.435,37.465"/>
      </dia:attribute>
      <dia:attribute name="elem_corner">
        <dia:point val="14.635,34.515"/>
      </dia:attribute>
      <dia:attribute name="elem_width">
        <dia:real val="6.75"/>
      </dia:attribute>
      <dia:attribute name="elem_height">
        <dia:real val="2.9"/>
      </dia:attribute>
      <dia:attribute name="line_colour">
        <dia:color val="#000000"/>
      </dia:attribute>
      <dia:attribute name="fill_colour">
        <dia:color val="#ffffff"/>
      </dia:attribute>
      <dia:attribute name="text">
        <dia:composite type="text">
          <dia:attribute name="string">
            <dia:string>#destructors
from backroll#</dia:string>
          </dia:attribute>
          <dia:attribute name="font">
            <dia:font family="monospace" style="0" name="Courier"/>
          </dia:attribute>
          <dia:attribute name="height">
            <dia:real val="1"/>
          </dia:attribute>
          <dia:attribute name="pos">
            <dia:point val="14.985,35.915"/>
          </dia:attribute>
          <dia:attribute name="color">
            <dia:color val="#000000"/>
          </dia:attribute>
          <dia:attribute name="alignment">
            <dia:enum val="0"/>
          </dia:attribute>
        </dia:composite>
      </dia:attribute>
    </dia:object>
    <dia:object type="Standard - Line" version="0" id="O18">
      <dia:attribute name="obj_pos">
        <dia:point val="21.385,34.515"/>
      </dia:attribute>
      <dia:attribute name="obj_bb">
        <dia:rectangle val="21.3183,31.9305;22.9672,34.5817"/>
      </dia:attribute>
      <dia:attribute name="conn_endpoints">
        <dia:point val="21.385,34.515"/>
        <dia:point val="22.4944,32.191"/>
      </dia:attribute>
      <dia:attribute name="numcp">
        <dia:int val="1"/>
      </dia:attribute>
      <dia:attribute name="end_arrow">
        <dia:enum val="22"/>
      </dia:attribute>
      <dia:attribute name="end_arrow_length">
        <dia:real val="0.5"/>
      </dia:attribute>
      <dia:attribute name="end_arrow_width">
        <dia:real val="0.5"/>
      </dia:attribute>
      <dia:connections>
        <dia:connection handle="0" to="O17" connection="2"/>
        <dia:connection handle="1" to="O6" connection="1"/>
      </dia:connections>
    </dia:object>
    <dia:object type="Standard - Line" version="0" id="O19">
      <dia:attribute name="obj_pos">
        <dia:point val="14.635,34.515"/>
      </dia:attribute>
      <dia:attribute name="obj_bb">
        <dia:rectangle val="12.4607,31.7888;14.7048,34.5848"/>
      </dia:attribute>
      <dia:attribute name="conn_endpoints">
        <dia:point val="14.635,34.515"/>
        <dia:point val="12.8944,32.1234"/>
      </dia:attribute>
      <dia:attribute name="numcp">
        <dia:int val="1"/>
      </dia:attribute>
      <dia:attribute name="end_arrow">
        <dia:enum val="22"/>
      </dia:attribute>
      <dia:attribute name="end_arrow_length">
        <dia:real val="0.5"/>
      </dia:attribute>
      <dia:attribute name="end_arrow_width">
        <dia:real val="0.5"/>
      </dia:attribute>
      <dia:connections>
        <dia:connection handle="0" to="O17" connection="0"/>
        <dia:connection handle="1" to="O2" connection="1"/>
      </dia:connections>
    </dia:object>
    <dia:object type="Standard - Line" version="0" id="O20">
      <dia:attribute name="obj_pos">
        <dia:point val="5.935,23.4076"/>
      </dia:attribute>
      <dia:attribute name="obj_bb">
        <dia:rectangle val="3.89809,20.7431;6.00447,23.4771"/>
      </dia:attribute>
      <dia:attribute name="conn_endpoints">
        <dia:point val="5.935,23.4076"/>
        <dia:point val="4.33944,21.066"/>
      </dia:attribute>
      <dia:attribute name="numcp">
        <dia:int val="1"/>
      </dia:attribute>
      <dia:attribute name="end_arrow">
        <dia:enum val="22"/>
      </dia:attribute>
      <dia:attribute name="end_arrow_length">
        <dia:real val="0.5"/>
      </dia:attribute>
      <dia:attribute name="end_arrow_width">
        <dia:real val="0.5"/>
      </dia:attribute>
      <dia:connections>
        <dia:connection handle="0" to="O23" connection="0"/>
        <dia:connection handle="1" to="O21" connection="1"/>
      </dia:connections>
    </dia:object>
    <dia:object type="SDL - Service" version="0" id="O21">
      <dia:attribute name="obj_pos">
        <dia:point val="3.085,18.94"/>
      </dia:attribute>
      <dia:attribute name="obj_bb">
        <dia:rectangle val="3.035,18.89;5.64388,21.116"/>
      </dia:attribute>
      <dia:attribute name="elem_corner">
        <dia:point val="3.085,18.94"/>
      </dia:attribute>
      <dia:attribute name="elem_width">
        <dia:real val="2.50888"/>
      </dia:attribute>
      <dia:attribute name="elem_height">
        <dia:real val="2.12601"/>
      </dia:attribute>
      <dia:attribute name="line_width">
        <dia:real val="0.1"/>
      </dia:attribute>
      <dia:attribute name="line_colour">
        <dia:color val="#000000"/>
      </dia:attribute>
      <dia:attribute name="fill_colour">
        <dia:color val="#ffffff"/>
      </dia:attribute>
      <dia:attribute name="show_background">
        <dia:boolean val="true"/>
      </dia:attribute>
      <dia:attribute name="line_style">
        <dia:enum val="0"/>
        <dia:real val="1"/>
      </dia:attribute>
      <dia:attribute name="text">
        <dia:composite type="text">
          <dia:attribute name="string">
            <dia:string>#SP#</dia:string>
          </dia:attribute>
          <dia:attribute name="font">
            <dia:font family="sans" style="0" name="Helvetica"/>
          </dia:attribute>
          <dia:attribute name="height">
            <dia:real val="1"/>
          </dia:attribute>
          <dia:attribute name="pos">
            <dia:point val="4.33944,20.253"/>
          </dia:attribute>
          <dia:attribute name="color">
            <dia:color val="#000000"/>
          </dia:attribute>
          <dia:attribute name="alignment">
            <dia:enum val="1"/>
          </dia:attribute>
        </dia:composite>
      </dia:attribute>
      <dia:attribute name="flip_horizontal">
        <dia:boolean val="false"/>
      </dia:attribute>
      <dia:attribute name="flip_vertical">
        <dia:boolean val="false"/>
      </dia:attribute>
    </dia:object>
    <dia:object type="SDL - Service" version="0" id="O22">
      <dia:attribute name="obj_pos">
        <dia:point val="11.085,18.94"/>
      </dia:attribute>
      <dia:attribute name="obj_bb">
        <dia:rectangle val="11.035,18.89;13.6439,21.116"/>
      </dia:attribute>
      <dia:attribute name="elem_corner">
        <dia:point val="11.085,18.94"/>
      </dia:attribute>
      <dia:attribute name="elem_width">
        <dia:real val="2.50888"/>
      </dia:attribute>
      <dia:attribute name="elem_height">
        <dia:real val="2.12601"/>
      </dia:attribute>
      <dia:attribute name="line_width">
        <dia:real val="0.1"/>
      </dia:attribute>
      <dia:attribute name="line_colour">
        <dia:color val="#000000"/>
      </dia:attribute>
      <dia:attribute name="fill_colour">
        <dia:color val="#ffffff"/>
      </dia:attribute>
      <dia:attribute name="show_background">
        <dia:boolean val="true"/>
      </dia:attribute>
      <dia:attribute name="line_style">
        <dia:enum val="0"/>
        <dia:real val="1"/>
      </dia:attribute>
      <dia:attribute name="text">
        <dia:composite type="text">
          <dia:attribute name="string">
            <dia:string>#SP#</dia:string>
          </dia:attribute>
          <dia:attribute name="font">
            <dia:font family="sans" style="0" name="Helvetica"/>
          </dia:attribute>
          <dia:attribute name="height">
            <dia:real val="1"/>
          </dia:attribute>
          <dia:attribute name="pos">
            <dia:point val="12.3394,20.253"/>
          </dia:attribute>
          <dia:attribute name="color">
            <dia:color val="#000000"/>
          </dia:attribute>
          <dia:attribute name="alignment">
            <dia:enum val="1"/>
          </dia:attribute>
        </dia:composite>
      </dia:attribute>
      <dia:attribute name="flip_horizontal">
        <dia:boolean val="false"/>
      </dia:attribute>
      <dia:attribute name="flip_vertical">
        <dia:boolean val="false"/>
      </dia:attribute>
    </dia:object>
    <dia:object type="UML - Note" version="0" id="O23">
      <dia:attribute name="obj_pos">
        <dia:point val="5.935,23.4076"/>
      </dia:attribute>
      <dia:attribute name="obj_bb">
        <dia:rectangle val="5.885,23.3576;11.385,26.3576"/>
      </dia:attribute>
      <dia:attribute name="elem_corner">
        <dia:point val="5.935,23.4076"/>
      </dia:attribute>
      <dia:attribute name="elem_width">
        <dia:real val="5.4"/>
      </dia:attribute>
      <dia:attribute name="elem_height">
        <dia:real val="2.9"/>
      </dia:attribute>
      <dia:attribute name="line_colour">
        <dia:color val="#000000"/>
      </dia:attribute>
      <dia:attribute name="fill_colour">
        <dia:color val="#ffffff"/>
      </dia:attribute>
      <dia:attribute name="text">
        <dia:composite type="text">
          <dia:attribute name="string">
            <dia:string>#expression
statement#</dia:string>
          </dia:attribute>
          <dia:attribute name="font">
            <dia:font family="monospace" style="0" name="Courier"/>
          </dia:attribute>
          <dia:attribute name="height">
            <dia:real val="1"/>
          </dia:attribute>
          <dia:attribute name="pos">
            <dia:point val="6.285,24.8076"/>
          </dia:attribute>
          <dia:attribute name="color">
            <dia:color val="#000000"/>
          </dia:attribute>
          <dia:attribute name="alignment">
            <dia:enum val="0"/>
          </dia:attribute>
        </dia:composite>
      </dia:attribute>
    </dia:object>
    <dia:object type="Standard - Line" version="0" id="O24">
      <dia:attribute name="obj_pos">
        <dia:point val="11.335,23.4076"/>
      </dia:attribute>
      <dia:attribute name="obj_bb">
        <dia:rectangle val="11.2693,20.8229;12.8186,23.4733"/>
      </dia:attribute>
      <dia:attribute name="conn_endpoints">
        <dia:point val="11.335,23.4076"/>
        <dia:point val="12.3394,21.066"/>
      </dia:attribute>
      <dia:attribute name="numcp">
        <dia:int val="1"/>
      </dia:attribute>
      <dia:attribute name="end_arrow">
        <dia:enum val="22"/>
      </dia:attribute>
      <dia:attribute name="end_arrow_length">
        <dia:real val="0.5"/>
      </dia:attribute>
      <dia:attribute name="end_arrow_width">
        <dia:real val="0.5"/>
      </dia:attribute>
      <dia:connections>
        <dia:connection handle="0" to="O23" connection="2"/>
        <dia:connection handle="1" to="O22" connection="1"/>
      </dia:connections>
    </dia:object>
    <dia:object type="Standard - Line" version="0" id="O25">
      <dia:attribute name="obj_pos">
        <dia:point val="23.635,23.2253"/>
      </dia:attribute>
      <dia:attribute name="obj_bb">
        <dia:rectangle val="21.5195,20.78;23.7053,23.2956"/>
      </dia:attribute>
      <dia:attribute name="conn_endpoints">
        <dia:point val="23.635,23.2253"/>
        <dia:point val="21.9394,21.1337"/>
      </dia:attribute>
      <dia:attribute name="numcp">
        <dia:int val="1"/>
      </dia:attribute>
      <dia:attribute name="end_arrow">
        <dia:enum val="22"/>
      </dia:attribute>
      <dia:attribute name="end_arrow_length">
        <dia:real val="0.5"/>
      </dia:attribute>
      <dia:attribute name="end_arrow_width">
        <dia:real val="0.5"/>
      </dia:attribute>
      <dia:connections>
        <dia:connection handle="0" to="O28" connection="0"/>
        <dia:connection handle="1" to="O26" connection="1"/>
      </dia:connections>
    </dia:object>
    <dia:object type="SDL - Service" version="0" id="O26">
      <dia:attribute name="obj_pos">
        <dia:point val="20.685,19.0076"/>
      </dia:attribute>
      <dia:attribute name="obj_bb">
        <dia:rectangle val="20.635,18.9576;23.2439,21.1836"/>
      </dia:attribute>
      <dia:attribute name="elem_corner">
        <dia:point val="20.685,19.0076"/>
      </dia:attribute>
      <dia:attribute name="elem_width">
        <dia:real val="2.50888"/>
      </dia:attribute>
      <dia:attribute name="elem_height">
        <dia:real val="2.12601"/>
      </dia:attribute>
      <dia:attribute name="line_width">
        <dia:real val="0.1"/>
      </dia:attribute>
      <dia:attribute name="line_colour">
        <dia:color val="#000000"/>
      </dia:attribute>
      <dia:attribute name="fill_colour">
        <dia:color val="#ffffff"/>
      </dia:attribute>
      <dia:attribute name="show_background">
        <dia:boolean val="true"/>
      </dia:attribute>
      <dia:attribute name="line_style">
        <dia:enum val="0"/>
        <dia:real val="1"/>
      </dia:attribute>
      <dia:attribute name="text">
        <dia:composite type="text">
          <dia:attribute name="string">
            <dia:string>#SP#</dia:string>
          </dia:attribute>
          <dia:attribute name="font">
            <dia:font family="sans" style="0" name="Helvetica"/>
          </dia:attribute>
          <dia:attribute name="height">
            <dia:real val="1"/>
          </dia:attribute>
          <dia:attribute name="pos">
            <dia:point val="21.9394,20.3206"/>
          </dia:attribute>
          <dia:attribute name="color">
            <dia:color val="#000000"/>
          </dia:attribute>
          <dia:attribute name="alignment">
            <dia:enum val="1"/>
          </dia:attribute>
        </dia:composite>
      </dia:attribute>
      <dia:attribute name="flip_horizontal">
        <dia:boolean val="false"/>
      </dia:attribute>
      <dia:attribute name="flip_vertical">
        <dia:boolean val="false"/>
      </dia:attribute>
    </dia:object>
    <dia:object type="SDL - Service" version="0" id="O27">
      <dia:attribute name="obj_pos">
        <dia:point val="28.535,19.0076"/>
      </dia:attribute>
      <dia:attribute name="obj_bb">
        <dia:rectangle val="28.485,18.9576;31.0939,21.1836"/>
      </dia:attribute>
      <dia:attribute name="elem_corner">
        <dia:point val="28.535,19.0076"/>
      </dia:attribute>
      <dia:attribute name="elem_width">
        <dia:real val="2.50888"/>
      </dia:attribute>
      <dia:attribute name="elem_height">
        <dia:real val="2.12601"/>
      </dia:attribute>
      <dia:attribute name="line_width">
        <dia:real val="0.1"/>
      </dia:attribute>
      <dia:attribute name="line_colour">
        <dia:color val="#000000"/>
      </dia:attribute>
      <dia:attribute name="fill_colour">
        <dia:color val="#ffffff"/>
      </dia:attribute>
      <dia:attribute name="show_background">
        <dia:boolean val="true"/>
      </dia:attribute>
      <dia:attribute name="line_style">
        <dia:enum val="0"/>
        <dia:real val="1"/>
      </dia:attribute>
      <dia:attribute name="text">
        <dia:composite type="text">
          <dia:attribute name="string">
            <dia:string>#SP#</dia:string>
          </dia:attribute>
          <dia:attribute name="font">
            <dia:font family="sans" style="0" name="Helvetica"/>
          </dia:attribute>
          <dia:attribute name="height">
            <dia:real val="1"/>
          </dia:attribute>
          <dia:attribute name="pos">
            <dia:point val="29.7894,20.3206"/>
          </dia:attribute>
          <dia:attribute name="color">
            <dia:color val="#000000"/>
          </dia:attribute>
          <dia:attribute name="alignment">
            <dia:enum val="1"/>
          </dia:attribute>
        </dia:composite>
      </dia:attribute>
      <dia:attribute name="flip_horizontal">
        <dia:boolean val="false"/>
      </dia:attribute>
      <dia:attribute name="flip_vertical">
        <dia:boolean val="false"/>
      </dia:attribute>
    </dia:object>
    <dia:object type="UML - Note" version="0" id="O28">
      <dia:attribute name="obj_pos">
        <dia:point val="23.635,23.2253"/>
      </dia:attribute>
      <dia:attribute name="obj_bb">
        <dia:rectangle val="23.585,23.1753;28.635,25.1753"/>
      </dia:attribute>
      <dia:attribute name="elem_corner">
        <dia:point val="23.635,23.2253"/>
      </dia:attribute>
      <dia:attribute name="elem_width">
        <dia:real val="4.95"/>
      </dia:attribute>
      <dia:attribute name="elem_height">
        <dia:real val="1.9"/>
      </dia:attribute>
      <dia:attribute name="line_colour">
        <dia:color val="#000000"/>
      </dia:attribute>
      <dia:attribute name="fill_colour">
        <dia:color val="#ffffff"/>
      </dia:attribute>
      <dia:attribute name="text">
        <dia:composite type="text">
          <dia:attribute name="string">
            <dia:string>#statement#</dia:string>
          </dia:attribute>
          <dia:attribute name="font">
            <dia:font family="monospace" style="0" name="Courier"/>
          </dia:attribute>
          <dia:attribute name="height">
            <dia:real val="1"/>
          </dia:attribute>
          <dia:attribute name="pos">
            <dia:point val="23.985,24.6253"/>
          </dia:attribute>
          <dia:attribute name="color">
            <dia:color val="#000000"/>
          </dia:attribute>
          <dia:attribute name="alignment">
            <dia:enum val="0"/>
          </dia:attribute>
        </dia:composite>
      </dia:attribute>
    </dia:object>
    <dia:object type="Standard - Line" version="0" id="O29">
      <dia:attribute name="obj_pos">
        <dia:point val="28.585,23.2253"/>
      </dia:attribute>
      <dia:attribute name="obj_bb">
        <dia:rectangle val="28.5167,20.8409;30.2476,23.2936"/>
      </dia:attribute>
      <dia:attribute name="conn_endpoints">
        <dia:point val="28.585,23.2253"/>
        <dia:point val="29.7894,21.1337"/>
      </dia:attribute>
      <dia:attribute name="numcp">
        <dia:int val="1"/>
      </dia:attribute>
      <dia:attribute name="end_arrow">
        <dia:enum val="22"/>
      </dia:attribute>
      <dia:attribute name="end_arrow_length">
        <dia:real val="0.5"/>
      </dia:attribute>
      <dia:attribute name="end_arrow_width">
        <dia:real val="0.5"/>
      </dia:attribute>
      <dia:connections>
        <dia:connection handle="0" to="O28" connection="2"/>
        <dia:connection handle="1" to="O27" connection="1"/>
      </dia:connections>
    </dia:object>
    <dia:object type="Standard - Line" version="0" id="O30">
      <dia:attribute name="obj_pos">
        <dia:point val="11.085,20.003"/>
      </dia:attribute>
      <dia:attribute name="obj_bb">
        <dia:rectangle val="5.49388,19.503;11.185,20.503"/>
      </dia:attribute>
      <dia:attribute name="conn_endpoints">
        <dia:point val="11.085,20.003"/>
        <dia:point val="5.59388,20.003"/>
      </dia:attribute>
      <dia:attribute name="numcp">
        <dia:int val="1"/>
      </dia:attribute>
      <dia:attribute name="line_width">
        <dia:real val="0.2"/>
      </dia:attribute>
      <dia:attribute name="start_arrow">
        <dia:enum val="3"/>
      </dia:attribute>
      <dia:attribute name="start_arrow_length">
        <dia:real val="0.5"/>
      </dia:attribute>
      <dia:attribute name="start_arrow_width">
        <dia:real val="0.5"/>
      </dia:attribute>
      <dia:attribute name="end_arrow">
        <dia:enum val="3"/>
      </dia:attribute>
      <dia:attribute name="end_arrow_length">
        <dia:real val="0.5"/>
      </dia:attribute>
      <dia:attribute name="end_arrow_width">
        <dia:real val="0.5"/>
      </dia:attribute>
      <dia:connections>
        <dia:connection handle="0" to="O22" connection="3"/>
        <dia:connection handle="1" to="O21" connection="2"/>
      </dia:connections>
    </dia:object>
    <dia:object type="Standard - Line" version="0" id="O31">
      <dia:attribute name="obj_pos">
        <dia:point val="28.535,20.0707"/>
      </dia:attribute>
      <dia:attribute name="obj_bb">
        <dia:rectangle val="23.0939,19.5707;28.635,20.5707"/>
      </dia:attribute>
      <dia:attribute name="conn_endpoints">
        <dia:point val="28.535,20.0707"/>
        <dia:point val="23.1939,20.0707"/>
      </dia:attribute>
      <dia:attribute name="numcp">
        <dia:int val="1"/>
      </dia:attribute>
      <dia:attribute name="line_width">
        <dia:real val="0.2"/>
      </dia:attribute>
      <dia:attribute name="start_arrow">
        <dia:enum val="3"/>
      </dia:attribute>
      <dia:attribute name="start_arrow_length">
        <dia:real val="0.5"/>
      </dia:attribute>
      <dia:attribute name="start_arrow_width">
        <dia:real val="0.5"/>
      </dia:attribute>
      <dia:attribute name="end_arrow">
        <dia:enum val="3"/>
      </dia:attribute>
      <dia:attribute name="end_arrow_length">
        <dia:real val="0.5"/>
      </dia:attribute>
      <dia:attribute name="end_arrow_width">
        <dia:real val="0.5"/>
      </dia:attribute>
      <dia:connections>
        <dia:connection handle="0" to="O27" connection="3"/>
        <dia:connection handle="1" to="O26" connection="2"/>
      </dia:connections>
    </dia:object>
    <dia:object type="Standard - Line" version="0" id="O32">
      <dia:attribute name="obj_pos">
        <dia:point val="20.685,20.0707"/>
      </dia:attribute>
      <dia:attribute name="obj_bb">
        <dia:rectangle val="13.4891,19.5021;20.7898,20.5716"/>
      </dia:attribute>
      <dia:attribute name="conn_endpoints">
        <dia:point val="20.685,20.0707"/>
        <dia:point val="13.5939,20.003"/>
      </dia:attribute>
      <dia:attribute name="numcp">
        <dia:int val="1"/>
      </dia:attribute>
      <dia:attribute name="line_width">
        <dia:real val="0.2"/>
      </dia:attribute>
      <dia:attribute name="start_arrow">
        <dia:enum val="3"/>
      </dia:attribute>
      <dia:attribute name="start_arrow_length">
        <dia:real val="0.5"/>
      </dia:attribute>
      <dia:attribute name="start_arrow_width">
        <dia:real val="0.5"/>
      </dia:attribute>
      <dia:attribute name="end_arrow">
        <dia:enum val="3"/>
      </dia:attribute>
      <dia:attribute name="end_arrow_length">
        <dia:real val="0.5"/>
      </dia:attribute>
      <dia:attribute name="end_arrow_width">
        <dia:real val="0.5"/>
      </dia:attribute>
      <dia:connections>
        <dia:connection handle="0" to="O26" connection="3"/>
        <dia:connection handle="1" to="O22" connection="2"/>
      </dia:connections>
    </dia:object>
    <dia:object type="Standard - Text" version="0" id="O33">
      <dia:attribute name="obj_pos">
        <dia:point val="5.645,22.0426"/>
      </dia:attribute>
      <dia:attribute name="obj_bb">
        <dia:rectangle val="5.645,21.2926;6.795,22.4926"/>
      </dia:attribute>
      <dia:attribute name="text">
        <dia:composite type="text">
          <dia:attribute name="string">
            <dia:string>#psp#</dia:string>
          </dia:attribute>
          <dia:attribute name="font">
            <dia:font family="sans" style="0" name="Helvetica"/>
          </dia:attribute>
          <dia:attribute name="height">
            <dia:real val="1"/>
          </dia:attribute>
          <dia:attribute name="pos">
            <dia:point val="5.645,22.0426"/>
          </dia:attribute>
          <dia:attribute name="color">
            <dia:color val="#000000"/>
          </dia:attribute>
          <dia:attribute name="alignment">
            <dia:enum val="0"/>
          </dia:attribute>
        </dia:composite>
      </dia:attribute>
    </dia:object>
    <dia:object type="Standard - Text" version="0" id="O34">
      <dia:attribute name="obj_pos">
        <dia:point val="23.23,22.4576"/>
      </dia:attribute>
      <dia:attribute name="obj_bb">
        <dia:rectangle val="23.23,21.7076;24.38,22.9076"/>
      </dia:attribute>
      <dia:attribute name="text">
        <dia:composite type="text">
          <dia:attribute name="string">
            <dia:string>#psp#</dia:string>
          </dia:attribute>
          <dia:attribute name="font">
            <dia:font family="sans" style="0" name="Helvetica"/>
          </dia:attribute>
          <dia:attribute name="height">
            <dia:real val="1"/>
          </dia:attribute>
          <dia:attribute name="pos">
            <dia:point val="23.23,22.4576"/>
          </dia:attribute>
          <dia:attribute name="color">
            <dia:color val="#000000"/>
          </dia:attribute>
          <dia:attribute name="alignment">
            <dia:enum val="0"/>
          </dia:attribute>
        </dia:composite>
      </dia:attribute>
    </dia:object>
    <dia:object type="Standard - Text" version="0" id="O35">
      <dia:attribute name="obj_pos">
        <dia:point val="10.38,22.0576"/>
      </dia:attribute>
      <dia:attribute name="obj_bb">
        <dia:rectangle val="10.38,21.3076;11.53,22.5076"/>
      </dia:attribute>
      <dia:attribute name="text">
        <dia:composite type="text">
          <dia:attribute name="string">
            <dia:string>#nsp#</dia:string>
          </dia:attribute>
          <dia:attribute name="font">
            <dia:font family="sans" style="0" name="Helvetica"/>
          </dia:attribute>
          <dia:attribute name="height">
            <dia:real val="1"/>
          </dia:attribute>
          <dia:attribute name="pos">
            <dia:point val="10.38,22.0576"/>
          </dia:attribute>
          <dia:attribute name="color">
            <dia:color val="#000000"/>
          </dia:attribute>
          <dia:attribute name="alignment">
            <dia:enum val="0"/>
          </dia:attribute>
        </dia:composite>
      </dia:attribute>
    </dia:object>
    <dia:object type="Standard - Text" version="0" id="O36">
      <dia:attribute name="obj_pos">
        <dia:point val="27.78,22.6076"/>
      </dia:attribute>
      <dia:attribute name="obj_bb">
        <dia:rectangle val="27.78,21.8576;28.93,23.0576"/>
      </dia:attribute>
      <dia:attribute name="text">
        <dia:composite type="text">
          <dia:attribute name="string">
            <dia:string>#nsp#</dia:string>
          </dia:attribute>
          <dia:attribute name="font">
            <dia:font family="sans" style="0" name="Helvetica"/>
          </dia:attribute>
          <dia:attribute name="height">
            <dia:real val="1"/>
          </dia:attribute>
          <dia:attribute name="pos">
            <dia:point val="27.78,22.6076"/>
          </dia:attribute>
          <dia:attribute name="color">
            <dia:color val="#000000"/>
          </dia:attribute>
          <dia:attribute name="alignment">
            <dia:enum val="0"/>
          </dia:attribute>
        </dia:composite>
      </dia:attribute>
    </dia:object>
    <dia:object type="Geometric - Down Arrow" version="0" id="O37">
      <dia:attribute name="obj_pos">
        <dia:point val="15,25.2333"/>
      </dia:attribute>
      <dia:attribute name="obj_bb">
        <dia:rectangle val="14.8793,25.1833;19.0591,29.2424"/>
      </dia:attribute>
      <dia:attribute name="elem_corner">
        <dia:point val="15,25.2333"/>
      </dia:attribute>
      <dia:attribute name="elem_width">
        <dia:real val="3.93843"/>
      </dia:attribute>
      <dia:attribute name="elem_height">
        <dia:real val="3.93843"/>
      </dia:attribute>
      <dia:attribute name="line_width">
        <dia:real val="0.1"/>
      </dia:attribute>
      <dia:attribute name="line_colour">
        <dia:color val="#000000"/>
      </dia:attribute>
      <dia:attribute name="fill_colour">
        <dia:color val="#ffffff"/>
      </dia:attribute>
      <dia:attribute name="show_background">
        <dia:boolean val="true"/>
      </dia:attribute>
      <dia:attribute name="line_style">
        <dia:enum val="0"/>
        <dia:real val="1"/>
      </dia:attribute>
      <dia:attribute name="flip_horizontal">
        <dia:boolean val="false"/>
      </dia:attribute>
      <dia:attribute name="flip_vertical">
        <dia:boolean val="false"/>
      </dia:attribute>
    </dia:object>
    <dia:object type="Standard - Text" version="0" id="O38">
      <dia:attribute name="obj_pos">
        <dia:point val="14.185,33.18"/>
      </dia:attribute>
      <dia:attribute name="obj_bb">
        <dia:rectangle val="14.185,32.43;15.335,33.63"/>
      </dia:attribute>
      <dia:attribute name="text">
        <dia:composite type="text">
          <dia:attribute name="string">
            <dia:string>#psp#</dia:string>
          </dia:attribute>
          <dia:attribute name="font">
            <dia:font family="sans" style="0" name="Helvetica"/>
          </dia:attribute>
          <dia:attribute name="height">
            <dia:real val="1"/>
          </dia:attribute>
          <dia:attribute name="pos">
            <dia:point val="14.185,33.18"/>
          </dia:attribute>
          <dia:attribute name="color">
            <dia:color val="#000000"/>
          </dia:attribute>
          <dia:attribute name="alignment">
            <dia:enum val="0"/>
          </dia:attribute>
        </dia:composite>
      </dia:attribute>
    </dia:object>
    <dia:object type="Standard - Text" version="0" id="O39">
      <dia:attribute name="obj_pos">
        <dia:point val="20.635,33.18"/>
      </dia:attribute>
      <dia:attribute name="obj_bb">
        <dia:rectangle val="20.635,32.43;21.785,33.63"/>
      </dia:attribute>
      <dia:attribute name="text">
        <dia:composite type="text">
          <dia:attribute name="string">
            <dia:string>#nsp#</dia:string>
          </dia:attribute>
          <dia:attribute name="font">
            <dia:font family="sans" style="0" name="Helvetica"/>
          </dia:attribute>
          <dia:attribute name="height">
            <dia:real val="1"/>
          </dia:attribute>
          <dia:attribute name="pos">
            <dia:point val="20.635,33.18"/>
          </dia:attribute>
          <dia:attribute name="color">
            <dia:color val="#000000"/>
          </dia:attribute>
          <dia:attribute name="alignment">
            <dia:enum val="0"/>
          </dia:attribute>
        </dia:composite>
      </dia:attribute>
    </dia:object>
  </dia:layer>
</dia:diagram>
