%!PS-Adobe-2.0 EPSF-2.0
%%Title: ss2pi_assign.dia
%%Creator: Dia v0.94
%%CreationDate: Thu May 26 13:09:37 2005
%%For: sandp9am
%%Orientation: Portrait
%%Magnification: 1.0000
%%BoundingBox: 0 0 1172 779
%%BeginSetup
%%EndSetup
%%EndComments
%%BeginProlog
[ /.notdef /.notdef /.notdef /.notdef /.notdef /.notdef /.notdef /.notdef /.notdef /.notdef
/.notdef /.notdef /.notdef /.notdef /.notdef /.notdef /.notdef /.notdef /.notdef /.notdef
/.notdef /.notdef /.notdef /.notdef /.notdef /.notdef /.notdef /.notdef /.notdef /.notdef
/.notdef /.notdef /space /exclam /quotedbl /numbersign /dollar /percent /ampersand /quoteright
/parenleft /parenright /asterisk /plus /comma /hyphen /period /slash /zero /one
/two /three /four /five /six /seven /eight /nine /colon /semicolon
/less /equal /greater /question /at /A /B /C /D /E
/F /G /H /I /J /K /L /M /N /O
/P /Q /R /S /T /U /V /W /X /Y
/Z /bracketleft /backslash /bracketright /asciicircum /underscore /quoteleft /a /b /c
/d /e /f /g /h /i /j /k /l /m
/n /o /p /q /r /s /t /u /v /w
/x /y /z /braceleft /bar /braceright /asciitilde /.notdef /.notdef /.notdef
/.notdef /.notdef /.notdef /.notdef /.notdef /.notdef /.notdef /.notdef /.notdef /.notdef
/.notdef /.notdef /.notdef /.notdef /.notdef /.notdef /.notdef /.notdef /.notdef /.notdef
/.notdef /.notdef /.notdef /.notdef /.notdef /.notdef /.notdef /.notdef /.notdef /.notdef
/space /exclamdown /cent /sterling /currency /yen /brokenbar /section /dieresis /copyright
/ordfeminine /guillemotleft /logicalnot /hyphen /registered /macron /degree /plusminus /twosuperior /threesuperior
/acute /mu /paragraph /periodcentered /cedilla /onesuperior /ordmasculine /guillemotright /onequarter /onehalf
/threequarters /questiondown /Agrave /Aacute /Acircumflex /Atilde /Adieresis /Aring /AE /Ccedilla
/Egrave /Eacute /Ecircumflex /Edieresis /Igrave /Iacute /Icircumflex /Idieresis /Eth /Ntilde
/Ograve /Oacute /Ocircumflex /Otilde /Odieresis /multiply /Oslash /Ugrave /Uacute /Ucircumflex
/Udieresis /Yacute /Thorn /germandbls /agrave /aacute /acircumflex /atilde /adieresis /aring
/ae /ccedilla /egrave /eacute /ecircumflex /edieresis /igrave /iacute /icircumflex /idieresis
/eth /ntilde /ograve /oacute /ocircumflex /otilde /odieresis /divide /oslash /ugrave
/uacute /ucircumflex /udieresis /yacute /thorn /ydieresis] /isolatin1encoding exch def
/cp {closepath} bind def
/c {curveto} bind def
/f {fill} bind def
/a {arc} bind def
/ef {eofill} bind def
/ex {exch} bind def
/gr {grestore} bind def
/gs {gsave} bind def
/sa {save} bind def
/rs {restore} bind def
/l {lineto} bind def
/m {moveto} bind def
/rm {rmoveto} bind def
/n {newpath} bind def
/s {stroke} bind def
/sh {show} bind def
/slc {setlinecap} bind def
/slj {setlinejoin} bind def
/slw {setlinewidth} bind def
/srgb {setrgbcolor} bind def
/rot {rotate} bind def
/sc {scale} bind def
/sd {setdash} bind def
/ff {findfont} bind def
/sf {setfont} bind def
/scf {scalefont} bind def
/sw {stringwidth pop} bind def
/tr {translate} bind def

/ellipsedict 8 dict def
ellipsedict /mtrx matrix put
/ellipse
{ ellipsedict begin
   /endangle exch def
   /startangle exch def
   /yrad exch def
   /xrad exch def
   /y exch def
   /x exch def   /savematrix mtrx currentmatrix def
   x y tr xrad yrad sc
   0 0 1 startangle endangle arc
   savematrix setmatrix
   end
} def

/mergeprocs {
dup length
3 -1 roll
dup
length
dup
5 1 roll
3 -1 roll
add
array cvx
dup
3 -1 roll
0 exch
putinterval
dup
4 2 roll
putinterval
} bind def
/Times-Roman-latin1
    /Times-Roman findfont
    dup length dict begin
	{1 index /FID ne {def} {pop pop} ifelse} forall
	/Encoding isolatin1encoding def
    currentdict end
definefont pop
/Times-Italic-latin1
    /Times-Italic findfont
    dup length dict begin
	{1 index /FID ne {def} {pop pop} ifelse} forall
	/Encoding isolatin1encoding def
    currentdict end
definefont pop
/Times-Bold-latin1
    /Times-Bold findfont
    dup length dict begin
	{1 index /FID ne {def} {pop pop} ifelse} forall
	/Encoding isolatin1encoding def
    currentdict end
definefont pop
/Times-BoldItalic-latin1
    /Times-BoldItalic findfont
    dup length dict begin
	{1 index /FID ne {def} {pop pop} ifelse} forall
	/Encoding isolatin1encoding def
    currentdict end
definefont pop
/AvantGarde-Book-latin1
    /AvantGarde-Book findfont
    dup length dict begin
	{1 index /FID ne {def} {pop pop} ifelse} forall
	/Encoding isolatin1encoding def
    currentdict end
definefont pop
/AvantGarde-BookOblique-latin1
    /AvantGarde-BookOblique findfont
    dup length dict begin
	{1 index /FID ne {def} {pop pop} ifelse} forall
	/Encoding isolatin1encoding def
    currentdict end
definefont pop
/AvantGarde-Demi-latin1
    /AvantGarde-Demi findfont
    dup length dict begin
	{1 index /FID ne {def} {pop pop} ifelse} forall
	/Encoding isolatin1encoding def
    currentdict end
definefont pop
/AvantGarde-DemiOblique-latin1
    /AvantGarde-DemiOblique findfont
    dup length dict begin
	{1 index /FID ne {def} {pop pop} ifelse} forall
	/Encoding isolatin1encoding def
    currentdict end
definefont pop
/Bookman-Light-latin1
    /Bookman-Light findfont
    dup length dict begin
	{1 index /FID ne {def} {pop pop} ifelse} forall
	/Encoding isolatin1encoding def
    currentdict end
definefont pop
/Bookman-LightItalic-latin1
    /Bookman-LightItalic findfont
    dup length dict begin
	{1 index /FID ne {def} {pop pop} ifelse} forall
	/Encoding isolatin1encoding def
    currentdict end
definefont pop
/Bookman-Demi-latin1
    /Bookman-Demi findfont
    dup length dict begin
	{1 index /FID ne {def} {pop pop} ifelse} forall
	/Encoding isolatin1encoding def
    currentdict end
definefont pop
/Bookman-DemiItalic-latin1
    /Bookman-DemiItalic findfont
    dup length dict begin
	{1 index /FID ne {def} {pop pop} ifelse} forall
	/Encoding isolatin1encoding def
    currentdict end
definefont pop
/Courier-latin1
    /Courier findfont
    dup length dict begin
	{1 index /FID ne {def} {pop pop} ifelse} forall
	/Encoding isolatin1encoding def
    currentdict end
definefont pop
/Courier-Oblique-latin1
    /Courier-Oblique findfont
    dup length dict begin
	{1 index /FID ne {def} {pop pop} ifelse} forall
	/Encoding isolatin1encoding def
    currentdict end
definefont pop
/Courier-Bold-latin1
    /Courier-Bold findfont
    dup length dict begin
	{1 index /FID ne {def} {pop pop} ifelse} forall
	/Encoding isolatin1encoding def
    currentdict end
definefont pop
/Courier-BoldOblique-latin1
    /Courier-BoldOblique findfont
    dup length dict begin
	{1 index /FID ne {def} {pop pop} ifelse} forall
	/Encoding isolatin1encoding def
    currentdict end
definefont pop
/Helvetica-latin1
    /Helvetica findfont
    dup length dict begin
	{1 index /FID ne {def} {pop pop} ifelse} forall
	/Encoding isolatin1encoding def
    currentdict end
definefont pop
/Helvetica-Oblique-latin1
    /Helvetica-Oblique findfont
    dup length dict begin
	{1 index /FID ne {def} {pop pop} ifelse} forall
	/Encoding isolatin1encoding def
    currentdict end
definefont pop
/Helvetica-Bold-latin1
    /Helvetica-Bold findfont
    dup length dict begin
	{1 index /FID ne {def} {pop pop} ifelse} forall
	/Encoding isolatin1encoding def
    currentdict end
definefont pop
/Helvetica-BoldOblique-latin1
    /Helvetica-BoldOblique findfont
    dup length dict begin
	{1 index /FID ne {def} {pop pop} ifelse} forall
	/Encoding isolatin1encoding def
    currentdict end
definefont pop
/Helvetica-Narrow-latin1
    /Helvetica-Narrow findfont
    dup length dict begin
	{1 index /FID ne {def} {pop pop} ifelse} forall
	/Encoding isolatin1encoding def
    currentdict end
definefont pop
/Helvetica-Narrow-Oblique-latin1
    /Helvetica-Narrow-Oblique findfont
    dup length dict begin
	{1 index /FID ne {def} {pop pop} ifelse} forall
	/Encoding isolatin1encoding def
    currentdict end
definefont pop
/Helvetica-Narrow-Bold-latin1
    /Helvetica-Narrow-Bold findfont
    dup length dict begin
	{1 index /FID ne {def} {pop pop} ifelse} forall
	/Encoding isolatin1encoding def
    currentdict end
definefont pop
/Helvetica-Narrow-BoldOblique-latin1
    /Helvetica-Narrow-BoldOblique findfont
    dup length dict begin
	{1 index /FID ne {def} {pop pop} ifelse} forall
	/Encoding isolatin1encoding def
    currentdict end
definefont pop
/NewCenturySchoolbook-Roman-latin1
    /NewCenturySchoolbook-Roman findfont
    dup length dict begin
	{1 index /FID ne {def} {pop pop} ifelse} forall
	/Encoding isolatin1encoding def
    currentdict end
definefont pop
/NewCenturySchoolbook-Italic-latin1
    /NewCenturySchoolbook-Italic findfont
    dup length dict begin
	{1 index /FID ne {def} {pop pop} ifelse} forall
	/Encoding isolatin1encoding def
    currentdict end
definefont pop
/NewCenturySchoolbook-Bold-latin1
    /NewCenturySchoolbook-Bold findfont
    dup length dict begin
	{1 index /FID ne {def} {pop pop} ifelse} forall
	/Encoding isolatin1encoding def
    currentdict end
definefont pop
/NewCenturySchoolbook-BoldItalic-latin1
    /NewCenturySchoolbook-BoldItalic findfont
    dup length dict begin
	{1 index /FID ne {def} {pop pop} ifelse} forall
	/Encoding isolatin1encoding def
    currentdict end
definefont pop
/Palatino-Roman-latin1
    /Palatino-Roman findfont
    dup length dict begin
	{1 index /FID ne {def} {pop pop} ifelse} forall
	/Encoding isolatin1encoding def
    currentdict end
definefont pop
/Palatino-Italic-latin1
    /Palatino-Italic findfont
    dup length dict begin
	{1 index /FID ne {def} {pop pop} ifelse} forall
	/Encoding isolatin1encoding def
    currentdict end
definefont pop
/Palatino-Bold-latin1
    /Palatino-Bold findfont
    dup length dict begin
	{1 index /FID ne {def} {pop pop} ifelse} forall
	/Encoding isolatin1encoding def
    currentdict end
definefont pop
/Palatino-BoldItalic-latin1
    /Palatino-BoldItalic findfont
    dup length dict begin
	{1 index /FID ne {def} {pop pop} ifelse} forall
	/Encoding isolatin1encoding def
    currentdict end
definefont pop
/Symbol-latin1
    /Symbol findfont
definefont pop
/ZapfChancery-MediumItalic-latin1
    /ZapfChancery-MediumItalic findfont
    dup length dict begin
	{1 index /FID ne {def} {pop pop} ifelse} forall
	/Encoding isolatin1encoding def
    currentdict end
definefont pop
/ZapfDingbats-latin1
    /ZapfDingbats findfont
    dup length dict begin
	{1 index /FID ne {def} {pop pop} ifelse} forall
	/Encoding isolatin1encoding def
    currentdict end
definefont pop
28.346000 -28.346000 scale
-2.449237 -26.407110 translate
%%EndProlog


/Helvetica-latin1 ff 0.700000 scf sf
0.000000 0.000000 0.000000 srgb
(Note: ) 2.700000 23.450000 m gs 1 -1 sc sh gr
("@" stands for pseudoreference) 2.700000 24.450000 m gs 1 -1 sc sh gr
(pi_mem/ptr_deref, pi_preg are expression results) 2.700000 25.450000 m gs 1 -1 sc sh gr
0.100000 slw
[] 0 sd
1.000000 1.000000 1.000000 srgb
n 17.500000 -0.900000 m 22.300000 -0.900000 l 22.900000 -0.300000 l 22.900000 2.000000 l 17.500000 2.000000 l ef
0.000000 0.000000 0.000000 srgb
n 17.500000 -0.900000 m 22.300000 -0.900000 l 22.900000 -0.300000 l 22.900000 2.000000 l 17.500000 2.000000 l cp s
0.050000 slw
n 22.300000 -0.900000 m 22.300000 -0.300000 l 22.900000 -0.300000 l s
/Courier-latin1 ff 0.700000 scf sf
(int &c,&d;) 17.850000 0.410937 m gs 1 -1 sc sh gr
(c=d;) 17.850000 1.410937 m gs 1 -1 sc sh gr
0.100000 slw
[] 0 sd
[] 0 sd
0 slc
0 slj
0 slc
0 slj
[] 0 sd
1.000000 1.000000 1.000000 srgb
n 18.358835 5.100000 m 21.524945 5.100000 l 21.524945 7.907110 l 18.358835 7.907110 l ef
0.000000 0.000000 0.000000 srgb
n 18.358835 5.100000 m 21.524945 5.100000 l 21.524945 7.907110 l 18.358835 7.907110 l cp s
/Helvetica-latin1 ff 0.700000 scf sf
(=) dup sw 2 div 19.941890 ex sub 6.236367 m gs 1 -1 sc sh gr
(int@) dup sw 2 div 19.941890 ex sub 7.236367 m gs 1 -1 sc sh gr
0.100000 slw
[] 0 sd
[] 0 sd
0 slc
0 slj
0 slc
0 slj
[] 0 sd
1.000000 1.000000 1.000000 srgb
n 16.125584 10.050000 m 19.245796 10.050000 l 19.245796 12.857110 l 16.125584 12.857110 l ef
0.000000 0.000000 0.000000 srgb
n 16.125584 10.050000 m 19.245796 10.050000 l 19.245796 12.857110 l 16.125584 12.857110 l cp s
/Helvetica-latin1 ff 0.700000 scf sf
(VR c) dup sw 2 div 17.685690 ex sub 11.186367 m gs 1 -1 sc sh gr
(int&) dup sw 2 div 17.685690 ex sub 12.186367 m gs 1 -1 sc sh gr
0.100000 slw
[] 0 sd
[] 0 sd
0 slc
0 slj
0 slc
0 slj
[] 0 sd
1.000000 1.000000 1.000000 srgb
n 20.877683 14.700000 m 24.093597 14.700000 l 24.093597 17.507110 l 20.877683 17.507110 l ef
0.000000 0.000000 0.000000 srgb
n 20.877683 14.700000 m 24.093597 14.700000 l 24.093597 17.507110 l 20.877683 17.507110 l cp s
/Helvetica-latin1 ff 0.700000 scf sf
(VR d) dup sw 2 div 22.485640 ex sub 15.836367 m gs 1 -1 sc sh gr
(int&) dup sw 2 div 22.485640 ex sub 16.836368 m gs 1 -1 sc sh gr
0.100000 slw
[] 0 sd
[] 0 sd
0 slc
n 18.038661 9.714756 m 19.941890 7.907110 l s
[] 0 sd
0 slj
0 slc
n 17.766756 9.973005 m 17.957130 9.447402 l 18.038661 9.714756 l 18.301462 9.809942 l ef
n 17.766756 9.973005 m 17.957130 9.447402 l 18.038661 9.714756 l 18.301462 9.809942 l cp s
0.100000 slw
[] 0 sd
[] 0 sd
0 slc
n 22.070120 9.778541 m 19.941890 7.907110 l s
[] 0 sd
0 slj
0 slc
n 22.351730 10.026171 m 21.811163 9.883737 l 22.070120 9.778541 l 22.141337 9.508257 l ef
n 22.351730 10.026171 m 21.811163 9.883737 l 22.070120 9.778541 l 22.141337 9.508257 l cp s
0.100000 slw
[] 0 sd
[] 0 sd
0 slc
0 slj
0 slc
0 slj
[] 0 sd
1.000000 1.000000 1.000000 srgb
n 20.900000 10.100000 m 23.971380 10.100000 l 23.971380 12.907110 l 20.900000 12.907110 l ef
0.000000 0.000000 0.000000 srgb
n 20.900000 10.100000 m 23.971380 10.100000 l 23.971380 12.907110 l 20.900000 12.907110 l cp s
/Helvetica-latin1 ff 0.700000 scf sf
(get) dup sw 2 div 22.435690 ex sub 11.236368 m gs 1 -1 sc sh gr
(int) dup sw 2 div 22.435690 ex sub 12.236368 m gs 1 -1 sc sh gr
0.100000 slw
[] 0 sd
[] 0 sd
0 slc
n 22.472083 14.213385 m 22.435690 12.907110 l s
[] 0 sd
0 slj
0 slc
n 22.482526 14.588240 m 22.218699 14.095396 l 22.472083 14.213385 l 22.718505 14.081472 l ef
n 22.482526 14.588240 m 22.218699 14.095396 l 22.472083 14.213385 l 22.718505 14.081472 l cp s
/Helvetica-latin1 ff 0.840000 scf sf
(2.) 16.500000 0.100000 m gs 1 -1 sc sh gr
0.100000 slw
[] 0 sd
[] 0 sd
0 slc
n 19.951413 4.613290 m 19.965692 3.883538 l s
[] 0 sd
0 slj
0 slc
n 19.944077 4.988218 m 19.703906 4.483423 l 19.951413 4.613290 l 20.203811 4.493204 l ef
n 19.944077 4.988218 m 19.703906 4.483423 l 19.951413 4.613290 l 20.203811 4.493204 l cp s
/Helvetica-latin1 ff 0.560000 scf sf
(pi_mem_ptr_deref) 37.438700 13.745000 m gs 1 -1 sc sh gr
0.100000 slw
[] 0 sd
1.000000 1.000000 1.000000 srgb
n 31.000000 -1.000000 m 35.800000 -1.000000 l 36.400000 -0.400000 l 36.400000 1.900000 l 31.000000 1.900000 l ef
0.000000 0.000000 0.000000 srgb
n 31.000000 -1.000000 m 35.800000 -1.000000 l 36.400000 -0.400000 l 36.400000 1.900000 l 31.000000 1.900000 l cp s
0.050000 slw
n 35.800000 -1.000000 m 35.800000 -0.400000 l 36.400000 -0.400000 l s
/Courier-latin1 ff 0.700000 scf sf
(int *e,*f;) 31.350000 0.310937 m gs 1 -1 sc sh gr
(*e=*f;) 31.350000 1.310938 m gs 1 -1 sc sh gr
0.100000 slw
[] 0 sd
[] 0 sd
0 slc
0 slj
0 slc
0 slj
[] 0 sd
1.000000 1.000000 1.000000 srgb
n 31.858835 5.000000 m 35.024945 5.000000 l 35.024945 7.807110 l 31.858835 7.807110 l ef
0.000000 0.000000 0.000000 srgb
n 31.858835 5.000000 m 35.024945 5.000000 l 35.024945 7.807110 l 31.858835 7.807110 l cp s
/Helvetica-latin1 ff 0.700000 scf sf
(=) dup sw 2 div 33.441890 ex sub 6.136367 m gs 1 -1 sc sh gr
(int@) dup sw 2 div 33.441890 ex sub 7.136367 m gs 1 -1 sc sh gr
0.100000 slw
[] 0 sd
[] 0 sd
0 slc
0 slj
0 slc
0 slj
[] 0 sd
1.000000 1.000000 1.000000 srgb
n 29.515378 10.100000 m 32.955902 10.100000 l 32.955902 12.907110 l 29.515378 12.907110 l ef
0.000000 0.000000 0.000000 srgb
n 29.515378 10.100000 m 32.955902 10.100000 l 32.955902 12.907110 l 29.515378 12.907110 l cp s
/Helvetica-latin1 ff 0.700000 scf sf
(deref) dup sw 2 div 31.235640 ex sub 11.236367 m gs 1 -1 sc sh gr
(int@) dup sw 2 div 31.235640 ex sub 12.236367 m gs 1 -1 sc sh gr
0.100000 slw
[] 0 sd
[] 0 sd
0 slc
0 slj
0 slc
0 slj
[] 0 sd
1.000000 1.000000 1.000000 srgb
n 34.115378 14.700000 m 37.555902 14.700000 l 37.555902 17.507110 l 34.115378 17.507110 l ef
0.000000 0.000000 0.000000 srgb
n 34.115378 14.700000 m 37.555902 14.700000 l 37.555902 17.507110 l 34.115378 17.507110 l cp s
/Helvetica-latin1 ff 0.700000 scf sf
(deref) dup sw 2 div 35.835640 ex sub 15.836367 m gs 1 -1 sc sh gr
(int@) dup sw 2 div 35.835640 ex sub 16.836367 m gs 1 -1 sc sh gr
0.100000 slw
[] 0 sd
[] 0 sd
0 slc
n 31.573172 9.749215 m 33.441900 7.807110 l s
[] 0 sd
0 slj
0 slc
n 31.313160 10.019436 m 31.479695 9.485801 l 31.573172 9.749215 l 31.839989 9.832482 l ef
n 31.313160 10.019436 m 31.479695 9.485801 l 31.573172 9.749215 l 31.839989 9.832482 l cp s
0.100000 slw
[] 0 sd
[] 0 sd
0 slc
n 35.480453 9.717157 m 33.441900 7.807110 l s
[] 0 sd
0 slj
0 slc
n 35.754103 9.973556 m 35.218304 9.814124 l 35.480453 9.717157 l 35.560170 9.449257 l ef
n 35.754103 9.973556 m 35.218304 9.814124 l 35.480453 9.717157 l 35.560170 9.449257 l cp s
0.100000 slw
[] 0 sd
[] 0 sd
0 slc
0 slj
0 slc
0 slj
[] 0 sd
1.000000 1.000000 1.000000 srgb
n 34.300000 10.050000 m 37.371380 10.050000 l 37.371380 12.857110 l 34.300000 12.857110 l ef
0.000000 0.000000 0.000000 srgb
n 34.300000 10.050000 m 37.371380 10.050000 l 37.371380 12.857110 l 34.300000 12.857110 l cp s
/Helvetica-latin1 ff 0.700000 scf sf
(get) dup sw 2 div 35.835690 ex sub 11.186367 m gs 1 -1 sc sh gr
(int) dup sw 2 div 35.835690 ex sub 12.186367 m gs 1 -1 sc sh gr
0.100000 slw
[] 0 sd
[] 0 sd
0 slc
n 35.835653 14.213197 m 35.835690 12.857110 l s
[] 0 sd
0 slj
0 slc
n 35.835643 14.588197 m 35.585657 14.088190 l 35.835653 14.213197 l 36.085657 14.088203 l ef
n 35.835643 14.588197 m 35.585657 14.088190 l 35.835653 14.213197 l 36.085657 14.088203 l cp s
0.100000 slw
[] 0 sd
[] 0 sd
0 slc
0 slj
0 slc
0 slj
[] 0 sd
1.000000 1.000000 1.000000 srgb
n 28.928902 19.200000 m 33.542278 19.200000 l 33.542278 22.007110 l 28.928902 22.007110 l ef
0.000000 0.000000 0.000000 srgb
n 28.928902 19.200000 m 33.542278 19.200000 l 33.542278 22.007110 l 28.928902 22.007110 l cp s
/Helvetica-latin1 ff 0.700000 scf sf
(VR a) dup sw 2 div 31.235590 ex sub 20.336367 m gs 1 -1 sc sh gr
(\(int*\)@) dup sw 2 div 31.235590 ex sub 21.336367 m gs 1 -1 sc sh gr
0.100000 slw
[] 0 sd
[] 0 sd
0 slc
0 slj
0 slc
0 slj
[] 0 sd
1.000000 1.000000 1.000000 srgb
n 29.750000 14.650000 m 32.821380 14.650000 l 32.821380 17.457110 l 29.750000 17.457110 l ef
0.000000 0.000000 0.000000 srgb
n 29.750000 14.650000 m 32.821380 14.650000 l 32.821380 17.457110 l 29.750000 17.457110 l cp s
/Helvetica-latin1 ff 0.700000 scf sf
(get) dup sw 2 div 31.285690 ex sub 15.786367 m gs 1 -1 sc sh gr
(int*) dup sw 2 div 31.285690 ex sub 16.786367 m gs 1 -1 sc sh gr
0.100000 slw
[] 0 sd
[] 0 sd
0 slc
0 slj
0 slc
0 slj
[] 0 sd
1.000000 1.000000 1.000000 srgb
n 34.350000 19.250000 m 37.421380 19.250000 l 37.421380 22.057110 l 34.350000 22.057110 l ef
0.000000 0.000000 0.000000 srgb
n 34.350000 19.250000 m 37.421380 19.250000 l 37.421380 22.057110 l 34.350000 22.057110 l cp s
/Helvetica-latin1 ff 0.700000 scf sf
(get) dup sw 2 div 35.885690 ex sub 20.386368 m gs 1 -1 sc sh gr
(int*) dup sw 2 div 35.885690 ex sub 21.386368 m gs 1 -1 sc sh gr
0.100000 slw
[] 0 sd
[] 0 sd
0 slc
0 slj
0 slc
0 slj
[] 0 sd
1.000000 1.000000 1.000000 srgb
n 33.629002 23.550000 m 38.242378 23.550000 l 38.242378 26.357110 l 33.629002 26.357110 l ef
0.000000 0.000000 0.000000 srgb
n 33.629002 23.550000 m 38.242378 23.550000 l 38.242378 26.357110 l 33.629002 26.357110 l cp s
/Helvetica-latin1 ff 0.700000 scf sf
(VR a) dup sw 2 div 35.935690 ex sub 24.686367 m gs 1 -1 sc sh gr
(\(int*\)@) dup sw 2 div 35.935690 ex sub 25.686367 m gs 1 -1 sc sh gr
0.100000 slw
[] 0 sd
[] 0 sd
0 slc
n 31.271716 14.163397 m 31.235640 12.907110 l s
[] 0 sd
0 slj
0 slc
n 31.282481 14.538243 m 31.018231 14.045625 l 31.271716 14.163397 l 31.518025 14.031272 l ef
n 31.282481 14.538243 m 31.018231 14.045625 l 31.271716 14.163397 l 31.518025 14.031272 l cp s
0.100000 slw
[] 0 sd
[] 0 sd
0 slc
n 31.249578 18.713398 m 31.285690 17.457110 l s
[] 0 sd
0 slj
0 slc
n 31.238803 19.088243 m 31.003272 18.581266 l 31.249578 18.713398 l 31.503066 18.595633 l ef
n 31.238803 19.088243 m 31.003272 18.581266 l 31.249578 18.713398 l 31.503066 18.595633 l cp s
0.100000 slw
[] 0 sd
[] 0 sd
0 slc
n 35.871716 18.763397 m 35.835640 17.507110 l s
[] 0 sd
0 slj
0 slc
n 35.882481 19.138243 m 35.618231 18.645625 l 35.871716 18.763397 l 36.118025 18.631272 l ef
n 35.882481 19.138243 m 35.618231 18.645625 l 35.871716 18.763397 l 36.118025 18.631272 l cp s
0.100000 slw
[] 0 sd
[] 0 sd
0 slc
n 35.919395 23.063469 m 35.885690 22.057110 l s
[] 0 sd
0 slj
0 slc
n 35.931948 23.438259 m 35.665351 22.946908 l 35.919395 23.063469 l 36.165071 22.930171 l ef
n 35.931948 23.438259 m 35.665351 22.946908 l 35.919395 23.063469 l 36.165071 22.930171 l cp s
/Helvetica-latin1 ff 0.840000 scf sf
(3.) 30.000000 0.000000 m gs 1 -1 sc sh gr
/Helvetica-latin1 ff 0.560000 scf sf
(pi_mem) 37.616600 22.852400 m gs 1 -1 sc sh gr
/Helvetica-latin1 ff 0.560000 scf sf
(pi_preg) 37.500000 18.500000 m gs 1 -1 sc sh gr
/Helvetica-latin1 ff 0.560000 scf sf
(pi_preg) 35.838700 8.845000 m gs 1 -1 sc sh gr
/Helvetica-latin1 ff 0.560000 scf sf
(pi_mem) 34.638700 4.495000 m gs 1 -1 sc sh gr
0.100000 slw
[] 0 sd
[] 0 sd
0 slc
n 33.445421 4.513209 m 33.450000 3.880130 l s
[] 0 sd
0 slj
0 slc
n 33.442709 4.888200 m 33.196332 4.386404 l 33.445421 4.513209 l 33.696319 4.390021 l ef
n 33.442709 4.888200 m 33.196332 4.386404 l 33.445421 4.513209 l 33.696319 4.390021 l cp s
/Helvetica-latin1 ff 0.560000 scf sf
(pi_mem) 10.300000 13.850000 m gs 1 -1 sc sh gr
0.100000 slw
[] 0 sd
1.000000 1.000000 1.000000 srgb
n 4.411250 -0.895000 m 8.311250 -0.895000 l 8.911250 -0.295000 l 8.911250 2.005000 l 4.411250 2.005000 l ef
0.000000 0.000000 0.000000 srgb
n 4.411250 -0.895000 m 8.311250 -0.895000 l 8.911250 -0.295000 l 8.911250 2.005000 l 4.411250 2.005000 l cp s
0.050000 slw
n 8.311250 -0.895000 m 8.311250 -0.295000 l 8.911250 -0.295000 l s
/Courier-latin1 ff 0.700000 scf sf
(int a,b;) 4.761250 0.415937 m gs 1 -1 sc sh gr
(a=b;) 4.761250 1.415938 m gs 1 -1 sc sh gr
0.100000 slw
[] 0 sd
[] 0 sd
0 slc
0 slj
0 slc
0 slj
[] 0 sd
1.000000 1.000000 1.000000 srgb
n 4.570135 5.155000 m 7.736245 5.155000 l 7.736245 7.962110 l 4.570135 7.962110 l ef
0.000000 0.000000 0.000000 srgb
n 4.570135 5.155000 m 7.736245 5.155000 l 7.736245 7.962110 l 4.570135 7.962110 l cp s
/Helvetica-latin1 ff 0.700000 scf sf
(=) dup sw 2 div 6.153190 ex sub 6.291367 m gs 1 -1 sc sh gr
(int@) dup sw 2 div 6.153190 ex sub 7.291367 m gs 1 -1 sc sh gr
0.100000 slw
[] 0 sd
[] 0 sd
0 slc
0 slj
0 slc
0 slj
[] 0 sd
1.000000 1.000000 1.000000 srgb
n 2.499237 10.055000 m 5.694643 10.055000 l 5.694643 12.862110 l 2.499237 12.862110 l ef
0.000000 0.000000 0.000000 srgb
n 2.499237 10.055000 m 5.694643 10.055000 l 5.694643 12.862110 l 2.499237 12.862110 l cp s
/Helvetica-latin1 ff 0.700000 scf sf
(VR a) dup sw 2 div 4.096940 ex sub 11.191368 m gs 1 -1 sc sh gr
(int@) dup sw 2 div 4.096940 ex sub 12.191368 m gs 1 -1 sc sh gr
0.100000 slw
[] 0 sd
[] 0 sd
0 slc
0 slj
0 slc
0 slj
[] 0 sd
1.000000 1.000000 1.000000 srgb
n 7.038983 14.655000 m 10.254897 14.655000 l 10.254897 17.462110 l 7.038983 17.462110 l ef
0.000000 0.000000 0.000000 srgb
n 7.038983 14.655000 m 10.254897 14.655000 l 10.254897 17.462110 l 7.038983 17.462110 l cp s
/Helvetica-latin1 ff 0.700000 scf sf
(VR b) dup sw 2 div 8.646940 ex sub 15.791367 m gs 1 -1 sc sh gr
(int@) dup sw 2 div 8.646940 ex sub 16.791367 m gs 1 -1 sc sh gr
0.100000 slw
[] 0 sd
[] 0 sd
0 slc
n 4.438109 9.707752 m 6.153190 7.962110 l s
[] 0 sd
0 slj
0 slc
n 4.175296 9.975248 m 4.347383 9.443378 l 4.438109 9.707752 l 4.704044 9.793795 l ef
n 4.175296 9.975248 m 4.347383 9.443378 l 4.438109 9.707752 l 4.704044 9.793795 l cp s
0.100000 slw
[] 0 sd
[] 0 sd
0 slc
n 8.321019 9.745708 m 6.153190 7.962110 l s
[] 0 sd
0 slj
0 slc
n 8.610603 9.983965 m 8.065654 9.859345 l 8.321019 9.745708 l 8.383330 9.473234 l ef
n 8.610603 9.983965 m 8.065654 9.859345 l 8.321019 9.745708 l 8.383330 9.473234 l cp s
0.100000 slw
[] 0 sd
[] 0 sd
0 slc
0 slj
0 slc
0 slj
[] 0 sd
1.000000 1.000000 1.000000 srgb
n 7.161250 10.055000 m 10.232630 10.055000 l 10.232630 12.862110 l 7.161250 12.862110 l ef
0.000000 0.000000 0.000000 srgb
n 7.161250 10.055000 m 10.232630 10.055000 l 10.232630 12.862110 l 7.161250 12.862110 l cp s
/Helvetica-latin1 ff 0.700000 scf sf
(get) dup sw 2 div 8.696940 ex sub 11.191368 m gs 1 -1 sc sh gr
(int) dup sw 2 div 8.696940 ex sub 12.191368 m gs 1 -1 sc sh gr
0.100000 slw
[] 0 sd
[] 0 sd
0 slc
n 8.660511 14.168386 m 8.696940 12.862110 l s
[] 0 sd
0 slj
0 slc
n 8.650057 14.543240 m 8.414092 14.036465 l 8.660511 14.168386 l 8.913898 14.050404 l ef
n 8.650057 14.543240 m 8.414092 14.036465 l 8.660511 14.168386 l 8.913898 14.050404 l cp s
/Helvetica-latin1 ff 0.840000 scf sf
(1.) 3.361250 0.105000 m gs 1 -1 sc sh gr
/Helvetica-latin1 ff 0.560000 scf sf
(pi_preg) 8.250000 8.750000 m gs 1 -1 sc sh gr
0.100000 slw
[] 0 sd
[] 0 sd
0 slc
n 6.141842 4.668329 m 6.125000 3.946038 l s
[] 0 sd
0 slj
0 slc
n 6.150584 5.043227 m 5.888996 4.549191 l 6.141842 4.668329 l 6.388860 4.537535 l ef
n 6.150584 5.043227 m 5.888996 4.549191 l 6.141842 4.668329 l 6.388860 4.537535 l cp s
/Helvetica-latin1 ff 0.560000 scf sf
(pi_mem) 7.250000 4.650000 m gs 1 -1 sc sh gr
showpage
