<?xml version="1.0" encoding="UTF-8"?>
<dia:diagram xmlns:dia="http://www.lysator.liu.se/~alla/dia/">
  <dia:diagramdata>
    <dia:attribute name="background">
      <dia:color val="#ffffff"/>
    </dia:attribute>
    <dia:attribute name="pagebreak">
      <dia:color val="#000099"/>
    </dia:attribute>
    <dia:attribute name="paper">
      <dia:composite type="paper">
        <dia:attribute name="name">
          <dia:string>#A4#</dia:string>
        </dia:attribute>
        <dia:attribute name="tmargin">
          <dia:real val="2.8222000598907471"/>
        </dia:attribute>
        <dia:attribute name="bmargin">
          <dia:real val="2.8222000598907471"/>
        </dia:attribute>
        <dia:attribute name="lmargin">
          <dia:real val="2.8222000598907471"/>
        </dia:attribute>
        <dia:attribute name="rmargin">
          <dia:real val="2.8222000598907471"/>
        </dia:attribute>
        <dia:attribute name="is_portrait">
          <dia:boolean val="true"/>
        </dia:attribute>
        <dia:attribute name="scaling">
          <dia:real val="1"/>
        </dia:attribute>
        <dia:attribute name="fitto">
          <dia:boolean val="false"/>
        </dia:attribute>
      </dia:composite>
    </dia:attribute>
    <dia:attribute name="grid">
      <dia:composite type="grid">
        <dia:attribute name="width_x">
          <dia:real val="1"/>
        </dia:attribute>
        <dia:attribute name="width_y">
          <dia:real val="1"/>
        </dia:attribute>
        <dia:attribute name="visible_x">
          <dia:int val="1"/>
        </dia:attribute>
        <dia:attribute name="visible_y">
          <dia:int val="1"/>
        </dia:attribute>
        <dia:composite type="color"/>
      </dia:composite>
    </dia:attribute>
    <dia:attribute name="color">
      <dia:color val="#d8e5e5"/>
    </dia:attribute>
    <dia:attribute name="guides">
      <dia:composite type="guides">
        <dia:attribute name="hguides"/>
        <dia:attribute name="vguides"/>
      </dia:composite>
    </dia:attribute>
  </dia:diagramdata>
  <dia:layer name="Background" visible="true">
    <dia:object type="UML - Class" version="0" id="O0">
      <dia:attribute name="obj_pos">
        <dia:point val="13.85,5.7"/>
      </dia:attribute>
      <dia:attribute name="obj_bb">
        <dia:rectangle val="13.8,5.65;19.2836,7.15"/>
      </dia:attribute>
      <dia:attribute name="elem_corner">
        <dia:point val="13.85,5.7"/>
      </dia:attribute>
      <dia:attribute name="elem_width">
        <dia:real val="5.3835937499999993"/>
      </dia:attribute>
      <dia:attribute name="elem_height">
        <dia:real val="1.3999999999999999"/>
      </dia:attribute>
      <dia:attribute name="name">
        <dia:string>#pi_operand#</dia:string>
      </dia:attribute>
      <dia:attribute name="stereotype">
        <dia:string>##</dia:string>
      </dia:attribute>
      <dia:attribute name="comment">
        <dia:string>##</dia:string>
      </dia:attribute>
      <dia:attribute name="abstract">
        <dia:boolean val="false"/>
      </dia:attribute>
      <dia:attribute name="suppress_attributes">
        <dia:boolean val="false"/>
      </dia:attribute>
      <dia:attribute name="suppress_operations">
        <dia:boolean val="false"/>
      </dia:attribute>
      <dia:attribute name="visible_attributes">
        <dia:boolean val="false"/>
      </dia:attribute>
      <dia:attribute name="visible_operations">
        <dia:boolean val="false"/>
      </dia:attribute>
      <dia:attribute name="visible_comments">
        <dia:boolean val="false"/>
      </dia:attribute>
      <dia:attribute name="wrap_operations">
        <dia:boolean val="false"/>
      </dia:attribute>
      <dia:attribute name="wrap_after_char">
        <dia:int val="40"/>
      </dia:attribute>
      <dia:attribute name="line_color">
        <dia:color val="#000000"/>
      </dia:attribute>
      <dia:attribute name="fill_color">
        <dia:color val="#ffffff"/>
      </dia:attribute>
      <dia:attribute name="text_color">
        <dia:color val="#000000"/>
      </dia:attribute>
      <dia:attribute name="normal_font">
        <dia:font family="monospace" style="0" name="Courier"/>
      </dia:attribute>
      <dia:attribute name="abstract_font">
        <dia:font family="monospace" style="88" name="Courier"/>
      </dia:attribute>
      <dia:attribute name="polymorphic_font">
        <dia:font family="monospace" style="8" name="Courier"/>
      </dia:attribute>
      <dia:attribute name="classname_font">
        <dia:font family="sans" style="80" name="Helvetica"/>
      </dia:attribute>
      <dia:attribute name="abstract_classname_font">
        <dia:font family="sans" style="88" name="Helvetica"/>
      </dia:attribute>
      <dia:attribute name="comment_font">
        <dia:font family="sans" style="8" name="Helvetica"/>
      </dia:attribute>
      <dia:attribute name="font_height">
        <dia:real val="0.80000000000000004"/>
      </dia:attribute>
      <dia:attribute name="polymorphic_font_height">
        <dia:real val="0.80000000000000004"/>
      </dia:attribute>
      <dia:attribute name="abstract_font_height">
        <dia:real val="0.80000000000000004"/>
      </dia:attribute>
      <dia:attribute name="classname_font_height">
        <dia:real val="1"/>
      </dia:attribute>
      <dia:attribute name="abstract_classname_font_height">
        <dia:real val="1"/>
      </dia:attribute>
      <dia:attribute name="comment_font_height">
        <dia:real val="1"/>
      </dia:attribute>
      <dia:attribute name="attributes"/>
      <dia:attribute name="operations"/>
      <dia:attribute name="template">
        <dia:boolean val="false"/>
      </dia:attribute>
      <dia:attribute name="templates"/>
    </dia:object>
    <dia:object type="UML - Class" version="0" id="O1">
      <dia:attribute name="obj_pos">
        <dia:point val="11.45,7.9"/>
      </dia:attribute>
      <dia:attribute name="obj_bb">
        <dia:rectangle val="11.4,7.85;15.5,9.35"/>
      </dia:attribute>
      <dia:attribute name="elem_corner">
        <dia:point val="11.45,7.9"/>
      </dia:attribute>
      <dia:attribute name="elem_width">
        <dia:real val="4"/>
      </dia:attribute>
      <dia:attribute name="elem_height">
        <dia:real val="1.3999999999999999"/>
      </dia:attribute>
      <dia:attribute name="name">
        <dia:string>#pi_mem#</dia:string>
      </dia:attribute>
      <dia:attribute name="stereotype">
        <dia:string>##</dia:string>
      </dia:attribute>
      <dia:attribute name="comment">
        <dia:string>##</dia:string>
      </dia:attribute>
      <dia:attribute name="abstract">
        <dia:boolean val="false"/>
      </dia:attribute>
      <dia:attribute name="suppress_attributes">
        <dia:boolean val="false"/>
      </dia:attribute>
      <dia:attribute name="suppress_operations">
        <dia:boolean val="false"/>
      </dia:attribute>
      <dia:attribute name="visible_attributes">
        <dia:boolean val="false"/>
      </dia:attribute>
      <dia:attribute name="visible_operations">
        <dia:boolean val="false"/>
      </dia:attribute>
      <dia:attribute name="visible_comments">
        <dia:boolean val="false"/>
      </dia:attribute>
      <dia:attribute name="wrap_operations">
        <dia:boolean val="false"/>
      </dia:attribute>
      <dia:attribute name="wrap_after_char">
        <dia:int val="40"/>
      </dia:attribute>
      <dia:attribute name="line_color">
        <dia:color val="#000000"/>
      </dia:attribute>
      <dia:attribute name="fill_color">
        <dia:color val="#ffffff"/>
      </dia:attribute>
      <dia:attribute name="text_color">
        <dia:color val="#000000"/>
      </dia:attribute>
      <dia:attribute name="normal_font">
        <dia:font family="monospace" style="0" name="Courier"/>
      </dia:attribute>
      <dia:attribute name="abstract_font">
        <dia:font family="monospace" style="88" name="Courier"/>
      </dia:attribute>
      <dia:attribute name="polymorphic_font">
        <dia:font family="monospace" style="8" name="Courier"/>
      </dia:attribute>
      <dia:attribute name="classname_font">
        <dia:font family="sans" style="80" name="Helvetica"/>
      </dia:attribute>
      <dia:attribute name="abstract_classname_font">
        <dia:font family="sans" style="88" name="Helvetica"/>
      </dia:attribute>
      <dia:attribute name="comment_font">
        <dia:font family="sans" style="8" name="Helvetica"/>
      </dia:attribute>
      <dia:attribute name="font_height">
        <dia:real val="0.80000000000000004"/>
      </dia:attribute>
      <dia:attribute name="polymorphic_font_height">
        <dia:real val="0.80000000000000004"/>
      </dia:attribute>
      <dia:attribute name="abstract_font_height">
        <dia:real val="0.80000000000000004"/>
      </dia:attribute>
      <dia:attribute name="classname_font_height">
        <dia:real val="1"/>
      </dia:attribute>
      <dia:attribute name="abstract_classname_font_height">
        <dia:real val="1"/>
      </dia:attribute>
      <dia:attribute name="comment_font_height">
        <dia:real val="1"/>
      </dia:attribute>
      <dia:attribute name="attributes"/>
      <dia:attribute name="operations"/>
      <dia:attribute name="template">
        <dia:boolean val="false"/>
      </dia:attribute>
      <dia:attribute name="templates"/>
    </dia:object>
    <dia:object type="UML - Class" version="0" id="O2">
      <dia:attribute name="obj_pos">
        <dia:point val="17.55,7.9"/>
      </dia:attribute>
      <dia:attribute name="obj_bb">
        <dia:rectangle val="17.5,7.85;23.7172,9.35"/>
      </dia:attribute>
      <dia:attribute name="elem_corner">
        <dia:point val="17.55,7.9"/>
      </dia:attribute>
      <dia:attribute name="elem_width">
        <dia:real val="6.1171875"/>
      </dia:attribute>
      <dia:attribute name="elem_height">
        <dia:real val="1.3999999999999999"/>
      </dia:attribute>
      <dia:attribute name="name">
        <dia:string>#pi_non_mem#</dia:string>
      </dia:attribute>
      <dia:attribute name="stereotype">
        <dia:string>##</dia:string>
      </dia:attribute>
      <dia:attribute name="comment">
        <dia:string>##</dia:string>
      </dia:attribute>
      <dia:attribute name="abstract">
        <dia:boolean val="false"/>
      </dia:attribute>
      <dia:attribute name="suppress_attributes">
        <dia:boolean val="false"/>
      </dia:attribute>
      <dia:attribute name="suppress_operations">
        <dia:boolean val="false"/>
      </dia:attribute>
      <dia:attribute name="visible_attributes">
        <dia:boolean val="false"/>
      </dia:attribute>
      <dia:attribute name="visible_operations">
        <dia:boolean val="false"/>
      </dia:attribute>
      <dia:attribute name="visible_comments">
        <dia:boolean val="false"/>
      </dia:attribute>
      <dia:attribute name="wrap_operations">
        <dia:boolean val="false"/>
      </dia:attribute>
      <dia:attribute name="wrap_after_char">
        <dia:int val="40"/>
      </dia:attribute>
      <dia:attribute name="line_color">
        <dia:color val="#000000"/>
      </dia:attribute>
      <dia:attribute name="fill_color">
        <dia:color val="#ffffff"/>
      </dia:attribute>
      <dia:attribute name="text_color">
        <dia:color val="#000000"/>
      </dia:attribute>
      <dia:attribute name="normal_font">
        <dia:font family="monospace" style="0" name="Courier"/>
      </dia:attribute>
      <dia:attribute name="abstract_font">
        <dia:font family="monospace" style="88" name="Courier"/>
      </dia:attribute>
      <dia:attribute name="polymorphic_font">
        <dia:font family="monospace" style="8" name="Courier"/>
      </dia:attribute>
      <dia:attribute name="classname_font">
        <dia:font family="sans" style="80" name="Helvetica"/>
      </dia:attribute>
      <dia:attribute name="abstract_classname_font">
        <dia:font family="sans" style="88" name="Helvetica"/>
      </dia:attribute>
      <dia:attribute name="comment_font">
        <dia:font family="sans" style="8" name="Helvetica"/>
      </dia:attribute>
      <dia:attribute name="font_height">
        <dia:real val="0.80000000000000004"/>
      </dia:attribute>
      <dia:attribute name="polymorphic_font_height">
        <dia:real val="0.80000000000000004"/>
      </dia:attribute>
      <dia:attribute name="abstract_font_height">
        <dia:real val="0.80000000000000004"/>
      </dia:attribute>
      <dia:attribute name="classname_font_height">
        <dia:real val="1"/>
      </dia:attribute>
      <dia:attribute name="abstract_classname_font_height">
        <dia:real val="1"/>
      </dia:attribute>
      <dia:attribute name="comment_font_height">
        <dia:real val="1"/>
      </dia:attribute>
      <dia:attribute name="attributes"/>
      <dia:attribute name="operations"/>
      <dia:attribute name="template">
        <dia:boolean val="false"/>
      </dia:attribute>
      <dia:attribute name="templates"/>
    </dia:object>
    <dia:object type="UML - Class" version="0" id="O3">
      <dia:attribute name="obj_pos">
        <dia:point val="5.9,10.5"/>
      </dia:attribute>
      <dia:attribute name="obj_bb">
        <dia:rectangle val="5.85,10.45;12.7156,11.95"/>
      </dia:attribute>
      <dia:attribute name="elem_corner">
        <dia:point val="5.9,10.5"/>
      </dia:attribute>
      <dia:attribute name="elem_width">
        <dia:real val="6.765625"/>
      </dia:attribute>
      <dia:attribute name="elem_height">
        <dia:real val="1.3999999999999999"/>
      </dia:attribute>
      <dia:attribute name="name">
        <dia:string>#pi_mem_stack#</dia:string>
      </dia:attribute>
      <dia:attribute name="stereotype">
        <dia:string>##</dia:string>
      </dia:attribute>
      <dia:attribute name="comment">
        <dia:string>##</dia:string>
      </dia:attribute>
      <dia:attribute name="abstract">
        <dia:boolean val="false"/>
      </dia:attribute>
      <dia:attribute name="suppress_attributes">
        <dia:boolean val="false"/>
      </dia:attribute>
      <dia:attribute name="suppress_operations">
        <dia:boolean val="false"/>
      </dia:attribute>
      <dia:attribute name="visible_attributes">
        <dia:boolean val="false"/>
      </dia:attribute>
      <dia:attribute name="visible_operations">
        <dia:boolean val="false"/>
      </dia:attribute>
      <dia:attribute name="visible_comments">
        <dia:boolean val="false"/>
      </dia:attribute>
      <dia:attribute name="wrap_operations">
        <dia:boolean val="false"/>
      </dia:attribute>
      <dia:attribute name="wrap_after_char">
        <dia:int val="40"/>
      </dia:attribute>
      <dia:attribute name="line_color">
        <dia:color val="#000000"/>
      </dia:attribute>
      <dia:attribute name="fill_color">
        <dia:color val="#ffffff"/>
      </dia:attribute>
      <dia:attribute name="text_color">
        <dia:color val="#000000"/>
      </dia:attribute>
      <dia:attribute name="normal_font">
        <dia:font family="monospace" style="0" name="Courier"/>
      </dia:attribute>
      <dia:attribute name="abstract_font">
        <dia:font family="monospace" style="88" name="Courier"/>
      </dia:attribute>
      <dia:attribute name="polymorphic_font">
        <dia:font family="monospace" style="8" name="Courier"/>
      </dia:attribute>
      <dia:attribute name="classname_font">
        <dia:font family="sans" style="80" name="Helvetica"/>
      </dia:attribute>
      <dia:attribute name="abstract_classname_font">
        <dia:font family="sans" style="88" name="Helvetica"/>
      </dia:attribute>
      <dia:attribute name="comment_font">
        <dia:font family="sans" style="8" name="Helvetica"/>
      </dia:attribute>
      <dia:attribute name="font_height">
        <dia:real val="0.80000000000000004"/>
      </dia:attribute>
      <dia:attribute name="polymorphic_font_height">
        <dia:real val="0.80000000000000004"/>
      </dia:attribute>
      <dia:attribute name="abstract_font_height">
        <dia:real val="0.80000000000000004"/>
      </dia:attribute>
      <dia:attribute name="classname_font_height">
        <dia:real val="1"/>
      </dia:attribute>
      <dia:attribute name="abstract_classname_font_height">
        <dia:real val="1"/>
      </dia:attribute>
      <dia:attribute name="comment_font_height">
        <dia:real val="1"/>
      </dia:attribute>
      <dia:attribute name="attributes"/>
      <dia:attribute name="operations"/>
      <dia:attribute name="template">
        <dia:boolean val="false"/>
      </dia:attribute>
      <dia:attribute name="templates"/>
    </dia:object>
    <dia:object type="UML - Class" version="0" id="O4">
      <dia:attribute name="obj_pos">
        <dia:point val="6.55,12.75"/>
      </dia:attribute>
      <dia:attribute name="obj_bb">
        <dia:rectangle val="6.5,12.7;12.8539,14.2"/>
      </dia:attribute>
      <dia:attribute name="elem_corner">
        <dia:point val="6.55,12.75"/>
      </dia:attribute>
      <dia:attribute name="elem_width">
        <dia:real val="6.25390625"/>
      </dia:attribute>
      <dia:attribute name="elem_height">
        <dia:real val="1.3999999999999999"/>
      </dia:attribute>
      <dia:attribute name="name">
        <dia:string>#pi_mem_decl#</dia:string>
      </dia:attribute>
      <dia:attribute name="stereotype">
        <dia:string>##</dia:string>
      </dia:attribute>
      <dia:attribute name="comment">
        <dia:string>##</dia:string>
      </dia:attribute>
      <dia:attribute name="abstract">
        <dia:boolean val="false"/>
      </dia:attribute>
      <dia:attribute name="suppress_attributes">
        <dia:boolean val="false"/>
      </dia:attribute>
      <dia:attribute name="suppress_operations">
        <dia:boolean val="false"/>
      </dia:attribute>
      <dia:attribute name="visible_attributes">
        <dia:boolean val="false"/>
      </dia:attribute>
      <dia:attribute name="visible_operations">
        <dia:boolean val="false"/>
      </dia:attribute>
      <dia:attribute name="visible_comments">
        <dia:boolean val="false"/>
      </dia:attribute>
      <dia:attribute name="wrap_operations">
        <dia:boolean val="false"/>
      </dia:attribute>
      <dia:attribute name="wrap_after_char">
        <dia:int val="40"/>
      </dia:attribute>
      <dia:attribute name="line_color">
        <dia:color val="#000000"/>
      </dia:attribute>
      <dia:attribute name="fill_color">
        <dia:color val="#ffffff"/>
      </dia:attribute>
      <dia:attribute name="text_color">
        <dia:color val="#000000"/>
      </dia:attribute>
      <dia:attribute name="normal_font">
        <dia:font family="monospace" style="0" name="Courier"/>
      </dia:attribute>
      <dia:attribute name="abstract_font">
        <dia:font family="monospace" style="88" name="Courier"/>
      </dia:attribute>
      <dia:attribute name="polymorphic_font">
        <dia:font family="monospace" style="8" name="Courier"/>
      </dia:attribute>
      <dia:attribute name="classname_font">
        <dia:font family="sans" style="80" name="Helvetica"/>
      </dia:attribute>
      <dia:attribute name="abstract_classname_font">
        <dia:font family="sans" style="88" name="Helvetica"/>
      </dia:attribute>
      <dia:attribute name="comment_font">
        <dia:font family="sans" style="8" name="Helvetica"/>
      </dia:attribute>
      <dia:attribute name="font_height">
        <dia:real val="0.80000000000000004"/>
      </dia:attribute>
      <dia:attribute name="polymorphic_font_height">
        <dia:real val="0.80000000000000004"/>
      </dia:attribute>
      <dia:attribute name="abstract_font_height">
        <dia:real val="0.80000000000000004"/>
      </dia:attribute>
      <dia:attribute name="classname_font_height">
        <dia:real val="1"/>
      </dia:attribute>
      <dia:attribute name="abstract_classname_font_height">
        <dia:real val="1"/>
      </dia:attribute>
      <dia:attribute name="comment_font_height">
        <dia:real val="1"/>
      </dia:attribute>
      <dia:attribute name="attributes"/>
      <dia:attribute name="operations"/>
      <dia:attribute name="template">
        <dia:boolean val="false"/>
      </dia:attribute>
      <dia:attribute name="templates"/>
    </dia:object>
    <dia:object type="UML - Class" version="0" id="O5">
      <dia:attribute name="obj_pos">
        <dia:point val="4.7,14.8"/>
      </dia:attribute>
      <dia:attribute name="obj_bb">
        <dia:rectangle val="4.65,14.75;12.7648,16.25"/>
      </dia:attribute>
      <dia:attribute name="elem_corner">
        <dia:point val="4.7,14.8"/>
      </dia:attribute>
      <dia:attribute name="elem_width">
        <dia:real val="8.0148437500000007"/>
      </dia:attribute>
      <dia:attribute name="elem_height">
        <dia:real val="1.3999999999999999"/>
      </dia:attribute>
      <dia:attribute name="name">
        <dia:string>#pi_mem_member#</dia:string>
      </dia:attribute>
      <dia:attribute name="stereotype">
        <dia:string>##</dia:string>
      </dia:attribute>
      <dia:attribute name="comment">
        <dia:string>##</dia:string>
      </dia:attribute>
      <dia:attribute name="abstract">
        <dia:boolean val="false"/>
      </dia:attribute>
      <dia:attribute name="suppress_attributes">
        <dia:boolean val="false"/>
      </dia:attribute>
      <dia:attribute name="suppress_operations">
        <dia:boolean val="false"/>
      </dia:attribute>
      <dia:attribute name="visible_attributes">
        <dia:boolean val="false"/>
      </dia:attribute>
      <dia:attribute name="visible_operations">
        <dia:boolean val="false"/>
      </dia:attribute>
      <dia:attribute name="visible_comments">
        <dia:boolean val="false"/>
      </dia:attribute>
      <dia:attribute name="wrap_operations">
        <dia:boolean val="false"/>
      </dia:attribute>
      <dia:attribute name="wrap_after_char">
        <dia:int val="40"/>
      </dia:attribute>
      <dia:attribute name="line_color">
        <dia:color val="#000000"/>
      </dia:attribute>
      <dia:attribute name="fill_color">
        <dia:color val="#ffffff"/>
      </dia:attribute>
      <dia:attribute name="text_color">
        <dia:color val="#000000"/>
      </dia:attribute>
      <dia:attribute name="normal_font">
        <dia:font family="monospace" style="0" name="Courier"/>
      </dia:attribute>
      <dia:attribute name="abstract_font">
        <dia:font family="monospace" style="88" name="Courier"/>
      </dia:attribute>
      <dia:attribute name="polymorphic_font">
        <dia:font family="monospace" style="8" name="Courier"/>
      </dia:attribute>
      <dia:attribute name="classname_font">
        <dia:font family="sans" style="80" name="Helvetica"/>
      </dia:attribute>
      <dia:attribute name="abstract_classname_font">
        <dia:font family="sans" style="88" name="Helvetica"/>
      </dia:attribute>
      <dia:attribute name="comment_font">
        <dia:font family="sans" style="8" name="Helvetica"/>
      </dia:attribute>
      <dia:attribute name="font_height">
        <dia:real val="0.80000000000000004"/>
      </dia:attribute>
      <dia:attribute name="polymorphic_font_height">
        <dia:real val="0.80000000000000004"/>
      </dia:attribute>
      <dia:attribute name="abstract_font_height">
        <dia:real val="0.80000000000000004"/>
      </dia:attribute>
      <dia:attribute name="classname_font_height">
        <dia:real val="1"/>
      </dia:attribute>
      <dia:attribute name="abstract_classname_font_height">
        <dia:real val="1"/>
      </dia:attribute>
      <dia:attribute name="comment_font_height">
        <dia:real val="1"/>
      </dia:attribute>
      <dia:attribute name="attributes"/>
      <dia:attribute name="operations"/>
      <dia:attribute name="template">
        <dia:boolean val="false"/>
      </dia:attribute>
      <dia:attribute name="templates"/>
    </dia:object>
    <dia:object type="UML - Class" version="0" id="O6">
      <dia:attribute name="obj_pos">
        <dia:point val="6.45,16.85"/>
      </dia:attribute>
      <dia:attribute name="obj_bb">
        <dia:rectangle val="6.4,16.8;12.9531,18.3"/>
      </dia:attribute>
      <dia:attribute name="elem_corner">
        <dia:point val="6.45,16.85"/>
      </dia:attribute>
      <dia:attribute name="elem_width">
        <dia:real val="6.453125"/>
      </dia:attribute>
      <dia:attribute name="elem_height">
        <dia:real val="1.3999999999999999"/>
      </dia:attribute>
      <dia:attribute name="name">
        <dia:string>#pi_mem_preg#</dia:string>
      </dia:attribute>
      <dia:attribute name="stereotype">
        <dia:string>##</dia:string>
      </dia:attribute>
      <dia:attribute name="comment">
        <dia:string>##</dia:string>
      </dia:attribute>
      <dia:attribute name="abstract">
        <dia:boolean val="false"/>
      </dia:attribute>
      <dia:attribute name="suppress_attributes">
        <dia:boolean val="false"/>
      </dia:attribute>
      <dia:attribute name="suppress_operations">
        <dia:boolean val="false"/>
      </dia:attribute>
      <dia:attribute name="visible_attributes">
        <dia:boolean val="false"/>
      </dia:attribute>
      <dia:attribute name="visible_operations">
        <dia:boolean val="false"/>
      </dia:attribute>
      <dia:attribute name="visible_comments">
        <dia:boolean val="false"/>
      </dia:attribute>
      <dia:attribute name="wrap_operations">
        <dia:boolean val="false"/>
      </dia:attribute>
      <dia:attribute name="wrap_after_char">
        <dia:int val="40"/>
      </dia:attribute>
      <dia:attribute name="line_color">
        <dia:color val="#000000"/>
      </dia:attribute>
      <dia:attribute name="fill_color">
        <dia:color val="#ffffff"/>
      </dia:attribute>
      <dia:attribute name="text_color">
        <dia:color val="#000000"/>
      </dia:attribute>
      <dia:attribute name="normal_font">
        <dia:font family="monospace" style="0" name="Courier"/>
      </dia:attribute>
      <dia:attribute name="abstract_font">
        <dia:font family="monospace" style="88" name="Courier"/>
      </dia:attribute>
      <dia:attribute name="polymorphic_font">
        <dia:font family="monospace" style="8" name="Courier"/>
      </dia:attribute>
      <dia:attribute name="classname_font">
        <dia:font family="sans" style="80" name="Helvetica"/>
      </dia:attribute>
      <dia:attribute name="abstract_classname_font">
        <dia:font family="sans" style="88" name="Helvetica"/>
      </dia:attribute>
      <dia:attribute name="comment_font">
        <dia:font family="sans" style="8" name="Helvetica"/>
      </dia:attribute>
      <dia:attribute name="font_height">
        <dia:real val="0.80000000000000004"/>
      </dia:attribute>
      <dia:attribute name="polymorphic_font_height">
        <dia:real val="0.80000000000000004"/>
      </dia:attribute>
      <dia:attribute name="abstract_font_height">
        <dia:real val="0.80000000000000004"/>
      </dia:attribute>
      <dia:attribute name="classname_font_height">
        <dia:real val="1"/>
      </dia:attribute>
      <dia:attribute name="abstract_classname_font_height">
        <dia:real val="1"/>
      </dia:attribute>
      <dia:attribute name="comment_font_height">
        <dia:real val="1"/>
      </dia:attribute>
      <dia:attribute name="attributes"/>
      <dia:attribute name="operations"/>
      <dia:attribute name="template">
        <dia:boolean val="false"/>
      </dia:attribute>
      <dia:attribute name="templates"/>
    </dia:object>
    <dia:object type="UML - Class" version="0" id="O7">
      <dia:attribute name="obj_pos">
        <dia:point val="4.55,19"/>
      </dia:attribute>
      <dia:attribute name="obj_bb">
        <dia:rectangle val="4.5,18.95;13.1156,20.45"/>
      </dia:attribute>
      <dia:attribute name="elem_corner">
        <dia:point val="4.55,19"/>
      </dia:attribute>
      <dia:attribute name="elem_width">
        <dia:real val="8.515625"/>
      </dia:attribute>
      <dia:attribute name="elem_height">
        <dia:real val="1.3999999999999999"/>
      </dia:attribute>
      <dia:attribute name="name">
        <dia:string>#pi_mem_ptr_deref#</dia:string>
      </dia:attribute>
      <dia:attribute name="stereotype">
        <dia:string>##</dia:string>
      </dia:attribute>
      <dia:attribute name="comment">
        <dia:string>##</dia:string>
      </dia:attribute>
      <dia:attribute name="abstract">
        <dia:boolean val="false"/>
      </dia:attribute>
      <dia:attribute name="suppress_attributes">
        <dia:boolean val="false"/>
      </dia:attribute>
      <dia:attribute name="suppress_operations">
        <dia:boolean val="false"/>
      </dia:attribute>
      <dia:attribute name="visible_attributes">
        <dia:boolean val="false"/>
      </dia:attribute>
      <dia:attribute name="visible_operations">
        <dia:boolean val="false"/>
      </dia:attribute>
      <dia:attribute name="visible_comments">
        <dia:boolean val="false"/>
      </dia:attribute>
      <dia:attribute name="wrap_operations">
        <dia:boolean val="false"/>
      </dia:attribute>
      <dia:attribute name="wrap_after_char">
        <dia:int val="40"/>
      </dia:attribute>
      <dia:attribute name="line_color">
        <dia:color val="#000000"/>
      </dia:attribute>
      <dia:attribute name="fill_color">
        <dia:color val="#ffffff"/>
      </dia:attribute>
      <dia:attribute name="text_color">
        <dia:color val="#000000"/>
      </dia:attribute>
      <dia:attribute name="normal_font">
        <dia:font family="monospace" style="0" name="Courier"/>
      </dia:attribute>
      <dia:attribute name="abstract_font">
        <dia:font family="monospace" style="88" name="Courier"/>
      </dia:attribute>
      <dia:attribute name="polymorphic_font">
        <dia:font family="monospace" style="8" name="Courier"/>
      </dia:attribute>
      <dia:attribute name="classname_font">
        <dia:font family="sans" style="80" name="Helvetica"/>
      </dia:attribute>
      <dia:attribute name="abstract_classname_font">
        <dia:font family="sans" style="88" name="Helvetica"/>
      </dia:attribute>
      <dia:attribute name="comment_font">
        <dia:font family="sans" style="8" name="Helvetica"/>
      </dia:attribute>
      <dia:attribute name="font_height">
        <dia:real val="0.80000000000000004"/>
      </dia:attribute>
      <dia:attribute name="polymorphic_font_height">
        <dia:real val="0.80000000000000004"/>
      </dia:attribute>
      <dia:attribute name="abstract_font_height">
        <dia:real val="0.80000000000000004"/>
      </dia:attribute>
      <dia:attribute name="classname_font_height">
        <dia:real val="1"/>
      </dia:attribute>
      <dia:attribute name="abstract_classname_font_height">
        <dia:real val="1"/>
      </dia:attribute>
      <dia:attribute name="comment_font_height">
        <dia:real val="1"/>
      </dia:attribute>
      <dia:attribute name="attributes"/>
      <dia:attribute name="operations"/>
      <dia:attribute name="template">
        <dia:boolean val="false"/>
      </dia:attribute>
      <dia:attribute name="templates"/>
    </dia:object>
    <dia:object type="UML - Class" version="0" id="O8">
      <dia:attribute name="obj_pos">
        <dia:point val="6.05,21.25"/>
      </dia:attribute>
      <dia:attribute name="obj_bb">
        <dia:rectangle val="6,21.2;12.7914,22.7"/>
      </dia:attribute>
      <dia:attribute name="elem_corner">
        <dia:point val="6.05,21.25"/>
      </dia:attribute>
      <dia:attribute name="elem_width">
        <dia:real val="6.69140625"/>
      </dia:attribute>
      <dia:attribute name="elem_height">
        <dia:real val="1.3999999999999999"/>
      </dia:attribute>
      <dia:attribute name="name">
        <dia:string>#pi_mem_temp#</dia:string>
      </dia:attribute>
      <dia:attribute name="stereotype">
        <dia:string>##</dia:string>
      </dia:attribute>
      <dia:attribute name="comment">
        <dia:string>##</dia:string>
      </dia:attribute>
      <dia:attribute name="abstract">
        <dia:boolean val="false"/>
      </dia:attribute>
      <dia:attribute name="suppress_attributes">
        <dia:boolean val="false"/>
      </dia:attribute>
      <dia:attribute name="suppress_operations">
        <dia:boolean val="false"/>
      </dia:attribute>
      <dia:attribute name="visible_attributes">
        <dia:boolean val="false"/>
      </dia:attribute>
      <dia:attribute name="visible_operations">
        <dia:boolean val="false"/>
      </dia:attribute>
      <dia:attribute name="visible_comments">
        <dia:boolean val="false"/>
      </dia:attribute>
      <dia:attribute name="wrap_operations">
        <dia:boolean val="false"/>
      </dia:attribute>
      <dia:attribute name="wrap_after_char">
        <dia:int val="40"/>
      </dia:attribute>
      <dia:attribute name="line_color">
        <dia:color val="#000000"/>
      </dia:attribute>
      <dia:attribute name="fill_color">
        <dia:color val="#ffffff"/>
      </dia:attribute>
      <dia:attribute name="text_color">
        <dia:color val="#000000"/>
      </dia:attribute>
      <dia:attribute name="normal_font">
        <dia:font family="monospace" style="0" name="Courier"/>
      </dia:attribute>
      <dia:attribute name="abstract_font">
        <dia:font family="monospace" style="88" name="Courier"/>
      </dia:attribute>
      <dia:attribute name="polymorphic_font">
        <dia:font family="monospace" style="8" name="Courier"/>
      </dia:attribute>
      <dia:attribute name="classname_font">
        <dia:font family="sans" style="80" name="Helvetica"/>
      </dia:attribute>
      <dia:attribute name="abstract_classname_font">
        <dia:font family="sans" style="88" name="Helvetica"/>
      </dia:attribute>
      <dia:attribute name="comment_font">
        <dia:font family="sans" style="8" name="Helvetica"/>
      </dia:attribute>
      <dia:attribute name="font_height">
        <dia:real val="0.80000000000000004"/>
      </dia:attribute>
      <dia:attribute name="polymorphic_font_height">
        <dia:real val="0.80000000000000004"/>
      </dia:attribute>
      <dia:attribute name="abstract_font_height">
        <dia:real val="0.80000000000000004"/>
      </dia:attribute>
      <dia:attribute name="classname_font_height">
        <dia:real val="1"/>
      </dia:attribute>
      <dia:attribute name="abstract_classname_font_height">
        <dia:real val="1"/>
      </dia:attribute>
      <dia:attribute name="comment_font_height">
        <dia:real val="1"/>
      </dia:attribute>
      <dia:attribute name="attributes"/>
      <dia:attribute name="operations"/>
      <dia:attribute name="template">
        <dia:boolean val="false"/>
      </dia:attribute>
      <dia:attribute name="templates"/>
    </dia:object>
    <dia:object type="UML - Class" version="0" id="O9">
      <dia:attribute name="obj_pos">
        <dia:point val="7.5,23.4"/>
      </dia:attribute>
      <dia:attribute name="obj_bb">
        <dia:rectangle val="7.45,23.35;12.9375,24.85"/>
      </dia:attribute>
      <dia:attribute name="elem_corner">
        <dia:point val="7.5,23.4"/>
      </dia:attribute>
      <dia:attribute name="elem_width">
        <dia:real val="5.3874999999999993"/>
      </dia:attribute>
      <dia:attribute name="elem_height">
        <dia:real val="1.3999999999999999"/>
      </dia:attribute>
      <dia:attribute name="name">
        <dia:string>#pi_mem_lit#</dia:string>
      </dia:attribute>
      <dia:attribute name="stereotype">
        <dia:string>##</dia:string>
      </dia:attribute>
      <dia:attribute name="comment">
        <dia:string>##</dia:string>
      </dia:attribute>
      <dia:attribute name="abstract">
        <dia:boolean val="false"/>
      </dia:attribute>
      <dia:attribute name="suppress_attributes">
        <dia:boolean val="false"/>
      </dia:attribute>
      <dia:attribute name="suppress_operations">
        <dia:boolean val="false"/>
      </dia:attribute>
      <dia:attribute name="visible_attributes">
        <dia:boolean val="false"/>
      </dia:attribute>
      <dia:attribute name="visible_operations">
        <dia:boolean val="false"/>
      </dia:attribute>
      <dia:attribute name="visible_comments">
        <dia:boolean val="false"/>
      </dia:attribute>
      <dia:attribute name="wrap_operations">
        <dia:boolean val="false"/>
      </dia:attribute>
      <dia:attribute name="wrap_after_char">
        <dia:int val="40"/>
      </dia:attribute>
      <dia:attribute name="line_color">
        <dia:color val="#000000"/>
      </dia:attribute>
      <dia:attribute name="fill_color">
        <dia:color val="#ffffff"/>
      </dia:attribute>
      <dia:attribute name="text_color">
        <dia:color val="#000000"/>
      </dia:attribute>
      <dia:attribute name="normal_font">
        <dia:font family="monospace" style="0" name="Courier"/>
      </dia:attribute>
      <dia:attribute name="abstract_font">
        <dia:font family="monospace" style="88" name="Courier"/>
      </dia:attribute>
      <dia:attribute name="polymorphic_font">
        <dia:font family="monospace" style="8" name="Courier"/>
      </dia:attribute>
      <dia:attribute name="classname_font">
        <dia:font family="sans" style="80" name="Helvetica"/>
      </dia:attribute>
      <dia:attribute name="abstract_classname_font">
        <dia:font family="sans" style="88" name="Helvetica"/>
      </dia:attribute>
      <dia:attribute name="comment_font">
        <dia:font family="sans" style="8" name="Helvetica"/>
      </dia:attribute>
      <dia:attribute name="font_height">
        <dia:real val="0.80000000000000004"/>
      </dia:attribute>
      <dia:attribute name="polymorphic_font_height">
        <dia:real val="0.80000000000000004"/>
      </dia:attribute>
      <dia:attribute name="abstract_font_height">
        <dia:real val="0.80000000000000004"/>
      </dia:attribute>
      <dia:attribute name="classname_font_height">
        <dia:real val="1"/>
      </dia:attribute>
      <dia:attribute name="abstract_classname_font_height">
        <dia:real val="1"/>
      </dia:attribute>
      <dia:attribute name="comment_font_height">
        <dia:real val="1"/>
      </dia:attribute>
      <dia:attribute name="attributes"/>
      <dia:attribute name="operations"/>
      <dia:attribute name="template">
        <dia:boolean val="false"/>
      </dia:attribute>
      <dia:attribute name="templates"/>
    </dia:object>
    <dia:object type="UML - Class" version="0" id="O10">
      <dia:attribute name="obj_pos">
        <dia:point val="21.55,10.2"/>
      </dia:attribute>
      <dia:attribute name="obj_bb">
        <dia:rectangle val="21.5,10.15;25.4336,11.65"/>
      </dia:attribute>
      <dia:attribute name="elem_corner">
        <dia:point val="21.55,10.2"/>
      </dia:attribute>
      <dia:attribute name="elem_width">
        <dia:real val="3.8335937499999999"/>
      </dia:attribute>
      <dia:attribute name="elem_height">
        <dia:real val="1.3999999999999999"/>
      </dia:attribute>
      <dia:attribute name="name">
        <dia:string>#pi_preg#</dia:string>
      </dia:attribute>
      <dia:attribute name="stereotype">
        <dia:string>##</dia:string>
      </dia:attribute>
      <dia:attribute name="comment">
        <dia:string>##</dia:string>
      </dia:attribute>
      <dia:attribute name="abstract">
        <dia:boolean val="false"/>
      </dia:attribute>
      <dia:attribute name="suppress_attributes">
        <dia:boolean val="false"/>
      </dia:attribute>
      <dia:attribute name="suppress_operations">
        <dia:boolean val="false"/>
      </dia:attribute>
      <dia:attribute name="visible_attributes">
        <dia:boolean val="false"/>
      </dia:attribute>
      <dia:attribute name="visible_operations">
        <dia:boolean val="false"/>
      </dia:attribute>
      <dia:attribute name="visible_comments">
        <dia:boolean val="false"/>
      </dia:attribute>
      <dia:attribute name="wrap_operations">
        <dia:boolean val="false"/>
      </dia:attribute>
      <dia:attribute name="wrap_after_char">
        <dia:int val="40"/>
      </dia:attribute>
      <dia:attribute name="line_color">
        <dia:color val="#000000"/>
      </dia:attribute>
      <dia:attribute name="fill_color">
        <dia:color val="#ffffff"/>
      </dia:attribute>
      <dia:attribute name="text_color">
        <dia:color val="#000000"/>
      </dia:attribute>
      <dia:attribute name="normal_font">
        <dia:font family="monospace" style="0" name="Courier"/>
      </dia:attribute>
      <dia:attribute name="abstract_font">
        <dia:font family="monospace" style="88" name="Courier"/>
      </dia:attribute>
      <dia:attribute name="polymorphic_font">
        <dia:font family="monospace" style="8" name="Courier"/>
      </dia:attribute>
      <dia:attribute name="classname_font">
        <dia:font family="sans" style="80" name="Helvetica"/>
      </dia:attribute>
      <dia:attribute name="abstract_classname_font">
        <dia:font family="sans" style="88" name="Helvetica"/>
      </dia:attribute>
      <dia:attribute name="comment_font">
        <dia:font family="sans" style="8" name="Helvetica"/>
      </dia:attribute>
      <dia:attribute name="font_height">
        <dia:real val="0.80000000000000004"/>
      </dia:attribute>
      <dia:attribute name="polymorphic_font_height">
        <dia:real val="0.80000000000000004"/>
      </dia:attribute>
      <dia:attribute name="abstract_font_height">
        <dia:real val="0.80000000000000004"/>
      </dia:attribute>
      <dia:attribute name="classname_font_height">
        <dia:real val="1"/>
      </dia:attribute>
      <dia:attribute name="abstract_classname_font_height">
        <dia:real val="1"/>
      </dia:attribute>
      <dia:attribute name="comment_font_height">
        <dia:real val="1"/>
      </dia:attribute>
      <dia:attribute name="attributes"/>
      <dia:attribute name="operations"/>
      <dia:attribute name="template">
        <dia:boolean val="false"/>
      </dia:attribute>
      <dia:attribute name="templates"/>
    </dia:object>
    <dia:object type="UML - Class" version="0" id="O11">
      <dia:attribute name="obj_pos">
        <dia:point val="21.65,12.45"/>
      </dia:attribute>
      <dia:attribute name="obj_bb">
        <dia:rectangle val="21.6,12.4;26.0961,13.9"/>
      </dia:attribute>
      <dia:attribute name="elem_corner">
        <dia:point val="21.65,12.45"/>
      </dia:attribute>
      <dia:attribute name="elem_width">
        <dia:real val="4.3960937499999995"/>
      </dia:attribute>
      <dia:attribute name="elem_height">
        <dia:real val="1.3999999999999999"/>
      </dia:attribute>
      <dia:attribute name="name">
        <dia:string>#pi_literal#</dia:string>
      </dia:attribute>
      <dia:attribute name="stereotype">
        <dia:string>##</dia:string>
      </dia:attribute>
      <dia:attribute name="comment">
        <dia:string>##</dia:string>
      </dia:attribute>
      <dia:attribute name="abstract">
        <dia:boolean val="false"/>
      </dia:attribute>
      <dia:attribute name="suppress_attributes">
        <dia:boolean val="false"/>
      </dia:attribute>
      <dia:attribute name="suppress_operations">
        <dia:boolean val="false"/>
      </dia:attribute>
      <dia:attribute name="visible_attributes">
        <dia:boolean val="false"/>
      </dia:attribute>
      <dia:attribute name="visible_operations">
        <dia:boolean val="false"/>
      </dia:attribute>
      <dia:attribute name="visible_comments">
        <dia:boolean val="false"/>
      </dia:attribute>
      <dia:attribute name="wrap_operations">
        <dia:boolean val="false"/>
      </dia:attribute>
      <dia:attribute name="wrap_after_char">
        <dia:int val="40"/>
      </dia:attribute>
      <dia:attribute name="line_color">
        <dia:color val="#000000"/>
      </dia:attribute>
      <dia:attribute name="fill_color">
        <dia:color val="#ffffff"/>
      </dia:attribute>
      <dia:attribute name="text_color">
        <dia:color val="#000000"/>
      </dia:attribute>
      <dia:attribute name="normal_font">
        <dia:font family="monospace" style="0" name="Courier"/>
      </dia:attribute>
      <dia:attribute name="abstract_font">
        <dia:font family="monospace" style="88" name="Courier"/>
      </dia:attribute>
      <dia:attribute name="polymorphic_font">
        <dia:font family="monospace" style="8" name="Courier"/>
      </dia:attribute>
      <dia:attribute name="classname_font">
        <dia:font family="sans" style="80" name="Helvetica"/>
      </dia:attribute>
      <dia:attribute name="abstract_classname_font">
        <dia:font family="sans" style="88" name="Helvetica"/>
      </dia:attribute>
      <dia:attribute name="comment_font">
        <dia:font family="sans" style="8" name="Helvetica"/>
      </dia:attribute>
      <dia:attribute name="font_height">
        <dia:real val="0.80000000000000004"/>
      </dia:attribute>
      <dia:attribute name="polymorphic_font_height">
        <dia:real val="0.80000000000000004"/>
      </dia:attribute>
      <dia:attribute name="abstract_font_height">
        <dia:real val="0.80000000000000004"/>
      </dia:attribute>
      <dia:attribute name="classname_font_height">
        <dia:real val="1"/>
      </dia:attribute>
      <dia:attribute name="abstract_classname_font_height">
        <dia:real val="1"/>
      </dia:attribute>
      <dia:attribute name="comment_font_height">
        <dia:real val="1"/>
      </dia:attribute>
      <dia:attribute name="attributes"/>
      <dia:attribute name="operations"/>
      <dia:attribute name="template">
        <dia:boolean val="false"/>
      </dia:attribute>
      <dia:attribute name="templates"/>
    </dia:object>
    <dia:object type="UML - Generalization" version="0" id="O12">
      <dia:attribute name="obj_pos">
        <dia:point val="16.375,7.1"/>
      </dia:attribute>
      <dia:attribute name="obj_bb">
        <dia:rectangle val="15.2,7.05;17.225,9.54297"/>
      </dia:attribute>
      <dia:attribute name="orth_points">
        <dia:point val="16.375,7.1"/>
        <dia:point val="16.375,8.6"/>
        <dia:point val="15.25,8.6"/>
      </dia:attribute>
      <dia:attribute name="orth_orient">
        <dia:enum val="1"/>
        <dia:enum val="0"/>
      </dia:attribute>
      <dia:attribute name="orth_autoroute">
        <dia:boolean val="true"/>
      </dia:attribute>
      <dia:attribute name="line_colour">
        <dia:color val="#000000"/>
      </dia:attribute>
      <dia:attribute name="name">
        <dia:string>##</dia:string>
      </dia:attribute>
      <dia:attribute name="stereotype">
        <dia:string>##</dia:string>
      </dia:attribute>
      <dia:connections>
        <dia:connection handle="0" to="O0" connection="6"/>
        <dia:connection handle="1" to="O1" connection="4"/>
      </dia:connections>
    </dia:object>
    <dia:object type="UML - Generalization" version="0" id="O13">
      <dia:attribute name="obj_pos">
        <dia:point val="16.375,7.1"/>
      </dia:attribute>
      <dia:attribute name="obj_bb">
        <dia:rectangle val="15.525,7.05;17.6,9.54297"/>
      </dia:attribute>
      <dia:attribute name="orth_points">
        <dia:point val="16.375,7.1"/>
        <dia:point val="16.375,8.6"/>
        <dia:point val="17.55,8.6"/>
      </dia:attribute>
      <dia:attribute name="orth_orient">
        <dia:enum val="1"/>
        <dia:enum val="0"/>
      </dia:attribute>
      <dia:attribute name="orth_autoroute">
        <dia:boolean val="true"/>
      </dia:attribute>
      <dia:attribute name="line_colour">
        <dia:color val="#000000"/>
      </dia:attribute>
      <dia:attribute name="name">
        <dia:string>##</dia:string>
      </dia:attribute>
      <dia:attribute name="stereotype">
        <dia:string>##</dia:string>
      </dia:attribute>
      <dia:connections>
        <dia:connection handle="0" to="O0" connection="6"/>
        <dia:connection handle="1" to="O2" connection="3"/>
      </dia:connections>
    </dia:object>
    <dia:object type="UML - Generalization" version="0" id="O14">
      <dia:attribute name="obj_pos">
        <dia:point val="13.35,9.3"/>
      </dia:attribute>
      <dia:attribute name="obj_bb">
        <dia:rectangle val="12.3,9.25;14.2,12.143"/>
      </dia:attribute>
      <dia:attribute name="orth_points">
        <dia:point val="13.35,9.3"/>
        <dia:point val="13.35,11.2"/>
        <dia:point val="12.35,11.2"/>
      </dia:attribute>
      <dia:attribute name="orth_orient">
        <dia:enum val="1"/>
        <dia:enum val="0"/>
      </dia:attribute>
      <dia:attribute name="orth_autoroute">
        <dia:boolean val="true"/>
      </dia:attribute>
      <dia:attribute name="line_colour">
        <dia:color val="#000000"/>
      </dia:attribute>
      <dia:attribute name="name">
        <dia:string>##</dia:string>
      </dia:attribute>
      <dia:attribute name="stereotype">
        <dia:string>##</dia:string>
      </dia:attribute>
      <dia:connections>
        <dia:connection handle="0" to="O1" connection="6"/>
        <dia:connection handle="1" to="O3" connection="4"/>
      </dia:connections>
    </dia:object>
    <dia:object type="UML - Generalization" version="0" id="O15">
      <dia:attribute name="obj_pos">
        <dia:point val="13.35,9.3"/>
      </dia:attribute>
      <dia:attribute name="obj_bb">
        <dia:rectangle val="12.35,9.25;14.2,13.5"/>
      </dia:attribute>
      <dia:attribute name="orth_points">
        <dia:point val="13.35,9.3"/>
        <dia:point val="13.35,10.3"/>
        <dia:point val="13.35,10.3"/>
        <dia:point val="13.35,13.45"/>
        <dia:point val="12.4,13.45"/>
      </dia:attribute>
      <dia:attribute name="orth_orient">
        <dia:enum val="1"/>
        <dia:enum val="0"/>
        <dia:enum val="1"/>
        <dia:enum val="0"/>
      </dia:attribute>
      <dia:attribute name="orth_autoroute">
        <dia:boolean val="false"/>
      </dia:attribute>
      <dia:attribute name="line_colour">
        <dia:color val="#000000"/>
      </dia:attribute>
      <dia:attribute name="name">
        <dia:string>##</dia:string>
      </dia:attribute>
      <dia:attribute name="stereotype">
        <dia:string>##</dia:string>
      </dia:attribute>
      <dia:connections>
        <dia:connection handle="0" to="O1" connection="6"/>
        <dia:connection handle="1" to="O4" connection="4"/>
      </dia:connections>
    </dia:object>
    <dia:object type="UML - Generalization" version="0" id="O16">
      <dia:attribute name="obj_pos">
        <dia:point val="13.35,9.3"/>
      </dia:attribute>
      <dia:attribute name="obj_bb">
        <dia:rectangle val="12.3,9.25;14.2,16.443"/>
      </dia:attribute>
      <dia:attribute name="orth_points">
        <dia:point val="13.35,9.3"/>
        <dia:point val="13.35,15.5"/>
        <dia:point val="12.35,15.5"/>
      </dia:attribute>
      <dia:attribute name="orth_orient">
        <dia:enum val="1"/>
        <dia:enum val="0"/>
      </dia:attribute>
      <dia:attribute name="orth_autoroute">
        <dia:boolean val="true"/>
      </dia:attribute>
      <dia:attribute name="line_colour">
        <dia:color val="#000000"/>
      </dia:attribute>
      <dia:attribute name="name">
        <dia:string>##</dia:string>
      </dia:attribute>
      <dia:attribute name="stereotype">
        <dia:string>##</dia:string>
      </dia:attribute>
      <dia:connections>
        <dia:connection handle="0" to="O1" connection="6"/>
        <dia:connection handle="1" to="O5" connection="4"/>
      </dia:connections>
    </dia:object>
    <dia:object type="UML - Generalization" version="0" id="O17">
      <dia:attribute name="obj_pos">
        <dia:point val="13.35,9.3"/>
      </dia:attribute>
      <dia:attribute name="obj_bb">
        <dia:rectangle val="12.4293,9.25;14.2,18.493"/>
      </dia:attribute>
      <dia:attribute name="orth_points">
        <dia:point val="13.35,9.3"/>
        <dia:point val="13.35,17.55"/>
        <dia:point val="12.5,17.55"/>
        <dia:point val="12.5,17.55"/>
      </dia:attribute>
      <dia:attribute name="orth_orient">
        <dia:enum val="1"/>
        <dia:enum val="0"/>
        <dia:enum val="1"/>
      </dia:attribute>
      <dia:attribute name="orth_autoroute">
        <dia:boolean val="false"/>
      </dia:attribute>
      <dia:attribute name="line_colour">
        <dia:color val="#000000"/>
      </dia:attribute>
      <dia:attribute name="name">
        <dia:string>##</dia:string>
      </dia:attribute>
      <dia:attribute name="stereotype">
        <dia:string>##</dia:string>
      </dia:attribute>
      <dia:connections>
        <dia:connection handle="0" to="O1" connection="6"/>
        <dia:connection handle="1" to="O6" connection="4"/>
      </dia:connections>
    </dia:object>
    <dia:object type="UML - Generalization" version="0" id="O18">
      <dia:attribute name="obj_pos">
        <dia:point val="13.35,9.3"/>
      </dia:attribute>
      <dia:attribute name="obj_bb">
        <dia:rectangle val="12.5,9.25;14.2,19.75"/>
      </dia:attribute>
      <dia:attribute name="orth_points">
        <dia:point val="13.35,9.3"/>
        <dia:point val="13.35,10.3"/>
        <dia:point val="13.35,10.3"/>
        <dia:point val="13.35,19.7"/>
        <dia:point val="12.55,19.7"/>
      </dia:attribute>
      <dia:attribute name="orth_orient">
        <dia:enum val="1"/>
        <dia:enum val="0"/>
        <dia:enum val="1"/>
        <dia:enum val="0"/>
      </dia:attribute>
      <dia:attribute name="orth_autoroute">
        <dia:boolean val="false"/>
      </dia:attribute>
      <dia:attribute name="line_colour">
        <dia:color val="#000000"/>
      </dia:attribute>
      <dia:attribute name="name">
        <dia:string>##</dia:string>
      </dia:attribute>
      <dia:attribute name="stereotype">
        <dia:string>##</dia:string>
      </dia:attribute>
      <dia:connections>
        <dia:connection handle="0" to="O1" connection="6"/>
        <dia:connection handle="1" to="O7" connection="4"/>
      </dia:connections>
    </dia:object>
    <dia:object type="UML - Generalization" version="0" id="O19">
      <dia:attribute name="obj_pos">
        <dia:point val="13.35,9.3"/>
      </dia:attribute>
      <dia:attribute name="obj_bb">
        <dia:rectangle val="12.35,9.25;14.2,22"/>
      </dia:attribute>
      <dia:attribute name="orth_points">
        <dia:point val="13.35,9.3"/>
        <dia:point val="13.35,10.3"/>
        <dia:point val="13.35,10.3"/>
        <dia:point val="13.35,21.95"/>
        <dia:point val="12.4,21.95"/>
      </dia:attribute>
      <dia:attribute name="orth_orient">
        <dia:enum val="1"/>
        <dia:enum val="0"/>
        <dia:enum val="1"/>
        <dia:enum val="0"/>
      </dia:attribute>
      <dia:attribute name="orth_autoroute">
        <dia:boolean val="false"/>
      </dia:attribute>
      <dia:attribute name="line_colour">
        <dia:color val="#000000"/>
      </dia:attribute>
      <dia:attribute name="name">
        <dia:string>##</dia:string>
      </dia:attribute>
      <dia:attribute name="stereotype">
        <dia:string>##</dia:string>
      </dia:attribute>
      <dia:connections>
        <dia:connection handle="0" to="O1" connection="6"/>
        <dia:connection handle="1" to="O8" connection="4"/>
      </dia:connections>
    </dia:object>
    <dia:object type="UML - Generalization" version="0" id="O20">
      <dia:attribute name="obj_pos">
        <dia:point val="13.35,9.3"/>
      </dia:attribute>
      <dia:attribute name="obj_bb">
        <dia:rectangle val="12.4,9.25;14.2,24.15"/>
      </dia:attribute>
      <dia:attribute name="orth_points">
        <dia:point val="13.35,9.3"/>
        <dia:point val="13.35,10.3"/>
        <dia:point val="13.35,10.3"/>
        <dia:point val="13.35,24.1"/>
        <dia:point val="12.45,24.1"/>
      </dia:attribute>
      <dia:attribute name="orth_orient">
        <dia:enum val="1"/>
        <dia:enum val="0"/>
        <dia:enum val="1"/>
        <dia:enum val="0"/>
      </dia:attribute>
      <dia:attribute name="orth_autoroute">
        <dia:boolean val="false"/>
      </dia:attribute>
      <dia:attribute name="line_colour">
        <dia:color val="#000000"/>
      </dia:attribute>
      <dia:attribute name="name">
        <dia:string>##</dia:string>
      </dia:attribute>
      <dia:attribute name="stereotype">
        <dia:string>##</dia:string>
      </dia:attribute>
      <dia:connections>
        <dia:connection handle="0" to="O1" connection="6"/>
        <dia:connection handle="1" to="O9" connection="4"/>
      </dia:connections>
    </dia:object>
    <dia:object type="UML - Generalization" version="0" id="O21">
      <dia:attribute name="obj_pos">
        <dia:point val="20.4,9.3"/>
      </dia:attribute>
      <dia:attribute name="obj_bb">
        <dia:rectangle val="19.55,9.25;21.6,11.843"/>
      </dia:attribute>
      <dia:attribute name="orth_points">
        <dia:point val="20.4,9.3"/>
        <dia:point val="20.4,10.9"/>
        <dia:point val="21.55,10.9"/>
      </dia:attribute>
      <dia:attribute name="orth_orient">
        <dia:enum val="1"/>
        <dia:enum val="0"/>
      </dia:attribute>
      <dia:attribute name="orth_autoroute">
        <dia:boolean val="true"/>
      </dia:attribute>
      <dia:attribute name="line_colour">
        <dia:color val="#000000"/>
      </dia:attribute>
      <dia:attribute name="name">
        <dia:string>##</dia:string>
      </dia:attribute>
      <dia:attribute name="stereotype">
        <dia:string>##</dia:string>
      </dia:attribute>
      <dia:connections>
        <dia:connection handle="0" to="O2" connection="6"/>
        <dia:connection handle="1" to="O10" connection="3"/>
      </dia:connections>
    </dia:object>
    <dia:object type="UML - Generalization" version="0" id="O22">
      <dia:attribute name="obj_pos">
        <dia:point val="20.4,9.3"/>
      </dia:attribute>
      <dia:attribute name="obj_bb">
        <dia:rectangle val="19.55,9.25;21.7,14.093"/>
      </dia:attribute>
      <dia:attribute name="orth_points">
        <dia:point val="20.4,9.3"/>
        <dia:point val="20.4,13.15"/>
        <dia:point val="21.65,13.15"/>
      </dia:attribute>
      <dia:attribute name="orth_orient">
        <dia:enum val="1"/>
        <dia:enum val="0"/>
      </dia:attribute>
      <dia:attribute name="orth_autoroute">
        <dia:boolean val="true"/>
      </dia:attribute>
      <dia:attribute name="line_colour">
        <dia:color val="#000000"/>
      </dia:attribute>
      <dia:attribute name="name">
        <dia:string>##</dia:string>
      </dia:attribute>
      <dia:attribute name="stereotype">
        <dia:string>##</dia:string>
      </dia:attribute>
      <dia:connections>
        <dia:connection handle="0" to="O2" connection="6"/>
        <dia:connection handle="1" to="O11" connection="3"/>
      </dia:connections>
    </dia:object>
  </dia:layer>
</dia:diagram>
