%!PS-Adobe-2.0 EPSF-2.0
%%Title: /afs/ms.mff.cuni.cz/u/s/sandp9am/BIG/les/doc/doc/lyx/class_handling.dia
%%Creator: Dia v0.94
%%CreationDate: Wed May 25 23:59:07 2005
%%For: sandp9am
%%Orientation: Portrait
%%Magnification: 1.0000
%%BoundingBox: 0 0 1109 825
%%BeginSetup
%%EndSetup
%%EndComments
%%BeginProlog
[ /.notdef /.notdef /.notdef /.notdef /.notdef /.notdef /.notdef /.notdef /.notdef /.notdef
/.notdef /.notdef /.notdef /.notdef /.notdef /.notdef /.notdef /.notdef /.notdef /.notdef
/.notdef /.notdef /.notdef /.notdef /.notdef /.notdef /.notdef /.notdef /.notdef /.notdef
/.notdef /.notdef /space /exclam /quotedbl /numbersign /dollar /percent /ampersand /quoteright
/parenleft /parenright /asterisk /plus /comma /hyphen /period /slash /zero /one
/two /three /four /five /six /seven /eight /nine /colon /semicolon
/less /equal /greater /question /at /A /B /C /D /E
/F /G /H /I /J /K /L /M /N /O
/P /Q /R /S /T /U /V /W /X /Y
/Z /bracketleft /backslash /bracketright /asciicircum /underscore /quoteleft /a /b /c
/d /e /f /g /h /i /j /k /l /m
/n /o /p /q /r /s /t /u /v /w
/x /y /z /braceleft /bar /braceright /asciitilde /.notdef /.notdef /.notdef
/.notdef /.notdef /.notdef /.notdef /.notdef /.notdef /.notdef /.notdef /.notdef /.notdef
/.notdef /.notdef /.notdef /.notdef /.notdef /.notdef /.notdef /.notdef /.notdef /.notdef
/.notdef /.notdef /.notdef /.notdef /.notdef /.notdef /.notdef /.notdef /.notdef /.notdef
/space /exclamdown /cent /sterling /currency /yen /brokenbar /section /dieresis /copyright
/ordfeminine /guillemotleft /logicalnot /hyphen /registered /macron /degree /plusminus /twosuperior /threesuperior
/acute /mu /paragraph /periodcentered /cedilla /onesuperior /ordmasculine /guillemotright /onequarter /onehalf
/threequarters /questiondown /Agrave /Aacute /Acircumflex /Atilde /Adieresis /Aring /AE /Ccedilla
/Egrave /Eacute /Ecircumflex /Edieresis /Igrave /Iacute /Icircumflex /Idieresis /Eth /Ntilde
/Ograve /Oacute /Ocircumflex /Otilde /Odieresis /multiply /Oslash /Ugrave /Uacute /Ucircumflex
/Udieresis /Yacute /Thorn /germandbls /agrave /aacute /acircumflex /atilde /adieresis /aring
/ae /ccedilla /egrave /eacute /ecircumflex /edieresis /igrave /iacute /icircumflex /idieresis
/eth /ntilde /ograve /oacute /ocircumflex /otilde /odieresis /divide /oslash /ugrave
/uacute /ucircumflex /udieresis /yacute /thorn /ydieresis] /isolatin1encoding exch def
/cp {closepath} bind def
/c {curveto} bind def
/f {fill} bind def
/a {arc} bind def
/ef {eofill} bind def
/ex {exch} bind def
/gr {grestore} bind def
/gs {gsave} bind def
/sa {save} bind def
/rs {restore} bind def
/l {lineto} bind def
/m {moveto} bind def
/rm {rmoveto} bind def
/n {newpath} bind def
/s {stroke} bind def
/sh {show} bind def
/slc {setlinecap} bind def
/slj {setlinejoin} bind def
/slw {setlinewidth} bind def
/srgb {setrgbcolor} bind def
/rot {rotate} bind def
/sc {scale} bind def
/sd {setdash} bind def
/ff {findfont} bind def
/sf {setfont} bind def
/scf {scalefont} bind def
/sw {stringwidth pop} bind def
/tr {translate} bind def

/ellipsedict 8 dict def
ellipsedict /mtrx matrix put
/ellipse
{ ellipsedict begin
   /endangle exch def
   /startangle exch def
   /yrad exch def
   /xrad exch def
   /y exch def
   /x exch def   /savematrix mtrx currentmatrix def
   x y tr xrad yrad sc
   0 0 1 startangle endangle arc
   savematrix setmatrix
   end
} def

/mergeprocs {
dup length
3 -1 roll
dup
length
dup
5 1 roll
3 -1 roll
add
array cvx
dup
3 -1 roll
0 exch
putinterval
dup
4 2 roll
putinterval
} bind def
/Times-Roman-latin1
    /Times-Roman findfont
    dup length dict begin
	{1 index /FID ne {def} {pop pop} ifelse} forall
	/Encoding isolatin1encoding def
    currentdict end
definefont pop
/Times-Italic-latin1
    /Times-Italic findfont
    dup length dict begin
	{1 index /FID ne {def} {pop pop} ifelse} forall
	/Encoding isolatin1encoding def
    currentdict end
definefont pop
/Times-Bold-latin1
    /Times-Bold findfont
    dup length dict begin
	{1 index /FID ne {def} {pop pop} ifelse} forall
	/Encoding isolatin1encoding def
    currentdict end
definefont pop
/Times-BoldItalic-latin1
    /Times-BoldItalic findfont
    dup length dict begin
	{1 index /FID ne {def} {pop pop} ifelse} forall
	/Encoding isolatin1encoding def
    currentdict end
definefont pop
/AvantGarde-Book-latin1
    /AvantGarde-Book findfont
    dup length dict begin
	{1 index /FID ne {def} {pop pop} ifelse} forall
	/Encoding isolatin1encoding def
    currentdict end
definefont pop
/AvantGarde-BookOblique-latin1
    /AvantGarde-BookOblique findfont
    dup length dict begin
	{1 index /FID ne {def} {pop pop} ifelse} forall
	/Encoding isolatin1encoding def
    currentdict end
definefont pop
/AvantGarde-Demi-latin1
    /AvantGarde-Demi findfont
    dup length dict begin
	{1 index /FID ne {def} {pop pop} ifelse} forall
	/Encoding isolatin1encoding def
    currentdict end
definefont pop
/AvantGarde-DemiOblique-latin1
    /AvantGarde-DemiOblique findfont
    dup length dict begin
	{1 index /FID ne {def} {pop pop} ifelse} forall
	/Encoding isolatin1encoding def
    currentdict end
definefont pop
/Bookman-Light-latin1
    /Bookman-Light findfont
    dup length dict begin
	{1 index /FID ne {def} {pop pop} ifelse} forall
	/Encoding isolatin1encoding def
    currentdict end
definefont pop
/Bookman-LightItalic-latin1
    /Bookman-LightItalic findfont
    dup length dict begin
	{1 index /FID ne {def} {pop pop} ifelse} forall
	/Encoding isolatin1encoding def
    currentdict end
definefont pop
/Bookman-Demi-latin1
    /Bookman-Demi findfont
    dup length dict begin
	{1 index /FID ne {def} {pop pop} ifelse} forall
	/Encoding isolatin1encoding def
    currentdict end
definefont pop
/Bookman-DemiItalic-latin1
    /Bookman-DemiItalic findfont
    dup length dict begin
	{1 index /FID ne {def} {pop pop} ifelse} forall
	/Encoding isolatin1encoding def
    currentdict end
definefont pop
/Courier-latin1
    /Courier findfont
    dup length dict begin
	{1 index /FID ne {def} {pop pop} ifelse} forall
	/Encoding isolatin1encoding def
    currentdict end
definefont pop
/Courier-Oblique-latin1
    /Courier-Oblique findfont
    dup length dict begin
	{1 index /FID ne {def} {pop pop} ifelse} forall
	/Encoding isolatin1encoding def
    currentdict end
definefont pop
/Courier-Bold-latin1
    /Courier-Bold findfont
    dup length dict begin
	{1 index /FID ne {def} {pop pop} ifelse} forall
	/Encoding isolatin1encoding def
    currentdict end
definefont pop
/Courier-BoldOblique-latin1
    /Courier-BoldOblique findfont
    dup length dict begin
	{1 index /FID ne {def} {pop pop} ifelse} forall
	/Encoding isolatin1encoding def
    currentdict end
definefont pop
/Helvetica-latin1
    /Helvetica findfont
    dup length dict begin
	{1 index /FID ne {def} {pop pop} ifelse} forall
	/Encoding isolatin1encoding def
    currentdict end
definefont pop
/Helvetica-Oblique-latin1
    /Helvetica-Oblique findfont
    dup length dict begin
	{1 index /FID ne {def} {pop pop} ifelse} forall
	/Encoding isolatin1encoding def
    currentdict end
definefont pop
/Helvetica-Bold-latin1
    /Helvetica-Bold findfont
    dup length dict begin
	{1 index /FID ne {def} {pop pop} ifelse} forall
	/Encoding isolatin1encoding def
    currentdict end
definefont pop
/Helvetica-BoldOblique-latin1
    /Helvetica-BoldOblique findfont
    dup length dict begin
	{1 index /FID ne {def} {pop pop} ifelse} forall
	/Encoding isolatin1encoding def
    currentdict end
definefont pop
/Helvetica-Narrow-latin1
    /Helvetica-Narrow findfont
    dup length dict begin
	{1 index /FID ne {def} {pop pop} ifelse} forall
	/Encoding isolatin1encoding def
    currentdict end
definefont pop
/Helvetica-Narrow-Oblique-latin1
    /Helvetica-Narrow-Oblique findfont
    dup length dict begin
	{1 index /FID ne {def} {pop pop} ifelse} forall
	/Encoding isolatin1encoding def
    currentdict end
definefont pop
/Helvetica-Narrow-Bold-latin1
    /Helvetica-Narrow-Bold findfont
    dup length dict begin
	{1 index /FID ne {def} {pop pop} ifelse} forall
	/Encoding isolatin1encoding def
    currentdict end
definefont pop
/Helvetica-Narrow-BoldOblique-latin1
    /Helvetica-Narrow-BoldOblique findfont
    dup length dict begin
	{1 index /FID ne {def} {pop pop} ifelse} forall
	/Encoding isolatin1encoding def
    currentdict end
definefont pop
/NewCenturySchoolbook-Roman-latin1
    /NewCenturySchoolbook-Roman findfont
    dup length dict begin
	{1 index /FID ne {def} {pop pop} ifelse} forall
	/Encoding isolatin1encoding def
    currentdict end
definefont pop
/NewCenturySchoolbook-Italic-latin1
    /NewCenturySchoolbook-Italic findfont
    dup length dict begin
	{1 index /FID ne {def} {pop pop} ifelse} forall
	/Encoding isolatin1encoding def
    currentdict end
definefont pop
/NewCenturySchoolbook-Bold-latin1
    /NewCenturySchoolbook-Bold findfont
    dup length dict begin
	{1 index /FID ne {def} {pop pop} ifelse} forall
	/Encoding isolatin1encoding def
    currentdict end
definefont pop
/NewCenturySchoolbook-BoldItalic-latin1
    /NewCenturySchoolbook-BoldItalic findfont
    dup length dict begin
	{1 index /FID ne {def} {pop pop} ifelse} forall
	/Encoding isolatin1encoding def
    currentdict end
definefont pop
/Palatino-Roman-latin1
    /Palatino-Roman findfont
    dup length dict begin
	{1 index /FID ne {def} {pop pop} ifelse} forall
	/Encoding isolatin1encoding def
    currentdict end
definefont pop
/Palatino-Italic-latin1
    /Palatino-Italic findfont
    dup length dict begin
	{1 index /FID ne {def} {pop pop} ifelse} forall
	/Encoding isolatin1encoding def
    currentdict end
definefont pop
/Palatino-Bold-latin1
    /Palatino-Bold findfont
    dup length dict begin
	{1 index /FID ne {def} {pop pop} ifelse} forall
	/Encoding isolatin1encoding def
    currentdict end
definefont pop
/Palatino-BoldItalic-latin1
    /Palatino-BoldItalic findfont
    dup length dict begin
	{1 index /FID ne {def} {pop pop} ifelse} forall
	/Encoding isolatin1encoding def
    currentdict end
definefont pop
/Symbol-latin1
    /Symbol findfont
definefont pop
/ZapfChancery-MediumItalic-latin1
    /ZapfChancery-MediumItalic findfont
    dup length dict begin
	{1 index /FID ne {def} {pop pop} ifelse} forall
	/Encoding isolatin1encoding def
    currentdict end
definefont pop
/ZapfDingbats-latin1
    /ZapfDingbats findfont
    dup length dict begin
	{1 index /FID ne {def} {pop pop} ifelse} forall
	/Encoding isolatin1encoding def
    currentdict end
definefont pop
28.346000 -28.346000 scale
4.050000 -29.050000 translate
%%EndProlog


0.100000 slw
[] 0 sd
[] 0 sd
0 slc
0 slj
0 slc
0 slj
[] 0 sd
0.000000 0.000000 0.000000 srgb
n -4.000000 9.000000 m -4.000000 15.000000 l 2.000000 15.000000 l 2.000000 9.000000 l cp s
0 slc
0 slj
[] 0 sd
n -3.400000 9.000000 m -3.400000 15.000000 l s
0 slc
0 slj
[] 0 sd
n -4.000000 9.600000 m 2.000000 9.600000 l s
/Helvetica-latin1 ff 0.560000 scf sf
(current) dup sw 2 div -0.700000 ex sub 11.686719 m gs 1 -1 sc sh gr
(declaration) dup sw 2 div -0.700000 ex sub 12.486719 m gs 1 -1 sc sh gr
(sequence) dup sw 2 div -0.700000 ex sub 13.286719 m gs 1 -1 sc sh gr
0.100000 slw
[] 0 sd
[] 0 sd
0 slc
0 slj
0 slc
0 slj
[] 0 sd
n -4.000000 18.000000 m -4.000000 24.000000 l 2.000000 24.000000 l 2.000000 18.000000 l cp s
0 slc
0 slj
[] 0 sd
n -3.400000 18.000000 m -3.400000 24.000000 l s
0 slc
0 slj
[] 0 sd
n -4.000000 18.600000 m 2.000000 18.600000 l s
/Helvetica-latin1 ff 0.560000 scf sf
(declaration) dup sw 2 div -0.700000 ex sub 20.286719 m gs 1 -1 sc sh gr
(sequence) dup sw 2 div -0.700000 ex sub 21.086719 m gs 1 -1 sc sh gr
(nominated) dup sw 2 div -0.700000 ex sub 21.886719 m gs 1 -1 sc sh gr
(by qualification) dup sw 2 div -0.700000 ex sub 22.686719 m gs 1 -1 sc sh gr
0.100000 slw
[] 0 sd
[] 0 sd
0 slj
n 8.000000 14.000000 m 8.000000 22.000000 l 16.000000 22.000000 l 16.000000 14.000000 l cp s
/Helvetica-latin1 ff 0.560000 scf sf
(class) dup sw 2 div 12.000000 ex sub 17.386719 m gs 1 -1 sc sh gr
(declaration) dup sw 2 div 12.000000 ex sub 18.186719 m gs 1 -1 sc sh gr
(processor) dup sw 2 div 12.000000 ex sub 18.986719 m gs 1 -1 sc sh gr
0.100000 slw
[0.200000] 0 sd
[0.200000] 0 sd
0 slj
0 slc
n 8.000000 14.000000 m 5.000000 14.000000 l 5.000000 13.500000 l 2.486803 13.500000 l s
[] 0 sd
0 slj
0 slc
n 2.111803 13.500000 m 2.611803 13.250000 l 2.486803 13.500000 l 2.611803 13.750000 l ef
n 2.111803 13.500000 m 2.611803 13.250000 l 2.486803 13.500000 l 2.611803 13.750000 l cp s
0.100000 slw
[0.200000] 0 sd
[0.200000] 0 sd
0 slj
0 slc
n 8.000000 16.000000 m -1.000000 16.000000 l -1.000000 17.513197 l s
[] 0 sd
0 slj
0 slc
n -1.000000 17.888197 m -1.250000 17.388197 l -1.000000 17.513197 l -0.750000 17.388197 l ef
n -1.000000 17.888197 m -1.250000 17.388197 l -1.000000 17.513197 l -0.750000 17.388197 l cp s
0.100000 slw
[] 0 sd
[] 0 sd
0 slj
n 7.000000 1.200000 m 7.000000 6.200000 l 14.000000 6.200000 l 14.000000 1.200000 l cp s
/Helvetica-latin1 ff 0.560000 scf sf
(parser) dup sw 2 div 10.500000 ex sub 3.886719 m gs 1 -1 sc sh gr
0.100000 slw
[] 0 sd
[] 0 sd
0 slj
n 29.850000 12.250000 m 29.850000 17.250000 l 34.850000 17.250000 l 34.850000 12.250000 l cp s
/Helvetica-latin1 ff 0.560000 scf sf
(lookup) dup sw 2 div 32.350000 ex sub 14.936719 m gs 1 -1 sc sh gr
0.100000 slw
[] 0 sd
[] 0 sd
0 slj
0 slc
n 16.000000 14.000000 m 22.925000 14.000000 l 22.925000 12.250000 l 29.363197 12.250000 l s
[] 0 sd
0 slj
0 slc
n 29.738197 12.250000 m 29.238197 12.500000 l 29.363197 12.250000 l 29.238197 12.000000 l ef
n 29.738197 12.250000 m 29.238197 12.500000 l 29.363197 12.250000 l 29.238197 12.000000 l cp s
0.100000 slw
[0.200000] 0 sd
[0.200000] 0 sd
0 slj
0 slc
n 29.850000 16.000000 m 20.500000 16.000000 l 20.500000 16.000000 l 16.486803 16.000000 l s
[] 0 sd
0 slj
0 slc
n 16.111803 16.000000 m 16.611803 15.750000 l 16.486803 16.000000 l 16.611803 16.250000 l ef
n 16.111803 16.000000 m 16.611803 15.750000 l 16.486803 16.000000 l 16.611803 16.250000 l cp s
0.100000 slw
[0.200000] 0 sd
[0.200000] 0 sd
0 slj
0 slc
n 34.850000 17.250000 m 34.850000 23.750000 l 33.486803 23.750000 l s
[] 0 sd
0 slj
0 slc
n 33.111803 23.750000 m 33.611803 23.500000 l 33.486803 23.750000 l 33.611803 24.000000 l ef
n 33.111803 23.750000 m 33.611803 23.500000 l 33.486803 23.750000 l 33.611803 24.000000 l cp s
0.100000 slw
[] 0 sd
[] 0 sd
0 slj
0 slc
n 27.750000 22.000000 m 27.750000 19.625000 l 29.850000 19.625000 l 29.850000 17.736803 l s
[] 0 sd
0 slj
0 slc
n 29.850000 17.361803 m 30.100000 17.861803 l 29.850000 17.736803 l 29.600000 17.861803 l ef
n 29.850000 17.361803 m 30.100000 17.861803 l 29.850000 17.736803 l 29.600000 17.861803 l cp s
0.100000 slw
[] 0 sd
[] 0 sd
0 slj
0 slc
n 7.000000 4.950000 m 6.000000 4.950000 l 6.000000 9.475000 l 10.000000 9.475000 l 10.000000 13.513197 l s
[] 0 sd
0 slj
0 slc
n 10.000000 13.888197 m 9.750000 13.388197 l 10.000000 13.513197 l 10.250000 13.388197 l ef
n 10.000000 13.888197 m 9.750000 13.388197 l 10.000000 13.513197 l 10.250000 13.388197 l cp s
0.100000 slw
[] 0 sd
[] 0 sd
0 slj
0 slc
n 14.000000 4.950000 m 15.000000 4.950000 l 15.000000 9.475000 l 14.000000 9.475000 l 14.000000 13.513197 l s
[] 0 sd
0 slj
0 slc
n 14.000000 13.888197 m 13.750000 13.388197 l 14.000000 13.513197 l 14.250000 13.388197 l ef
n 14.000000 13.888197 m 13.750000 13.388197 l 14.000000 13.513197 l 14.250000 13.388197 l cp s
/Helvetica-latin1 ff 0.560000 scf sf
(find former) dup sw 2 div 25.750000 ex sub 13.300000 m gs 1 -1 sc sh gr
(declaration) dup sw 2 div 25.750000 ex sub 14.100000 m gs 1 -1 sc sh gr
/Helvetica-latin1 ff 0.560000 scf sf
(former) dup sw 2 div 23.612100 ex sub 16.728100 m gs 1 -1 sc sh gr
(dclaseclarations) dup sw 2 div 23.612100 ex sub 17.528100 m gs 1 -1 sc sh gr
(for name) dup sw 2 div 23.612100 ex sub 18.328100 m gs 1 -1 sc sh gr
0.100000 slw
[] 0 sd
[] 0 sd
0 slj
0 slc
n 10.500000 6.200000 m 10.500000 10.100000 l 12.000000 10.100000 l 12.000000 13.513197 l s
[] 0 sd
0 slj
0 slc
n 12.000000 13.888197 m 11.750000 13.388197 l 12.000000 13.513197 l 12.250000 13.388197 l ef
n 12.000000 13.888197 m 11.750000 13.388197 l 12.000000 13.513197 l 12.250000 13.388197 l cp s
/Helvetica-latin1 ff 0.560000 scf sf
(find bases) dup sw 2 div 27.962100 ex sub 18.978100 m gs 1 -1 sc sh gr
/Helvetica-latin1 ff 0.560000 scf sf
(declara-) dup sw 2 div 33.362100 ex sub 19.178100 m gs 1 -1 sc sh gr
(tions) dup sw 2 div 33.362100 ex sub 19.978100 m gs 1 -1 sc sh gr
(of base) dup sw 2 div 33.362100 ex sub 20.778100 m gs 1 -1 sc sh gr
(classes) dup sw 2 div 33.362100 ex sub 21.578100 m gs 1 -1 sc sh gr
/Helvetica-latin1 ff 0.560000 scf sf
(class) 16.000000 7.000000 m gs 1 -1 sc sh gr
(body) 16.000000 7.800000 m gs 1 -1 sc sh gr
(end) 16.000000 8.600000 m gs 1 -1 sc sh gr
/Helvetica-latin1 ff 0.560000 scf sf
(class) dup sw 2 div 12.000000 ex sub 7.000000 m gs 1 -1 sc sh gr
(body) dup sw 2 div 12.000000 ex sub 7.800000 m gs 1 -1 sc sh gr
(start) dup sw 2 div 12.000000 ex sub 8.600000 m gs 1 -1 sc sh gr
/Helvetica-latin1 ff 0.560000 scf sf
(forward) dup sw 5.550000 ex sub 6.800000 m gs 1 -1 sc sh gr
(class) dup sw 5.550000 ex sub 7.600000 m gs 1 -1 sc sh gr
(declaration) dup sw 5.550000 ex sub 8.400000 m gs 1 -1 sc sh gr
/Helvetica-latin1 ff 0.560000 scf sf
(new declaration) dup sw 2 div 5.000000 ex sub 15.000000 m gs 1 -1 sc sh gr
0.100000 slw
[] 0 sd
[] 0 sd
0 slj
n 26.000000 22.000000 m 26.000000 29.000000 l 33.000000 29.000000 l 33.000000 22.000000 l cp s
/Helvetica-latin1 ff 0.560000 scf sf
(base specifier) dup sw 2 div 29.500000 ex sub 25.286719 m gs 1 -1 sc sh gr
(processor) dup sw 2 div 29.500000 ex sub 26.086719 m gs 1 -1 sc sh gr
0.100000 slw
[1.000000] 0 sd
[1.000000] 0 sd
0 slj
0 slc
n 16.000000 22.000000 m 16.000000 22.000000 l 25.513197 22.000000 l s
[] 0 sd
0 slj
0 slc
n 25.888197 22.000000 m 25.388197 22.250000 l 25.513197 22.000000 l 25.388197 21.750000 l ef
n 25.888197 22.000000 m 25.388197 22.250000 l 25.513197 22.000000 l 25.388197 21.750000 l cp s
0.100000 slw
[0.200000] 0 sd
[0.200000] 0 sd
0 slj
0 slc
n 26.000000 23.750000 m 14.000000 23.750000 l 14.000000 22.486803 l s
[] 0 sd
0 slj
0 slc
n 14.000000 22.111803 m 14.250000 22.611803 l 14.000000 22.486803 l 13.750000 22.611803 l ef
n 14.000000 22.111803 m 14.250000 22.611803 l 14.000000 22.486803 l 13.750000 22.611803 l cp s
0.100000 slw
[] 0 sd
[] 0 sd
0 slj
n 10.000000 25.000000 m 10.000000 29.000000 l 15.000000 29.000000 l 15.000000 25.000000 l cp s
/Helvetica-latin1 ff 0.560000 scf sf
(default) dup sw 2 div 12.500000 ex sub 26.386719 m gs 1 -1 sc sh gr
(visibility) dup sw 2 div 12.500000 ex sub 27.186719 m gs 1 -1 sc sh gr
(visitor) dup sw 2 div 12.500000 ex sub 27.986719 m gs 1 -1 sc sh gr
0.100000 slw
[] 0 sd
[] 0 sd
0 slj
0 slc
n 10.000000 22.000000 m 10.000000 23.500000 l 11.250000 23.500000 l 11.250000 24.513197 l s
[] 0 sd
0 slj
0 slc
n 11.250000 24.888197 m 11.000000 24.388197 l 11.250000 24.513197 l 11.500000 24.388197 l ef
n 11.250000 24.888197 m 11.000000 24.388197 l 11.250000 24.513197 l 11.500000 24.388197 l cp s
0.100000 slw
[] 0 sd
[] 0 sd
0 slj
n 3.000000 25.000000 m 3.000000 29.000000 l 7.876563 29.000000 l 7.876563 25.000000 l cp s
/Helvetica-latin1 ff 0.560000 scf sf
(ss_type) dup sw 2 div 5.438281 ex sub 26.386719 m gs 1 -1 sc sh gr
(creating) dup sw 2 div 5.438281 ex sub 27.186719 m gs 1 -1 sc sh gr
(visitor) dup sw 2 div 5.438281 ex sub 27.986719 m gs 1 -1 sc sh gr
0.100000 slw
[] 0 sd
[] 0 sd
0 slj
0 slc
n 8.000000 22.000000 m 8.000000 23.500000 l 6.657420 23.500000 l 6.657420 24.513197 l s
[] 0 sd
0 slj
0 slc
n 6.657420 24.888197 m 6.407420 24.388197 l 6.657420 24.513197 l 6.907420 24.388197 l ef
n 6.657420 24.888197 m 6.407420 24.388197 l 6.657420 24.513197 l 6.907420 24.388197 l cp s
0.100000 slw
[] 0 sd
[] 0 sd
0 slc
0 slj
0 slc
0 slj
[] 0 sd
1.000000 1.000000 1.000000 srgb
n -4.000000 2.000000 m 2.000000 2.000000 l 2.000000 5.428571 l 0.800000 4.857143 0.200000 4.857143 -1.000000 5.428571 c -2.200000 6.000000 -2.800000 6.000000 -4.000000 5.428571 c -4.000000 2.000000 l ef
0.000000 0.000000 0.000000 srgb
n -4.000000 2.000000 m 2.000000 2.000000 l 2.000000 5.428571 l 0.800000 4.857143 0.200000 4.857143 -1.000000 5.428571 c -2.200000 6.000000 -2.800000 6.000000 -4.000000 5.428571 c -4.000000 2.000000 l s
/Helvetica-latin1 ff 0.560000 scf sf
(class A : B { };) dup sw 2 div -1.000000 ex sub 3.215290 m gs 1 -1 sc sh gr
(class C;) dup sw 2 div -1.000000 ex sub 4.015290 m gs 1 -1 sc sh gr
0.100000 slw
[0.200000] 0 sd
[0.200000] 0 sd
0 slj
0 slc
n 2.000000 3.714290 m 4.500000 3.714290 l 4.500000 3.700000 l 6.513197 3.700000 l s
[] 0 sd
0 slj
0 slc
n 6.888197 3.700000 m 6.388197 3.950000 l 6.513197 3.700000 l 6.388197 3.450000 l ef
n 6.888197 3.700000 m 6.388197 3.950000 l 6.513197 3.700000 l 6.388197 3.450000 l cp s
/Helvetica-latin1 ff 0.560000 scf sf
(SOURCE PROGRAM) dup sw 2 div -1.000000 ex sub 1.000000 m gs 1 -1 sc sh gr
/Helvetica-latin1 ff 0.560000 scf sf
(base classes) dup sw 2 div 19.812100 ex sub 23.028100 m gs 1 -1 sc sh gr
0.100000 slw
[] 0 sd
[] 0 sd
0 slj
n 19.000000 0.000000 m 19.000000 11.000000 l 35.000000 11.000000 l 35.000000 0.000000 l cp s
/Helvetica-latin1 ff 0.560000 scf sf
0.100000 slw
[] 0 sd
[] 0 sd
0 slj
0 slc
n 20.000000 4.000000 m 20.000000 4.000000 l 27.513197 4.000000 l s
[] 0 sd
0 slj
0 slc
n 27.888197 4.000000 m 27.388197 4.250000 l 27.513197 4.000000 l 27.388197 3.750000 l ef
n 27.888197 4.000000 m 27.388197 4.250000 l 27.513197 4.000000 l 27.388197 3.750000 l cp s
0.100000 slw
[0.200000] 0 sd
[0.200000] 0 sd
0 slj
0 slc
n 20.000000 6.000000 m 20.000000 6.000000 l 27.513197 6.000000 l s
[] 0 sd
0 slj
0 slc
n 27.888197 6.000000 m 27.388197 6.250000 l 27.513197 6.000000 l 27.388197 5.750000 l ef
n 27.888197 6.000000 m 27.388197 6.250000 l 27.513197 6.000000 l 27.388197 5.750000 l cp s
/Helvetica-latin1 ff 0.560000 scf sf
(control passing) dup sw 2 div 24.000000 ex sub 5.000000 m gs 1 -1 sc sh gr
/Helvetica-latin1 ff 0.560000 scf sf
(data passing) dup sw 2 div 24.000000 ex sub 7.000000 m gs 1 -1 sc sh gr
0.100000 slw
[1.000000] 0 sd
[1.000000] 0 sd
0 slj
0 slc
n 20.000000 8.000000 m 24.000000 8.000000 l 24.000000 8.000000 l 27.513197 8.000000 l s
[] 0 sd
0 slj
0 slc
n 27.888197 8.000000 m 27.388197 8.250000 l 27.513197 8.000000 l 27.388197 7.750000 l ef
n 27.888197 8.000000 m 27.388197 8.250000 l 27.513197 8.000000 l 27.388197 7.750000 l cp s
/Helvetica-latin1 ff 0.560000 scf sf
(data and control) dup sw 2 div 24.000000 ex sub 9.000000 m gs 1 -1 sc sh gr
(passing) dup sw 2 div 24.000000 ex sub 9.800000 m gs 1 -1 sc sh gr
/Helvetica-latin1 ff 1.400000 scf sf
(LEGEND) dup sw 2 div 27.000000 ex sub 2.000000 m gs 1 -1 sc sh gr
0.100000 slw
[] 0 sd
[] 0 sd
0 slj
n 30.000000 3.000000 m 30.000000 6.000000 l 34.000000 6.000000 l 34.000000 3.000000 l cp s
/Helvetica-latin1 ff 0.560000 scf sf
(process) dup sw 2 div 32.000000 ex sub 4.686719 m gs 1 -1 sc sh gr
0.100000 slw
[] 0 sd
[] 0 sd
0 slc
0 slj
0 slc
0 slj
[] 0 sd
n 30.000000 7.000000 m 30.000000 10.000000 l 34.000000 10.000000 l 34.000000 7.000000 l cp s
0 slc
0 slj
[] 0 sd
n 30.400000 7.000000 m 30.400000 10.000000 l s
0 slc
0 slj
[] 0 sd
n 30.000000 7.300000 m 34.000000 7.300000 l s
/Helvetica-latin1 ff 0.560000 scf sf
(storage) dup sw 2 div 32.200000 ex sub 8.836719 m gs 1 -1 sc sh gr
showpage
