<?xml version="1.0" encoding="UTF-8"?>
<dia:diagram xmlns:dia="http://www.lysator.liu.se/~alla/dia/">
  <dia:diagramdata>
    <dia:attribute name="background">
      <dia:color val="#ffffff"/>
    </dia:attribute>
    <dia:attribute name="pagebreak">
      <dia:color val="#000099"/>
    </dia:attribute>
    <dia:attribute name="paper">
      <dia:composite type="paper">
        <dia:attribute name="name">
          <dia:string>#A4#</dia:string>
        </dia:attribute>
        <dia:attribute name="tmargin">
          <dia:real val="2.8222000598907471"/>
        </dia:attribute>
        <dia:attribute name="bmargin">
          <dia:real val="2.8222000598907471"/>
        </dia:attribute>
        <dia:attribute name="lmargin">
          <dia:real val="2.8222000598907471"/>
        </dia:attribute>
        <dia:attribute name="rmargin">
          <dia:real val="2.8222000598907471"/>
        </dia:attribute>
        <dia:attribute name="is_portrait">
          <dia:boolean val="true"/>
        </dia:attribute>
        <dia:attribute name="scaling">
          <dia:real val="1"/>
        </dia:attribute>
        <dia:attribute name="fitto">
          <dia:boolean val="false"/>
        </dia:attribute>
      </dia:composite>
    </dia:attribute>
    <dia:attribute name="grid">
      <dia:composite type="grid">
        <dia:attribute name="width_x">
          <dia:real val="1"/>
        </dia:attribute>
        <dia:attribute name="width_y">
          <dia:real val="1"/>
        </dia:attribute>
        <dia:attribute name="visible_x">
          <dia:int val="1"/>
        </dia:attribute>
        <dia:attribute name="visible_y">
          <dia:int val="1"/>
        </dia:attribute>
        <dia:composite type="color"/>
      </dia:composite>
    </dia:attribute>
    <dia:attribute name="color">
      <dia:color val="#d8e5e5"/>
    </dia:attribute>
    <dia:attribute name="guides">
      <dia:composite type="guides">
        <dia:attribute name="hguides"/>
        <dia:attribute name="vguides"/>
      </dia:composite>
    </dia:attribute>
  </dia:diagramdata>
  <dia:layer name="Background" visible="true">
    <dia:object type="Standard - Text" version="0" id="O0">
      <dia:attribute name="obj_pos">
        <dia:point val="2.7,23.45"/>
      </dia:attribute>
      <dia:attribute name="obj_bb">
        <dia:rectangle val="2.7,22.695;21.537,25.9146"/>
      </dia:attribute>
      <dia:attribute name="text">
        <dia:composite type="text">
          <dia:attribute name="string">
            <dia:string>#Note: 
"@" stands for pseudoreference
pi_mem/ptr_deref, pi_preg are expression results#</dia:string>
          </dia:attribute>
          <dia:attribute name="font">
            <dia:font family="sans" style="0" name="Helvetica"/>
          </dia:attribute>
          <dia:attribute name="height">
            <dia:real val="1"/>
          </dia:attribute>
          <dia:attribute name="pos">
            <dia:point val="2.7,23.45"/>
          </dia:attribute>
          <dia:attribute name="color">
            <dia:color val="#000000"/>
          </dia:attribute>
          <dia:attribute name="alignment">
            <dia:enum val="0"/>
          </dia:attribute>
        </dia:composite>
      </dia:attribute>
    </dia:object>
    <dia:group>
      <dia:object type="UML - Note" version="0" id="O1">
        <dia:attribute name="obj_pos">
          <dia:point val="17.5,-0.9"/>
        </dia:attribute>
        <dia:attribute name="obj_bb">
          <dia:rectangle val="17.45,-0.95;22.95,2.05"/>
        </dia:attribute>
        <dia:attribute name="elem_corner">
          <dia:point val="17.5,-0.9"/>
        </dia:attribute>
        <dia:attribute name="elem_width">
          <dia:real val="5.4000000000000004"/>
        </dia:attribute>
        <dia:attribute name="elem_height">
          <dia:real val="2.8999999999999999"/>
        </dia:attribute>
        <dia:attribute name="line_colour">
          <dia:color val="#000000"/>
        </dia:attribute>
        <dia:attribute name="fill_colour">
          <dia:color val="#ffffff"/>
        </dia:attribute>
        <dia:attribute name="text">
          <dia:composite type="text">
            <dia:attribute name="string">
              <dia:string>#int &amp;c,&amp;d;
c=d;#</dia:string>
            </dia:attribute>
            <dia:attribute name="font">
              <dia:font family="monospace" style="0" name="Courier"/>
            </dia:attribute>
            <dia:attribute name="height">
              <dia:real val="1"/>
            </dia:attribute>
            <dia:attribute name="pos">
              <dia:point val="17.85,0.410937"/>
            </dia:attribute>
            <dia:attribute name="color">
              <dia:color val="#000000"/>
            </dia:attribute>
            <dia:attribute name="alignment">
              <dia:enum val="0"/>
            </dia:attribute>
          </dia:composite>
        </dia:attribute>
      </dia:object>
      <dia:object type="SDL - Task" version="0" id="O2">
        <dia:attribute name="obj_pos">
          <dia:point val="18.3588,5.1"/>
        </dia:attribute>
        <dia:attribute name="obj_bb">
          <dia:rectangle val="18.3088,5.05;21.5749,7.95711"/>
        </dia:attribute>
        <dia:attribute name="elem_corner">
          <dia:point val="18.3588,5.1"/>
        </dia:attribute>
        <dia:attribute name="elem_width">
          <dia:real val="3.1661100389831844"/>
        </dia:attribute>
        <dia:attribute name="elem_height">
          <dia:real val="2.8071100000000002"/>
        </dia:attribute>
        <dia:attribute name="line_width">
          <dia:real val="0.10000000000000001"/>
        </dia:attribute>
        <dia:attribute name="line_colour">
          <dia:color val="#000000"/>
        </dia:attribute>
        <dia:attribute name="fill_colour">
          <dia:color val="#ffffff"/>
        </dia:attribute>
        <dia:attribute name="show_background">
          <dia:boolean val="true"/>
        </dia:attribute>
        <dia:attribute name="line_style">
          <dia:enum val="0"/>
          <dia:real val="1"/>
        </dia:attribute>
        <dia:attribute name="text">
          <dia:composite type="text">
            <dia:attribute name="string">
              <dia:string>#=
int@#</dia:string>
            </dia:attribute>
            <dia:attribute name="font">
              <dia:font family="sans" style="0" name="Helvetica"/>
            </dia:attribute>
            <dia:attribute name="height">
              <dia:real val="1"/>
            </dia:attribute>
            <dia:attribute name="pos">
              <dia:point val="19.9419,6.23637"/>
            </dia:attribute>
            <dia:attribute name="color">
              <dia:color val="#000000"/>
            </dia:attribute>
            <dia:attribute name="alignment">
              <dia:enum val="1"/>
            </dia:attribute>
          </dia:composite>
        </dia:attribute>
        <dia:attribute name="flip_horizontal">
          <dia:boolean val="false"/>
        </dia:attribute>
        <dia:attribute name="flip_vertical">
          <dia:boolean val="false"/>
        </dia:attribute>
      </dia:object>
      <dia:object type="SDL - Task" version="0" id="O3">
        <dia:attribute name="obj_pos">
          <dia:point val="16.1256,10.05"/>
        </dia:attribute>
        <dia:attribute name="obj_bb">
          <dia:rectangle val="16.0756,10;19.2958,12.9071"/>
        </dia:attribute>
        <dia:attribute name="elem_corner">
          <dia:point val="16.1256,10.05"/>
        </dia:attribute>
        <dia:attribute name="elem_width">
          <dia:real val="3.120211601483184"/>
        </dia:attribute>
        <dia:attribute name="elem_height">
          <dia:real val="2.8071100000000002"/>
        </dia:attribute>
        <dia:attribute name="line_width">
          <dia:real val="0.10000000000000001"/>
        </dia:attribute>
        <dia:attribute name="line_colour">
          <dia:color val="#000000"/>
        </dia:attribute>
        <dia:attribute name="fill_colour">
          <dia:color val="#ffffff"/>
        </dia:attribute>
        <dia:attribute name="show_background">
          <dia:boolean val="true"/>
        </dia:attribute>
        <dia:attribute name="line_style">
          <dia:enum val="0"/>
          <dia:real val="1"/>
        </dia:attribute>
        <dia:attribute name="text">
          <dia:composite type="text">
            <dia:attribute name="string">
              <dia:string>#VR c
int&amp;#</dia:string>
            </dia:attribute>
            <dia:attribute name="font">
              <dia:font family="sans" style="0" name="Helvetica"/>
            </dia:attribute>
            <dia:attribute name="height">
              <dia:real val="1"/>
            </dia:attribute>
            <dia:attribute name="pos">
              <dia:point val="17.6857,11.1864"/>
            </dia:attribute>
            <dia:attribute name="color">
              <dia:color val="#000000"/>
            </dia:attribute>
            <dia:attribute name="alignment">
              <dia:enum val="1"/>
            </dia:attribute>
          </dia:composite>
        </dia:attribute>
        <dia:attribute name="flip_horizontal">
          <dia:boolean val="false"/>
        </dia:attribute>
        <dia:attribute name="flip_vertical">
          <dia:boolean val="false"/>
        </dia:attribute>
      </dia:object>
      <dia:object type="SDL - Task" version="0" id="O4">
        <dia:attribute name="obj_pos">
          <dia:point val="20.8777,14.7"/>
        </dia:attribute>
        <dia:attribute name="obj_bb">
          <dia:rectangle val="20.8277,14.65;24.1436,17.5571"/>
        </dia:attribute>
        <dia:attribute name="elem_corner">
          <dia:point val="20.8777,14.7"/>
        </dia:attribute>
        <dia:attribute name="elem_width">
          <dia:real val="3.2159147264831849"/>
        </dia:attribute>
        <dia:attribute name="elem_height">
          <dia:real val="2.8071100000000002"/>
        </dia:attribute>
        <dia:attribute name="line_width">
          <dia:real val="0.10000000000000001"/>
        </dia:attribute>
        <dia:attribute name="line_colour">
          <dia:color val="#000000"/>
        </dia:attribute>
        <dia:attribute name="fill_colour">
          <dia:color val="#ffffff"/>
        </dia:attribute>
        <dia:attribute name="show_background">
          <dia:boolean val="true"/>
        </dia:attribute>
        <dia:attribute name="line_style">
          <dia:enum val="0"/>
          <dia:real val="1"/>
        </dia:attribute>
        <dia:attribute name="text">
          <dia:composite type="text">
            <dia:attribute name="string">
              <dia:string>#VR d
int&amp;#</dia:string>
            </dia:attribute>
            <dia:attribute name="font">
              <dia:font family="sans" style="0" name="Helvetica"/>
            </dia:attribute>
            <dia:attribute name="height">
              <dia:real val="1"/>
            </dia:attribute>
            <dia:attribute name="pos">
              <dia:point val="22.4856,15.8364"/>
            </dia:attribute>
            <dia:attribute name="color">
              <dia:color val="#000000"/>
            </dia:attribute>
            <dia:attribute name="alignment">
              <dia:enum val="1"/>
            </dia:attribute>
          </dia:composite>
        </dia:attribute>
        <dia:attribute name="flip_horizontal">
          <dia:boolean val="false"/>
        </dia:attribute>
        <dia:attribute name="flip_vertical">
          <dia:boolean val="false"/>
        </dia:attribute>
      </dia:object>
      <dia:object type="Standard - Line" version="0" id="O5">
        <dia:attribute name="obj_pos">
          <dia:point val="17.6857,10.05"/>
        </dia:attribute>
        <dia:attribute name="obj_bb">
          <dia:rectangle val="17.3051,7.83642;20.0126,10.447"/>
        </dia:attribute>
        <dia:attribute name="conn_endpoints">
          <dia:point val="17.6857,10.05"/>
          <dia:point val="19.9419,7.90711"/>
        </dia:attribute>
        <dia:attribute name="numcp">
          <dia:int val="1"/>
        </dia:attribute>
        <dia:attribute name="start_arrow">
          <dia:enum val="22"/>
        </dia:attribute>
        <dia:attribute name="start_arrow_length">
          <dia:real val="0.5"/>
        </dia:attribute>
        <dia:attribute name="start_arrow_width">
          <dia:real val="0.5"/>
        </dia:attribute>
        <dia:connections>
          <dia:connection handle="0" to="O3" connection="0"/>
          <dia:connection handle="1" to="O2" connection="1"/>
        </dia:connections>
      </dia:object>
      <dia:object type="Standard - Line" version="0" id="O6">
        <dia:attribute name="obj_pos">
          <dia:point val="22.4357,10.1"/>
        </dia:attribute>
        <dia:attribute name="obj_bb">
          <dia:rectangle val="19.8713,7.83654;22.8034,10.5085"/>
        </dia:attribute>
        <dia:attribute name="conn_endpoints">
          <dia:point val="22.4357,10.1"/>
          <dia:point val="19.9419,7.90711"/>
        </dia:attribute>
        <dia:attribute name="numcp">
          <dia:int val="1"/>
        </dia:attribute>
        <dia:attribute name="start_arrow">
          <dia:enum val="22"/>
        </dia:attribute>
        <dia:attribute name="start_arrow_length">
          <dia:real val="0.5"/>
        </dia:attribute>
        <dia:attribute name="start_arrow_width">
          <dia:real val="0.5"/>
        </dia:attribute>
        <dia:connections>
          <dia:connection handle="0" to="O7" connection="0"/>
          <dia:connection handle="1" to="O2" connection="1"/>
        </dia:connections>
      </dia:object>
      <dia:object type="SDL - Task" version="0" id="O7">
        <dia:attribute name="obj_pos">
          <dia:point val="20.9,10.1"/>
        </dia:attribute>
        <dia:attribute name="obj_bb">
          <dia:rectangle val="20.85,10.05;24.0214,12.9571"/>
        </dia:attribute>
        <dia:attribute name="elem_corner">
          <dia:point val="20.9,10.1"/>
        </dia:attribute>
        <dia:attribute name="elem_width">
          <dia:real val="3.07138"/>
        </dia:attribute>
        <dia:attribute name="elem_height">
          <dia:real val="2.8071100000000002"/>
        </dia:attribute>
        <dia:attribute name="line_width">
          <dia:real val="0.10000000000000001"/>
        </dia:attribute>
        <dia:attribute name="line_colour">
          <dia:color val="#000000"/>
        </dia:attribute>
        <dia:attribute name="fill_colour">
          <dia:color val="#ffffff"/>
        </dia:attribute>
        <dia:attribute name="show_background">
          <dia:boolean val="true"/>
        </dia:attribute>
        <dia:attribute name="line_style">
          <dia:enum val="0"/>
          <dia:real val="1"/>
        </dia:attribute>
        <dia:attribute name="text">
          <dia:composite type="text">
            <dia:attribute name="string">
              <dia:string>#get
int#</dia:string>
            </dia:attribute>
            <dia:attribute name="font">
              <dia:font family="sans" style="0" name="Helvetica"/>
            </dia:attribute>
            <dia:attribute name="height">
              <dia:real val="1"/>
            </dia:attribute>
            <dia:attribute name="pos">
              <dia:point val="22.4357,11.2364"/>
            </dia:attribute>
            <dia:attribute name="color">
              <dia:color val="#000000"/>
            </dia:attribute>
            <dia:attribute name="alignment">
              <dia:enum val="1"/>
            </dia:attribute>
          </dia:composite>
        </dia:attribute>
        <dia:attribute name="flip_horizontal">
          <dia:boolean val="false"/>
        </dia:attribute>
        <dia:attribute name="flip_vertical">
          <dia:boolean val="false"/>
        </dia:attribute>
      </dia:object>
      <dia:object type="Standard - Line" version="0" id="O8">
        <dia:attribute name="obj_pos">
          <dia:point val="22.4856,14.7"/>
        </dia:attribute>
        <dia:attribute name="obj_bb">
          <dia:rectangle val="21.9844,12.8557;22.9868,14.7639"/>
        </dia:attribute>
        <dia:attribute name="conn_endpoints">
          <dia:point val="22.4856,14.7"/>
          <dia:point val="22.4357,12.9071"/>
        </dia:attribute>
        <dia:attribute name="numcp">
          <dia:int val="1"/>
        </dia:attribute>
        <dia:attribute name="start_arrow">
          <dia:enum val="22"/>
        </dia:attribute>
        <dia:attribute name="start_arrow_length">
          <dia:real val="0.5"/>
        </dia:attribute>
        <dia:attribute name="start_arrow_width">
          <dia:real val="0.5"/>
        </dia:attribute>
        <dia:connections>
          <dia:connection handle="0" to="O4" connection="0"/>
          <dia:connection handle="1" to="O7" connection="1"/>
        </dia:connections>
      </dia:object>
      <dia:object type="Standard - Text" version="0" id="O9">
        <dia:attribute name="obj_pos">
          <dia:point val="16.5,0.1"/>
        </dia:attribute>
        <dia:attribute name="obj_bb">
          <dia:rectangle val="16.5,-0.779687;17.3992,0.603906"/>
        </dia:attribute>
        <dia:attribute name="text">
          <dia:composite type="text">
            <dia:attribute name="string">
              <dia:string>#2.#</dia:string>
            </dia:attribute>
            <dia:attribute name="font">
              <dia:font family="sans" style="0" name="Helvetica"/>
            </dia:attribute>
            <dia:attribute name="height">
              <dia:real val="1.2"/>
            </dia:attribute>
            <dia:attribute name="pos">
              <dia:point val="16.5,0.1"/>
            </dia:attribute>
            <dia:attribute name="color">
              <dia:color val="#000000"/>
            </dia:attribute>
            <dia:attribute name="alignment">
              <dia:enum val="0"/>
            </dia:attribute>
          </dia:composite>
        </dia:attribute>
      </dia:object>
      <dia:object type="Standard - Line" version="0" id="O10">
        <dia:attribute name="obj_pos">
          <dia:point val="19.9419,5.1"/>
        </dia:attribute>
        <dia:attribute name="obj_bb">
          <dia:rectangle val="19.441,3.83257;20.4428,5.15977"/>
        </dia:attribute>
        <dia:attribute name="conn_endpoints">
          <dia:point val="19.9419,5.1"/>
          <dia:point val="19.9657,3.88354"/>
        </dia:attribute>
        <dia:attribute name="numcp">
          <dia:int val="1"/>
        </dia:attribute>
        <dia:attribute name="start_arrow">
          <dia:enum val="22"/>
        </dia:attribute>
        <dia:attribute name="start_arrow_length">
          <dia:real val="0.5"/>
        </dia:attribute>
        <dia:attribute name="start_arrow_width">
          <dia:real val="0.5"/>
        </dia:attribute>
        <dia:connections>
          <dia:connection handle="0" to="O2" connection="0"/>
        </dia:connections>
      </dia:object>
    </dia:group>
    <dia:group>
      <dia:object type="Standard - Text" version="0" id="O11">
        <dia:attribute name="obj_pos">
          <dia:point val="37.4387,13.745"/>
        </dia:attribute>
        <dia:attribute name="obj_bb">
          <dia:rectangle val="37.4387,13.1405;43.7892,14.1164"/>
        </dia:attribute>
        <dia:attribute name="text">
          <dia:composite type="text">
            <dia:attribute name="string">
              <dia:string>#pi_mem_ptr_deref#</dia:string>
            </dia:attribute>
            <dia:attribute name="font">
              <dia:font family="sans" style="80" name="Helvetica"/>
            </dia:attribute>
            <dia:attribute name="height">
              <dia:real val="0.80000000000000004"/>
            </dia:attribute>
            <dia:attribute name="pos">
              <dia:point val="37.4387,13.745"/>
            </dia:attribute>
            <dia:attribute name="color">
              <dia:color val="#000000"/>
            </dia:attribute>
            <dia:attribute name="alignment">
              <dia:enum val="0"/>
            </dia:attribute>
          </dia:composite>
        </dia:attribute>
      </dia:object>
      <dia:object type="UML - Note" version="0" id="O12">
        <dia:attribute name="obj_pos">
          <dia:point val="31,-1"/>
        </dia:attribute>
        <dia:attribute name="obj_bb">
          <dia:rectangle val="30.95,-1.05;36.45,1.95"/>
        </dia:attribute>
        <dia:attribute name="elem_corner">
          <dia:point val="31,-1"/>
        </dia:attribute>
        <dia:attribute name="elem_width">
          <dia:real val="5.4000000000000004"/>
        </dia:attribute>
        <dia:attribute name="elem_height">
          <dia:real val="2.8999999999999999"/>
        </dia:attribute>
        <dia:attribute name="line_colour">
          <dia:color val="#000000"/>
        </dia:attribute>
        <dia:attribute name="fill_colour">
          <dia:color val="#ffffff"/>
        </dia:attribute>
        <dia:attribute name="text">
          <dia:composite type="text">
            <dia:attribute name="string">
              <dia:string>#int *e,*f;
*e=*f;#</dia:string>
            </dia:attribute>
            <dia:attribute name="font">
              <dia:font family="monospace" style="0" name="Courier"/>
            </dia:attribute>
            <dia:attribute name="height">
              <dia:real val="1"/>
            </dia:attribute>
            <dia:attribute name="pos">
              <dia:point val="31.35,0.310937"/>
            </dia:attribute>
            <dia:attribute name="color">
              <dia:color val="#000000"/>
            </dia:attribute>
            <dia:attribute name="alignment">
              <dia:enum val="0"/>
            </dia:attribute>
          </dia:composite>
        </dia:attribute>
      </dia:object>
      <dia:object type="SDL - Task" version="0" id="O13">
        <dia:attribute name="obj_pos">
          <dia:point val="31.8588,5"/>
        </dia:attribute>
        <dia:attribute name="obj_bb">
          <dia:rectangle val="31.8088,4.95;35.0749,7.85711"/>
        </dia:attribute>
        <dia:attribute name="elem_corner">
          <dia:point val="31.8588,5"/>
        </dia:attribute>
        <dia:attribute name="elem_width">
          <dia:real val="3.1661100389831844"/>
        </dia:attribute>
        <dia:attribute name="elem_height">
          <dia:real val="2.8071100000000002"/>
        </dia:attribute>
        <dia:attribute name="line_width">
          <dia:real val="0.10000000000000001"/>
        </dia:attribute>
        <dia:attribute name="line_colour">
          <dia:color val="#000000"/>
        </dia:attribute>
        <dia:attribute name="fill_colour">
          <dia:color val="#ffffff"/>
        </dia:attribute>
        <dia:attribute name="show_background">
          <dia:boolean val="true"/>
        </dia:attribute>
        <dia:attribute name="line_style">
          <dia:enum val="0"/>
          <dia:real val="1"/>
        </dia:attribute>
        <dia:attribute name="text">
          <dia:composite type="text">
            <dia:attribute name="string">
              <dia:string>#=
int@#</dia:string>
            </dia:attribute>
            <dia:attribute name="font">
              <dia:font family="sans" style="0" name="Helvetica"/>
            </dia:attribute>
            <dia:attribute name="height">
              <dia:real val="1"/>
            </dia:attribute>
            <dia:attribute name="pos">
              <dia:point val="33.4419,6.13637"/>
            </dia:attribute>
            <dia:attribute name="color">
              <dia:color val="#000000"/>
            </dia:attribute>
            <dia:attribute name="alignment">
              <dia:enum val="1"/>
            </dia:attribute>
          </dia:composite>
        </dia:attribute>
        <dia:attribute name="flip_horizontal">
          <dia:boolean val="false"/>
        </dia:attribute>
        <dia:attribute name="flip_vertical">
          <dia:boolean val="false"/>
        </dia:attribute>
      </dia:object>
      <dia:object type="SDL - Task" version="0" id="O14">
        <dia:attribute name="obj_pos">
          <dia:point val="29.5154,10.1"/>
        </dia:attribute>
        <dia:attribute name="obj_bb">
          <dia:rectangle val="29.4654,10.05;33.0059,12.9571"/>
        </dia:attribute>
        <dia:attribute name="elem_corner">
          <dia:point val="29.5154,10.1"/>
        </dia:attribute>
        <dia:attribute name="elem_width">
          <dia:real val="3.440524101483184"/>
        </dia:attribute>
        <dia:attribute name="elem_height">
          <dia:real val="2.8071100000000002"/>
        </dia:attribute>
        <dia:attribute name="line_width">
          <dia:real val="0.10000000000000001"/>
        </dia:attribute>
        <dia:attribute name="line_colour">
          <dia:color val="#000000"/>
        </dia:attribute>
        <dia:attribute name="fill_colour">
          <dia:color val="#ffffff"/>
        </dia:attribute>
        <dia:attribute name="show_background">
          <dia:boolean val="true"/>
        </dia:attribute>
        <dia:attribute name="line_style">
          <dia:enum val="0"/>
          <dia:real val="1"/>
        </dia:attribute>
        <dia:attribute name="text">
          <dia:composite type="text">
            <dia:attribute name="string">
              <dia:string>#deref
int@#</dia:string>
            </dia:attribute>
            <dia:attribute name="font">
              <dia:font family="sans" style="0" name="Helvetica"/>
            </dia:attribute>
            <dia:attribute name="height">
              <dia:real val="1"/>
            </dia:attribute>
            <dia:attribute name="pos">
              <dia:point val="31.2356,11.2364"/>
            </dia:attribute>
            <dia:attribute name="color">
              <dia:color val="#000000"/>
            </dia:attribute>
            <dia:attribute name="alignment">
              <dia:enum val="1"/>
            </dia:attribute>
          </dia:composite>
        </dia:attribute>
        <dia:attribute name="flip_horizontal">
          <dia:boolean val="false"/>
        </dia:attribute>
        <dia:attribute name="flip_vertical">
          <dia:boolean val="false"/>
        </dia:attribute>
      </dia:object>
      <dia:object type="SDL - Task" version="0" id="O15">
        <dia:attribute name="obj_pos">
          <dia:point val="34.1154,14.7"/>
        </dia:attribute>
        <dia:attribute name="obj_bb">
          <dia:rectangle val="34.0654,14.65;37.6059,17.5571"/>
        </dia:attribute>
        <dia:attribute name="elem_corner">
          <dia:point val="34.1154,14.7"/>
        </dia:attribute>
        <dia:attribute name="elem_width">
          <dia:real val="3.440524101483184"/>
        </dia:attribute>
        <dia:attribute name="elem_height">
          <dia:real val="2.8071100000000002"/>
        </dia:attribute>
        <dia:attribute name="line_width">
          <dia:real val="0.10000000000000001"/>
        </dia:attribute>
        <dia:attribute name="line_colour">
          <dia:color val="#000000"/>
        </dia:attribute>
        <dia:attribute name="fill_colour">
          <dia:color val="#ffffff"/>
        </dia:attribute>
        <dia:attribute name="show_background">
          <dia:boolean val="true"/>
        </dia:attribute>
        <dia:attribute name="line_style">
          <dia:enum val="0"/>
          <dia:real val="1"/>
        </dia:attribute>
        <dia:attribute name="text">
          <dia:composite type="text">
            <dia:attribute name="string">
              <dia:string>#deref
int@#</dia:string>
            </dia:attribute>
            <dia:attribute name="font">
              <dia:font family="sans" style="0" name="Helvetica"/>
            </dia:attribute>
            <dia:attribute name="height">
              <dia:real val="1"/>
            </dia:attribute>
            <dia:attribute name="pos">
              <dia:point val="35.8356,15.8364"/>
            </dia:attribute>
            <dia:attribute name="color">
              <dia:color val="#000000"/>
            </dia:attribute>
            <dia:attribute name="alignment">
              <dia:enum val="1"/>
            </dia:attribute>
          </dia:composite>
        </dia:attribute>
        <dia:attribute name="flip_horizontal">
          <dia:boolean val="false"/>
        </dia:attribute>
        <dia:attribute name="flip_vertical">
          <dia:boolean val="false"/>
        </dia:attribute>
      </dia:object>
      <dia:object type="Standard - Line" version="0" id="O16">
        <dia:attribute name="obj_pos">
          <dia:point val="31.2356,10.1"/>
        </dia:attribute>
        <dia:attribute name="obj_bb">
          <dia:rectangle val="30.8407,7.73641;33.5126,10.4827"/>
        </dia:attribute>
        <dia:attribute name="conn_endpoints">
          <dia:point val="31.2356,10.1"/>
          <dia:point val="33.4419,7.80711"/>
        </dia:attribute>
        <dia:attribute name="numcp">
          <dia:int val="1"/>
        </dia:attribute>
        <dia:attribute name="start_arrow">
          <dia:enum val="22"/>
        </dia:attribute>
        <dia:attribute name="start_arrow_length">
          <dia:real val="0.5"/>
        </dia:attribute>
        <dia:attribute name="start_arrow_width">
          <dia:real val="0.5"/>
        </dia:attribute>
        <dia:connections>
          <dia:connection handle="0" to="O14" connection="0"/>
          <dia:connection handle="1" to="O13" connection="1"/>
        </dia:connections>
      </dia:object>
      <dia:object type="Standard - Line" version="0" id="O17">
        <dia:attribute name="obj_pos">
          <dia:point val="35.8357,10.05"/>
        </dia:attribute>
        <dia:attribute name="obj_bb">
          <dia:rectangle val="33.3712,7.73644;36.214,10.4491"/>
        </dia:attribute>
        <dia:attribute name="conn_endpoints">
          <dia:point val="35.8357,10.05"/>
          <dia:point val="33.4419,7.80711"/>
        </dia:attribute>
        <dia:attribute name="numcp">
          <dia:int val="1"/>
        </dia:attribute>
        <dia:attribute name="start_arrow">
          <dia:enum val="22"/>
        </dia:attribute>
        <dia:attribute name="start_arrow_length">
          <dia:real val="0.5"/>
        </dia:attribute>
        <dia:attribute name="start_arrow_width">
          <dia:real val="0.5"/>
        </dia:attribute>
        <dia:connections>
          <dia:connection handle="0" to="O18" connection="0"/>
          <dia:connection handle="1" to="O13" connection="1"/>
        </dia:connections>
      </dia:object>
      <dia:object type="SDL - Task" version="0" id="O18">
        <dia:attribute name="obj_pos">
          <dia:point val="34.3,10.05"/>
        </dia:attribute>
        <dia:attribute name="obj_bb">
          <dia:rectangle val="34.25,10;37.4214,12.9071"/>
        </dia:attribute>
        <dia:attribute name="elem_corner">
          <dia:point val="34.3,10.05"/>
        </dia:attribute>
        <dia:attribute name="elem_width">
          <dia:real val="3.07138"/>
        </dia:attribute>
        <dia:attribute name="elem_height">
          <dia:real val="2.8071100000000002"/>
        </dia:attribute>
        <dia:attribute name="line_width">
          <dia:real val="0.10000000000000001"/>
        </dia:attribute>
        <dia:attribute name="line_colour">
          <dia:color val="#000000"/>
        </dia:attribute>
        <dia:attribute name="fill_colour">
          <dia:color val="#ffffff"/>
        </dia:attribute>
        <dia:attribute name="show_background">
          <dia:boolean val="true"/>
        </dia:attribute>
        <dia:attribute name="line_style">
          <dia:enum val="0"/>
          <dia:real val="1"/>
        </dia:attribute>
        <dia:attribute name="text">
          <dia:composite type="text">
            <dia:attribute name="string">
              <dia:string>#get
int#</dia:string>
            </dia:attribute>
            <dia:attribute name="font">
              <dia:font family="sans" style="0" name="Helvetica"/>
            </dia:attribute>
            <dia:attribute name="height">
              <dia:real val="1"/>
            </dia:attribute>
            <dia:attribute name="pos">
              <dia:point val="35.8357,11.1864"/>
            </dia:attribute>
            <dia:attribute name="color">
              <dia:color val="#000000"/>
            </dia:attribute>
            <dia:attribute name="alignment">
              <dia:enum val="1"/>
            </dia:attribute>
          </dia:composite>
        </dia:attribute>
        <dia:attribute name="flip_horizontal">
          <dia:boolean val="false"/>
        </dia:attribute>
        <dia:attribute name="flip_vertical">
          <dia:boolean val="false"/>
        </dia:attribute>
      </dia:object>
      <dia:object type="Standard - Line" version="0" id="O19">
        <dia:attribute name="obj_pos">
          <dia:point val="35.8356,14.7"/>
        </dia:attribute>
        <dia:attribute name="obj_bb">
          <dia:rectangle val="35.3356,12.8071;36.3356,14.75"/>
        </dia:attribute>
        <dia:attribute name="conn_endpoints">
          <dia:point val="35.8356,14.7"/>
          <dia:point val="35.8357,12.8571"/>
        </dia:attribute>
        <dia:attribute name="numcp">
          <dia:int val="1"/>
        </dia:attribute>
        <dia:attribute name="start_arrow">
          <dia:enum val="22"/>
        </dia:attribute>
        <dia:attribute name="start_arrow_length">
          <dia:real val="0.5"/>
        </dia:attribute>
        <dia:attribute name="start_arrow_width">
          <dia:real val="0.5"/>
        </dia:attribute>
        <dia:connections>
          <dia:connection handle="0" to="O15" connection="0"/>
          <dia:connection handle="1" to="O18" connection="1"/>
        </dia:connections>
      </dia:object>
      <dia:object type="SDL - Task" version="0" id="O20">
        <dia:attribute name="obj_pos">
          <dia:point val="28.9289,19.2"/>
        </dia:attribute>
        <dia:attribute name="obj_bb">
          <dia:rectangle val="28.8789,19.15;33.5923,22.0571"/>
        </dia:attribute>
        <dia:attribute name="elem_corner">
          <dia:point val="28.9289,19.2"/>
        </dia:attribute>
        <dia:attribute name="elem_width">
          <dia:real val="4.6133756639831844"/>
        </dia:attribute>
        <dia:attribute name="elem_height">
          <dia:real val="2.8071100000000002"/>
        </dia:attribute>
        <dia:attribute name="line_width">
          <dia:real val="0.10000000000000001"/>
        </dia:attribute>
        <dia:attribute name="line_colour">
          <dia:color val="#000000"/>
        </dia:attribute>
        <dia:attribute name="fill_colour">
          <dia:color val="#ffffff"/>
        </dia:attribute>
        <dia:attribute name="show_background">
          <dia:boolean val="true"/>
        </dia:attribute>
        <dia:attribute name="line_style">
          <dia:enum val="0"/>
          <dia:real val="1"/>
        </dia:attribute>
        <dia:attribute name="text">
          <dia:composite type="text">
            <dia:attribute name="string">
              <dia:string>#VR a
(int*)@#</dia:string>
            </dia:attribute>
            <dia:attribute name="font">
              <dia:font family="sans" style="0" name="Helvetica"/>
            </dia:attribute>
            <dia:attribute name="height">
              <dia:real val="1"/>
            </dia:attribute>
            <dia:attribute name="pos">
              <dia:point val="31.2356,20.3364"/>
            </dia:attribute>
            <dia:attribute name="color">
              <dia:color val="#000000"/>
            </dia:attribute>
            <dia:attribute name="alignment">
              <dia:enum val="1"/>
            </dia:attribute>
          </dia:composite>
        </dia:attribute>
        <dia:attribute name="flip_horizontal">
          <dia:boolean val="false"/>
        </dia:attribute>
        <dia:attribute name="flip_vertical">
          <dia:boolean val="false"/>
        </dia:attribute>
      </dia:object>
      <dia:object type="SDL - Task" version="0" id="O21">
        <dia:attribute name="obj_pos">
          <dia:point val="29.75,14.65"/>
        </dia:attribute>
        <dia:attribute name="obj_bb">
          <dia:rectangle val="29.7,14.6;32.8714,17.5071"/>
        </dia:attribute>
        <dia:attribute name="elem_corner">
          <dia:point val="29.75,14.65"/>
        </dia:attribute>
        <dia:attribute name="elem_width">
          <dia:real val="3.07138"/>
        </dia:attribute>
        <dia:attribute name="elem_height">
          <dia:real val="2.8071100000000002"/>
        </dia:attribute>
        <dia:attribute name="line_width">
          <dia:real val="0.10000000000000001"/>
        </dia:attribute>
        <dia:attribute name="line_colour">
          <dia:color val="#000000"/>
        </dia:attribute>
        <dia:attribute name="fill_colour">
          <dia:color val="#ffffff"/>
        </dia:attribute>
        <dia:attribute name="show_background">
          <dia:boolean val="true"/>
        </dia:attribute>
        <dia:attribute name="line_style">
          <dia:enum val="0"/>
          <dia:real val="1"/>
        </dia:attribute>
        <dia:attribute name="text">
          <dia:composite type="text">
            <dia:attribute name="string">
              <dia:string>#get
int*#</dia:string>
            </dia:attribute>
            <dia:attribute name="font">
              <dia:font family="sans" style="0" name="Helvetica"/>
            </dia:attribute>
            <dia:attribute name="height">
              <dia:real val="1"/>
            </dia:attribute>
            <dia:attribute name="pos">
              <dia:point val="31.2857,15.7864"/>
            </dia:attribute>
            <dia:attribute name="color">
              <dia:color val="#000000"/>
            </dia:attribute>
            <dia:attribute name="alignment">
              <dia:enum val="1"/>
            </dia:attribute>
          </dia:composite>
        </dia:attribute>
        <dia:attribute name="flip_horizontal">
          <dia:boolean val="false"/>
        </dia:attribute>
        <dia:attribute name="flip_vertical">
          <dia:boolean val="false"/>
        </dia:attribute>
      </dia:object>
      <dia:object type="SDL - Task" version="0" id="O22">
        <dia:attribute name="obj_pos">
          <dia:point val="34.35,19.25"/>
        </dia:attribute>
        <dia:attribute name="obj_bb">
          <dia:rectangle val="34.3,19.2;37.4714,22.1071"/>
        </dia:attribute>
        <dia:attribute name="elem_corner">
          <dia:point val="34.35,19.25"/>
        </dia:attribute>
        <dia:attribute name="elem_width">
          <dia:real val="3.07138"/>
        </dia:attribute>
        <dia:attribute name="elem_height">
          <dia:real val="2.8071100000000002"/>
        </dia:attribute>
        <dia:attribute name="line_width">
          <dia:real val="0.10000000000000001"/>
        </dia:attribute>
        <dia:attribute name="line_colour">
          <dia:color val="#000000"/>
        </dia:attribute>
        <dia:attribute name="fill_colour">
          <dia:color val="#ffffff"/>
        </dia:attribute>
        <dia:attribute name="show_background">
          <dia:boolean val="true"/>
        </dia:attribute>
        <dia:attribute name="line_style">
          <dia:enum val="0"/>
          <dia:real val="1"/>
        </dia:attribute>
        <dia:attribute name="text">
          <dia:composite type="text">
            <dia:attribute name="string">
              <dia:string>#get
int*#</dia:string>
            </dia:attribute>
            <dia:attribute name="font">
              <dia:font family="sans" style="0" name="Helvetica"/>
            </dia:attribute>
            <dia:attribute name="height">
              <dia:real val="1"/>
            </dia:attribute>
            <dia:attribute name="pos">
              <dia:point val="35.8857,20.3864"/>
            </dia:attribute>
            <dia:attribute name="color">
              <dia:color val="#000000"/>
            </dia:attribute>
            <dia:attribute name="alignment">
              <dia:enum val="1"/>
            </dia:attribute>
          </dia:composite>
        </dia:attribute>
        <dia:attribute name="flip_horizontal">
          <dia:boolean val="false"/>
        </dia:attribute>
        <dia:attribute name="flip_vertical">
          <dia:boolean val="false"/>
        </dia:attribute>
      </dia:object>
      <dia:object type="SDL - Task" version="0" id="O23">
        <dia:attribute name="obj_pos">
          <dia:point val="33.629,23.55"/>
        </dia:attribute>
        <dia:attribute name="obj_bb">
          <dia:rectangle val="33.579,23.5;38.2924,26.4071"/>
        </dia:attribute>
        <dia:attribute name="elem_corner">
          <dia:point val="33.629,23.55"/>
        </dia:attribute>
        <dia:attribute name="elem_width">
          <dia:real val="4.6133756639831844"/>
        </dia:attribute>
        <dia:attribute name="elem_height">
          <dia:real val="2.8071100000000002"/>
        </dia:attribute>
        <dia:attribute name="line_width">
          <dia:real val="0.10000000000000001"/>
        </dia:attribute>
        <dia:attribute name="line_colour">
          <dia:color val="#000000"/>
        </dia:attribute>
        <dia:attribute name="fill_colour">
          <dia:color val="#ffffff"/>
        </dia:attribute>
        <dia:attribute name="show_background">
          <dia:boolean val="true"/>
        </dia:attribute>
        <dia:attribute name="line_style">
          <dia:enum val="0"/>
          <dia:real val="1"/>
        </dia:attribute>
        <dia:attribute name="text">
          <dia:composite type="text">
            <dia:attribute name="string">
              <dia:string>#VR a
(int*)@#</dia:string>
            </dia:attribute>
            <dia:attribute name="font">
              <dia:font family="sans" style="0" name="Helvetica"/>
            </dia:attribute>
            <dia:attribute name="height">
              <dia:real val="1"/>
            </dia:attribute>
            <dia:attribute name="pos">
              <dia:point val="35.9357,24.6864"/>
            </dia:attribute>
            <dia:attribute name="color">
              <dia:color val="#000000"/>
            </dia:attribute>
            <dia:attribute name="alignment">
              <dia:enum val="1"/>
            </dia:attribute>
          </dia:composite>
        </dia:attribute>
        <dia:attribute name="flip_horizontal">
          <dia:boolean val="false"/>
        </dia:attribute>
        <dia:attribute name="flip_vertical">
          <dia:boolean val="false"/>
        </dia:attribute>
      </dia:object>
      <dia:object type="Standard - Line" version="0" id="O24">
        <dia:attribute name="obj_pos">
          <dia:point val="31.2857,14.65"/>
        </dia:attribute>
        <dia:attribute name="obj_bb">
          <dia:rectangle val="30.7845,12.8557;31.7869,14.7143"/>
        </dia:attribute>
        <dia:attribute name="conn_endpoints">
          <dia:point val="31.2857,14.65"/>
          <dia:point val="31.2356,12.9071"/>
        </dia:attribute>
        <dia:attribute name="numcp">
          <dia:int val="1"/>
        </dia:attribute>
        <dia:attribute name="start_arrow">
          <dia:enum val="22"/>
        </dia:attribute>
        <dia:attribute name="start_arrow_length">
          <dia:real val="0.5"/>
        </dia:attribute>
        <dia:attribute name="start_arrow_width">
          <dia:real val="0.5"/>
        </dia:attribute>
        <dia:connections>
          <dia:connection handle="0" to="O21" connection="0"/>
          <dia:connection handle="1" to="O14" connection="1"/>
        </dia:connections>
      </dia:object>
      <dia:object type="Standard - Line" version="0" id="O25">
        <dia:attribute name="obj_pos">
          <dia:point val="31.2356,19.2"/>
        </dia:attribute>
        <dia:attribute name="obj_bb">
          <dia:rectangle val="30.7344,17.4057;31.7368,19.2643"/>
        </dia:attribute>
        <dia:attribute name="conn_endpoints">
          <dia:point val="31.2356,19.2"/>
          <dia:point val="31.2857,17.4571"/>
        </dia:attribute>
        <dia:attribute name="numcp">
          <dia:int val="1"/>
        </dia:attribute>
        <dia:attribute name="start_arrow">
          <dia:enum val="22"/>
        </dia:attribute>
        <dia:attribute name="start_arrow_length">
          <dia:real val="0.5"/>
        </dia:attribute>
        <dia:attribute name="start_arrow_width">
          <dia:real val="0.5"/>
        </dia:attribute>
        <dia:connections>
          <dia:connection handle="0" to="O20" connection="0"/>
          <dia:connection handle="1" to="O21" connection="1"/>
        </dia:connections>
      </dia:object>
      <dia:object type="Standard - Line" version="0" id="O26">
        <dia:attribute name="obj_pos">
          <dia:point val="35.8857,19.25"/>
        </dia:attribute>
        <dia:attribute name="obj_bb">
          <dia:rectangle val="35.3845,17.4557;36.3869,19.3143"/>
        </dia:attribute>
        <dia:attribute name="conn_endpoints">
          <dia:point val="35.8857,19.25"/>
          <dia:point val="35.8356,17.5071"/>
        </dia:attribute>
        <dia:attribute name="numcp">
          <dia:int val="1"/>
        </dia:attribute>
        <dia:attribute name="start_arrow">
          <dia:enum val="22"/>
        </dia:attribute>
        <dia:attribute name="start_arrow_length">
          <dia:real val="0.5"/>
        </dia:attribute>
        <dia:attribute name="start_arrow_width">
          <dia:real val="0.5"/>
        </dia:attribute>
        <dia:connections>
          <dia:connection handle="0" to="O22" connection="0"/>
          <dia:connection handle="1" to="O15" connection="1"/>
        </dia:connections>
      </dia:object>
      <dia:object type="Standard - Line" version="0" id="O27">
        <dia:attribute name="obj_pos">
          <dia:point val="35.9357,23.55"/>
        </dia:attribute>
        <dia:attribute name="obj_bb">
          <dia:rectangle val="35.4343,22.0055;36.4371,23.6167"/>
        </dia:attribute>
        <dia:attribute name="conn_endpoints">
          <dia:point val="35.9357,23.55"/>
          <dia:point val="35.8857,22.0571"/>
        </dia:attribute>
        <dia:attribute name="numcp">
          <dia:int val="1"/>
        </dia:attribute>
        <dia:attribute name="start_arrow">
          <dia:enum val="22"/>
        </dia:attribute>
        <dia:attribute name="start_arrow_length">
          <dia:real val="0.5"/>
        </dia:attribute>
        <dia:attribute name="start_arrow_width">
          <dia:real val="0.5"/>
        </dia:attribute>
        <dia:connections>
          <dia:connection handle="0" to="O23" connection="0"/>
          <dia:connection handle="1" to="O22" connection="1"/>
        </dia:connections>
      </dia:object>
      <dia:object type="Standard - Text" version="0" id="O28">
        <dia:attribute name="obj_pos">
          <dia:point val="30,0"/>
        </dia:attribute>
        <dia:attribute name="obj_bb">
          <dia:rectangle val="30,-0.879687;30.8992,0.503906"/>
        </dia:attribute>
        <dia:attribute name="text">
          <dia:composite type="text">
            <dia:attribute name="string">
              <dia:string>#3.#</dia:string>
            </dia:attribute>
            <dia:attribute name="font">
              <dia:font family="sans" style="0" name="Helvetica"/>
            </dia:attribute>
            <dia:attribute name="height">
              <dia:real val="1.2"/>
            </dia:attribute>
            <dia:attribute name="pos">
              <dia:point val="30,0"/>
            </dia:attribute>
            <dia:attribute name="color">
              <dia:color val="#000000"/>
            </dia:attribute>
            <dia:attribute name="alignment">
              <dia:enum val="0"/>
            </dia:attribute>
          </dia:composite>
        </dia:attribute>
      </dia:object>
      <dia:object type="Standard - Text" version="0" id="O29">
        <dia:attribute name="obj_pos">
          <dia:point val="37.6166,22.8524"/>
        </dia:attribute>
        <dia:attribute name="obj_bb">
          <dia:rectangle val="37.6166,22.2479;40.3546,23.2238"/>
        </dia:attribute>
        <dia:attribute name="text">
          <dia:composite type="text">
            <dia:attribute name="string">
              <dia:string>#pi_mem#</dia:string>
            </dia:attribute>
            <dia:attribute name="font">
              <dia:font family="sans" style="80" name="Helvetica"/>
            </dia:attribute>
            <dia:attribute name="height">
              <dia:real val="0.80000000000000004"/>
            </dia:attribute>
            <dia:attribute name="pos">
              <dia:point val="37.6166,22.8524"/>
            </dia:attribute>
            <dia:attribute name="color">
              <dia:color val="#000000"/>
            </dia:attribute>
            <dia:attribute name="alignment">
              <dia:enum val="0"/>
            </dia:attribute>
          </dia:composite>
        </dia:attribute>
      </dia:object>
      <dia:object type="Standard - Text" version="0" id="O30">
        <dia:attribute name="obj_pos">
          <dia:point val="37.5,18.5"/>
        </dia:attribute>
        <dia:attribute name="obj_bb">
          <dia:rectangle val="37.5,17.8955;40.1052,18.8714"/>
        </dia:attribute>
        <dia:attribute name="text">
          <dia:composite type="text">
            <dia:attribute name="string">
              <dia:string>#pi_preg#</dia:string>
            </dia:attribute>
            <dia:attribute name="font">
              <dia:font family="sans" style="80" name="Helvetica"/>
            </dia:attribute>
            <dia:attribute name="height">
              <dia:real val="0.80000000000000004"/>
            </dia:attribute>
            <dia:attribute name="pos">
              <dia:point val="37.5,18.5"/>
            </dia:attribute>
            <dia:attribute name="color">
              <dia:color val="#000000"/>
            </dia:attribute>
            <dia:attribute name="alignment">
              <dia:enum val="0"/>
            </dia:attribute>
          </dia:composite>
        </dia:attribute>
      </dia:object>
      <dia:object type="Standard - Text" version="0" id="O31">
        <dia:attribute name="obj_pos">
          <dia:point val="35.8387,8.845"/>
        </dia:attribute>
        <dia:attribute name="obj_bb">
          <dia:rectangle val="35.8387,8.24055;38.4439,9.21641"/>
        </dia:attribute>
        <dia:attribute name="text">
          <dia:composite type="text">
            <dia:attribute name="string">
              <dia:string>#pi_preg#</dia:string>
            </dia:attribute>
            <dia:attribute name="font">
              <dia:font family="sans" style="80" name="Helvetica"/>
            </dia:attribute>
            <dia:attribute name="height">
              <dia:real val="0.80000000000000004"/>
            </dia:attribute>
            <dia:attribute name="pos">
              <dia:point val="35.8387,8.845"/>
            </dia:attribute>
            <dia:attribute name="color">
              <dia:color val="#000000"/>
            </dia:attribute>
            <dia:attribute name="alignment">
              <dia:enum val="0"/>
            </dia:attribute>
          </dia:composite>
        </dia:attribute>
      </dia:object>
      <dia:object type="Standard - Text" version="0" id="O32">
        <dia:attribute name="obj_pos">
          <dia:point val="34.6387,4.495"/>
        </dia:attribute>
        <dia:attribute name="obj_bb">
          <dia:rectangle val="34.6387,3.90828;37.359,4.83094"/>
        </dia:attribute>
        <dia:attribute name="text">
          <dia:composite type="text">
            <dia:attribute name="string">
              <dia:string>#pi_mem#</dia:string>
            </dia:attribute>
            <dia:attribute name="font">
              <dia:font family="sans" style="80" name="Helvetica"/>
            </dia:attribute>
            <dia:attribute name="height">
              <dia:real val="0.80000000000000004"/>
            </dia:attribute>
            <dia:attribute name="pos">
              <dia:point val="34.6387,4.495"/>
            </dia:attribute>
            <dia:attribute name="color">
              <dia:color val="#000000"/>
            </dia:attribute>
            <dia:attribute name="alignment">
              <dia:enum val="0"/>
            </dia:attribute>
          </dia:composite>
        </dia:attribute>
      </dia:object>
      <dia:object type="Standard - Line" version="0" id="O33">
        <dia:attribute name="obj_pos">
          <dia:point val="33.4419,5"/>
        </dia:attribute>
        <dia:attribute name="obj_bb">
          <dia:rectangle val="32.9416,3.82977;33.9422,5.05362"/>
        </dia:attribute>
        <dia:attribute name="conn_endpoints">
          <dia:point val="33.4419,5"/>
          <dia:point val="33.45,3.88013"/>
        </dia:attribute>
        <dia:attribute name="numcp">
          <dia:int val="1"/>
        </dia:attribute>
        <dia:attribute name="start_arrow">
          <dia:enum val="22"/>
        </dia:attribute>
        <dia:attribute name="start_arrow_length">
          <dia:real val="0.5"/>
        </dia:attribute>
        <dia:attribute name="start_arrow_width">
          <dia:real val="0.5"/>
        </dia:attribute>
        <dia:connections>
          <dia:connection handle="0" to="O13" connection="0"/>
        </dia:connections>
      </dia:object>
    </dia:group>
    <dia:group>
      <dia:object type="Standard - Text" version="0" id="O34">
        <dia:attribute name="obj_pos">
          <dia:point val="10.3,13.85"/>
        </dia:attribute>
        <dia:attribute name="obj_bb">
          <dia:rectangle val="10.3,13.2455;13.038,14.2214"/>
        </dia:attribute>
        <dia:attribute name="text">
          <dia:composite type="text">
            <dia:attribute name="string">
              <dia:string>#pi_mem#</dia:string>
            </dia:attribute>
            <dia:attribute name="font">
              <dia:font family="sans" style="80" name="Helvetica"/>
            </dia:attribute>
            <dia:attribute name="height">
              <dia:real val="0.80000000000000004"/>
            </dia:attribute>
            <dia:attribute name="pos">
              <dia:point val="10.3,13.85"/>
            </dia:attribute>
            <dia:attribute name="color">
              <dia:color val="#000000"/>
            </dia:attribute>
            <dia:attribute name="alignment">
              <dia:enum val="0"/>
            </dia:attribute>
          </dia:composite>
        </dia:attribute>
      </dia:object>
      <dia:object type="UML - Note" version="0" id="O35">
        <dia:attribute name="obj_pos">
          <dia:point val="4.41125,-0.895"/>
        </dia:attribute>
        <dia:attribute name="obj_bb">
          <dia:rectangle val="4.36125,-0.945;8.96125,2.055"/>
        </dia:attribute>
        <dia:attribute name="elem_corner">
          <dia:point val="4.41125,-0.895"/>
        </dia:attribute>
        <dia:attribute name="elem_width">
          <dia:real val="4.5"/>
        </dia:attribute>
        <dia:attribute name="elem_height">
          <dia:real val="2.8999999999999999"/>
        </dia:attribute>
        <dia:attribute name="line_colour">
          <dia:color val="#000000"/>
        </dia:attribute>
        <dia:attribute name="fill_colour">
          <dia:color val="#ffffff"/>
        </dia:attribute>
        <dia:attribute name="text">
          <dia:composite type="text">
            <dia:attribute name="string">
              <dia:string>#int a,b;
a=b;#</dia:string>
            </dia:attribute>
            <dia:attribute name="font">
              <dia:font family="monospace" style="0" name="Courier"/>
            </dia:attribute>
            <dia:attribute name="height">
              <dia:real val="1"/>
            </dia:attribute>
            <dia:attribute name="pos">
              <dia:point val="4.76125,0.415937"/>
            </dia:attribute>
            <dia:attribute name="color">
              <dia:color val="#000000"/>
            </dia:attribute>
            <dia:attribute name="alignment">
              <dia:enum val="0"/>
            </dia:attribute>
          </dia:composite>
        </dia:attribute>
      </dia:object>
      <dia:object type="SDL - Task" version="0" id="O36">
        <dia:attribute name="obj_pos">
          <dia:point val="4.57013,5.155"/>
        </dia:attribute>
        <dia:attribute name="obj_bb">
          <dia:rectangle val="4.52013,5.105;7.78625,8.01211"/>
        </dia:attribute>
        <dia:attribute name="elem_corner">
          <dia:point val="4.57013,5.155"/>
        </dia:attribute>
        <dia:attribute name="elem_width">
          <dia:real val="3.1661100389831844"/>
        </dia:attribute>
        <dia:attribute name="elem_height">
          <dia:real val="2.8071100000000002"/>
        </dia:attribute>
        <dia:attribute name="line_width">
          <dia:real val="0.10000000000000001"/>
        </dia:attribute>
        <dia:attribute name="line_colour">
          <dia:color val="#000000"/>
        </dia:attribute>
        <dia:attribute name="fill_colour">
          <dia:color val="#ffffff"/>
        </dia:attribute>
        <dia:attribute name="show_background">
          <dia:boolean val="true"/>
        </dia:attribute>
        <dia:attribute name="line_style">
          <dia:enum val="0"/>
          <dia:real val="1"/>
        </dia:attribute>
        <dia:attribute name="text">
          <dia:composite type="text">
            <dia:attribute name="string">
              <dia:string>#=
int@#</dia:string>
            </dia:attribute>
            <dia:attribute name="font">
              <dia:font family="sans" style="0" name="Helvetica"/>
            </dia:attribute>
            <dia:attribute name="height">
              <dia:real val="1"/>
            </dia:attribute>
            <dia:attribute name="pos">
              <dia:point val="6.15319,6.29137"/>
            </dia:attribute>
            <dia:attribute name="color">
              <dia:color val="#000000"/>
            </dia:attribute>
            <dia:attribute name="alignment">
              <dia:enum val="1"/>
            </dia:attribute>
          </dia:composite>
        </dia:attribute>
        <dia:attribute name="flip_horizontal">
          <dia:boolean val="false"/>
        </dia:attribute>
        <dia:attribute name="flip_vertical">
          <dia:boolean val="false"/>
        </dia:attribute>
      </dia:object>
      <dia:object type="SDL - Task" version="0" id="O37">
        <dia:attribute name="obj_pos">
          <dia:point val="2.49924,10.055"/>
        </dia:attribute>
        <dia:attribute name="obj_bb">
          <dia:rectangle val="2.44924,10.005;5.74464,12.9121"/>
        </dia:attribute>
        <dia:attribute name="elem_corner">
          <dia:point val="2.49924,10.055"/>
        </dia:attribute>
        <dia:attribute name="elem_width">
          <dia:real val="3.1954069139831849"/>
        </dia:attribute>
        <dia:attribute name="elem_height">
          <dia:real val="2.8071100000000002"/>
        </dia:attribute>
        <dia:attribute name="line_width">
          <dia:real val="0.10000000000000001"/>
        </dia:attribute>
        <dia:attribute name="line_colour">
          <dia:color val="#000000"/>
        </dia:attribute>
        <dia:attribute name="fill_colour">
          <dia:color val="#ffffff"/>
        </dia:attribute>
        <dia:attribute name="show_background">
          <dia:boolean val="true"/>
        </dia:attribute>
        <dia:attribute name="line_style">
          <dia:enum val="0"/>
          <dia:real val="1"/>
        </dia:attribute>
        <dia:attribute name="text">
          <dia:composite type="text">
            <dia:attribute name="string">
              <dia:string>#VR a
int@#</dia:string>
            </dia:attribute>
            <dia:attribute name="font">
              <dia:font family="sans" style="0" name="Helvetica"/>
            </dia:attribute>
            <dia:attribute name="height">
              <dia:real val="1"/>
            </dia:attribute>
            <dia:attribute name="pos">
              <dia:point val="4.09694,11.1914"/>
            </dia:attribute>
            <dia:attribute name="color">
              <dia:color val="#000000"/>
            </dia:attribute>
            <dia:attribute name="alignment">
              <dia:enum val="1"/>
            </dia:attribute>
          </dia:composite>
        </dia:attribute>
        <dia:attribute name="flip_horizontal">
          <dia:boolean val="false"/>
        </dia:attribute>
        <dia:attribute name="flip_vertical">
          <dia:boolean val="false"/>
        </dia:attribute>
      </dia:object>
      <dia:object type="SDL - Task" version="0" id="O38">
        <dia:attribute name="obj_pos">
          <dia:point val="7.03898,14.655"/>
        </dia:attribute>
        <dia:attribute name="obj_bb">
          <dia:rectangle val="6.98898,14.605;10.3049,17.5121"/>
        </dia:attribute>
        <dia:attribute name="elem_corner">
          <dia:point val="7.03898,14.655"/>
        </dia:attribute>
        <dia:attribute name="elem_width">
          <dia:real val="3.2159147264831849"/>
        </dia:attribute>
        <dia:attribute name="elem_height">
          <dia:real val="2.8071100000000002"/>
        </dia:attribute>
        <dia:attribute name="line_width">
          <dia:real val="0.10000000000000001"/>
        </dia:attribute>
        <dia:attribute name="line_colour">
          <dia:color val="#000000"/>
        </dia:attribute>
        <dia:attribute name="fill_colour">
          <dia:color val="#ffffff"/>
        </dia:attribute>
        <dia:attribute name="show_background">
          <dia:boolean val="true"/>
        </dia:attribute>
        <dia:attribute name="line_style">
          <dia:enum val="0"/>
          <dia:real val="1"/>
        </dia:attribute>
        <dia:attribute name="text">
          <dia:composite type="text">
            <dia:attribute name="string">
              <dia:string>#VR b
int@#</dia:string>
            </dia:attribute>
            <dia:attribute name="font">
              <dia:font family="sans" style="0" name="Helvetica"/>
            </dia:attribute>
            <dia:attribute name="height">
              <dia:real val="1"/>
            </dia:attribute>
            <dia:attribute name="pos">
              <dia:point val="8.64694,15.7914"/>
            </dia:attribute>
            <dia:attribute name="color">
              <dia:color val="#000000"/>
            </dia:attribute>
            <dia:attribute name="alignment">
              <dia:enum val="1"/>
            </dia:attribute>
          </dia:composite>
        </dia:attribute>
        <dia:attribute name="flip_horizontal">
          <dia:boolean val="false"/>
        </dia:attribute>
        <dia:attribute name="flip_vertical">
          <dia:boolean val="false"/>
        </dia:attribute>
      </dia:object>
      <dia:object type="Standard - Line" version="0" id="O39">
        <dia:attribute name="obj_pos">
          <dia:point val="4.09694,10.055"/>
        </dia:attribute>
        <dia:attribute name="obj_bb">
          <dia:rectangle val="3.70524,7.8914;6.2239,10.4411"/>
        </dia:attribute>
        <dia:attribute name="conn_endpoints">
          <dia:point val="4.09694,10.055"/>
          <dia:point val="6.15319,7.96211"/>
        </dia:attribute>
        <dia:attribute name="numcp">
          <dia:int val="1"/>
        </dia:attribute>
        <dia:attribute name="start_arrow">
          <dia:enum val="22"/>
        </dia:attribute>
        <dia:attribute name="start_arrow_length">
          <dia:real val="0.5"/>
        </dia:attribute>
        <dia:attribute name="start_arrow_width">
          <dia:real val="0.5"/>
        </dia:attribute>
        <dia:connections>
          <dia:connection handle="0" to="O37" connection="0"/>
          <dia:connection handle="1" to="O36" connection="1"/>
        </dia:connections>
      </dia:object>
      <dia:object type="Standard - Line" version="0" id="O40">
        <dia:attribute name="obj_pos">
          <dia:point val="8.69694,10.055"/>
        </dia:attribute>
        <dia:attribute name="obj_bb">
          <dia:rectangle val="6.08281,7.89173;9.05323,10.4729"/>
        </dia:attribute>
        <dia:attribute name="conn_endpoints">
          <dia:point val="8.69694,10.055"/>
          <dia:point val="6.15319,7.96211"/>
        </dia:attribute>
        <dia:attribute name="numcp">
          <dia:int val="1"/>
        </dia:attribute>
        <dia:attribute name="start_arrow">
          <dia:enum val="22"/>
        </dia:attribute>
        <dia:attribute name="start_arrow_length">
          <dia:real val="0.5"/>
        </dia:attribute>
        <dia:attribute name="start_arrow_width">
          <dia:real val="0.5"/>
        </dia:attribute>
        <dia:connections>
          <dia:connection handle="0" to="O41" connection="0"/>
          <dia:connection handle="1" to="O36" connection="1"/>
        </dia:connections>
      </dia:object>
      <dia:object type="SDL - Task" version="0" id="O41">
        <dia:attribute name="obj_pos">
          <dia:point val="7.16125,10.055"/>
        </dia:attribute>
        <dia:attribute name="obj_bb">
          <dia:rectangle val="7.11125,10.005;10.2826,12.9121"/>
        </dia:attribute>
        <dia:attribute name="elem_corner">
          <dia:point val="7.16125,10.055"/>
        </dia:attribute>
        <dia:attribute name="elem_width">
          <dia:real val="3.07138"/>
        </dia:attribute>
        <dia:attribute name="elem_height">
          <dia:real val="2.8071100000000002"/>
        </dia:attribute>
        <dia:attribute name="line_width">
          <dia:real val="0.10000000000000001"/>
        </dia:attribute>
        <dia:attribute name="line_colour">
          <dia:color val="#000000"/>
        </dia:attribute>
        <dia:attribute name="fill_colour">
          <dia:color val="#ffffff"/>
        </dia:attribute>
        <dia:attribute name="show_background">
          <dia:boolean val="true"/>
        </dia:attribute>
        <dia:attribute name="line_style">
          <dia:enum val="0"/>
          <dia:real val="1"/>
        </dia:attribute>
        <dia:attribute name="text">
          <dia:composite type="text">
            <dia:attribute name="string">
              <dia:string>#get
int#</dia:string>
            </dia:attribute>
            <dia:attribute name="font">
              <dia:font family="sans" style="0" name="Helvetica"/>
            </dia:attribute>
            <dia:attribute name="height">
              <dia:real val="1"/>
            </dia:attribute>
            <dia:attribute name="pos">
              <dia:point val="8.69694,11.1914"/>
            </dia:attribute>
            <dia:attribute name="color">
              <dia:color val="#000000"/>
            </dia:attribute>
            <dia:attribute name="alignment">
              <dia:enum val="1"/>
            </dia:attribute>
          </dia:composite>
        </dia:attribute>
        <dia:attribute name="flip_horizontal">
          <dia:boolean val="false"/>
        </dia:attribute>
        <dia:attribute name="flip_vertical">
          <dia:boolean val="false"/>
        </dia:attribute>
      </dia:object>
      <dia:object type="Standard - Line" version="0" id="O42">
        <dia:attribute name="obj_pos">
          <dia:point val="8.64694,14.655"/>
        </dia:attribute>
        <dia:attribute name="obj_bb">
          <dia:rectangle val="8.14574,12.8107;9.14814,14.7189"/>
        </dia:attribute>
        <dia:attribute name="conn_endpoints">
          <dia:point val="8.64694,14.655"/>
          <dia:point val="8.69694,12.8621"/>
        </dia:attribute>
        <dia:attribute name="numcp">
          <dia:int val="1"/>
        </dia:attribute>
        <dia:attribute name="start_arrow">
          <dia:enum val="22"/>
        </dia:attribute>
        <dia:attribute name="start_arrow_length">
          <dia:real val="0.5"/>
        </dia:attribute>
        <dia:attribute name="start_arrow_width">
          <dia:real val="0.5"/>
        </dia:attribute>
        <dia:connections>
          <dia:connection handle="0" to="O38" connection="0"/>
          <dia:connection handle="1" to="O41" connection="1"/>
        </dia:connections>
      </dia:object>
      <dia:object type="Standard - Text" version="0" id="O43">
        <dia:attribute name="obj_pos">
          <dia:point val="3.36125,0.105"/>
        </dia:attribute>
        <dia:attribute name="obj_bb">
          <dia:rectangle val="3.33467,-0.80127;4.26047,0.66207"/>
        </dia:attribute>
        <dia:attribute name="text">
          <dia:composite type="text">
            <dia:attribute name="string">
              <dia:string>#1.#</dia:string>
            </dia:attribute>
            <dia:attribute name="font">
              <dia:font family="sans" style="0" name="Helvetica"/>
            </dia:attribute>
            <dia:attribute name="height">
              <dia:real val="1.2"/>
            </dia:attribute>
            <dia:attribute name="pos">
              <dia:point val="3.36125,0.105"/>
            </dia:attribute>
            <dia:attribute name="color">
              <dia:color val="#000000"/>
            </dia:attribute>
            <dia:attribute name="alignment">
              <dia:enum val="0"/>
            </dia:attribute>
          </dia:composite>
        </dia:attribute>
      </dia:object>
      <dia:object type="Standard - Text" version="0" id="O44">
        <dia:attribute name="obj_pos">
          <dia:point val="8.25,8.75"/>
        </dia:attribute>
        <dia:attribute name="obj_bb">
          <dia:rectangle val="8.25,8.14555;10.8552,9.12141"/>
        </dia:attribute>
        <dia:attribute name="text">
          <dia:composite type="text">
            <dia:attribute name="string">
              <dia:string>#pi_preg#</dia:string>
            </dia:attribute>
            <dia:attribute name="font">
              <dia:font family="sans" style="80" name="Helvetica"/>
            </dia:attribute>
            <dia:attribute name="height">
              <dia:real val="0.80000000000000004"/>
            </dia:attribute>
            <dia:attribute name="pos">
              <dia:point val="8.25,8.75"/>
            </dia:attribute>
            <dia:attribute name="color">
              <dia:color val="#000000"/>
            </dia:attribute>
            <dia:attribute name="alignment">
              <dia:enum val="0"/>
            </dia:attribute>
          </dia:composite>
        </dia:attribute>
      </dia:object>
      <dia:object type="Standard - Line" version="0" id="O45">
        <dia:attribute name="obj_pos">
          <dia:point val="6.15319,5.155"/>
        </dia:attribute>
        <dia:attribute name="obj_bb">
          <dia:rectangle val="5.65216,3.89489;6.65422,5.21664"/>
        </dia:attribute>
        <dia:attribute name="conn_endpoints">
          <dia:point val="6.15319,5.155"/>
          <dia:point val="6.125,3.94604"/>
        </dia:attribute>
        <dia:attribute name="numcp">
          <dia:int val="1"/>
        </dia:attribute>
        <dia:attribute name="start_arrow">
          <dia:enum val="22"/>
        </dia:attribute>
        <dia:attribute name="start_arrow_length">
          <dia:real val="0.5"/>
        </dia:attribute>
        <dia:attribute name="start_arrow_width">
          <dia:real val="0.5"/>
        </dia:attribute>
        <dia:connections>
          <dia:connection handle="0" to="O36" connection="0"/>
        </dia:connections>
      </dia:object>
      <dia:object type="Standard - Text" version="0" id="O46">
        <dia:attribute name="obj_pos">
          <dia:point val="7.25,4.65"/>
        </dia:attribute>
        <dia:attribute name="obj_bb">
          <dia:rectangle val="7.25,4.06328;9.97031,4.98594"/>
        </dia:attribute>
        <dia:attribute name="text">
          <dia:composite type="text">
            <dia:attribute name="string">
              <dia:string>#pi_mem#</dia:string>
            </dia:attribute>
            <dia:attribute name="font">
              <dia:font family="sans" style="80" name="Helvetica"/>
            </dia:attribute>
            <dia:attribute name="height">
              <dia:real val="0.80000000000000004"/>
            </dia:attribute>
            <dia:attribute name="pos">
              <dia:point val="7.25,4.65"/>
            </dia:attribute>
            <dia:attribute name="color">
              <dia:color val="#000000"/>
            </dia:attribute>
            <dia:attribute name="alignment">
              <dia:enum val="0"/>
            </dia:attribute>
          </dia:composite>
        </dia:attribute>
      </dia:object>
    </dia:group>
  </dia:layer>
</dia:diagram>
