%!PS-Adobe-2.0 EPSF-2.0
%%Title: /home/jencek/projects/lestes/tla@twin/lestes--doc--0.0--patch-3/doc/lyx/pi_operand_hierarchy.dia
%%Creator: Dia v0.94
%%CreationDate: Mon May 23 16:59:30 2005
%%For: jencek
%%Orientation: Portrait
%%Magnification: 1.0000
%%BoundingBox: 0 0 601 545
%%BeginSetup
%%EndSetup
%%EndComments
%%BeginProlog
[ /.notdef /.notdef /.notdef /.notdef /.notdef /.notdef /.notdef /.notdef /.notdef /.notdef
/.notdef /.notdef /.notdef /.notdef /.notdef /.notdef /.notdef /.notdef /.notdef /.notdef
/.notdef /.notdef /.notdef /.notdef /.notdef /.notdef /.notdef /.notdef /.notdef /.notdef
/.notdef /.notdef /space /exclam /quotedbl /numbersign /dollar /percent /ampersand /quoteright
/parenleft /parenright /asterisk /plus /comma /hyphen /period /slash /zero /one
/two /three /four /five /six /seven /eight /nine /colon /semicolon
/less /equal /greater /question /at /A /B /C /D /E
/F /G /H /I /J /K /L /M /N /O
/P /Q /R /S /T /U /V /W /X /Y
/Z /bracketleft /backslash /bracketright /asciicircum /underscore /quoteleft /a /b /c
/d /e /f /g /h /i /j /k /l /m
/n /o /p /q /r /s /t /u /v /w
/x /y /z /braceleft /bar /braceright /asciitilde /.notdef /.notdef /.notdef
/.notdef /.notdef /.notdef /.notdef /.notdef /.notdef /.notdef /.notdef /.notdef /.notdef
/.notdef /.notdef /.notdef /.notdef /.notdef /.notdef /.notdef /.notdef /.notdef /.notdef
/.notdef /.notdef /.notdef /.notdef /.notdef /.notdef /.notdef /.notdef /.notdef /.notdef
/space /exclamdown /cent /sterling /currency /yen /brokenbar /section /dieresis /copyright
/ordfeminine /guillemotleft /logicalnot /hyphen /registered /macron /degree /plusminus /twosuperior /threesuperior
/acute /mu /paragraph /periodcentered /cedilla /onesuperior /ordmasculine /guillemotright /onequarter /onehalf
/threequarters /questiondown /Agrave /Aacute /Acircumflex /Atilde /Adieresis /Aring /AE /Ccedilla
/Egrave /Eacute /Ecircumflex /Edieresis /Igrave /Iacute /Icircumflex /Idieresis /Eth /Ntilde
/Ograve /Oacute /Ocircumflex /Otilde /Odieresis /multiply /Oslash /Ugrave /Uacute /Ucircumflex
/Udieresis /Yacute /Thorn /germandbls /agrave /aacute /acircumflex /atilde /adieresis /aring
/ae /ccedilla /egrave /eacute /ecircumflex /edieresis /igrave /iacute /icircumflex /idieresis
/eth /ntilde /ograve /oacute /ocircumflex /otilde /odieresis /divide /oslash /ugrave
/uacute /ucircumflex /udieresis /yacute /thorn /ydieresis] /isolatin1encoding exch def
/cp {closepath} bind def
/c {curveto} bind def
/f {fill} bind def
/a {arc} bind def
/ef {eofill} bind def
/ex {exch} bind def
/gr {grestore} bind def
/gs {gsave} bind def
/sa {save} bind def
/rs {restore} bind def
/l {lineto} bind def
/m {moveto} bind def
/rm {rmoveto} bind def
/n {newpath} bind def
/s {stroke} bind def
/sh {show} bind def
/slc {setlinecap} bind def
/slj {setlinejoin} bind def
/slw {setlinewidth} bind def
/srgb {setrgbcolor} bind def
/rot {rotate} bind def
/sc {scale} bind def
/sd {setdash} bind def
/ff {findfont} bind def
/sf {setfont} bind def
/scf {scalefont} bind def
/sw {stringwidth pop} bind def
/tr {translate} bind def

/ellipsedict 8 dict def
ellipsedict /mtrx matrix put
/ellipse
{ ellipsedict begin
   /endangle exch def
   /startangle exch def
   /yrad exch def
   /xrad exch def
   /y exch def
   /x exch def   /savematrix mtrx currentmatrix def
   x y tr xrad yrad sc
   0 0 1 startangle endangle arc
   savematrix setmatrix
   end
} def

/mergeprocs {
dup length
3 -1 roll
dup
length
dup
5 1 roll
3 -1 roll
add
array cvx
dup
3 -1 roll
0 exch
putinterval
dup
4 2 roll
putinterval
} bind def
/Times-Roman-latin1
    /Times-Roman findfont
    dup length dict begin
	{1 index /FID ne {def} {pop pop} ifelse} forall
	/Encoding isolatin1encoding def
    currentdict end
definefont pop
/Times-Italic-latin1
    /Times-Italic findfont
    dup length dict begin
	{1 index /FID ne {def} {pop pop} ifelse} forall
	/Encoding isolatin1encoding def
    currentdict end
definefont pop
/Times-Bold-latin1
    /Times-Bold findfont
    dup length dict begin
	{1 index /FID ne {def} {pop pop} ifelse} forall
	/Encoding isolatin1encoding def
    currentdict end
definefont pop
/Times-BoldItalic-latin1
    /Times-BoldItalic findfont
    dup length dict begin
	{1 index /FID ne {def} {pop pop} ifelse} forall
	/Encoding isolatin1encoding def
    currentdict end
definefont pop
/AvantGarde-Book-latin1
    /AvantGarde-Book findfont
    dup length dict begin
	{1 index /FID ne {def} {pop pop} ifelse} forall
	/Encoding isolatin1encoding def
    currentdict end
definefont pop
/AvantGarde-BookOblique-latin1
    /AvantGarde-BookOblique findfont
    dup length dict begin
	{1 index /FID ne {def} {pop pop} ifelse} forall
	/Encoding isolatin1encoding def
    currentdict end
definefont pop
/AvantGarde-Demi-latin1
    /AvantGarde-Demi findfont
    dup length dict begin
	{1 index /FID ne {def} {pop pop} ifelse} forall
	/Encoding isolatin1encoding def
    currentdict end
definefont pop
/AvantGarde-DemiOblique-latin1
    /AvantGarde-DemiOblique findfont
    dup length dict begin
	{1 index /FID ne {def} {pop pop} ifelse} forall
	/Encoding isolatin1encoding def
    currentdict end
definefont pop
/Bookman-Light-latin1
    /Bookman-Light findfont
    dup length dict begin
	{1 index /FID ne {def} {pop pop} ifelse} forall
	/Encoding isolatin1encoding def
    currentdict end
definefont pop
/Bookman-LightItalic-latin1
    /Bookman-LightItalic findfont
    dup length dict begin
	{1 index /FID ne {def} {pop pop} ifelse} forall
	/Encoding isolatin1encoding def
    currentdict end
definefont pop
/Bookman-Demi-latin1
    /Bookman-Demi findfont
    dup length dict begin
	{1 index /FID ne {def} {pop pop} ifelse} forall
	/Encoding isolatin1encoding def
    currentdict end
definefont pop
/Bookman-DemiItalic-latin1
    /Bookman-DemiItalic findfont
    dup length dict begin
	{1 index /FID ne {def} {pop pop} ifelse} forall
	/Encoding isolatin1encoding def
    currentdict end
definefont pop
/Courier-latin1
    /Courier findfont
    dup length dict begin
	{1 index /FID ne {def} {pop pop} ifelse} forall
	/Encoding isolatin1encoding def
    currentdict end
definefont pop
/Courier-Oblique-latin1
    /Courier-Oblique findfont
    dup length dict begin
	{1 index /FID ne {def} {pop pop} ifelse} forall
	/Encoding isolatin1encoding def
    currentdict end
definefont pop
/Courier-Bold-latin1
    /Courier-Bold findfont
    dup length dict begin
	{1 index /FID ne {def} {pop pop} ifelse} forall
	/Encoding isolatin1encoding def
    currentdict end
definefont pop
/Courier-BoldOblique-latin1
    /Courier-BoldOblique findfont
    dup length dict begin
	{1 index /FID ne {def} {pop pop} ifelse} forall
	/Encoding isolatin1encoding def
    currentdict end
definefont pop
/Helvetica-latin1
    /Helvetica findfont
    dup length dict begin
	{1 index /FID ne {def} {pop pop} ifelse} forall
	/Encoding isolatin1encoding def
    currentdict end
definefont pop
/Helvetica-Oblique-latin1
    /Helvetica-Oblique findfont
    dup length dict begin
	{1 index /FID ne {def} {pop pop} ifelse} forall
	/Encoding isolatin1encoding def
    currentdict end
definefont pop
/Helvetica-Bold-latin1
    /Helvetica-Bold findfont
    dup length dict begin
	{1 index /FID ne {def} {pop pop} ifelse} forall
	/Encoding isolatin1encoding def
    currentdict end
definefont pop
/Helvetica-BoldOblique-latin1
    /Helvetica-BoldOblique findfont
    dup length dict begin
	{1 index /FID ne {def} {pop pop} ifelse} forall
	/Encoding isolatin1encoding def
    currentdict end
definefont pop
/Helvetica-Narrow-latin1
    /Helvetica-Narrow findfont
    dup length dict begin
	{1 index /FID ne {def} {pop pop} ifelse} forall
	/Encoding isolatin1encoding def
    currentdict end
definefont pop
/Helvetica-Narrow-Oblique-latin1
    /Helvetica-Narrow-Oblique findfont
    dup length dict begin
	{1 index /FID ne {def} {pop pop} ifelse} forall
	/Encoding isolatin1encoding def
    currentdict end
definefont pop
/Helvetica-Narrow-Bold-latin1
    /Helvetica-Narrow-Bold findfont
    dup length dict begin
	{1 index /FID ne {def} {pop pop} ifelse} forall
	/Encoding isolatin1encoding def
    currentdict end
definefont pop
/Helvetica-Narrow-BoldOblique-latin1
    /Helvetica-Narrow-BoldOblique findfont
    dup length dict begin
	{1 index /FID ne {def} {pop pop} ifelse} forall
	/Encoding isolatin1encoding def
    currentdict end
definefont pop
/NewCenturySchoolbook-Roman-latin1
    /NewCenturySchoolbook-Roman findfont
    dup length dict begin
	{1 index /FID ne {def} {pop pop} ifelse} forall
	/Encoding isolatin1encoding def
    currentdict end
definefont pop
/NewCenturySchoolbook-Italic-latin1
    /NewCenturySchoolbook-Italic findfont
    dup length dict begin
	{1 index /FID ne {def} {pop pop} ifelse} forall
	/Encoding isolatin1encoding def
    currentdict end
definefont pop
/NewCenturySchoolbook-Bold-latin1
    /NewCenturySchoolbook-Bold findfont
    dup length dict begin
	{1 index /FID ne {def} {pop pop} ifelse} forall
	/Encoding isolatin1encoding def
    currentdict end
definefont pop
/NewCenturySchoolbook-BoldItalic-latin1
    /NewCenturySchoolbook-BoldItalic findfont
    dup length dict begin
	{1 index /FID ne {def} {pop pop} ifelse} forall
	/Encoding isolatin1encoding def
    currentdict end
definefont pop
/Palatino-Roman-latin1
    /Palatino-Roman findfont
    dup length dict begin
	{1 index /FID ne {def} {pop pop} ifelse} forall
	/Encoding isolatin1encoding def
    currentdict end
definefont pop
/Palatino-Italic-latin1
    /Palatino-Italic findfont
    dup length dict begin
	{1 index /FID ne {def} {pop pop} ifelse} forall
	/Encoding isolatin1encoding def
    currentdict end
definefont pop
/Palatino-Bold-latin1
    /Palatino-Bold findfont
    dup length dict begin
	{1 index /FID ne {def} {pop pop} ifelse} forall
	/Encoding isolatin1encoding def
    currentdict end
definefont pop
/Palatino-BoldItalic-latin1
    /Palatino-BoldItalic findfont
    dup length dict begin
	{1 index /FID ne {def} {pop pop} ifelse} forall
	/Encoding isolatin1encoding def
    currentdict end
definefont pop
/Symbol-latin1
    /Symbol findfont
definefont pop
/ZapfChancery-MediumItalic-latin1
    /ZapfChancery-MediumItalic findfont
    dup length dict begin
	{1 index /FID ne {def} {pop pop} ifelse} forall
	/Encoding isolatin1encoding def
    currentdict end
definefont pop
/ZapfDingbats-latin1
    /ZapfDingbats findfont
    dup length dict begin
	{1 index /FID ne {def} {pop pop} ifelse} forall
	/Encoding isolatin1encoding def
    currentdict end
definefont pop
28.346000 -28.346000 scale
-4.500000 -24.850000 translate
%%EndProlog


0.100000 slw
[] 0 sd
1.000000 1.000000 1.000000 srgb
n 13.850000 5.700000 m 13.850000 7.100000 l 18.900000 7.100000 l 18.900000 5.700000 l f
0.000000 0.000000 0.000000 srgb
n 13.850000 5.700000 m 13.850000 7.100000 l 18.900000 7.100000 l 18.900000 5.700000 l cp s
/Helvetica-latin1 ff 0.700000 scf sf
(pi_operand) dup sw 2 div 16.375000 ex sub 6.700000 m gs 1 -1 sc sh gr
0.100000 slw
[] 0 sd
1.000000 1.000000 1.000000 srgb
n 11.450000 7.900000 m 11.450000 9.300000 l 15.250000 9.300000 l 15.250000 7.900000 l f
0.000000 0.000000 0.000000 srgb
n 11.450000 7.900000 m 11.450000 9.300000 l 15.250000 9.300000 l 15.250000 7.900000 l cp s
/Helvetica-latin1 ff 0.700000 scf sf
(pi_mem) dup sw 2 div 13.350000 ex sub 8.900000 m gs 1 -1 sc sh gr
0.100000 slw
[] 0 sd
1.000000 1.000000 1.000000 srgb
n 17.550000 7.900000 m 17.550000 9.300000 l 23.250000 9.300000 l 23.250000 7.900000 l f
0.000000 0.000000 0.000000 srgb
n 17.550000 7.900000 m 17.550000 9.300000 l 23.250000 9.300000 l 23.250000 7.900000 l cp s
/Helvetica-latin1 ff 0.700000 scf sf
(pi_non_mem) dup sw 2 div 20.400000 ex sub 8.900000 m gs 1 -1 sc sh gr
0.100000 slw
[] 0 sd
1.000000 1.000000 1.000000 srgb
n 5.900000 10.500000 m 5.900000 11.900000 l 12.350000 11.900000 l 12.350000 10.500000 l f
0.000000 0.000000 0.000000 srgb
n 5.900000 10.500000 m 5.900000 11.900000 l 12.350000 11.900000 l 12.350000 10.500000 l cp s
/Helvetica-latin1 ff 0.700000 scf sf
(pi_mem_stack) dup sw 2 div 9.125000 ex sub 11.500000 m gs 1 -1 sc sh gr
0.100000 slw
[] 0 sd
1.000000 1.000000 1.000000 srgb
n 6.550000 12.750000 m 6.550000 14.150000 l 12.400000 14.150000 l 12.400000 12.750000 l f
0.000000 0.000000 0.000000 srgb
n 6.550000 12.750000 m 6.550000 14.150000 l 12.400000 14.150000 l 12.400000 12.750000 l cp s
/Helvetica-latin1 ff 0.700000 scf sf
(pi_mem_decl) dup sw 2 div 9.475000 ex sub 13.750000 m gs 1 -1 sc sh gr
0.100000 slw
[] 0 sd
1.000000 1.000000 1.000000 srgb
n 4.700000 14.800000 m 4.700000 16.200000 l 12.350000 16.200000 l 12.350000 14.800000 l f
0.000000 0.000000 0.000000 srgb
n 4.700000 14.800000 m 4.700000 16.200000 l 12.350000 16.200000 l 12.350000 14.800000 l cp s
/Helvetica-latin1 ff 0.700000 scf sf
(pi_mem_member) dup sw 2 div 8.525000 ex sub 15.800000 m gs 1 -1 sc sh gr
0.100000 slw
[] 0 sd
1.000000 1.000000 1.000000 srgb
n 6.450000 16.850000 m 6.450000 18.250000 l 12.500000 18.250000 l 12.500000 16.850000 l f
0.000000 0.000000 0.000000 srgb
n 6.450000 16.850000 m 6.450000 18.250000 l 12.500000 18.250000 l 12.500000 16.850000 l cp s
/Helvetica-latin1 ff 0.700000 scf sf
(pi_mem_preg) dup sw 2 div 9.475000 ex sub 17.850000 m gs 1 -1 sc sh gr
0.100000 slw
[] 0 sd
1.000000 1.000000 1.000000 srgb
n 4.550000 19.000000 m 4.550000 20.400000 l 12.550000 20.400000 l 12.550000 19.000000 l f
0.000000 0.000000 0.000000 srgb
n 4.550000 19.000000 m 4.550000 20.400000 l 12.550000 20.400000 l 12.550000 19.000000 l cp s
/Helvetica-latin1 ff 0.700000 scf sf
(pi_mem_ptr_deref) dup sw 2 div 8.550000 ex sub 20.000000 m gs 1 -1 sc sh gr
0.100000 slw
[] 0 sd
1.000000 1.000000 1.000000 srgb
n 6.050000 21.250000 m 6.050000 22.650000 l 12.400000 22.650000 l 12.400000 21.250000 l f
0.000000 0.000000 0.000000 srgb
n 6.050000 21.250000 m 6.050000 22.650000 l 12.400000 22.650000 l 12.400000 21.250000 l cp s
/Helvetica-latin1 ff 0.700000 scf sf
(pi_mem_temp) dup sw 2 div 9.225000 ex sub 22.250000 m gs 1 -1 sc sh gr
0.100000 slw
[] 0 sd
1.000000 1.000000 1.000000 srgb
n 7.500000 23.400000 m 7.500000 24.800000 l 12.450000 24.800000 l 12.450000 23.400000 l f
0.000000 0.000000 0.000000 srgb
n 7.500000 23.400000 m 7.500000 24.800000 l 12.450000 24.800000 l 12.450000 23.400000 l cp s
/Helvetica-latin1 ff 0.700000 scf sf
(pi_mem_lit) dup sw 2 div 9.975000 ex sub 24.400000 m gs 1 -1 sc sh gr
0.100000 slw
[] 0 sd
1.000000 1.000000 1.000000 srgb
n 21.550000 10.200000 m 21.550000 11.600000 l 25.100000 11.600000 l 25.100000 10.200000 l f
0.000000 0.000000 0.000000 srgb
n 21.550000 10.200000 m 21.550000 11.600000 l 25.100000 11.600000 l 25.100000 10.200000 l cp s
/Helvetica-latin1 ff 0.700000 scf sf
(pi_preg) dup sw 2 div 23.325000 ex sub 11.200000 m gs 1 -1 sc sh gr
0.100000 slw
[] 0 sd
1.000000 1.000000 1.000000 srgb
n 21.650000 12.450000 m 21.650000 13.850000 l 25.650000 13.850000 l 25.650000 12.450000 l f
0.000000 0.000000 0.000000 srgb
n 21.650000 12.450000 m 21.650000 13.850000 l 25.650000 13.850000 l 25.650000 12.450000 l cp s
/Helvetica-latin1 ff 0.700000 scf sf
(pi_literal) dup sw 2 div 23.650000 ex sub 13.450000 m gs 1 -1 sc sh gr
0.100000 slw
[] 0 sd
0 slj
0 slc
n 16.375000 8.011803 m 16.375000 8.600000 l 15.250000 8.600000 l s
0 slj
1.000000 1.000000 1.000000 srgb
n 16.775000 8.011803 m 16.375000 7.211803 l 15.975000 8.011803 l ef
0.100000 slw
[] 0 sd
0 slj
0.000000 0.000000 0.000000 srgb
n 16.775000 8.011803 m 16.375000 7.211803 l 15.975000 8.011803 l cp s
/Courier-latin1 ff 0.560000 scf sf
0.100000 slw
[] 0 sd
0 slj
0 slc
n 16.375000 8.011803 m 16.375000 8.600000 l 17.550000 8.600000 l s
0 slj
1.000000 1.000000 1.000000 srgb
n 16.775000 8.011803 m 16.375000 7.211803 l 15.975000 8.011803 l ef
0.100000 slw
[] 0 sd
0 slj
0.000000 0.000000 0.000000 srgb
n 16.775000 8.011803 m 16.375000 7.211803 l 15.975000 8.011803 l cp s
/Courier-latin1 ff 0.560000 scf sf
0.100000 slw
[] 0 sd
0 slj
0 slc
n 13.350000 10.211803 m 13.350000 11.200000 l 12.350000 11.200000 l s
0 slj
1.000000 1.000000 1.000000 srgb
n 13.750000 10.211803 m 13.350000 9.411803 l 12.950000 10.211803 l ef
0.100000 slw
[] 0 sd
0 slj
0.000000 0.000000 0.000000 srgb
n 13.750000 10.211803 m 13.350000 9.411803 l 12.950000 10.211803 l cp s
/Courier-latin1 ff 0.560000 scf sf
0.100000 slw
[] 0 sd
0 slj
0 slc
n 13.350000 10.211803 m 13.350000 10.300000 l 13.350000 10.300000 l 13.350000 13.450000 l 12.400000 13.450000 l s
0 slj
1.000000 1.000000 1.000000 srgb
n 13.750000 10.211803 m 13.350000 9.411803 l 12.950000 10.211803 l ef
0.100000 slw
[] 0 sd
0 slj
0.000000 0.000000 0.000000 srgb
n 13.750000 10.211803 m 13.350000 9.411803 l 12.950000 10.211803 l cp s
/Courier-latin1 ff 0.560000 scf sf
0.100000 slw
[] 0 sd
0 slj
0 slc
n 13.350000 10.211803 m 13.350000 15.500000 l 12.350000 15.500000 l s
0 slj
1.000000 1.000000 1.000000 srgb
n 13.750000 10.211803 m 13.350000 9.411803 l 12.950000 10.211803 l ef
0.100000 slw
[] 0 sd
0 slj
0.000000 0.000000 0.000000 srgb
n 13.750000 10.211803 m 13.350000 9.411803 l 12.950000 10.211803 l cp s
/Courier-latin1 ff 0.560000 scf sf
0.100000 slw
[] 0 sd
0 slj
0 slc
n 13.350000 10.211803 m 13.350000 17.550000 l 12.500000 17.550000 l 12.500000 17.550000 l s
0 slj
1.000000 1.000000 1.000000 srgb
n 13.750000 10.211803 m 13.350000 9.411803 l 12.950000 10.211803 l ef
0.100000 slw
[] 0 sd
0 slj
0.000000 0.000000 0.000000 srgb
n 13.750000 10.211803 m 13.350000 9.411803 l 12.950000 10.211803 l cp s
/Courier-latin1 ff 0.560000 scf sf
0.100000 slw
[] 0 sd
0 slj
0 slc
n 13.350000 10.211803 m 13.350000 10.300000 l 13.350000 10.300000 l 13.350000 19.700000 l 12.550000 19.700000 l s
0 slj
1.000000 1.000000 1.000000 srgb
n 13.750000 10.211803 m 13.350000 9.411803 l 12.950000 10.211803 l ef
0.100000 slw
[] 0 sd
0 slj
0.000000 0.000000 0.000000 srgb
n 13.750000 10.211803 m 13.350000 9.411803 l 12.950000 10.211803 l cp s
/Courier-latin1 ff 0.560000 scf sf
0.100000 slw
[] 0 sd
0 slj
0 slc
n 13.350000 10.211803 m 13.350000 10.300000 l 13.350000 10.300000 l 13.350000 21.950000 l 12.400000 21.950000 l s
0 slj
1.000000 1.000000 1.000000 srgb
n 13.750000 10.211803 m 13.350000 9.411803 l 12.950000 10.211803 l ef
0.100000 slw
[] 0 sd
0 slj
0.000000 0.000000 0.000000 srgb
n 13.750000 10.211803 m 13.350000 9.411803 l 12.950000 10.211803 l cp s
/Courier-latin1 ff 0.560000 scf sf
0.100000 slw
[] 0 sd
0 slj
0 slc
n 13.350000 10.211803 m 13.350000 10.300000 l 13.350000 10.300000 l 13.350000 24.100000 l 12.450000 24.100000 l s
0 slj
1.000000 1.000000 1.000000 srgb
n 13.750000 10.211803 m 13.350000 9.411803 l 12.950000 10.211803 l ef
0.100000 slw
[] 0 sd
0 slj
0.000000 0.000000 0.000000 srgb
n 13.750000 10.211803 m 13.350000 9.411803 l 12.950000 10.211803 l cp s
/Courier-latin1 ff 0.560000 scf sf
0.100000 slw
[] 0 sd
0 slj
0 slc
n 20.400000 10.211803 m 20.400000 10.900000 l 21.550000 10.900000 l s
0 slj
1.000000 1.000000 1.000000 srgb
n 20.800000 10.211803 m 20.400000 9.411803 l 20.000000 10.211803 l ef
0.100000 slw
[] 0 sd
0 slj
0.000000 0.000000 0.000000 srgb
n 20.800000 10.211803 m 20.400000 9.411803 l 20.000000 10.211803 l cp s
/Courier-latin1 ff 0.560000 scf sf
0.100000 slw
[] 0 sd
0 slj
0 slc
n 20.400000 10.211803 m 20.400000 13.150000 l 21.650000 13.150000 l s
0 slj
1.000000 1.000000 1.000000 srgb
n 20.800000 10.211803 m 20.400000 9.411803 l 20.000000 10.211803 l ef
0.100000 slw
[] 0 sd
0 slj
0.000000 0.000000 0.000000 srgb
n 20.800000 10.211803 m 20.400000 9.411803 l 20.000000 10.211803 l cp s
/Courier-latin1 ff 0.560000 scf sf
showpage
