[REGS]
AX: 0x0 AH: 0x0 AL: 0x0
CX: 0x0 CH: 0x0 CL: 0x0
DX: 0x0 DH: 0x0 DL: 0x0
BX: 0x0 BH: 0x0 BL: 0x0
SI: 0x0 DI: 0x0 ES: 0x0
SP: 0x0 BP: 0x0 SS: 0x0
IP: 0x0 CS: 0x0 DS: 0x0
[REGS]
AX: 0x3 AH: 0x0 AL: 0x3
CX: 0x0 CH: 0x0 CL: 0x0
DX: 0x0 DH: 0x0 DL: 0x0
BX: 0x0 BH: 0x0 BL: 0x0
SI: 0x0 DI: 0x0 ES: 0x0
SP: 0x0 BP: 0x0 SS: 0x0
IP: 0x3 CS: 0x0 DS: 0x0
