lzr_levels_tutorial_chest.mts,Open the Chest,lzr_core:wood,ocean
lzr_levels_tutorial_emitter.mts,Locked Chest,lzr_core:wood,ocean
lzr_levels_tutorial_mirror.mts,The Mirror,lzr_core:wood,ocean
lzr_levels_tutorial_barricade.mts,Barricades,lzr_core:wood,ocean
lzr_levels_level_3.mts,Boxes,lzr_core:wood|lzr_decor:woodframed_glass,ocean
lzr_levels_level_4.mts,Raised Mirrors,lzr_core:wood|lzr_decor:woodframed_glass,ocean
lzr_levels_level_5.mts,Going Around,lzr_core:wood|lzr_decor:woodframed_glass,ocean
lzr_levels_level_6.mts,Glass-Covered Laser,lzr_core:wood|lzr_decor:woodframed_glass,ocean
lzr_levels_26_mirrors.mts,26 Mirrors,lzr_core:wood,ocean
lzr_levels_palm.mts,Palm Pit,lzr_core:sand|lzr_core:sand|lzr_core:sand|lzr_core:barrier,ocean
lzr_levels_lamp_cross.mts,Lamp Cross,lzr_core:wood|lzr_decor:woodframed_glass,ocean
lzr_levels_dripstone_cave.mts,Dripstone Cave,lzr_core:stone|lzr_core:stone|lzr_core:stone|lzr_core:barrier,ocean
lzr_levels_crystal_room.mts,Crystal Room,lzr_decor:ocean_stone|lzr_decor:ocean_stone|lzr_core:dirt|lzr_core:dirt,temple
lzr_levels_withered_throne.mts,Withered Throne,lzr_decor:ocean_stone|lzr_decor:ocean_stone|lzr_core:seabed|lzr_core:dirt,temple
