# Blender v3.1.0 Alpha OBJ File: 'lzr_laser_transmissive_mirror_on.blend'
# www.blender.org
mtllib lzr_laser_transmissive_mirror_on.mtl
v -0.500000 -0.062500 -0.062500
v -0.062500 0.062500 0.062500
v -0.062500 -0.062500 0.062500
v -0.500000 0.062500 0.062500
v -0.500000 -0.062500 0.062500
v -0.062500 0.062500 -0.062500
v -0.062500 -0.062500 -0.062500
v -0.500000 0.062500 -0.062500
v -0.062500 -0.062500 -0.500000
v -0.062500 0.062500 -0.500000
v 0.062500 -0.062500 -0.500000
v 0.062500 0.062500 -0.500000
v 0.062500 0.062500 -0.062500
v 0.062500 -0.062500 -0.062500
v -0.062500 0.062500 0.500000
v -0.062500 -0.062500 0.500000
v 0.062500 0.062500 0.062500
v 0.062500 -0.062500 0.062500
v 0.062500 0.062500 0.500000
v 0.062500 -0.062500 0.500000
vt 0.000000 0.000000
vt 1.000000 0.000000
vt 1.000000 1.000000
vt 0.000000 1.000000
vt 0.000000 0.000000
vt 1.000000 0.000000
vt 1.000000 1.000000
vt 0.000000 1.000000
vt 1.000000 0.000000
vt 1.000000 1.000000
vt 0.000000 1.000000
vt 0.000000 0.000000
vt 1.000000 0.000000
vt 1.000000 1.000000
vt 0.000000 1.000000
vt 0.000000 0.000000
vt 1.000000 0.000000
vt 1.000000 1.000000
vt 0.000000 1.000000
vt 0.000000 0.000000
vt 0.000000 1.000000
vt 0.000000 0.000000
vt 1.000000 0.000000
vt 1.000000 1.000000
vt 0.000000 0.000000
vt 1.000000 0.000000
vt 1.000000 1.000000
vt 0.000000 1.000000
vt 1.000000 1.000000
vt 0.000000 1.000000
vt 0.000000 0.000000
vt 1.000000 0.000000
vt 1.000000 1.000000
vt 0.000000 1.000000
vt 0.000000 0.000000
vt 1.000000 1.000000
vt 1.000000 0.000000
vt 1.000000 1.000000
vt 1.000000 0.000000
vt 1.000000 1.000000
vt 0.000000 1.000000
vt 0.000000 0.000000
vt 1.000000 0.000000
vt 0.000000 1.000000
vt 0.000000 1.000000
vn -0.0000 0.0000 -1.0000
vn 0.0000 -1.0000 0.0000
vn 0.0000 0.0000 1.0000
vn 0.0000 1.0000 0.0000
vn -1.0000 -0.0000 -0.0000
vn 1.0000 0.0000 0.0000
g LaserThru1_Laser.005_Laser
usemtl Laser
s off
f 1/1/1 8/2/1 6/3/1 7/4/1
f 3/5/2 7/6/2 14/7/2 18/8/2
f 3/5/3 2/9/3 4/10/3 5/11/3
f 7/12/2 3/13/2 5/14/2 1/15/2
f 2/16/4 6/17/4 8/18/4 4/19/4
f 9/20/5 7/6/5 6/3/5 10/21/5
f 6/22/4 13/23/4 12/24/4 10/21/4
f 11/25/6 12/26/6 13/27/6 14/28/6
f 2/16/5 3/13/5 16/29/5 15/30/5
f 18/31/6 17/32/6 19/33/6 20/34/6
f 14/35/6 13/23/6 17/36/6 18/8/6
f 7/12/2 9/37/2 11/38/2 14/28/2
f 3/5/2 18/39/2 20/40/2 16/41/2
f 15/42/4 19/43/4 17/36/4 2/44/4
f 6/22/4 2/9/4 17/36/4 13/45/4
v -0.500083 -0.500083 0.500083
v -0.500083 0.500010 0.500083
v 0.500000 0.499964 0.500000
v 0.500000 -0.500125 0.500000
v 0.500083 0.500010 -0.500083
v 0.500083 -0.500083 -0.500083
v -0.500000 0.437643 -0.500000
v -0.500125 0.500052 -0.500125
v 0.500000 0.437643 -0.500000
v -0.500000 0.437643 0.500000
v -0.500125 -0.500125 -0.500125
v -0.500000 -0.437792 -0.500000
v 0.500000 -0.437792 -0.500000
v -0.500000 -0.437792 0.500000
v -0.437750 -0.437542 -0.500250
v -0.437750 0.437393 -0.500250
v -0.500250 -0.437542 -0.437750
v -0.500250 0.437393 -0.437750
v -0.437750 -0.437542 -0.437750
v -0.437750 0.437500 -0.437750
v -0.500250 -0.437542 0.437750
v -0.500250 0.437393 0.437750
v -0.437750 -0.437542 0.437750
v -0.437750 0.437500 0.437750
v 0.437750 -0.437542 -0.500250
v 0.437750 0.437393 -0.500250
v 0.437750 -0.437625 -0.437750
v 0.437750 0.437500 -0.437750
v 0.500000 -0.437625 0.500000
vt 0.000120 0.000000
vt 0.062641 0.062313
vt 0.062390 0.000083
vt 0.000250 0.062391
vt 0.000125 0.000078
vt 0.062479 0.062641
vt 0.937687 0.937521
vt 0.937687 1.000000
vt 0.062479 1.000000
vt 0.062479 0.937521
vt 0.000000 0.937521
vt 0.000000 0.062313
vt 0.062479 0.062313
vt 0.999917 0.000083
vt 0.000167 0.000000
vt 0.000125 0.999875
vt 1.000000 0.999833
vt 0.062479 0.937284
vt 0.000250 0.937533
vt 0.000000 0.062641
vt 0.000000 0.937284
vt 0.062479 0.937391
vt 0.062479 0.062641
vt 0.062641 0.937521
vt 0.937391 0.937521
vt 0.937284 1.000000
vt 0.062641 1.000000
vt 0.062391 0.999750
vt 0.937533 0.999750
vt 0.937284 0.937521
vt 0.062641 0.937521
vt 0.062641 1.000000
vt 0.937284 1.000000
vt 0.937391 0.937521
vt 0.062641 0.937521
vt 0.937533 0.000083
vt 0.937283 0.062313
vt 0.999917 0.062391
vt 0.999917 0.937533
vt 0.937687 0.937284
vt 0.937687 0.062641
vt 0.062479 0.062557
vt 0.062479 0.937391
vt 0.000000 0.937283
vt 0.000000 0.062641
vt 0.062479 0.062313
vt 0.000000 0.062313
vt 0.000000 0.937521
vt 0.062479 0.937521
vt 0.062479 1.000000
vt 0.937687 1.000000
vt 0.937687 0.937521
vt 1.000000 0.999880
vt 0.000078 0.999875
vt 0.999917 0.000083
vt 0.000250 0.000083
vt 0.999917 0.999750
vt 0.999922 0.999875
vt 0.999880 0.000000
vt 1.000000 0.000120
vt 1.000000 0.999833
vt 0.000167 0.000000
vt 0.999917 0.000083
vt 0.937687 0.937391
vt 0.937687 0.062641
vt 0.062391 0.999750
vt 0.000120 0.999833
vt 0.000078 0.000083
vt 0.062557 0.000083
vt 0.999833 0.000083
vt 0.999880 0.999833
vt 0.937533 0.999750
vt 0.999917 0.999833
vt 0.999917 0.062557
vt 0.000167 0.999880
vt 0.000250 0.937533
vt 0.000250 0.062390
vt 0.000167 0.000120
vn 0.0040 0.0013 -1.0000
vn -1.0000 0.0020 -0.0040
vn -1.0000 0.0005 -0.0032
vn 0.0002 -1.0000 0.0002
vn 0.0000 1.0000 0.0000
vn 0.0018 1.0000 0.0001
vn -0.0016 1.0000 0.0000
vn 0.0001 1.0000 0.0018
vn -1.0000 0.0000 -0.0040
vn 1.0000 0.0000 0.0000
vn 0.0000 0.0000 1.0000
vn -0.0040 0.0000 -1.0000
vn -0.0000 0.0000 -1.0000
vn 0.0040 0.0000 -1.0000
vn -1.0000 0.0000 0.0040
vn -1.0000 0.0000 0.0000
vn 0.0001 1.0000 0.0001
vn -1.0000 -0.0020 -0.0040
vn -1.0000 -0.0016 -0.0056
vn -1.0000 0.0027 0.0000
vn -1.0000 0.0043 0.0003
vn -1.0000 -0.0013 0.0040
vn -1.0000 0.0001 0.0032
vn -0.0040 0.0020 -1.0000
vn -0.0056 0.0016 -1.0000
vn 0.0000 -0.0027 -1.0000
vn 0.0001 1.0000 -0.0000
vn 0.0026 1.0000 -0.0001
vn -0.0002 1.0000 0.0039
vn -0.0008 0.0041 -1.0000
vn 0.0005 0.0043 -1.0000
vn 0.0000 0.0026 -1.0000
vn 0.0040 -0.0013 -1.0000
vn 0.0031 0.0002 -1.0000
vn 0.0000 0.0020 -1.0000
vn -0.0003 0.0031 -1.0000
vn -0.0032 -0.0006 -1.0000
vn -0.0040 -0.0020 -1.0000
vn -1.0000 -0.0020 -0.0000
vn -1.0000 -0.0036 -0.0004
vn -1.0000 0.0013 0.0040
vn -0.7097 -0.6114 -0.3500
vn -1.0000 0.0036 0.0008
vn -1.0000 0.0012 -0.0014
vn -1.0000 0.0020 0.0000
vn -0.1472 -0.5527 0.8203
vn -0.0385 -0.8927 -0.4491
vn 0.7212 0.1370 -0.6791
vn 0.2462 -0.8629 0.4414
vn 0.0000 -0.0020 -1.0000
vn -1.0000 -0.0026 0.0000
vn -0.7071 0.0000 -0.7071
vn 0.0000 0.0007 1.0000
vn 0.0001 -0.0013 1.0000
vn -0.0015 -0.0014 1.0000
vn 1.0000 0.0000 0.0001
vn 1.0000 -0.0010 -0.0014
vn 1.0000 -0.0013 -0.0012
vn 1.0000 -0.0009 -0.0029
vn 1.0000 0.0007 0.0000
g Mirror_Mirror_Box
usemtl Box
s off
f 26/46/7 45/47/7 33/48/7
f 32/49/8 31/50/9 37/51/8
f 44/52/10 42/53/10 38/54/10 40/55/10 36/56/10 46/57/10 48/58/10
f 23/59/11 25/60/12 28/61/13 22/62/14
f 32/49/15 37/51/15 38/63/15 27/64/15
f 35/65/16 36/66/16 40/67/16 39/68/16
f 39/69/17 40/70/17 38/71/17 37/72/17
f 32/73/18 27/74/18 36/75/18 35/76/18
f 41/77/19 42/78/19 44/79/19 43/80/19
f 29/81/20 33/48/20 45/47/20 46/82/20
f 34/83/21 30/84/21 42/85/21 41/86/21
f 47/87/22 48/88/22 46/89/22 45/90/22
f 47/91/23 45/92/23 35/93/23 39/94/23 37/95/23 41/96/23 43/97/23
f 27/64/24 38/63/24 28/61/25
f 42/85/26 22/98/27 38/63/26
f 30/84/28 22/98/29 42/85/28
f 32/73/30 35/76/30 31/99/31
f 45/47/32 26/46/32 35/76/32
f 49/100/33 47/91/33 43/97/33
f 49/100/34 33/101/34 45/92/34 47/91/34
f 49/100/35 43/97/35 41/96/35 34/102/35
f 28/103/36 25/104/37 46/82/38
f 29/81/39 46/82/39 25/104/40
f 46/82/41 36/75/41 28/103/42
f 28/103/43 36/75/44 27/74/44
f 41/86/45 37/51/45 31/50/46
f 34/83/47 41/86/47 21/105/48
f 22/98/49 28/61/50 38/63/51
s 1
f 21/106/52 31/99/53 26/107/54 24/108/55
f 31/99/53 35/76/56 26/46/54
f 31/50/53 21/105/52 41/86/57
g Mirror_Mirror_Mirror
usemtl Mirror
s off
f 44/109/58 48/88/58 47/87/58 43/110/58
g Mirror_Mirror_Backside
usemtl Backside
f 34/111/59 21/112/59 24/113/59 49/114/59
f 34/111/17 49/114/17 23/115/17
f 23/115/60 22/116/61 30/117/60
f 30/117/17 34/111/17 23/115/17
f 23/118/62 49/119/62 25/120/63
f 29/121/64 25/120/65 49/119/64
f 49/119/16 33/122/16 29/121/16
s 1
f 24/108/55 26/123/54 33/122/66 49/119/66
