   1              		.file	"req_ctx.c"
   9              	.Ltext0:
  10              		.section	.fastrun,"ax",%progbits
  11              		.align	2
  12              		.global	req_ctx_find_get
  14              	req_ctx_find_get:
  15              	.LFB282:
  16              		.file 1 "src/os/req_ctx.c"
   1:src/os/req_ctx.c **** /* AT91SAM7 USB Request Context for OpenPCD / OpenPICC
   2:src/os/req_ctx.c ****  * (C) 2006 by Harald Welte <hwelte@hmw-consulting.de>
   3:src/os/req_ctx.c ****  *
   4:src/os/req_ctx.c ****  *  This program is free software; you can redistribute it and/or modify
   5:src/os/req_ctx.c ****  *  it under the terms of the GNU General Public License as published by 
   6:src/os/req_ctx.c ****  *  the Free Software Foundation; either version 2 of the License, or
   7:src/os/req_ctx.c ****  *  (at your option) any later version.
   8:src/os/req_ctx.c ****  *
   9:src/os/req_ctx.c ****  *  This program is distributed in the hope that it will be useful,
  10:src/os/req_ctx.c ****  *  but WITHOUT ANY WARRANTY; without even the implied warranty of
  11:src/os/req_ctx.c ****  *  MERCHANTABILITY or FITNESS FOR A PARTICULAR PURPOSE.  See the
  12:src/os/req_ctx.c ****  *  GNU General Public License for more details.
  13:src/os/req_ctx.c ****  *
  14:src/os/req_ctx.c ****  *  You should have received a copy of the GNU General Public License
  15:src/os/req_ctx.c ****  *  along with this program; if not, write to the Free Software
  16:src/os/req_ctx.c ****  *  Foundation, Inc., 59 Temple Place, Suite 330, Boston, MA  02111-1307  USA
  17:src/os/req_ctx.c ****  *
  18:src/os/req_ctx.c ****  */
  19:src/os/req_ctx.c **** 
  20:src/os/req_ctx.c **** #include <unistd.h>
  21:src/os/req_ctx.c **** #include <stdlib.h>
  22:src/os/req_ctx.c **** #include <sys/types.h>
  23:src/os/req_ctx.c **** #include <asm/bitops.h>
  24:src/os/req_ctx.c **** #include <os/dbgu.h>
  25:src/os/req_ctx.c **** #include <os/req_ctx.h>
  26:src/os/req_ctx.c **** 
  27:src/os/req_ctx.c **** #include "../openpcd.h"
  28:src/os/req_ctx.c **** 
  29:src/os/req_ctx.c **** /* FIXME: locking, FIFO order processing */
  30:src/os/req_ctx.c **** 
  31:src/os/req_ctx.c **** #define NUM_RCTX_SMALL 8
  32:src/os/req_ctx.c **** #define NUM_RCTX_LARGE 4
  33:src/os/req_ctx.c **** 
  34:src/os/req_ctx.c **** #define NUM_REQ_CTX	(NUM_RCTX_SMALL+NUM_RCTX_LARGE)
  35:src/os/req_ctx.c **** 
  36:src/os/req_ctx.c **** static u_int8_t rctx_data[NUM_RCTX_SMALL][RCTX_SIZE_SMALL];
  37:src/os/req_ctx.c **** static u_int8_t rctx_data_large[NUM_RCTX_LARGE][RCTX_SIZE_LARGE];
  38:src/os/req_ctx.c **** 
  39:src/os/req_ctx.c **** static struct req_ctx req_ctx[NUM_REQ_CTX];
  40:src/os/req_ctx.c **** 
  41:src/os/req_ctx.c **** struct req_ctx __ramfunc *req_ctx_find_get(int large,
  42:src/os/req_ctx.c **** 				 unsigned long old_state, 
  43:src/os/req_ctx.c **** 				 unsigned long new_state)
  44:src/os/req_ctx.c **** {
  17              		.loc 1 44 0
  18              		@ args = 0, pretend = 0, frame = 0
  19              		@ frame_needed = 0, uses_anonymous_args = 0
  20              	.LVL0:
  45:src/os/req_ctx.c **** 	unsigned long flags;
  46:src/os/req_ctx.c **** 	u_int8_t i;
  47:src/os/req_ctx.c **** 	
  48:src/os/req_ctx.c **** 	if (large)
  21              		.loc 1 48 0
  22 0000 000050E3 		cmp	r0, #0
  23 0004 0800A013 		movne	r0, #8
  24              	.LVL1:
  25              		.loc 1 44 0
  26 0008 F0402DE9 		stmfd	sp!, {r4, r5, r6, r7, lr}
  27              	.LCFI0:
  28              		.loc 1 44 0
  29 000c 0160A0E1 		mov	r6, r1
  30 0010 0270A0E1 		mov	r7, r2
  31              		.loc 1 48 0
  32 0014 0010A011 		movne	r1, r0
  33              	.LVL2:
  34 0018 0010A001 		moveq	r1, r0
  35              	.LBB2:
  49:src/os/req_ctx.c **** 		i = NUM_RCTX_SMALL;
  50:src/os/req_ctx.c **** 	else
  51:src/os/req_ctx.c **** 		i = 0;
  52:src/os/req_ctx.c **** 
  53:src/os/req_ctx.c **** 	for (; i < NUM_REQ_CTX; i++) {
  54:src/os/req_ctx.c **** 		local_irq_save(flags);
  36              		.loc 1 54 0
  37 001c 00E00FE1 		mrs	lr, cpsr		@ local_irq_save
  38 0020 80308EE3 		orr	r3, lr, #128
  39 0024 03F021E1 		msr	cpsr_c, r3
  40              	.LVL3:
  41              	.LBE2:
  55:src/os/req_ctx.c **** 		if (req_ctx[i].state == old_state) {
  42              		.loc 1 55 0
  43 0028 78509FE5 		ldr	r5, .L19
  44 002c 8140A0E1 		mov	r4, r1, asl #1
  45 0030 013084E0 		add	r3, r4, r1
  46              	.LVL4:
  47 0034 032195E7 		ldr	r2, [r5, r3, asl #2]
  48              	.LVL5:
  49 0038 020056E1 		cmp	r6, r2
  50 003c 1800001A 		bne	.L12
  51 0040 260000EA 		b	.L18
  52              	.L7:
  53              	.LBB3:
  54              		.loc 1 54 0
  55 0044 00E00FE1 		mrs	lr, cpsr		@ local_irq_save
  56 0048 80308EE3 		orr	r3, lr, #128
  57 004c 03F021E1 		msr	cpsr_c, r3
  58              	.LVL6:
  59              	.LBE3:
  60              		.loc 1 55 0
  61 0050 80C0A0E1 		mov	ip, r0, asl #1
  62 0054 00308CE0 		add	r3, ip, r0
  63              	.LVL7:
  64 0058 032195E7 		ldr	r2, [r5, r3, asl #2]
  65 005c 060052E1 		cmp	r2, r6
  66 0060 0010A0E1 		mov	r1, r0
  67 0064 1F00000A 		beq	.L17
  68              	.L12:
  56:src/os/req_ctx.c **** 			req_ctx[i].state = new_state;
  57:src/os/req_ctx.c **** 			local_irq_restore(flags);
  58:src/os/req_ctx.c **** 			return &req_ctx[i];
  59:src/os/req_ctx.c **** 		}
  60:src/os/req_ctx.c **** 		local_irq_restore(flags);
  69              		.loc 1 60 0
  70 0068 0EF021E1 		msr	cpsr_c, lr		@ local_irq_restore
  71              	
  72              		.loc 1 53 0
  73 006c 013080E2 		add	r3, r0, #1
  74 0070 FF0003E2 		and	r0, r3, #255
  75 0074 0B0050E3 		cmp	r0, #11
  76 0078 0F00009A 		bls	.L7
  77 007c 0000A0E3 		mov	r0, #0
  78              	.LVL8:
  61:src/os/req_ctx.c **** 	}
  62:src/os/req_ctx.c **** 
  63:src/os/req_ctx.c **** 	return NULL;
  64:src/os/req_ctx.c **** }
  79              		.loc 1 64 0
  80 0080 F080BDE8 		ldmfd	sp!, {r4, r5, r6, r7, pc}
  81              	.LVL9:
  82              	.L17:
  83 0084 0C40A0E1 		mov	r4, ip
  84              	.L5:
  85              		.loc 1 56 0
  86 0088 013084E0 		add	r3, r4, r1
  87 008c 037185E7 		str	r7, [r5, r3, asl #2]
  88              		.loc 1 57 0
  89 0090 0EF021E1 		msr	cpsr_c, lr		@ local_irq_restore
  90              	
  91              		.loc 1 58 0
  92 0094 00308CE0 		add	r3, ip, r0
  93 0098 030185E0 		add	r0, r5, r3, asl #2
  94              	.LVL10:
  95 009c F080BDE8 		ldmfd	sp!, {r4, r5, r6, r7, pc}
  96              	.LVL11:
  97              	.L18:
  98 00a0 80C0A0E1 		mov	ip, r0, asl #1
  99 00a4 200000EA 		b	.L5
 100              	.L20:
 101              		.align	2
 102              	.L19:
 103 00a8 00220000 		.word	req_ctx
 104              	.LFE282:
 106              		.text
 107              		.align	2
 108              		.global	req_ctx_num
 110              	req_ctx_num:
 111              	.LFB283:
  65:src/os/req_ctx.c **** 
  66:src/os/req_ctx.c **** u_int8_t req_ctx_num(struct req_ctx *ctx)
  67:src/os/req_ctx.c **** {
 112              		.loc 1 67 0
 113              		@ args = 0, pretend = 0, frame = 0
 114              		@ frame_needed = 0, uses_anonymous_args = 0
 115              		@ link register save eliminated.
 116              	.LVL12:
  68:src/os/req_ctx.c **** 	return ((char *)ctx - (char *)&req_ctx[0])/sizeof(*ctx);
 117              		.loc 1 68 0
 118 0000 14309FE5 		ldr	r3, .L23
 119 0004 14209FE5 		ldr	r2, .L23+4
 120 0008 000063E0 		rsb	r0, r3, r0
 121              	.LVL13:
 122 000c 923080E0 		umull	r3, r0, r2, r0
 123 0010 A001A0E1 		mov	r0, r0, lsr #3
  69:src/os/req_ctx.c **** }
 124              		.loc 1 69 0
 125 0014 FF0000E2 		and	r0, r0, #255
 126              		.loc 1 67 0
 127              		@ lr needed for prologue
 128              		.loc 1 69 0
 129 0018 1EFF2FE1 		bx	lr
 130              	.L24:
 131              		.align	2
 132              	.L23:
 133 001c 00220000 		.word	req_ctx
 134 0020 ABAAAAAA 		.word	-1431655765
 135              	.LFE283:
 137              		.align	2
 138              		.global	req_ctx_set_state
 140              	req_ctx_set_state:
 141              	.LFB284:
  70:src/os/req_ctx.c **** 
  71:src/os/req_ctx.c **** void req_ctx_set_state(struct req_ctx *ctx, unsigned long new_state)
  72:src/os/req_ctx.c **** {
 142              		.loc 1 72 0
 143              		@ args = 0, pretend = 0, frame = 0
 144              		@ frame_needed = 0, uses_anonymous_args = 0
 145              		@ link register save eliminated.
 146              	.LVL14:
 147              		@ lr needed for prologue
 148              	.LBB4:
  73:src/os/req_ctx.c **** 	unsigned long flags;
  74:src/os/req_ctx.c **** 
  75:src/os/req_ctx.c **** 	/* FIXME: do we need this kind of locking, we're UP! */
  76:src/os/req_ctx.c **** 	local_irq_save(flags);
 149              		.loc 1 76 0
 150 0024 00300FE1 		mrs	r3, cpsr		@ local_irq_save
 151 0028 802083E3 		orr	r2, r3, #128
 152 002c 02F021E1 		msr	cpsr_c, r2
 153              	.LVL15:
 154              	.LBE4:
  77:src/os/req_ctx.c **** 	ctx->state = new_state;
 155              		.loc 1 77 0
 156 0030 001080E5 		str	r1, [r0, #0]
  78:src/os/req_ctx.c **** 	local_irq_restore(flags);
 157              		.loc 1 78 0
 158 0034 03F021E1 		msr	cpsr_c, r3		@ local_irq_restore
 159              	
  79:src/os/req_ctx.c **** }
 160              		.loc 1 79 0
 161 0038 1EFF2FE1 		bx	lr
 162              	.LFE284:
 164              		.align	2
 165              		.global	req_ctx_put
 167              	req_ctx_put:
 168              	.LFB285:
  80:src/os/req_ctx.c **** 
  81:src/os/req_ctx.c **** void req_ctx_put(struct req_ctx *ctx)
  82:src/os/req_ctx.c **** {
 169              		.loc 1 82 0
 170              		@ args = 0, pretend = 0, frame = 0
 171              		@ frame_needed = 0, uses_anonymous_args = 0
 172              		@ link register save eliminated.
 173              	.LVL16:
  83:src/os/req_ctx.c **** 	req_ctx_set_state(ctx, RCTX_STATE_FREE);
 174              		.loc 1 83 0
 175 003c FE10A0E3 		mov	r1, #254
 176              		.loc 1 82 0
 177              		@ lr needed for prologue
  84:src/os/req_ctx.c **** }
 178              		.loc 1 84 0
 179              		.loc 1 83 0
 180 0040 FEFFFFEA 		b	req_ctx_set_state
 181              	.LVL17:
 182              	.LFE285:
 184              		.align	2
 185              		.global	req_ctx_init
 187              	req_ctx_init:
 188              	.LFB286:
  85:src/os/req_ctx.c **** 
  86:src/os/req_ctx.c **** void req_ctx_init(void)
  87:src/os/req_ctx.c **** {
 189              		.loc 1 87 0
 190              		@ args = 0, pretend = 0, frame = 0
 191              		@ frame_needed = 0, uses_anonymous_args = 0
 192 0044 04E02DE5 		str	lr, [sp, #-4]!
 193              	.LCFI1:
 194              		.loc 1 87 0
 195 0048 5C209FE5 		ldr	r2, .L39
 196 004c 5C009FE5 		ldr	r0, .L39+4
 197 0050 0010A0E3 		mov	r1, #0
 198              	.LVL18:
 199 0054 FEC0A0E3 		mov	ip, #254
 200 0058 0230A0E1 		mov	r3, r2
 201              	.L30:
  88:src/os/req_ctx.c **** 	int i;
  89:src/os/req_ctx.c **** 
  90:src/os/req_ctx.c **** 	for (i = 0; i < NUM_RCTX_SMALL; i++) {
 202              		.loc 1 90 0
 203 005c 011081E2 		add	r1, r1, #1
  91:src/os/req_ctx.c **** 		req_ctx[i].size = RCTX_SIZE_SMALL;
 204              		.loc 1 91 0
 205 0060 40E0A0E3 		mov	lr, #64	@ movhi
 206              		.loc 1 90 0
 207 0064 080051E3 		cmp	r1, #8
  92:src/os/req_ctx.c **** 		req_ctx[i].data = rctx_data[i];
 208              		.loc 1 92 0
 209 0068 080082E5 		str	r0, [r2, #8]
 210              		.loc 1 91 0
 211 006c B4E0C2E1 		strh	lr, [r2, #4]	@ movhi
  93:src/os/req_ctx.c **** 		req_ctx[i].state = RCTX_STATE_FREE;
 212              		.loc 1 93 0
 213 0070 0CC083E4 		str	ip, [r3], #12
 214              		.loc 1 90 0
 215 0074 400080E2 		add	r0, r0, #64
 216 0078 0C2082E2 		add	r2, r2, #12
 217 007c 1500001A 		bne	.L30
 218 0080 24309FE5 		ldr	r3, .L39
 219 0084 28209FE5 		ldr	r2, .L39+8
 220 0088 301083E2 		add	r1, r3, #48
 221              	.LVL19:
 222              	.L32:
  94:src/os/req_ctx.c **** 	}
  95:src/os/req_ctx.c **** 
  96:src/os/req_ctx.c **** 	for (i = 0; i < NUM_RCTX_LARGE; i++) {
  97:src/os/req_ctx.c **** 		req_ctx[NUM_RCTX_SMALL+i].size = RCTX_SIZE_LARGE;
 223              		.loc 1 97 0
 224 008c 020BA0E3 		mov	r0, #2048	@ movhi
  98:src/os/req_ctx.c **** 		req_ctx[NUM_RCTX_SMALL+i].data = rctx_data_large[i];
 225              		.loc 1 98 0
 226 0090 682083E5 		str	r2, [r3, #104]
 227              		.loc 1 97 0
 228 0094 B406C3E1 		strh	r0, [r3, #100]	@ movhi
 229              		.loc 1 98 0
 230 0098 0C3083E2 		add	r3, r3, #12
 231              		.loc 1 96 0
 232 009c 010053E1 		cmp	r3, r1
 233              		.loc 1 98 0
 234 00a0 022B82E2 		add	r2, r2, #2048
 235              		.loc 1 96 0
 236 00a4 2100001A 		bne	.L32
  99:src/os/req_ctx.c **** 	}
 100:src/os/req_ctx.c **** }
 237              		.loc 1 100 0
 238 00a8 04F09DE4 		ldr	pc, [sp], #4
 239              	.L40:
 240              		.align	2
 241              	.L39:
 242 00ac 00220000 		.word	req_ctx
 243 00b0 00000000 		.word	rctx_data
 244 00b4 00020000 		.word	rctx_data_large
 245              	.LFE286:
 247              		.bss
 248              	rctx_data:
 249 0000 00000000 		.space	512
 249      00000000 
 249      00000000 
 249      00000000 
 249      00000000 
 250              	rctx_data_large:
 251 0200 00000000 		.space	8192
 251      00000000 
 251      00000000 
 251      00000000 
 251      00000000 
 252              		.align	2
 253              	req_ctx:
 254 2200 00000000 		.space	144
 254      00000000 
 254      00000000 
 254      00000000 
 254      00000000 
 333              	.Letext0:
DEFINED SYMBOLS
                            *ABS*:00000000 req_ctx.c
     /tmp/ccOd49Kc.s:14     .fastrun:00000000 req_ctx_find_get
     /tmp/ccOd49Kc.s:22     .fastrun:00000000 $a
     /tmp/ccOd49Kc.s:103    .fastrun:000000a8 $d
     /tmp/ccOd49Kc.s:253    .bss:00002200 req_ctx
     /tmp/ccOd49Kc.s:110    .text:00000000 req_ctx_num
     /tmp/ccOd49Kc.s:118    .text:00000000 $a
     /tmp/ccOd49Kc.s:133    .text:0000001c $d
     /tmp/ccOd49Kc.s:140    .text:00000024 req_ctx_set_state
     /tmp/ccOd49Kc.s:150    .text:00000024 $a
     /tmp/ccOd49Kc.s:167    .text:0000003c req_ctx_put
     /tmp/ccOd49Kc.s:187    .text:00000044 req_ctx_init
     /tmp/ccOd49Kc.s:242    .text:000000ac $d
     /tmp/ccOd49Kc.s:248    .bss:00000000 rctx_data
     /tmp/ccOd49Kc.s:250    .bss:00000200 rctx_data_large

NO UNDEFINED SYMBOLS
