   1              		.file	"tc_cdiv.c"
   9              	.Ltext0:
  10              		.align	2
  11              		.global	tc_cdiv_set_divider
  13              	tc_cdiv_set_divider:
  14              	.LFB277:
  15              		.file 1 "src/os/tc_cdiv.c"
   1:src/os/tc_cdiv.c **** /* OpenPC TC (Timer / Clock) support code
   2:src/os/tc_cdiv.c ****  * (C) 2006 by Harald Welte <hwelte@hmw-consulting.de>
   3:src/os/tc_cdiv.c ****  *
   4:src/os/tc_cdiv.c ****  *  This program is free software; you can redistribute it and/or modify
   5:src/os/tc_cdiv.c ****  *  it under the terms of the GNU General Public License as published by 
   6:src/os/tc_cdiv.c ****  *  the Free Software Foundation; either version 2 of the License, or
   7:src/os/tc_cdiv.c ****  *  (at your option) any later version.
   8:src/os/tc_cdiv.c ****  *
   9:src/os/tc_cdiv.c ****  *  This program is distributed in the hope that it will be useful,
  10:src/os/tc_cdiv.c ****  *  but WITHOUT ANY WARRANTY; without even the implied warranty of
  11:src/os/tc_cdiv.c ****  *  MERCHANTABILITY or FITNESS FOR A PARTICULAR PURPOSE.  See the
  12:src/os/tc_cdiv.c ****  *  GNU General Public License for more details.
  13:src/os/tc_cdiv.c ****  *
  14:src/os/tc_cdiv.c ****  *  You should have received a copy of the GNU General Public License
  15:src/os/tc_cdiv.c ****  *  along with this program; if not, write to the Free Software
  16:src/os/tc_cdiv.c ****  *  Foundation, Inc., 59 Temple Place, Suite 330, Boston, MA  02111-1307  USA
  17:src/os/tc_cdiv.c ****  *
  18:src/os/tc_cdiv.c ****  * This idea of this code is to feed the 13.56MHz carrier clock of RC632
  19:src/os/tc_cdiv.c ****  * into TCLK1, which is routed to XC1.  Then configure TC0 to divide this
  20:src/os/tc_cdiv.c ****  * clock by a configurable divider.
  21:src/os/tc_cdiv.c ****  *
  22:src/os/tc_cdiv.c ****  */
  23:src/os/tc_cdiv.c **** 
  24:src/os/tc_cdiv.c **** #include <lib_AT91SAM7.h>
  25:src/os/tc_cdiv.c **** #include <AT91SAM7.h>
  26:src/os/tc_cdiv.c **** #include <os/dbgu.h>
  27:src/os/tc_cdiv.c **** 
  28:src/os/tc_cdiv.c **** #include "../openpcd.h"
  29:src/os/tc_cdiv.c **** #include <os/tc_cdiv.h>
  30:src/os/tc_cdiv.c **** 
  31:src/os/tc_cdiv.c **** static AT91PS_TCB tcb = AT91C_BASE_TCB;
  32:src/os/tc_cdiv.c **** 
  33:src/os/tc_cdiv.c **** /* set carrier divider to a specific */
  34:src/os/tc_cdiv.c **** void tc_cdiv_set_divider(u_int16_t div)
  35:src/os/tc_cdiv.c **** {
  16              		.loc 1 35 0
  17              		@ args = 0, pretend = 0, frame = 0
  18              		@ frame_needed = 0, uses_anonymous_args = 0
  19              		@ link register save eliminated.
  20              	.LVL0:
  21 0000 0008A0E1 		mov	r0, r0, asl #16
  22              	.LVL1:
  36:src/os/tc_cdiv.c **** 	tcb->TCB_TC0.TC_RC = div;
  37:src/os/tc_cdiv.c **** 
  38:src/os/tc_cdiv.c **** 	/* set to 50% duty cycle */
  39:src/os/tc_cdiv.c **** 	tcb->TCB_TC0.TC_RA = 1;
  40:src/os/tc_cdiv.c **** 	tcb->TCB_TC0.TC_RB = 1 + (div >> 1);
  23              		.loc 1 40 0
  24 0004 A018A0E1 		mov	r1, r0, lsr #17
  25              		.loc 1 36 0
  26 0008 5F2AE0E3 		mvn	r2, #389120
  27              		.loc 1 40 0
  28 000c 011081E2 		add	r1, r1, #1
  29              		.loc 1 35 0
  30 0010 2008A0E1 		mov	r0, r0, lsr #16
  31              	.LVL2:
  32              		.loc 1 39 0
  33 0014 0130A0E3 		mov	r3, #1
  34              		.loc 1 36 0
  35 0018 E30F02E5 		str	r0, [r2, #-4067]
  36              		.loc 1 35 0
  37              		@ lr needed for prologue
  38              		.loc 1 39 0
  39 001c EB3F02E5 		str	r3, [r2, #-4075]
  40              		.loc 1 40 0
  41 0020 E71F02E5 		str	r1, [r2, #-4071]
  41:src/os/tc_cdiv.c **** }
  42              		.loc 1 41 0
  43 0024 1EFF2FE1 		bx	lr
  44              	.LFE277:
  46              		.global	__umodsi3
  47              		.align	2
  48              		.global	tc_cdiv_phase_add
  50              	tc_cdiv_phase_add:
  51              	.LFB278:
  42:src/os/tc_cdiv.c **** 
  43:src/os/tc_cdiv.c **** void tc_cdiv_phase_add(int16_t inc)
  44:src/os/tc_cdiv.c **** {
  52              		.loc 1 44 0
  53              		@ args = 0, pretend = 0, frame = 0
  54              		@ frame_needed = 0, uses_anonymous_args = 0
  55              	.LVL3:
  56 0028 30402DE9 		stmfd	sp!, {r4, r5, lr}
  57              	.LCFI0:
  45:src/os/tc_cdiv.c **** 	tcb->TCB_TC0.TC_RA = (tcb->TCB_TC0.TC_RA + inc) % tcb->TCB_TC0.TC_RC;
  58              		.loc 1 45 0
  59 002c 5F5AE0E3 		mvn	r5, #389120
  60 0030 0048A0E1 		mov	r4, r0, asl #16
  61 0034 EB0F15E5 		ldr	r0, [r5, #-4075]
  62              	.LVL4:
  63 0038 4448A0E1 		mov	r4, r4, asr #16
  64 003c E31F15E5 		ldr	r1, [r5, #-4067]
  65 0040 040080E0 		add	r0, r0, r4
  66 0044 FEFFFFEB 		bl	__umodsi3
  67 0048 EB0F05E5 		str	r0, [r5, #-4075]
  46:src/os/tc_cdiv.c **** 	tcb->TCB_TC0.TC_RB = (tcb->TCB_TC0.TC_RB + inc) % tcb->TCB_TC0.TC_RC;
  68              		.loc 1 46 0
  69 004c E70F15E5 		ldr	r0, [r5, #-4071]
  70 0050 E31F15E5 		ldr	r1, [r5, #-4067]
  71 0054 000084E0 		add	r0, r4, r0
  72 0058 FEFFFFEB 		bl	__umodsi3
  73 005c E70F05E5 		str	r0, [r5, #-4071]
  47:src/os/tc_cdiv.c **** 
  48:src/os/tc_cdiv.c **** 	/* FIXME: can this be done more elegantly? */
  49:src/os/tc_cdiv.c **** 	if (tcb->TCB_TC0.TC_RA == 0) {
  74              		.loc 1 49 0
  75 0060 EB3F15E5 		ldr	r3, [r5, #-4075]
  76 0064 000053E3 		cmp	r3, #0
  77 0068 3080BD18 		ldmnefd	sp!, {r4, r5, pc}
  50:src/os/tc_cdiv.c **** 		tcb->TCB_TC0.TC_RA += 1;
  78              		.loc 1 50 0
  79 006c EB3F15E5 		ldr	r3, [r5, #-4075]
  80 0070 013083E2 		add	r3, r3, #1
  81 0074 EB3F05E5 		str	r3, [r5, #-4075]
  51:src/os/tc_cdiv.c **** 		tcb->TCB_TC0.TC_RB += 1;
  82              		.loc 1 51 0
  83 0078 E72F15E5 		ldr	r2, [r5, #-4071]
  84 007c 012082E2 		add	r2, r2, #1
  85 0080 E72F05E5 		str	r2, [r5, #-4071]
  86 0084 3080BDE8 		ldmfd	sp!, {r4, r5, pc}
  87              	.LFE278:
  89              		.align	2
  90              		.global	tc_cdiv_init
  92              	tc_cdiv_init:
  93              	.LFB279:
  52:src/os/tc_cdiv.c **** 	}
  53:src/os/tc_cdiv.c **** }
  54:src/os/tc_cdiv.c **** 
  55:src/os/tc_cdiv.c **** void tc_cdiv_init(void)
  56:src/os/tc_cdiv.c **** {
  94              		.loc 1 56 0
  95              		@ args = 0, pretend = 0, frame = 0
  96              		@ frame_needed = 0, uses_anonymous_args = 0
  97              	.LBB6:
  98              	.LBB7:
  99              		.file 2 "include/lib_AT91SAM7.h"
   1:include/lib_AT91SAM7.h **** //* ----------------------------------------------------------------------------
   2:include/lib_AT91SAM7.h **** //*         ATMEL Microcontroller Software Support  -  ROUSSET  -
   3:include/lib_AT91SAM7.h **** //* ----------------------------------------------------------------------------
   4:include/lib_AT91SAM7.h **** //* DISCLAIMER:  THIS SOFTWARE IS PROVIDED BY ATMEL "AS IS" AND ANY EXPRESS OR
   5:include/lib_AT91SAM7.h **** //* IMPLIED WARRANTIES, INCLUDING, BUT NOT LIMITED TO, THE IMPLIED WARRANTIES OF
   6:include/lib_AT91SAM7.h **** //* MERCHANTABILITY, FITNESS FOR A PARTICULAR PURPOSE AND NON-INFRINGEMENT ARE
   7:include/lib_AT91SAM7.h **** //* DISCLAIMED. IN NO EVENT SHALL ATMEL BE LIABLE FOR ANY DIRECT, INDIRECT,
   8:include/lib_AT91SAM7.h **** //* INCIDENTAL, SPECIAL, EXEMPLARY, OR CONSEQUENTIAL DAMAGES (INCLUDING, BUT NOT
   9:include/lib_AT91SAM7.h **** //* LIMITED TO, PROCUREMENT OF SUBSTITUTE GOODS OR SERVICES; LOSS OF USE, DATA,
  10:include/lib_AT91SAM7.h **** //* OR PROFITS; OR BUSINESS INTERRUPTION) HOWEVER CAUSED AND ON ANY THEORY OF
  11:include/lib_AT91SAM7.h **** //* LIABILITY, WHETHER IN CONTRACT, STRICT LIABILITY, OR TORT (INCLUDING
  12:include/lib_AT91SAM7.h **** //* NEGLIGENCE OR OTHERWISE) ARISING IN ANY WAY OUT OF THE USE OF THIS SOFTWARE,
  13:include/lib_AT91SAM7.h **** //* EVEN IF ADVISED OF THE POSSIBILITY OF SUCH DAMAGE.
  14:include/lib_AT91SAM7.h **** //* ----------------------------------------------------------------------------
  15:include/lib_AT91SAM7.h **** //* File Name           : lib_AT91SAM7S64.h
  16:include/lib_AT91SAM7.h **** //* Object              : AT91SAM7S64 inlined functions
  17:include/lib_AT91SAM7.h **** //* Generated           : AT91 SW Application Group  08/30/2005 (15:52:59)
  18:include/lib_AT91SAM7.h **** //*
  19:include/lib_AT91SAM7.h **** //* CVS Reference       : /lib_dbgu.h/1.1/Thu Aug 25 12:56:22 2005//
  20:include/lib_AT91SAM7.h **** //* CVS Reference       : /lib_pmc_SAM7S.h/1.4/Tue Aug 30 13:00:43 2005//
  21:include/lib_AT91SAM7.h **** //* CVS Reference       : /lib_VREG_6085B.h/1.1/Tue Feb  1 16:20:47 2005//
  22:include/lib_AT91SAM7.h **** //* CVS Reference       : /lib_rstc_6098A.h/1.1/Wed Oct  6 10:39:20 2004//
  23:include/lib_AT91SAM7.h **** //* CVS Reference       : /lib_ssc.h/1.4/Fri Jan 31 12:19:20 2003//
  24:include/lib_AT91SAM7.h **** //* CVS Reference       : /lib_wdtc_6080A.h/1.1/Wed Oct  6 10:38:30 2004//
  25:include/lib_AT91SAM7.h **** //* CVS Reference       : /lib_usart.h/1.5/Thu Nov 21 16:01:54 2002//
  26:include/lib_AT91SAM7.h **** //* CVS Reference       : /lib_spi2.h/1.2/Tue Aug 23 15:37:28 2005//
  27:include/lib_AT91SAM7.h **** //* CVS Reference       : /lib_pitc_6079A.h/1.2/Tue Nov  9 14:43:56 2004//
  28:include/lib_AT91SAM7.h **** //* CVS Reference       : /lib_aic_6075b.h/1.2/Thu Jul  7 07:48:22 2005//
  29:include/lib_AT91SAM7.h **** //* CVS Reference       : /lib_twi.h/1.3/Mon Jul 19 14:27:58 2004//
  30:include/lib_AT91SAM7.h **** //* CVS Reference       : /lib_adc.h/1.6/Fri Oct 17 09:12:38 2003//
  31:include/lib_AT91SAM7.h **** //* CVS Reference       : /lib_rttc_6081A.h/1.1/Wed Oct  6 10:39:38 2004//
  32:include/lib_AT91SAM7.h **** //* CVS Reference       : /lib_udp.h/1.5/Tue Aug 30 12:13:47 2005//
  33:include/lib_AT91SAM7.h **** //* CVS Reference       : /lib_tc_1753b.h/1.1/Fri Jan 31 12:20:02 2003//
  34:include/lib_AT91SAM7.h **** //* CVS Reference       : /lib_MC_SAM7S.h/1.1/Thu Mar 25 15:19:14 2004//
  35:include/lib_AT91SAM7.h **** //* CVS Reference       : /lib_pio.h/1.3/Fri Jan 31 12:18:56 2003//
  36:include/lib_AT91SAM7.h **** //* CVS Reference       : /lib_PWM_SAM.h/1.3/Thu Jan 22 10:10:50 2004//
  37:include/lib_AT91SAM7.h **** //* CVS Reference       : /lib_pdc.h/1.2/Tue Jul  2 13:29:40 2002//
  38:include/lib_AT91SAM7.h **** //* ----------------------------------------------------------------------------
  39:include/lib_AT91SAM7.h **** 
  40:include/lib_AT91SAM7.h **** #ifndef lib_AT91SAM7S64_H
  41:include/lib_AT91SAM7.h **** #define lib_AT91SAM7S64_H
  42:include/lib_AT91SAM7.h **** 
  43:include/lib_AT91SAM7.h **** #include <AT91SAM7.h>
  44:include/lib_AT91SAM7.h **** 
  45:include/lib_AT91SAM7.h **** /* *****************************************************************************
  46:include/lib_AT91SAM7.h ****                 SOFTWARE API FOR AIC
  47:include/lib_AT91SAM7.h ****    ***************************************************************************** */
  48:include/lib_AT91SAM7.h **** #define AT91C_AIC_BRANCH_OPCODE ((void (*) ()) 0xE51FFF20) // ldr, pc, [pc, #-&F20]
  49:include/lib_AT91SAM7.h **** 
  50:include/lib_AT91SAM7.h **** //*----------------------------------------------------------------------------
  51:include/lib_AT91SAM7.h **** //* \fn    AT91F_AIC_ConfigureIt
  52:include/lib_AT91SAM7.h **** //* \brief Interrupt Handler Initialization
  53:include/lib_AT91SAM7.h **** //*----------------------------------------------------------------------------
  54:include/lib_AT91SAM7.h **** extern unsigned int AT91F_AIC_ConfigureIt (
  55:include/lib_AT91SAM7.h **** 	AT91PS_AIC pAic,  // \arg pointer to the AIC registers
  56:include/lib_AT91SAM7.h **** 	unsigned int irq_id,     // \arg interrupt number to initialize
  57:include/lib_AT91SAM7.h **** 	unsigned int priority,   // \arg priority to give to the interrupt
  58:include/lib_AT91SAM7.h **** 	unsigned int src_type,   // \arg activation and sense of activation
  59:include/lib_AT91SAM7.h **** 	void (*newHandler) () ); // \arg address of the interrupt handler
  60:include/lib_AT91SAM7.h **** 
  61:include/lib_AT91SAM7.h **** //*----------------------------------------------------------------------------
  62:include/lib_AT91SAM7.h **** //* \fn    AT91F_AIC_EnableIt
  63:include/lib_AT91SAM7.h **** //* \brief Enable corresponding IT number
  64:include/lib_AT91SAM7.h **** //*----------------------------------------------------------------------------
  65:include/lib_AT91SAM7.h **** static inline void AT91F_AIC_EnableIt (
  66:include/lib_AT91SAM7.h **** 	AT91PS_AIC pAic,      // \arg pointer to the AIC registers
  67:include/lib_AT91SAM7.h **** 	unsigned int irq_id ) // \arg interrupt number to initialize
  68:include/lib_AT91SAM7.h **** {
  69:include/lib_AT91SAM7.h ****     //* Enable the interrupt on the interrupt controller
  70:include/lib_AT91SAM7.h ****     pAic->AIC_IECR = 0x1 << irq_id ;
  71:include/lib_AT91SAM7.h **** }
  72:include/lib_AT91SAM7.h **** 
  73:include/lib_AT91SAM7.h **** //*----------------------------------------------------------------------------
  74:include/lib_AT91SAM7.h **** //* \fn    AT91F_AIC_DisableIt
  75:include/lib_AT91SAM7.h **** //* \brief Disable corresponding IT number
  76:include/lib_AT91SAM7.h **** //*----------------------------------------------------------------------------
  77:include/lib_AT91SAM7.h **** static inline void AT91F_AIC_DisableIt (
  78:include/lib_AT91SAM7.h **** 	AT91PS_AIC pAic,      // \arg pointer to the AIC registers
  79:include/lib_AT91SAM7.h **** 	unsigned int irq_id ) // \arg interrupt number to initialize
  80:include/lib_AT91SAM7.h **** {
  81:include/lib_AT91SAM7.h ****     unsigned int mask = 0x1 << irq_id;
  82:include/lib_AT91SAM7.h ****     //* Disable the interrupt on the interrupt controller
  83:include/lib_AT91SAM7.h ****     pAic->AIC_IDCR = mask ;
  84:include/lib_AT91SAM7.h ****     //* Clear the interrupt on the Interrupt Controller ( if one is pending )
  85:include/lib_AT91SAM7.h ****     pAic->AIC_ICCR = mask ;
  86:include/lib_AT91SAM7.h **** }
  87:include/lib_AT91SAM7.h **** 
  88:include/lib_AT91SAM7.h **** //*----------------------------------------------------------------------------
  89:include/lib_AT91SAM7.h **** //* \fn    AT91F_AIC_ClearIt
  90:include/lib_AT91SAM7.h **** //* \brief Clear corresponding IT number
  91:include/lib_AT91SAM7.h **** //*----------------------------------------------------------------------------
  92:include/lib_AT91SAM7.h **** static inline void AT91F_AIC_ClearIt (
  93:include/lib_AT91SAM7.h **** 	AT91PS_AIC pAic,     // \arg pointer to the AIC registers
  94:include/lib_AT91SAM7.h **** 	unsigned int irq_id) // \arg interrupt number to initialize
  95:include/lib_AT91SAM7.h **** {
  96:include/lib_AT91SAM7.h ****     //* Clear the interrupt on the Interrupt Controller ( if one is pending )
  97:include/lib_AT91SAM7.h ****     pAic->AIC_ICCR = (0x1 << irq_id);
  98:include/lib_AT91SAM7.h **** }
  99:include/lib_AT91SAM7.h **** 
 100:include/lib_AT91SAM7.h **** //*----------------------------------------------------------------------------
 101:include/lib_AT91SAM7.h **** //* \fn    AT91F_AIC_AcknowledgeIt
 102:include/lib_AT91SAM7.h **** //* \brief Acknowledge corresponding IT number
 103:include/lib_AT91SAM7.h **** //*----------------------------------------------------------------------------
 104:include/lib_AT91SAM7.h **** static inline void AT91F_AIC_AcknowledgeIt (
 105:include/lib_AT91SAM7.h **** 	AT91PS_AIC pAic)     // \arg pointer to the AIC registers
 106:include/lib_AT91SAM7.h **** {
 107:include/lib_AT91SAM7.h ****     pAic->AIC_EOICR = pAic->AIC_EOICR;
 108:include/lib_AT91SAM7.h **** }
 109:include/lib_AT91SAM7.h **** 
 110:include/lib_AT91SAM7.h **** //*----------------------------------------------------------------------------
 111:include/lib_AT91SAM7.h **** //* \fn    AT91F_AIC_SetExceptionVector
 112:include/lib_AT91SAM7.h **** //* \brief Configure vector handler
 113:include/lib_AT91SAM7.h **** //*----------------------------------------------------------------------------
 114:include/lib_AT91SAM7.h **** extern unsigned int  AT91F_AIC_SetExceptionVector (
 115:include/lib_AT91SAM7.h **** 	unsigned int *pVector, // \arg pointer to the AIC registers
 116:include/lib_AT91SAM7.h **** 	void (*Handler) () );   // \arg Interrupt Handler
 117:include/lib_AT91SAM7.h **** 
 118:include/lib_AT91SAM7.h **** //*----------------------------------------------------------------------------
 119:include/lib_AT91SAM7.h **** //* \fn    AT91F_AIC_Trig
 120:include/lib_AT91SAM7.h **** //* \brief Trig an IT
 121:include/lib_AT91SAM7.h **** //*----------------------------------------------------------------------------
 122:include/lib_AT91SAM7.h **** static inline void  AT91F_AIC_Trig (
 123:include/lib_AT91SAM7.h **** 	AT91PS_AIC pAic,     // \arg pointer to the AIC registers
 124:include/lib_AT91SAM7.h **** 	unsigned int irq_id) // \arg interrupt number
 125:include/lib_AT91SAM7.h **** {
 126:include/lib_AT91SAM7.h **** 	pAic->AIC_ISCR = (0x1 << irq_id) ;
 127:include/lib_AT91SAM7.h **** }
 128:include/lib_AT91SAM7.h **** 
 129:include/lib_AT91SAM7.h **** //*----------------------------------------------------------------------------
 130:include/lib_AT91SAM7.h **** //* \fn    AT91F_AIC_IsActive
 131:include/lib_AT91SAM7.h **** //* \brief Test if an IT is active
 132:include/lib_AT91SAM7.h **** //*----------------------------------------------------------------------------
 133:include/lib_AT91SAM7.h **** static inline unsigned int  AT91F_AIC_IsActive (
 134:include/lib_AT91SAM7.h **** 	AT91PS_AIC pAic,     // \arg pointer to the AIC registers
 135:include/lib_AT91SAM7.h **** 	unsigned int irq_id) // \arg Interrupt Number
 136:include/lib_AT91SAM7.h **** {
 137:include/lib_AT91SAM7.h **** 	return (pAic->AIC_ISR & (0x1 << irq_id));
 138:include/lib_AT91SAM7.h **** }
 139:include/lib_AT91SAM7.h **** 
 140:include/lib_AT91SAM7.h **** //*----------------------------------------------------------------------------
 141:include/lib_AT91SAM7.h **** //* \fn    AT91F_AIC_IsPending
 142:include/lib_AT91SAM7.h **** //* \brief Test if an IT is pending
 143:include/lib_AT91SAM7.h **** //*----------------------------------------------------------------------------
 144:include/lib_AT91SAM7.h **** static inline unsigned int  AT91F_AIC_IsPending (
 145:include/lib_AT91SAM7.h **** 	AT91PS_AIC pAic,     // \arg pointer to the AIC registers
 146:include/lib_AT91SAM7.h **** 	unsigned int irq_id) // \arg Interrupt Number
 147:include/lib_AT91SAM7.h **** {
 148:include/lib_AT91SAM7.h **** 	return (pAic->AIC_IPR & (0x1 << irq_id));
 149:include/lib_AT91SAM7.h **** }
 150:include/lib_AT91SAM7.h **** 
 151:include/lib_AT91SAM7.h **** //*----------------------------------------------------------------------------
 152:include/lib_AT91SAM7.h **** //* \fn    AT91F_AIC_Open
 153:include/lib_AT91SAM7.h **** //* \brief Set exception vectors and AIC registers to default values
 154:include/lib_AT91SAM7.h **** //*----------------------------------------------------------------------------
 155:include/lib_AT91SAM7.h **** extern void AT91F_AIC_Open(
 156:include/lib_AT91SAM7.h **** 	AT91PS_AIC pAic,        // \arg pointer to the AIC registers
 157:include/lib_AT91SAM7.h **** 	void (*IrqHandler) (),  // \arg Default IRQ vector exception
 158:include/lib_AT91SAM7.h **** 	void (*FiqHandler) (),  // \arg Default FIQ vector exception
 159:include/lib_AT91SAM7.h **** 	void (*DefaultHandler)  (), // \arg Default Handler set in ISR
 160:include/lib_AT91SAM7.h **** 	void (*SpuriousHandler) (), // \arg Default Spurious Handler
 161:include/lib_AT91SAM7.h **** 	unsigned int protectMode);   // \arg Debug Control Register
 162:include/lib_AT91SAM7.h **** 
 163:include/lib_AT91SAM7.h **** /* *****************************************************************************
 164:include/lib_AT91SAM7.h ****                 SOFTWARE API FOR PDC
 165:include/lib_AT91SAM7.h ****    ***************************************************************************** */
 166:include/lib_AT91SAM7.h **** //*----------------------------------------------------------------------------
 167:include/lib_AT91SAM7.h **** //* \fn    AT91F_PDC_SetNextRx
 168:include/lib_AT91SAM7.h **** //* \brief Set the next receive transfer descriptor
 169:include/lib_AT91SAM7.h **** //*----------------------------------------------------------------------------
 170:include/lib_AT91SAM7.h **** static inline void AT91F_PDC_SetNextRx (
 171:include/lib_AT91SAM7.h **** 	AT91PS_PDC pPDC,     // \arg pointer to a PDC controller
 172:include/lib_AT91SAM7.h **** 	unsigned char *address,// \arg address to the next bloc to be received
 173:include/lib_AT91SAM7.h **** 	unsigned int bytes)  // \arg number of bytes to be received
 174:include/lib_AT91SAM7.h **** {
 175:include/lib_AT91SAM7.h **** 	pPDC->PDC_RNPR = (unsigned int) address;
 176:include/lib_AT91SAM7.h **** 	pPDC->PDC_RNCR = bytes;
 177:include/lib_AT91SAM7.h **** }
 178:include/lib_AT91SAM7.h **** 
 179:include/lib_AT91SAM7.h **** //*----------------------------------------------------------------------------
 180:include/lib_AT91SAM7.h **** //* \fn    AT91F_PDC_SetNextTx
 181:include/lib_AT91SAM7.h **** //* \brief Set the next transmit transfer descriptor
 182:include/lib_AT91SAM7.h **** //*----------------------------------------------------------------------------
 183:include/lib_AT91SAM7.h **** static inline void AT91F_PDC_SetNextTx (
 184:include/lib_AT91SAM7.h **** 	AT91PS_PDC pPDC,       // \arg pointer to a PDC controller
 185:include/lib_AT91SAM7.h **** 	const unsigned char *address,// \arg address to the next bloc to be transmitted
 186:include/lib_AT91SAM7.h **** 	unsigned int bytes)    // \arg number of bytes to be transmitted
 187:include/lib_AT91SAM7.h **** {
 188:include/lib_AT91SAM7.h **** 	pPDC->PDC_TNPR = (unsigned int) address;
 189:include/lib_AT91SAM7.h **** 	pPDC->PDC_TNCR = bytes;
 190:include/lib_AT91SAM7.h **** }
 191:include/lib_AT91SAM7.h **** 
 192:include/lib_AT91SAM7.h **** //*----------------------------------------------------------------------------
 193:include/lib_AT91SAM7.h **** //* \fn    AT91F_PDC_SetRx
 194:include/lib_AT91SAM7.h **** //* \brief Set the receive transfer descriptor
 195:include/lib_AT91SAM7.h **** //*----------------------------------------------------------------------------
 196:include/lib_AT91SAM7.h **** static inline void AT91F_PDC_SetRx (
 197:include/lib_AT91SAM7.h **** 	AT91PS_PDC pPDC,       // \arg pointer to a PDC controller
 198:include/lib_AT91SAM7.h **** 	unsigned char *address,// \arg address to the next bloc to be received
 199:include/lib_AT91SAM7.h **** 	unsigned int bytes)    // \arg number of bytes to be received
 200:include/lib_AT91SAM7.h **** {
 201:include/lib_AT91SAM7.h **** 	pPDC->PDC_RPR = (unsigned int) address;
 202:include/lib_AT91SAM7.h **** 	pPDC->PDC_RCR = bytes;
 203:include/lib_AT91SAM7.h **** }
 204:include/lib_AT91SAM7.h **** 
 205:include/lib_AT91SAM7.h **** //*----------------------------------------------------------------------------
 206:include/lib_AT91SAM7.h **** //* \fn    AT91F_PDC_SetTx
 207:include/lib_AT91SAM7.h **** //* \brief Set the transmit transfer descriptor
 208:include/lib_AT91SAM7.h **** //*----------------------------------------------------------------------------
 209:include/lib_AT91SAM7.h **** static inline void AT91F_PDC_SetTx (
 210:include/lib_AT91SAM7.h **** 	AT91PS_PDC pPDC,       // \arg pointer to a PDC controller
 211:include/lib_AT91SAM7.h **** 	const unsigned char *address,// \arg address to the next bloc to be transmitted
 212:include/lib_AT91SAM7.h **** 	unsigned int bytes)    // \arg number of bytes to be transmitted
 213:include/lib_AT91SAM7.h **** {
 214:include/lib_AT91SAM7.h **** 	pPDC->PDC_TPR = (unsigned int) address;
 215:include/lib_AT91SAM7.h **** 	pPDC->PDC_TCR = bytes;
 216:include/lib_AT91SAM7.h **** }
 217:include/lib_AT91SAM7.h **** 
 218:include/lib_AT91SAM7.h **** //*----------------------------------------------------------------------------
 219:include/lib_AT91SAM7.h **** //* \fn    AT91F_PDC_EnableTx
 220:include/lib_AT91SAM7.h **** //* \brief Enable transmit
 221:include/lib_AT91SAM7.h **** //*----------------------------------------------------------------------------
 222:include/lib_AT91SAM7.h **** static inline void AT91F_PDC_EnableTx (
 223:include/lib_AT91SAM7.h **** 	AT91PS_PDC pPDC )       // \arg pointer to a PDC controller
 224:include/lib_AT91SAM7.h **** {
 225:include/lib_AT91SAM7.h **** 	pPDC->PDC_PTCR = AT91C_PDC_TXTEN;
 226:include/lib_AT91SAM7.h **** }
 227:include/lib_AT91SAM7.h **** 
 228:include/lib_AT91SAM7.h **** //*----------------------------------------------------------------------------
 229:include/lib_AT91SAM7.h **** //* \fn    AT91F_PDC_EnableRx
 230:include/lib_AT91SAM7.h **** //* \brief Enable receive
 231:include/lib_AT91SAM7.h **** //*----------------------------------------------------------------------------
 232:include/lib_AT91SAM7.h **** static inline void AT91F_PDC_EnableRx (
 233:include/lib_AT91SAM7.h **** 	AT91PS_PDC pPDC )       // \arg pointer to a PDC controller
 234:include/lib_AT91SAM7.h **** {
 235:include/lib_AT91SAM7.h **** 	pPDC->PDC_PTCR = AT91C_PDC_RXTEN;
 236:include/lib_AT91SAM7.h **** }
 237:include/lib_AT91SAM7.h **** 
 238:include/lib_AT91SAM7.h **** //*----------------------------------------------------------------------------
 239:include/lib_AT91SAM7.h **** //* \fn    AT91F_PDC_DisableTx
 240:include/lib_AT91SAM7.h **** //* \brief Disable transmit
 241:include/lib_AT91SAM7.h **** //*----------------------------------------------------------------------------
 242:include/lib_AT91SAM7.h **** static inline void AT91F_PDC_DisableTx (
 243:include/lib_AT91SAM7.h **** 	AT91PS_PDC pPDC )       // \arg pointer to a PDC controller
 244:include/lib_AT91SAM7.h **** {
 245:include/lib_AT91SAM7.h **** 	pPDC->PDC_PTCR = AT91C_PDC_TXTDIS;
 246:include/lib_AT91SAM7.h **** }
 247:include/lib_AT91SAM7.h **** 
 248:include/lib_AT91SAM7.h **** //*----------------------------------------------------------------------------
 249:include/lib_AT91SAM7.h **** //* \fn    AT91F_PDC_DisableRx
 250:include/lib_AT91SAM7.h **** //* \brief Disable receive
 251:include/lib_AT91SAM7.h **** //*----------------------------------------------------------------------------
 252:include/lib_AT91SAM7.h **** static inline void AT91F_PDC_DisableRx (
 253:include/lib_AT91SAM7.h **** 	AT91PS_PDC pPDC )       // \arg pointer to a PDC controller
 254:include/lib_AT91SAM7.h **** {
 255:include/lib_AT91SAM7.h **** 	pPDC->PDC_PTCR = AT91C_PDC_RXTDIS;
 256:include/lib_AT91SAM7.h **** }
 257:include/lib_AT91SAM7.h **** 
 258:include/lib_AT91SAM7.h **** //*----------------------------------------------------------------------------
 259:include/lib_AT91SAM7.h **** //* \fn    AT91F_PDC_IsTxEmpty
 260:include/lib_AT91SAM7.h **** //* \brief Test if the current transfer descriptor has been sent
 261:include/lib_AT91SAM7.h **** //*----------------------------------------------------------------------------
 262:include/lib_AT91SAM7.h **** static inline int AT91F_PDC_IsTxEmpty ( // \return return 1 if transfer is complete
 263:include/lib_AT91SAM7.h **** 	AT91PS_PDC pPDC )       // \arg pointer to a PDC controller
 264:include/lib_AT91SAM7.h **** {
 265:include/lib_AT91SAM7.h **** 	return !(pPDC->PDC_TCR);
 266:include/lib_AT91SAM7.h **** }
 267:include/lib_AT91SAM7.h **** 
 268:include/lib_AT91SAM7.h **** //*----------------------------------------------------------------------------
 269:include/lib_AT91SAM7.h **** //* \fn    AT91F_PDC_IsNextTxEmpty
 270:include/lib_AT91SAM7.h **** //* \brief Test if the next transfer descriptor has been moved to the current td
 271:include/lib_AT91SAM7.h **** //*----------------------------------------------------------------------------
 272:include/lib_AT91SAM7.h **** static inline int AT91F_PDC_IsNextTxEmpty ( // \return return 1 if transfer is complete
 273:include/lib_AT91SAM7.h **** 	AT91PS_PDC pPDC )       // \arg pointer to a PDC controller
 274:include/lib_AT91SAM7.h **** {
 275:include/lib_AT91SAM7.h **** 	return !(pPDC->PDC_TNCR);
 276:include/lib_AT91SAM7.h **** }
 277:include/lib_AT91SAM7.h **** 
 278:include/lib_AT91SAM7.h **** //*----------------------------------------------------------------------------
 279:include/lib_AT91SAM7.h **** //* \fn    AT91F_PDC_IsRxEmpty
 280:include/lib_AT91SAM7.h **** //* \brief Test if the current transfer descriptor has been filled
 281:include/lib_AT91SAM7.h **** //*----------------------------------------------------------------------------
 282:include/lib_AT91SAM7.h **** static inline int AT91F_PDC_IsRxEmpty ( // \return return 1 if transfer is complete
 283:include/lib_AT91SAM7.h **** 	AT91PS_PDC pPDC )       // \arg pointer to a PDC controller
 284:include/lib_AT91SAM7.h **** {
 285:include/lib_AT91SAM7.h **** 	return !(pPDC->PDC_RCR);
 286:include/lib_AT91SAM7.h **** }
 287:include/lib_AT91SAM7.h **** 
 288:include/lib_AT91SAM7.h **** //*----------------------------------------------------------------------------
 289:include/lib_AT91SAM7.h **** //* \fn    AT91F_PDC_IsNextRxEmpty
 290:include/lib_AT91SAM7.h **** //* \brief Test if the next transfer descriptor has been moved to the current td
 291:include/lib_AT91SAM7.h **** //*----------------------------------------------------------------------------
 292:include/lib_AT91SAM7.h **** static inline int AT91F_PDC_IsNextRxEmpty ( // \return return 1 if transfer is complete
 293:include/lib_AT91SAM7.h **** 	AT91PS_PDC pPDC )       // \arg pointer to a PDC controller
 294:include/lib_AT91SAM7.h **** {
 295:include/lib_AT91SAM7.h **** 	return !(pPDC->PDC_RNCR);
 296:include/lib_AT91SAM7.h **** }
 297:include/lib_AT91SAM7.h **** 
 298:include/lib_AT91SAM7.h **** //*----------------------------------------------------------------------------
 299:include/lib_AT91SAM7.h **** //* \fn    AT91F_PDC_Open
 300:include/lib_AT91SAM7.h **** //* \brief Open PDC: disable TX and RX reset transfer descriptors, re-enable RX and TX
 301:include/lib_AT91SAM7.h **** //*----------------------------------------------------------------------------
 302:include/lib_AT91SAM7.h **** extern void AT91F_PDC_Open(AT91PS_PDC pPDC);      // \arg pointer to a PDC controller
 303:include/lib_AT91SAM7.h **** 
 304:include/lib_AT91SAM7.h **** //*----------------------------------------------------------------------------
 305:include/lib_AT91SAM7.h **** //* \fn    AT91F_PDC_Close
 306:include/lib_AT91SAM7.h **** //* \brief Close PDC: disable TX and RX reset transfer descriptors
 307:include/lib_AT91SAM7.h **** //*----------------------------------------------------------------------------
 308:include/lib_AT91SAM7.h **** extern void AT91F_PDC_Close(AT91PS_PDC pPDC);       // \arg pointer to a PDC controller
 309:include/lib_AT91SAM7.h **** 
 310:include/lib_AT91SAM7.h **** //*----------------------------------------------------------------------------
 311:include/lib_AT91SAM7.h **** //* \fn    AT91F_PDC_SendFrame
 312:include/lib_AT91SAM7.h **** //* \brief Close PDC: disable TX and RX reset transfer descriptors
 313:include/lib_AT91SAM7.h **** //*----------------------------------------------------------------------------
 314:include/lib_AT91SAM7.h **** extern unsigned int AT91F_PDC_SendFrame(
 315:include/lib_AT91SAM7.h **** 	AT91PS_PDC pPDC,
 316:include/lib_AT91SAM7.h **** 	const unsigned char *pBuffer,
 317:include/lib_AT91SAM7.h **** 	unsigned int szBuffer,
 318:include/lib_AT91SAM7.h **** 	const unsigned char *pNextBuffer,
 319:include/lib_AT91SAM7.h **** 	unsigned int szNextBuffer);
 320:include/lib_AT91SAM7.h **** 
 321:include/lib_AT91SAM7.h **** //*----------------------------------------------------------------------------
 322:include/lib_AT91SAM7.h **** //* \fn    AT91F_PDC_ReceiveFrame
 323:include/lib_AT91SAM7.h **** //* \brief Close PDC: disable TX and RX reset transfer descriptors
 324:include/lib_AT91SAM7.h **** //*----------------------------------------------------------------------------
 325:include/lib_AT91SAM7.h **** extern unsigned int AT91F_PDC_ReceiveFrame (
 326:include/lib_AT91SAM7.h **** 	AT91PS_PDC pPDC,
 327:include/lib_AT91SAM7.h **** 	unsigned char *pBuffer,
 328:include/lib_AT91SAM7.h **** 	unsigned int szBuffer,
 329:include/lib_AT91SAM7.h **** 	unsigned char *pNextBuffer,
 330:include/lib_AT91SAM7.h **** 	unsigned int szNextBuffer);
 331:include/lib_AT91SAM7.h **** 
 332:include/lib_AT91SAM7.h **** /* *****************************************************************************
 333:include/lib_AT91SAM7.h ****                 SOFTWARE API FOR DBGU
 334:include/lib_AT91SAM7.h ****    ***************************************************************************** */
 335:include/lib_AT91SAM7.h **** //*----------------------------------------------------------------------------
 336:include/lib_AT91SAM7.h **** //* \fn    AT91F_DBGU_InterruptEnable
 337:include/lib_AT91SAM7.h **** //* \brief Enable DBGU Interrupt
 338:include/lib_AT91SAM7.h **** //*----------------------------------------------------------------------------
 339:include/lib_AT91SAM7.h **** static inline void AT91F_DBGU_InterruptEnable(
 340:include/lib_AT91SAM7.h ****         AT91PS_DBGU pDbgu,   // \arg  pointer to a DBGU controller
 341:include/lib_AT91SAM7.h ****         unsigned int flag) // \arg  dbgu interrupt to be enabled
 342:include/lib_AT91SAM7.h **** {
 343:include/lib_AT91SAM7.h ****         pDbgu->DBGU_IER = flag;
 344:include/lib_AT91SAM7.h **** }
 345:include/lib_AT91SAM7.h **** 
 346:include/lib_AT91SAM7.h **** //*----------------------------------------------------------------------------
 347:include/lib_AT91SAM7.h **** //* \fn    AT91F_DBGU_InterruptDisable
 348:include/lib_AT91SAM7.h **** //* \brief Disable DBGU Interrupt
 349:include/lib_AT91SAM7.h **** //*----------------------------------------------------------------------------
 350:include/lib_AT91SAM7.h **** static inline void AT91F_DBGU_InterruptDisable(
 351:include/lib_AT91SAM7.h ****         AT91PS_DBGU pDbgu,   // \arg  pointer to a DBGU controller
 352:include/lib_AT91SAM7.h ****         unsigned int flag) // \arg  dbgu interrupt to be disabled
 353:include/lib_AT91SAM7.h **** {
 354:include/lib_AT91SAM7.h ****         pDbgu->DBGU_IDR = flag;
 355:include/lib_AT91SAM7.h **** }
 356:include/lib_AT91SAM7.h **** 
 357:include/lib_AT91SAM7.h **** //*----------------------------------------------------------------------------
 358:include/lib_AT91SAM7.h **** //* \fn    AT91F_DBGU_GetInterruptMaskStatus
 359:include/lib_AT91SAM7.h **** //* \brief Return DBGU Interrupt Mask Status
 360:include/lib_AT91SAM7.h **** //*----------------------------------------------------------------------------
 361:include/lib_AT91SAM7.h **** static inline unsigned int AT91F_DBGU_GetInterruptMaskStatus( // \return DBGU Interrupt Mask Status
 362:include/lib_AT91SAM7.h ****         AT91PS_DBGU pDbgu) // \arg  pointer to a DBGU controller
 363:include/lib_AT91SAM7.h **** {
 364:include/lib_AT91SAM7.h ****         return pDbgu->DBGU_IMR;
 365:include/lib_AT91SAM7.h **** }
 366:include/lib_AT91SAM7.h **** 
 367:include/lib_AT91SAM7.h **** //*----------------------------------------------------------------------------
 368:include/lib_AT91SAM7.h **** //* \fn    AT91F_DBGU_IsInterruptMasked
 369:include/lib_AT91SAM7.h **** //* \brief Test if DBGU Interrupt is Masked 
 370:include/lib_AT91SAM7.h **** //*----------------------------------------------------------------------------
 371:include/lib_AT91SAM7.h **** static inline int AT91F_DBGU_IsInterruptMasked(
 372:include/lib_AT91SAM7.h ****         AT91PS_DBGU pDbgu,   // \arg  pointer to a DBGU controller
 373:include/lib_AT91SAM7.h ****         unsigned int flag) // \arg  flag to be tested
 374:include/lib_AT91SAM7.h **** {
 375:include/lib_AT91SAM7.h ****         return (AT91F_DBGU_GetInterruptMaskStatus(pDbgu) & flag);
 376:include/lib_AT91SAM7.h **** }
 377:include/lib_AT91SAM7.h **** 
 378:include/lib_AT91SAM7.h **** /* *****************************************************************************
 379:include/lib_AT91SAM7.h ****                 SOFTWARE API FOR PIO
 380:include/lib_AT91SAM7.h ****    ***************************************************************************** */
 381:include/lib_AT91SAM7.h **** //*----------------------------------------------------------------------------
 382:include/lib_AT91SAM7.h **** //* \fn    AT91F_PIO_CfgPeriph
 383:include/lib_AT91SAM7.h **** //* \brief Enable pins to be drived by peripheral
 384:include/lib_AT91SAM7.h **** //*----------------------------------------------------------------------------
 385:include/lib_AT91SAM7.h **** static inline void AT91F_PIO_CfgPeriph(
 386:include/lib_AT91SAM7.h **** 	AT91PS_PIO pPio,             // \arg pointer to a PIO controller
 387:include/lib_AT91SAM7.h **** 	unsigned int periphAEnable,  // \arg PERIPH A to enable
 388:include/lib_AT91SAM7.h **** 	unsigned int periphBEnable)  // \arg PERIPH B to enable
 389:include/lib_AT91SAM7.h **** 
 390:include/lib_AT91SAM7.h **** {
 391:include/lib_AT91SAM7.h **** 	pPio->PIO_ASR = periphAEnable;
 100              		.loc 2 391 0
 101 0088 0B2CE0E3 		mvn	r2, #2816
 102 008c 0030A0E3 		mov	r3, #0
 103 0090 8F3002E5 		str	r3, [r2, #-143]
 104              	.LBE7:
 105              	.LBE6:
 106              		.loc 1 56 0
 107 0094 30402DE9 		stmfd	sp!, {r4, r5, lr}
 108              	.LCFI1:
 109              	.LBB8:
 110              	.LBB9:
 392:include/lib_AT91SAM7.h **** 	pPio->PIO_BSR = periphBEnable;
 111              		.loc 2 392 0
 112 0098 3302A0E3 		mov	r0, #805306371
 113              	.LBE9:
 114              	.LBE8:
  57:src/os/tc_cdiv.c **** 	/* Cfg PA28(TCLK1), PA0(TIOA0), PA1(TIOB0), PA20(TCLK2) as Periph B */
  58:src/os/tc_cdiv.c **** 	AT91F_PIO_CfgPeriph(AT91C_BASE_PIOA, 0, 
  59:src/os/tc_cdiv.c **** 			    OPENPCD_PIO_CARRIER_IN |
  60:src/os/tc_cdiv.c **** 			    OPENPCD_PIO_CARRIER_DIV_OUT |
  61:src/os/tc_cdiv.c **** 			    OPENPCD_PIO_CDIV_HELP_OUT |
  62:src/os/tc_cdiv.c **** 			    OPENPCD_PIO_CDIV_HELP_IN);
  63:src/os/tc_cdiv.c **** 
  64:src/os/tc_cdiv.c **** 	AT91F_PMC_EnablePeriphClock(AT91C_BASE_PMC, 
  65:src/os/tc_cdiv.c **** 				    ((unsigned int) 1 << AT91C_ID_TC0));
  66:src/os/tc_cdiv.c **** 
  67:src/os/tc_cdiv.c **** 	/* Enable Clock for TC0 */
  68:src/os/tc_cdiv.c **** 	tcb->TCB_TC0.TC_CCR = AT91C_TC_CLKEN;
 115              		.loc 1 68 0
 116 009c 5F4AE0E3 		mvn	r4, #389120
 117 00a0 0150A0E3 		mov	r5, #1
 118              	.LBB10:
 119              	.LBB11:
 393:include/lib_AT91SAM7.h **** 	pPio->PIO_PDR = (periphAEnable | periphBEnable); // Set in Periph mode
 394:include/lib_AT91SAM7.h **** }
 395:include/lib_AT91SAM7.h **** 
 396:include/lib_AT91SAM7.h **** //*----------------------------------------------------------------------------
 397:include/lib_AT91SAM7.h **** //* \fn    AT91F_PIO_CfgOutput
 398:include/lib_AT91SAM7.h **** //* \brief Enable PIO in output mode
 399:include/lib_AT91SAM7.h **** //*----------------------------------------------------------------------------
 400:include/lib_AT91SAM7.h **** static inline void AT91F_PIO_CfgOutput(
 401:include/lib_AT91SAM7.h **** 	AT91PS_PIO pPio,             // \arg pointer to a PIO controller
 402:include/lib_AT91SAM7.h **** 	unsigned int pioEnable)      // \arg PIO to be enabled
 403:include/lib_AT91SAM7.h **** {
 404:include/lib_AT91SAM7.h **** 	pPio->PIO_PER = pioEnable; // Set in PIO mode
 405:include/lib_AT91SAM7.h **** 	pPio->PIO_OER = pioEnable; // Configure in Output
 406:include/lib_AT91SAM7.h **** }
 407:include/lib_AT91SAM7.h **** 
 408:include/lib_AT91SAM7.h **** //*----------------------------------------------------------------------------
 409:include/lib_AT91SAM7.h **** //* \fn    AT91F_PIO_CfgInput
 410:include/lib_AT91SAM7.h **** //* \brief Enable PIO in input mode
 411:include/lib_AT91SAM7.h **** //*----------------------------------------------------------------------------
 412:include/lib_AT91SAM7.h **** static inline void AT91F_PIO_CfgInput(
 413:include/lib_AT91SAM7.h **** 	AT91PS_PIO pPio,             // \arg pointer to a PIO controller
 414:include/lib_AT91SAM7.h **** 	unsigned int inputEnable)      // \arg PIO to be enabled
 415:include/lib_AT91SAM7.h **** {
 416:include/lib_AT91SAM7.h **** 	// Disable output
 417:include/lib_AT91SAM7.h **** 	pPio->PIO_ODR  = inputEnable;
 418:include/lib_AT91SAM7.h **** 	pPio->PIO_PER  = inputEnable;
 419:include/lib_AT91SAM7.h **** }
 420:include/lib_AT91SAM7.h **** 
 421:include/lib_AT91SAM7.h **** //*----------------------------------------------------------------------------
 422:include/lib_AT91SAM7.h **** //* \fn    AT91F_PIO_CfgOpendrain
 423:include/lib_AT91SAM7.h **** //* \brief Configure PIO in open drain
 424:include/lib_AT91SAM7.h **** //*----------------------------------------------------------------------------
 425:include/lib_AT91SAM7.h **** static inline void AT91F_PIO_CfgOpendrain(
 426:include/lib_AT91SAM7.h **** 	AT91PS_PIO pPio,             // \arg pointer to a PIO controller
 427:include/lib_AT91SAM7.h **** 	unsigned int multiDrvEnable) // \arg pio to be configured in open drain
 428:include/lib_AT91SAM7.h **** {
 429:include/lib_AT91SAM7.h **** 	// Configure the multi-drive option
 430:include/lib_AT91SAM7.h **** 	pPio->PIO_MDDR = ~multiDrvEnable;
 431:include/lib_AT91SAM7.h **** 	pPio->PIO_MDER = multiDrvEnable;
 432:include/lib_AT91SAM7.h **** }
 433:include/lib_AT91SAM7.h **** 
 434:include/lib_AT91SAM7.h **** //*----------------------------------------------------------------------------
 435:include/lib_AT91SAM7.h **** //* \fn    AT91F_PIO_CfgPullup
 436:include/lib_AT91SAM7.h **** //* \brief Enable pullup on PIO
 437:include/lib_AT91SAM7.h **** //*----------------------------------------------------------------------------
 438:include/lib_AT91SAM7.h **** static inline void AT91F_PIO_CfgPullup(
 439:include/lib_AT91SAM7.h **** 	AT91PS_PIO pPio,             // \arg pointer to a PIO controller
 440:include/lib_AT91SAM7.h **** 	unsigned int pullupEnable)   // \arg enable pullup on PIO
 441:include/lib_AT91SAM7.h **** {
 442:include/lib_AT91SAM7.h **** 		// Connect or not Pullup
 443:include/lib_AT91SAM7.h **** 	pPio->PIO_PPUDR = ~pullupEnable;
 444:include/lib_AT91SAM7.h **** 	pPio->PIO_PPUER = pullupEnable;
 445:include/lib_AT91SAM7.h **** }
 446:include/lib_AT91SAM7.h **** 
 447:include/lib_AT91SAM7.h **** //*----------------------------------------------------------------------------
 448:include/lib_AT91SAM7.h **** //* \fn    AT91F_PIO_CfgDirectDrive
 449:include/lib_AT91SAM7.h **** //* \brief Enable direct drive on PIO
 450:include/lib_AT91SAM7.h **** //*----------------------------------------------------------------------------
 451:include/lib_AT91SAM7.h **** static inline void AT91F_PIO_CfgDirectDrive(
 452:include/lib_AT91SAM7.h **** 	AT91PS_PIO pPio,             // \arg pointer to a PIO controller
 453:include/lib_AT91SAM7.h **** 	unsigned int directDrive)    // \arg PIO to be configured with direct drive
 454:include/lib_AT91SAM7.h **** 
 455:include/lib_AT91SAM7.h **** {
 456:include/lib_AT91SAM7.h **** 	// Configure the Direct Drive
 457:include/lib_AT91SAM7.h **** 	pPio->PIO_OWDR  = ~directDrive;
 458:include/lib_AT91SAM7.h **** 	pPio->PIO_OWER  = directDrive;
 459:include/lib_AT91SAM7.h **** }
 460:include/lib_AT91SAM7.h **** 
 461:include/lib_AT91SAM7.h **** //*----------------------------------------------------------------------------
 462:include/lib_AT91SAM7.h **** //* \fn    AT91F_PIO_CfgInputFilter
 463:include/lib_AT91SAM7.h **** //* \brief Enable input filter on input PIO
 464:include/lib_AT91SAM7.h **** //*----------------------------------------------------------------------------
 465:include/lib_AT91SAM7.h **** static inline void AT91F_PIO_CfgInputFilter(
 466:include/lib_AT91SAM7.h **** 	AT91PS_PIO pPio,             // \arg pointer to a PIO controller
 467:include/lib_AT91SAM7.h **** 	unsigned int inputFilter)    // \arg PIO to be configured with input filter
 468:include/lib_AT91SAM7.h **** 
 469:include/lib_AT91SAM7.h **** {
 470:include/lib_AT91SAM7.h **** 	// Configure the Direct Drive
 471:include/lib_AT91SAM7.h **** 	pPio->PIO_IFDR  = ~inputFilter;
 472:include/lib_AT91SAM7.h **** 	pPio->PIO_IFER  = inputFilter;
 473:include/lib_AT91SAM7.h **** }
 474:include/lib_AT91SAM7.h **** 
 475:include/lib_AT91SAM7.h **** //*----------------------------------------------------------------------------
 476:include/lib_AT91SAM7.h **** //* \fn    AT91F_PIO_GetInput
 477:include/lib_AT91SAM7.h **** //* \brief Return PIO input value
 478:include/lib_AT91SAM7.h **** //*----------------------------------------------------------------------------
 479:include/lib_AT91SAM7.h **** static inline unsigned int AT91F_PIO_GetInput( // \return PIO input
 480:include/lib_AT91SAM7.h **** 	AT91PS_PIO pPio) // \arg  pointer to a PIO controller
 481:include/lib_AT91SAM7.h **** {
 482:include/lib_AT91SAM7.h **** 	return pPio->PIO_PDSR;
 483:include/lib_AT91SAM7.h **** }
 484:include/lib_AT91SAM7.h **** 
 485:include/lib_AT91SAM7.h **** //*----------------------------------------------------------------------------
 486:include/lib_AT91SAM7.h **** //* \fn    AT91F_PIO_IsInputSet
 487:include/lib_AT91SAM7.h **** //* \brief Test if PIO is input flag is active
 488:include/lib_AT91SAM7.h **** //*----------------------------------------------------------------------------
 489:include/lib_AT91SAM7.h **** static inline int AT91F_PIO_IsInputSet(
 490:include/lib_AT91SAM7.h **** 	AT91PS_PIO pPio,   // \arg  pointer to a PIO controller
 491:include/lib_AT91SAM7.h **** 	unsigned int flag) // \arg  flag to be tested
 492:include/lib_AT91SAM7.h **** {
 493:include/lib_AT91SAM7.h **** 	return (AT91F_PIO_GetInput(pPio) & flag);
 494:include/lib_AT91SAM7.h **** }
 495:include/lib_AT91SAM7.h **** 
 496:include/lib_AT91SAM7.h **** 
 497:include/lib_AT91SAM7.h **** //*----------------------------------------------------------------------------
 498:include/lib_AT91SAM7.h **** //* \fn    AT91F_PIO_SetOutput
 499:include/lib_AT91SAM7.h **** //* \brief Set to 1 output PIO
 500:include/lib_AT91SAM7.h **** //*----------------------------------------------------------------------------
 501:include/lib_AT91SAM7.h **** static inline void AT91F_PIO_SetOutput(
 502:include/lib_AT91SAM7.h **** 	const AT91PS_PIO pPio,   // \arg  pointer to a PIO controller
 503:include/lib_AT91SAM7.h **** 	const unsigned int flag) // \arg  output to be set
 504:include/lib_AT91SAM7.h **** {
 505:include/lib_AT91SAM7.h **** 	pPio->PIO_SODR = flag;
 506:include/lib_AT91SAM7.h **** }
 507:include/lib_AT91SAM7.h **** 
 508:include/lib_AT91SAM7.h **** //*----------------------------------------------------------------------------
 509:include/lib_AT91SAM7.h **** //* \fn    AT91F_PIO_ClearOutput
 510:include/lib_AT91SAM7.h **** //* \brief Set to 0 output PIO
 511:include/lib_AT91SAM7.h **** //*----------------------------------------------------------------------------
 512:include/lib_AT91SAM7.h **** static inline void AT91F_PIO_ClearOutput(
 513:include/lib_AT91SAM7.h **** 	AT91PS_PIO pPio,   // \arg  pointer to a PIO controller
 514:include/lib_AT91SAM7.h **** 	unsigned int flag) // \arg  output to be cleared
 515:include/lib_AT91SAM7.h **** {
 516:include/lib_AT91SAM7.h **** 	pPio->PIO_CODR = flag;
 517:include/lib_AT91SAM7.h **** }
 518:include/lib_AT91SAM7.h **** 
 519:include/lib_AT91SAM7.h **** //*----------------------------------------------------------------------------
 520:include/lib_AT91SAM7.h **** //* \fn    AT91F_PIO_ForceOutput
 521:include/lib_AT91SAM7.h **** //* \brief Force output when Direct drive option is enabled
 522:include/lib_AT91SAM7.h **** //*----------------------------------------------------------------------------
 523:include/lib_AT91SAM7.h **** static inline void AT91F_PIO_ForceOutput(
 524:include/lib_AT91SAM7.h **** 	AT91PS_PIO pPio,   // \arg  pointer to a PIO controller
 525:include/lib_AT91SAM7.h **** 	unsigned int flag) // \arg  output to be forced
 526:include/lib_AT91SAM7.h **** {
 527:include/lib_AT91SAM7.h **** 	pPio->PIO_ODSR = flag;
 528:include/lib_AT91SAM7.h **** }
 529:include/lib_AT91SAM7.h **** 
 530:include/lib_AT91SAM7.h **** //*----------------------------------------------------------------------------
 531:include/lib_AT91SAM7.h **** //* \fn    AT91F_PIO_Enable
 532:include/lib_AT91SAM7.h **** //* \brief Enable PIO
 533:include/lib_AT91SAM7.h **** //*----------------------------------------------------------------------------
 534:include/lib_AT91SAM7.h **** static inline void AT91F_PIO_Enable(
 535:include/lib_AT91SAM7.h ****         AT91PS_PIO pPio,   // \arg  pointer to a PIO controller
 536:include/lib_AT91SAM7.h ****         unsigned int flag) // \arg  pio to be enabled 
 537:include/lib_AT91SAM7.h **** {
 538:include/lib_AT91SAM7.h ****         pPio->PIO_PER = flag;
 539:include/lib_AT91SAM7.h **** }
 540:include/lib_AT91SAM7.h **** 
 541:include/lib_AT91SAM7.h **** //*----------------------------------------------------------------------------
 542:include/lib_AT91SAM7.h **** //* \fn    AT91F_PIO_Disable
 543:include/lib_AT91SAM7.h **** //* \brief Disable PIO
 544:include/lib_AT91SAM7.h **** //*----------------------------------------------------------------------------
 545:include/lib_AT91SAM7.h **** static inline void AT91F_PIO_Disable(
 546:include/lib_AT91SAM7.h ****         AT91PS_PIO pPio,   // \arg  pointer to a PIO controller
 547:include/lib_AT91SAM7.h ****         unsigned int flag) // \arg  pio to be disabled 
 548:include/lib_AT91SAM7.h **** {
 549:include/lib_AT91SAM7.h ****         pPio->PIO_PDR = flag;
 550:include/lib_AT91SAM7.h **** }
 551:include/lib_AT91SAM7.h **** 
 552:include/lib_AT91SAM7.h **** //*----------------------------------------------------------------------------
 553:include/lib_AT91SAM7.h **** //* \fn    AT91F_PIO_GetStatus
 554:include/lib_AT91SAM7.h **** //* \brief Return PIO Status
 555:include/lib_AT91SAM7.h **** //*----------------------------------------------------------------------------
 556:include/lib_AT91SAM7.h **** static inline unsigned int AT91F_PIO_GetStatus( // \return PIO Status
 557:include/lib_AT91SAM7.h ****         AT91PS_PIO pPio) // \arg  pointer to a PIO controller
 558:include/lib_AT91SAM7.h **** {
 559:include/lib_AT91SAM7.h ****         return pPio->PIO_PSR;
 560:include/lib_AT91SAM7.h **** }
 561:include/lib_AT91SAM7.h **** 
 562:include/lib_AT91SAM7.h **** //*----------------------------------------------------------------------------
 563:include/lib_AT91SAM7.h **** //* \fn    AT91F_PIO_IsSet
 564:include/lib_AT91SAM7.h **** //* \brief Test if PIO is Set
 565:include/lib_AT91SAM7.h **** //*----------------------------------------------------------------------------
 566:include/lib_AT91SAM7.h **** static inline int AT91F_PIO_IsSet(
 567:include/lib_AT91SAM7.h ****         AT91PS_PIO pPio,   // \arg  pointer to a PIO controller
 568:include/lib_AT91SAM7.h ****         unsigned int flag) // \arg  flag to be tested
 569:include/lib_AT91SAM7.h **** {
 570:include/lib_AT91SAM7.h ****         return (AT91F_PIO_GetStatus(pPio) & flag);
 571:include/lib_AT91SAM7.h **** }
 572:include/lib_AT91SAM7.h **** 
 573:include/lib_AT91SAM7.h **** //*----------------------------------------------------------------------------
 574:include/lib_AT91SAM7.h **** //* \fn    AT91F_PIO_OutputEnable
 575:include/lib_AT91SAM7.h **** //* \brief Output Enable PIO
 576:include/lib_AT91SAM7.h **** //*----------------------------------------------------------------------------
 577:include/lib_AT91SAM7.h **** static inline void AT91F_PIO_OutputEnable(
 578:include/lib_AT91SAM7.h ****         AT91PS_PIO pPio,   // \arg  pointer to a PIO controller
 579:include/lib_AT91SAM7.h ****         unsigned int flag) // \arg  pio output to be enabled
 580:include/lib_AT91SAM7.h **** {
 581:include/lib_AT91SAM7.h ****         pPio->PIO_OER = flag;
 582:include/lib_AT91SAM7.h **** }
 583:include/lib_AT91SAM7.h **** 
 584:include/lib_AT91SAM7.h **** //*----------------------------------------------------------------------------
 585:include/lib_AT91SAM7.h **** //* \fn    AT91F_PIO_OutputDisable
 586:include/lib_AT91SAM7.h **** //* \brief Output Enable PIO
 587:include/lib_AT91SAM7.h **** //*----------------------------------------------------------------------------
 588:include/lib_AT91SAM7.h **** static inline void AT91F_PIO_OutputDisable(
 589:include/lib_AT91SAM7.h ****         AT91PS_PIO pPio,   // \arg  pointer to a PIO controller
 590:include/lib_AT91SAM7.h ****         unsigned int flag) // \arg  pio output to be disabled
 591:include/lib_AT91SAM7.h **** {
 592:include/lib_AT91SAM7.h ****         pPio->PIO_ODR = flag;
 593:include/lib_AT91SAM7.h **** }
 594:include/lib_AT91SAM7.h **** 
 595:include/lib_AT91SAM7.h **** //*----------------------------------------------------------------------------
 596:include/lib_AT91SAM7.h **** //* \fn    AT91F_PIO_GetOutputStatus
 597:include/lib_AT91SAM7.h **** //* \brief Return PIO Output Status
 598:include/lib_AT91SAM7.h **** //*----------------------------------------------------------------------------
 599:include/lib_AT91SAM7.h **** static inline unsigned int AT91F_PIO_GetOutputStatus( // \return PIO Output Status
 600:include/lib_AT91SAM7.h ****         AT91PS_PIO pPio) // \arg  pointer to a PIO controller
 601:include/lib_AT91SAM7.h **** {
 602:include/lib_AT91SAM7.h ****         return pPio->PIO_OSR;
 603:include/lib_AT91SAM7.h **** }
 604:include/lib_AT91SAM7.h **** 
 605:include/lib_AT91SAM7.h **** //*----------------------------------------------------------------------------
 606:include/lib_AT91SAM7.h **** //* \fn    AT91F_PIO_IsOuputSet
 607:include/lib_AT91SAM7.h **** //* \brief Test if PIO Output is Set
 608:include/lib_AT91SAM7.h **** //*----------------------------------------------------------------------------
 609:include/lib_AT91SAM7.h **** static inline int AT91F_PIO_IsOutputSet(
 610:include/lib_AT91SAM7.h ****         AT91PS_PIO pPio,   // \arg  pointer to a PIO controller
 611:include/lib_AT91SAM7.h ****         unsigned int flag) // \arg  flag to be tested
 612:include/lib_AT91SAM7.h **** {
 613:include/lib_AT91SAM7.h ****         return (AT91F_PIO_GetOutputStatus(pPio) & flag);
 614:include/lib_AT91SAM7.h **** }
 615:include/lib_AT91SAM7.h **** 
 616:include/lib_AT91SAM7.h **** //*----------------------------------------------------------------------------
 617:include/lib_AT91SAM7.h **** //* \fn    AT91F_PIO_InputFilterEnable
 618:include/lib_AT91SAM7.h **** //* \brief Input Filter Enable PIO
 619:include/lib_AT91SAM7.h **** //*----------------------------------------------------------------------------
 620:include/lib_AT91SAM7.h **** static inline void AT91F_PIO_InputFilterEnable(
 621:include/lib_AT91SAM7.h ****         AT91PS_PIO pPio,   // \arg  pointer to a PIO controller
 622:include/lib_AT91SAM7.h ****         unsigned int flag) // \arg  pio input filter to be enabled
 623:include/lib_AT91SAM7.h **** {
 624:include/lib_AT91SAM7.h ****         pPio->PIO_IFER = flag;
 625:include/lib_AT91SAM7.h **** }
 626:include/lib_AT91SAM7.h **** 
 627:include/lib_AT91SAM7.h **** //*----------------------------------------------------------------------------
 628:include/lib_AT91SAM7.h **** //* \fn    AT91F_PIO_InputFilterDisable
 629:include/lib_AT91SAM7.h **** //* \brief Input Filter Disable PIO
 630:include/lib_AT91SAM7.h **** //*----------------------------------------------------------------------------
 631:include/lib_AT91SAM7.h **** static inline void AT91F_PIO_InputFilterDisable(
 632:include/lib_AT91SAM7.h ****         AT91PS_PIO pPio,   // \arg  pointer to a PIO controller
 633:include/lib_AT91SAM7.h ****         unsigned int flag) // \arg  pio input filter to be disabled
 634:include/lib_AT91SAM7.h **** {
 635:include/lib_AT91SAM7.h ****         pPio->PIO_IFDR = flag;
 636:include/lib_AT91SAM7.h **** }
 637:include/lib_AT91SAM7.h **** 
 638:include/lib_AT91SAM7.h **** //*----------------------------------------------------------------------------
 639:include/lib_AT91SAM7.h **** //* \fn    AT91F_PIO_GetInputFilterStatus
 640:include/lib_AT91SAM7.h **** //* \brief Return PIO Input Filter Status
 641:include/lib_AT91SAM7.h **** //*----------------------------------------------------------------------------
 642:include/lib_AT91SAM7.h **** static inline unsigned int AT91F_PIO_GetInputFilterStatus( // \return PIO Input Filter Status
 643:include/lib_AT91SAM7.h ****         AT91PS_PIO pPio) // \arg  pointer to a PIO controller
 644:include/lib_AT91SAM7.h **** {
 645:include/lib_AT91SAM7.h ****         return pPio->PIO_IFSR;
 646:include/lib_AT91SAM7.h **** }
 647:include/lib_AT91SAM7.h **** 
 648:include/lib_AT91SAM7.h **** //*----------------------------------------------------------------------------
 649:include/lib_AT91SAM7.h **** //* \fn    AT91F_PIO_IsInputFilterSet
 650:include/lib_AT91SAM7.h **** //* \brief Test if PIO Input filter is Set
 651:include/lib_AT91SAM7.h **** //*----------------------------------------------------------------------------
 652:include/lib_AT91SAM7.h **** static inline int AT91F_PIO_IsInputFilterSet(
 653:include/lib_AT91SAM7.h ****         AT91PS_PIO pPio,   // \arg  pointer to a PIO controller
 654:include/lib_AT91SAM7.h ****         unsigned int flag) // \arg  flag to be tested
 655:include/lib_AT91SAM7.h **** {
 656:include/lib_AT91SAM7.h ****         return (AT91F_PIO_GetInputFilterStatus(pPio) & flag);
 657:include/lib_AT91SAM7.h **** }
 658:include/lib_AT91SAM7.h **** 
 659:include/lib_AT91SAM7.h **** //*----------------------------------------------------------------------------
 660:include/lib_AT91SAM7.h **** //* \fn    AT91F_PIO_GetOutputDataStatus
 661:include/lib_AT91SAM7.h **** //* \brief Return PIO Output Data Status 
 662:include/lib_AT91SAM7.h **** //*----------------------------------------------------------------------------
 663:include/lib_AT91SAM7.h **** static inline unsigned int AT91F_PIO_GetOutputDataStatus( // \return PIO Output Data Status 
 664:include/lib_AT91SAM7.h **** 	AT91PS_PIO pPio) // \arg  pointer to a PIO controller
 665:include/lib_AT91SAM7.h **** {
 666:include/lib_AT91SAM7.h ****         return pPio->PIO_ODSR;
 667:include/lib_AT91SAM7.h **** }
 668:include/lib_AT91SAM7.h **** 
 669:include/lib_AT91SAM7.h **** //*----------------------------------------------------------------------------
 670:include/lib_AT91SAM7.h **** //* \fn    AT91F_PIO_InterruptEnable
 671:include/lib_AT91SAM7.h **** //* \brief Enable PIO Interrupt
 672:include/lib_AT91SAM7.h **** //*----------------------------------------------------------------------------
 673:include/lib_AT91SAM7.h **** static inline void AT91F_PIO_InterruptEnable(
 674:include/lib_AT91SAM7.h ****         AT91PS_PIO pPio,   // \arg  pointer to a PIO controller
 675:include/lib_AT91SAM7.h ****         unsigned int flag) // \arg  pio interrupt to be enabled
 676:include/lib_AT91SAM7.h **** {
 677:include/lib_AT91SAM7.h ****         pPio->PIO_IER = flag;
 678:include/lib_AT91SAM7.h **** }
 679:include/lib_AT91SAM7.h **** 
 680:include/lib_AT91SAM7.h **** //*----------------------------------------------------------------------------
 681:include/lib_AT91SAM7.h **** //* \fn    AT91F_PIO_InterruptDisable
 682:include/lib_AT91SAM7.h **** //* \brief Disable PIO Interrupt
 683:include/lib_AT91SAM7.h **** //*----------------------------------------------------------------------------
 684:include/lib_AT91SAM7.h **** static inline void AT91F_PIO_InterruptDisable(
 685:include/lib_AT91SAM7.h ****         AT91PS_PIO pPio,   // \arg  pointer to a PIO controller
 686:include/lib_AT91SAM7.h ****         unsigned int flag) // \arg  pio interrupt to be disabled
 687:include/lib_AT91SAM7.h **** {
 688:include/lib_AT91SAM7.h ****         pPio->PIO_IDR = flag;
 689:include/lib_AT91SAM7.h **** }
 690:include/lib_AT91SAM7.h **** 
 691:include/lib_AT91SAM7.h **** //*----------------------------------------------------------------------------
 692:include/lib_AT91SAM7.h **** //* \fn    AT91F_PIO_GetInterruptMaskStatus
 693:include/lib_AT91SAM7.h **** //* \brief Return PIO Interrupt Mask Status
 694:include/lib_AT91SAM7.h **** //*----------------------------------------------------------------------------
 695:include/lib_AT91SAM7.h **** static inline unsigned int AT91F_PIO_GetInterruptMaskStatus( // \return PIO Interrupt Mask Status
 696:include/lib_AT91SAM7.h ****         AT91PS_PIO pPio) // \arg  pointer to a PIO controller
 697:include/lib_AT91SAM7.h **** {
 698:include/lib_AT91SAM7.h ****         return pPio->PIO_IMR;
 699:include/lib_AT91SAM7.h **** }
 700:include/lib_AT91SAM7.h **** 
 701:include/lib_AT91SAM7.h **** //*----------------------------------------------------------------------------
 702:include/lib_AT91SAM7.h **** //* \fn    AT91F_PIO_GetInterruptStatus
 703:include/lib_AT91SAM7.h **** //* \brief Return PIO Interrupt Status
 704:include/lib_AT91SAM7.h **** //*----------------------------------------------------------------------------
 705:include/lib_AT91SAM7.h **** static inline unsigned int AT91F_PIO_GetInterruptStatus( // \return PIO Interrupt Status
 706:include/lib_AT91SAM7.h ****         AT91PS_PIO pPio) // \arg  pointer to a PIO controller
 707:include/lib_AT91SAM7.h **** {
 708:include/lib_AT91SAM7.h ****         return pPio->PIO_ISR;
 709:include/lib_AT91SAM7.h **** }
 710:include/lib_AT91SAM7.h **** 
 711:include/lib_AT91SAM7.h **** //*----------------------------------------------------------------------------
 712:include/lib_AT91SAM7.h **** //* \fn    AT91F_PIO_IsInterruptMasked
 713:include/lib_AT91SAM7.h **** //* \brief Test if PIO Interrupt is Masked 
 714:include/lib_AT91SAM7.h **** //*----------------------------------------------------------------------------
 715:include/lib_AT91SAM7.h **** static inline int AT91F_PIO_IsInterruptMasked(
 716:include/lib_AT91SAM7.h ****         AT91PS_PIO pPio,   // \arg  pointer to a PIO controller
 717:include/lib_AT91SAM7.h ****         unsigned int flag) // \arg  flag to be tested
 718:include/lib_AT91SAM7.h **** {
 719:include/lib_AT91SAM7.h ****         return (AT91F_PIO_GetInterruptMaskStatus(pPio) & flag);
 720:include/lib_AT91SAM7.h **** }
 721:include/lib_AT91SAM7.h **** 
 722:include/lib_AT91SAM7.h **** //*----------------------------------------------------------------------------
 723:include/lib_AT91SAM7.h **** //* \fn    AT91F_PIO_IsInterruptSet
 724:include/lib_AT91SAM7.h **** //* \brief Test if PIO Interrupt is Set
 725:include/lib_AT91SAM7.h **** //*----------------------------------------------------------------------------
 726:include/lib_AT91SAM7.h **** static inline int AT91F_PIO_IsInterruptSet(
 727:include/lib_AT91SAM7.h ****         AT91PS_PIO pPio,   // \arg  pointer to a PIO controller
 728:include/lib_AT91SAM7.h ****         unsigned int flag) // \arg  flag to be tested
 729:include/lib_AT91SAM7.h **** {
 730:include/lib_AT91SAM7.h ****         return (AT91F_PIO_GetInterruptStatus(pPio) & flag);
 731:include/lib_AT91SAM7.h **** }
 732:include/lib_AT91SAM7.h **** 
 733:include/lib_AT91SAM7.h **** //*----------------------------------------------------------------------------
 734:include/lib_AT91SAM7.h **** //* \fn    AT91F_PIO_MultiDriverEnable
 735:include/lib_AT91SAM7.h **** //* \brief Multi Driver Enable PIO
 736:include/lib_AT91SAM7.h **** //*----------------------------------------------------------------------------
 737:include/lib_AT91SAM7.h **** static inline void AT91F_PIO_MultiDriverEnable(
 738:include/lib_AT91SAM7.h ****         AT91PS_PIO pPio,   // \arg  pointer to a PIO controller
 739:include/lib_AT91SAM7.h ****         unsigned int flag) // \arg  pio to be enabled
 740:include/lib_AT91SAM7.h **** {
 741:include/lib_AT91SAM7.h ****         pPio->PIO_MDER = flag;
 742:include/lib_AT91SAM7.h **** }
 743:include/lib_AT91SAM7.h **** 
 744:include/lib_AT91SAM7.h **** //*----------------------------------------------------------------------------
 745:include/lib_AT91SAM7.h **** //* \fn    AT91F_PIO_MultiDriverDisable
 746:include/lib_AT91SAM7.h **** //* \brief Multi Driver Disable PIO
 747:include/lib_AT91SAM7.h **** //*----------------------------------------------------------------------------
 748:include/lib_AT91SAM7.h **** static inline void AT91F_PIO_MultiDriverDisable(
 749:include/lib_AT91SAM7.h ****         AT91PS_PIO pPio,   // \arg  pointer to a PIO controller
 750:include/lib_AT91SAM7.h ****         unsigned int flag) // \arg  pio to be disabled
 751:include/lib_AT91SAM7.h **** {
 752:include/lib_AT91SAM7.h ****         pPio->PIO_MDDR = flag;
 753:include/lib_AT91SAM7.h **** }
 754:include/lib_AT91SAM7.h **** 
 755:include/lib_AT91SAM7.h **** //*----------------------------------------------------------------------------
 756:include/lib_AT91SAM7.h **** //* \fn    AT91F_PIO_GetMultiDriverStatus
 757:include/lib_AT91SAM7.h **** //* \brief Return PIO Multi Driver Status
 758:include/lib_AT91SAM7.h **** //*----------------------------------------------------------------------------
 759:include/lib_AT91SAM7.h **** static inline unsigned int AT91F_PIO_GetMultiDriverStatus( // \return PIO Multi Driver Status
 760:include/lib_AT91SAM7.h ****         AT91PS_PIO pPio) // \arg  pointer to a PIO controller
 761:include/lib_AT91SAM7.h **** {
 762:include/lib_AT91SAM7.h ****         return pPio->PIO_MDSR;
 763:include/lib_AT91SAM7.h **** }
 764:include/lib_AT91SAM7.h **** 
 765:include/lib_AT91SAM7.h **** //*----------------------------------------------------------------------------
 766:include/lib_AT91SAM7.h **** //* \fn    AT91F_PIO_IsMultiDriverSet
 767:include/lib_AT91SAM7.h **** //* \brief Test if PIO MultiDriver is Set
 768:include/lib_AT91SAM7.h **** //*----------------------------------------------------------------------------
 769:include/lib_AT91SAM7.h **** static inline int AT91F_PIO_IsMultiDriverSet(
 770:include/lib_AT91SAM7.h ****         AT91PS_PIO pPio,   // \arg  pointer to a PIO controller
 771:include/lib_AT91SAM7.h ****         unsigned int flag) // \arg  flag to be tested
 772:include/lib_AT91SAM7.h **** {
 773:include/lib_AT91SAM7.h ****         return (AT91F_PIO_GetMultiDriverStatus(pPio) & flag);
 774:include/lib_AT91SAM7.h **** }
 775:include/lib_AT91SAM7.h **** 
 776:include/lib_AT91SAM7.h **** //*----------------------------------------------------------------------------
 777:include/lib_AT91SAM7.h **** //* \fn    AT91F_PIO_A_RegisterSelection
 778:include/lib_AT91SAM7.h **** //* \brief PIO A Register Selection 
 779:include/lib_AT91SAM7.h **** //*----------------------------------------------------------------------------
 780:include/lib_AT91SAM7.h **** static inline void AT91F_PIO_A_RegisterSelection(
 781:include/lib_AT91SAM7.h ****         AT91PS_PIO pPio,   // \arg  pointer to a PIO controller
 782:include/lib_AT91SAM7.h ****         unsigned int flag) // \arg  pio A register selection
 783:include/lib_AT91SAM7.h **** {
 784:include/lib_AT91SAM7.h ****         pPio->PIO_ASR = flag;
 785:include/lib_AT91SAM7.h **** }
 786:include/lib_AT91SAM7.h **** 
 787:include/lib_AT91SAM7.h **** //*----------------------------------------------------------------------------
 788:include/lib_AT91SAM7.h **** //* \fn    AT91F_PIO_B_RegisterSelection
 789:include/lib_AT91SAM7.h **** //* \brief PIO B Register Selection 
 790:include/lib_AT91SAM7.h **** //*----------------------------------------------------------------------------
 791:include/lib_AT91SAM7.h **** static inline void AT91F_PIO_B_RegisterSelection(
 792:include/lib_AT91SAM7.h ****         AT91PS_PIO pPio,   // \arg  pointer to a PIO controller
 793:include/lib_AT91SAM7.h ****         unsigned int flag) // \arg  pio B register selection 
 794:include/lib_AT91SAM7.h **** {
 795:include/lib_AT91SAM7.h ****         pPio->PIO_BSR = flag;
 796:include/lib_AT91SAM7.h **** }
 797:include/lib_AT91SAM7.h **** 
 798:include/lib_AT91SAM7.h **** //*----------------------------------------------------------------------------
 799:include/lib_AT91SAM7.h **** //* \fn    AT91F_PIO_Get_AB_RegisterStatus
 800:include/lib_AT91SAM7.h **** //* \brief Return PIO Interrupt Status
 801:include/lib_AT91SAM7.h **** //*----------------------------------------------------------------------------
 802:include/lib_AT91SAM7.h **** static inline unsigned int AT91F_PIO_Get_AB_RegisterStatus( // \return PIO AB Register Status
 803:include/lib_AT91SAM7.h ****         AT91PS_PIO pPio) // \arg  pointer to a PIO controller
 804:include/lib_AT91SAM7.h **** {
 805:include/lib_AT91SAM7.h ****         return pPio->PIO_ABSR;
 806:include/lib_AT91SAM7.h **** }
 807:include/lib_AT91SAM7.h **** 
 808:include/lib_AT91SAM7.h **** //*----------------------------------------------------------------------------
 809:include/lib_AT91SAM7.h **** //* \fn    AT91F_PIO_IsAB_RegisterSet
 810:include/lib_AT91SAM7.h **** //* \brief Test if PIO AB Register is Set
 811:include/lib_AT91SAM7.h **** //*----------------------------------------------------------------------------
 812:include/lib_AT91SAM7.h **** static inline int AT91F_PIO_IsAB_RegisterSet(
 813:include/lib_AT91SAM7.h ****         AT91PS_PIO pPio,   // \arg  pointer to a PIO controller
 814:include/lib_AT91SAM7.h ****         unsigned int flag) // \arg  flag to be tested
 815:include/lib_AT91SAM7.h **** {
 816:include/lib_AT91SAM7.h ****         return (AT91F_PIO_Get_AB_RegisterStatus(pPio) & flag);
 817:include/lib_AT91SAM7.h **** }
 818:include/lib_AT91SAM7.h **** 
 819:include/lib_AT91SAM7.h **** //*----------------------------------------------------------------------------
 820:include/lib_AT91SAM7.h **** //* \fn    AT91F_PIO_OutputWriteEnable
 821:include/lib_AT91SAM7.h **** //* \brief Output Write Enable PIO
 822:include/lib_AT91SAM7.h **** //*----------------------------------------------------------------------------
 823:include/lib_AT91SAM7.h **** static inline void AT91F_PIO_OutputWriteEnable(
 824:include/lib_AT91SAM7.h ****         AT91PS_PIO pPio,   // \arg  pointer to a PIO controller
 825:include/lib_AT91SAM7.h ****         unsigned int flag) // \arg  pio output write to be enabled
 826:include/lib_AT91SAM7.h **** {
 827:include/lib_AT91SAM7.h ****         pPio->PIO_OWER = flag;
 828:include/lib_AT91SAM7.h **** }
 829:include/lib_AT91SAM7.h **** 
 830:include/lib_AT91SAM7.h **** //*----------------------------------------------------------------------------
 831:include/lib_AT91SAM7.h **** //* \fn    AT91F_PIO_OutputWriteDisable
 832:include/lib_AT91SAM7.h **** //* \brief Output Write Disable PIO
 833:include/lib_AT91SAM7.h **** //*----------------------------------------------------------------------------
 834:include/lib_AT91SAM7.h **** static inline void AT91F_PIO_OutputWriteDisable(
 835:include/lib_AT91SAM7.h ****         AT91PS_PIO pPio,   // \arg  pointer to a PIO controller
 836:include/lib_AT91SAM7.h ****         unsigned int flag) // \arg  pio output write to be disabled
 837:include/lib_AT91SAM7.h **** {
 838:include/lib_AT91SAM7.h ****         pPio->PIO_OWDR = flag;
 839:include/lib_AT91SAM7.h **** }
 840:include/lib_AT91SAM7.h **** 
 841:include/lib_AT91SAM7.h **** //*----------------------------------------------------------------------------
 842:include/lib_AT91SAM7.h **** //* \fn    AT91F_PIO_GetOutputWriteStatus
 843:include/lib_AT91SAM7.h **** //* \brief Return PIO Output Write Status
 844:include/lib_AT91SAM7.h **** //*----------------------------------------------------------------------------
 845:include/lib_AT91SAM7.h **** static inline unsigned int AT91F_PIO_GetOutputWriteStatus( // \return PIO Output Write Status
 846:include/lib_AT91SAM7.h ****         AT91PS_PIO pPio) // \arg  pointer to a PIO controller
 847:include/lib_AT91SAM7.h **** {
 848:include/lib_AT91SAM7.h ****         return pPio->PIO_OWSR;
 849:include/lib_AT91SAM7.h **** }
 850:include/lib_AT91SAM7.h **** 
 851:include/lib_AT91SAM7.h **** //*----------------------------------------------------------------------------
 852:include/lib_AT91SAM7.h **** //* \fn    AT91F_PIO_IsOutputWriteSet
 853:include/lib_AT91SAM7.h **** //* \brief Test if PIO OutputWrite is Set
 854:include/lib_AT91SAM7.h **** //*----------------------------------------------------------------------------
 855:include/lib_AT91SAM7.h **** static inline int AT91F_PIO_IsOutputWriteSet(
 856:include/lib_AT91SAM7.h ****         AT91PS_PIO pPio,   // \arg  pointer to a PIO controller
 857:include/lib_AT91SAM7.h ****         unsigned int flag) // \arg  flag to be tested
 858:include/lib_AT91SAM7.h **** {
 859:include/lib_AT91SAM7.h ****         return (AT91F_PIO_GetOutputWriteStatus(pPio) & flag);
 860:include/lib_AT91SAM7.h **** }
 861:include/lib_AT91SAM7.h **** 
 862:include/lib_AT91SAM7.h **** //*----------------------------------------------------------------------------
 863:include/lib_AT91SAM7.h **** //* \fn    AT91F_PIO_GetCfgPullup
 864:include/lib_AT91SAM7.h **** //* \brief Return PIO Configuration Pullup
 865:include/lib_AT91SAM7.h **** //*----------------------------------------------------------------------------
 866:include/lib_AT91SAM7.h **** static inline unsigned int AT91F_PIO_GetCfgPullup( // \return PIO Configuration Pullup 
 867:include/lib_AT91SAM7.h ****         AT91PS_PIO pPio) // \arg  pointer to a PIO controller
 868:include/lib_AT91SAM7.h **** {
 869:include/lib_AT91SAM7.h ****         return pPio->PIO_PPUSR;
 870:include/lib_AT91SAM7.h **** }
 871:include/lib_AT91SAM7.h **** 
 872:include/lib_AT91SAM7.h **** //*----------------------------------------------------------------------------
 873:include/lib_AT91SAM7.h **** //* \fn    AT91F_PIO_IsOutputDataStatusSet
 874:include/lib_AT91SAM7.h **** //* \brief Test if PIO Output Data Status is Set 
 875:include/lib_AT91SAM7.h **** //*----------------------------------------------------------------------------
 876:include/lib_AT91SAM7.h **** static inline int AT91F_PIO_IsOutputDataStatusSet(
 877:include/lib_AT91SAM7.h ****         AT91PS_PIO pPio,   // \arg  pointer to a PIO controller
 878:include/lib_AT91SAM7.h ****         unsigned int flag) // \arg  flag to be tested
 879:include/lib_AT91SAM7.h **** {
 880:include/lib_AT91SAM7.h ****         return (AT91F_PIO_GetOutputDataStatus(pPio) & flag);
 881:include/lib_AT91SAM7.h **** }
 882:include/lib_AT91SAM7.h **** 
 883:include/lib_AT91SAM7.h **** //*----------------------------------------------------------------------------
 884:include/lib_AT91SAM7.h **** //* \fn    AT91F_PIO_IsCfgPullupStatusSet
 885:include/lib_AT91SAM7.h **** //* \brief Test if PIO Configuration Pullup Status is Set
 886:include/lib_AT91SAM7.h **** //*----------------------------------------------------------------------------
 887:include/lib_AT91SAM7.h **** static inline int AT91F_PIO_IsCfgPullupStatusSet(
 888:include/lib_AT91SAM7.h ****         AT91PS_PIO pPio,   // \arg  pointer to a PIO controller
 889:include/lib_AT91SAM7.h ****         unsigned int flag) // \arg  flag to be tested
 890:include/lib_AT91SAM7.h **** {
 891:include/lib_AT91SAM7.h ****         return (~AT91F_PIO_GetCfgPullup(pPio) & flag);
 892:include/lib_AT91SAM7.h **** }
 893:include/lib_AT91SAM7.h **** 
 894:include/lib_AT91SAM7.h **** /* *****************************************************************************
 895:include/lib_AT91SAM7.h ****                 SOFTWARE API FOR PMC
 896:include/lib_AT91SAM7.h ****    ***************************************************************************** */
 897:include/lib_AT91SAM7.h **** //*----------------------------------------------------------------------------
 898:include/lib_AT91SAM7.h **** //* \fn    AT91F_PMC_CfgSysClkEnableReg
 899:include/lib_AT91SAM7.h **** //* \brief Configure the System Clock Enable Register of the PMC controller
 900:include/lib_AT91SAM7.h **** //*----------------------------------------------------------------------------
 901:include/lib_AT91SAM7.h **** static inline void AT91F_PMC_CfgSysClkEnableReg (
 902:include/lib_AT91SAM7.h **** 	AT91PS_PMC pPMC, // \arg pointer to PMC controller
 903:include/lib_AT91SAM7.h **** 	unsigned int mode)
 904:include/lib_AT91SAM7.h **** {
 905:include/lib_AT91SAM7.h **** 	//* Write to the SCER register
 906:include/lib_AT91SAM7.h **** 	pPMC->PMC_SCER = mode;
 907:include/lib_AT91SAM7.h **** }
 908:include/lib_AT91SAM7.h **** 
 909:include/lib_AT91SAM7.h **** //*----------------------------------------------------------------------------
 910:include/lib_AT91SAM7.h **** //* \fn    AT91F_PMC_CfgSysClkDisableReg
 911:include/lib_AT91SAM7.h **** //* \brief Configure the System Clock Disable Register of the PMC controller
 912:include/lib_AT91SAM7.h **** //*----------------------------------------------------------------------------
 913:include/lib_AT91SAM7.h **** static inline void AT91F_PMC_CfgSysClkDisableReg (
 914:include/lib_AT91SAM7.h **** 	AT91PS_PMC pPMC, // \arg pointer to PMC controller
 915:include/lib_AT91SAM7.h **** 	unsigned int mode)
 916:include/lib_AT91SAM7.h **** {
 917:include/lib_AT91SAM7.h **** 	//* Write to the SCDR register
 918:include/lib_AT91SAM7.h **** 	pPMC->PMC_SCDR = mode;
 919:include/lib_AT91SAM7.h **** }
 920:include/lib_AT91SAM7.h **** 
 921:include/lib_AT91SAM7.h **** //*----------------------------------------------------------------------------
 922:include/lib_AT91SAM7.h **** //* \fn    AT91F_PMC_GetSysClkStatusReg
 923:include/lib_AT91SAM7.h **** //* \brief Return the System Clock Status Register of the PMC controller
 924:include/lib_AT91SAM7.h **** //*----------------------------------------------------------------------------
 925:include/lib_AT91SAM7.h **** static inline unsigned int AT91F_PMC_GetSysClkStatusReg (
 926:include/lib_AT91SAM7.h **** 	AT91PS_PMC pPMC // pointer to a CAN controller
 927:include/lib_AT91SAM7.h **** 	)
 928:include/lib_AT91SAM7.h **** {
 929:include/lib_AT91SAM7.h **** 	return pPMC->PMC_SCSR;
 930:include/lib_AT91SAM7.h **** }
 931:include/lib_AT91SAM7.h **** 
 932:include/lib_AT91SAM7.h **** //*----------------------------------------------------------------------------
 933:include/lib_AT91SAM7.h **** //* \fn    AT91F_PMC_EnablePeriphClock
 934:include/lib_AT91SAM7.h **** //* \brief Enable peripheral clock
 935:include/lib_AT91SAM7.h **** //*----------------------------------------------------------------------------
 936:include/lib_AT91SAM7.h **** static inline void AT91F_PMC_EnablePeriphClock (
 937:include/lib_AT91SAM7.h **** 	AT91PS_PMC pPMC, // \arg pointer to PMC controller
 938:include/lib_AT91SAM7.h **** 	unsigned int periphIds)  // \arg IDs of peripherals to enable
 939:include/lib_AT91SAM7.h **** {
 940:include/lib_AT91SAM7.h **** 	pPMC->PMC_PCER = periphIds;
 120              		.loc 2 940 0
 121 00a4 011AA0E3 		mov	r1, #4096
 122 00a8 033CE0E3 		mvn	r3, #768
 123              	.LBE11:
 124              	.LBE10:
 125              	.LBB12:
 126              	.LBB13:
 127              		.loc 2 392 0
 128 00ac 8B0002E5 		str	r0, [r2, #-139]
 129              		.loc 2 393 0
 130 00b0 FB0002E5 		str	r0, [r2, #-251]
 131              	.LBE13:
 132              	.LBE12:
 133              	.LBB14:
 134              	.LBB15:
 135              		.loc 2 940 0
 136 00b4 EF1003E5 		str	r1, [r3, #-239]
 137              	.LBE15:
 138              	.LBE14:
 139              		.loc 1 68 0
 140 00b8 FF5F04E5 		str	r5, [r4, #-4095]
  69:src/os/tc_cdiv.c **** 
  70:src/os/tc_cdiv.c **** 	/* Connect TCLK1 to XC1, TCLK2 to XC2 */
  71:src/os/tc_cdiv.c **** 	tcb->TCB_BMR &= ~(AT91C_TCB_TC1XC1S | AT91C_TCB_TC2XC2S);
 141              		.loc 1 71 0
 142 00bc 3B3F14E5 		ldr	r3, [r4, #-3899]
 143 00c0 3C30C3E3 		bic	r3, r3, #60
 144 00c4 3B3F04E5 		str	r3, [r4, #-3899]
  72:src/os/tc_cdiv.c **** 	tcb->TCB_BMR |=  (AT91C_TCB_TC1XC1S_TCLK1 | AT91C_TCB_TC2XC2S_TCLK2);
  73:src/os/tc_cdiv.c **** 
  74:src/os/tc_cdiv.c **** 	/* Clock XC1, Wave mode, Reset on RC comp
  75:src/os/tc_cdiv.c **** 	 * TIOA0 on RA comp = set, * TIOA0 on RC comp = clear,
  76:src/os/tc_cdiv.c **** 	 * TIOB0 on EEVT = set, TIOB0 on RB comp = clear,
  77:src/os/tc_cdiv.c **** 	 * EEVT = XC2 (TIOA0) */
  78:src/os/tc_cdiv.c **** 	tcb->TCB_TC0.TC_CMR = AT91C_TC_CLKS_XC1 | AT91C_TC_WAVE |
 145              		.loc 1 78 0
 146 00c8 18309FE5 		ldr	r3, .L10
 147              		.loc 1 72 0
 148 00cc 3B2F14E5 		ldr	r2, [r4, #-3899]
  79:src/os/tc_cdiv.c **** 			      AT91C_TC_WAVESEL_UP_AUTO | 
  80:src/os/tc_cdiv.c **** 			      AT91C_TC_ACPA_SET | AT91C_TC_ACPC_CLEAR |
  81:src/os/tc_cdiv.c **** 			      AT91C_TC_BEEVT_SET | AT91C_TC_BCPB_CLEAR |
  82:src/os/tc_cdiv.c **** 			      AT91C_TC_EEVT_XC2 | AT91C_TC_ETRGEDG_RISING |
  83:src/os/tc_cdiv.c **** 			      AT91C_TC_BSWTRG_CLEAR | AT91C_TC_ASWTRG_CLEAR;
  84:src/os/tc_cdiv.c **** 
  85:src/os/tc_cdiv.c **** 	tc_cdiv_set_divider(128);
 149              		.loc 1 85 0
 150 00d0 8000A0E3 		mov	r0, #128
 151              		.loc 1 72 0
 152 00d4 3B2F04E5 		str	r2, [r4, #-3899]
 153              		.loc 1 78 0
 154 00d8 FB3F04E5 		str	r3, [r4, #-4091]
 155              		.loc 1 85 0
 156 00dc FEFFFFEB 		bl	tc_cdiv_set_divider
  86:src/os/tc_cdiv.c **** 
  87:src/os/tc_cdiv.c **** 	/* Reset to start timers */
  88:src/os/tc_cdiv.c **** 	tcb->TCB_BCR = 1;
 157              		.loc 1 88 0
 158 00e0 3F5F04E5 		str	r5, [r4, #-3903]
  89:src/os/tc_cdiv.c **** }
 159              		.loc 1 89 0
 160 00e4 3080BDE8 		ldmfd	sp!, {r4, r5, pc}
 161              	.L11:
 162              		.align	2
 163              	.L10:
 164 00e8 06CD8992 		.word	-1836462842
 165              	.LFE279:
 167              		.align	2
 168              		.global	tc_cdiv_print
 170              	tc_cdiv_print:
 171              	.LFB280:
  90:src/os/tc_cdiv.c **** 
  91:src/os/tc_cdiv.c **** void tc_cdiv_print(void)
  92:src/os/tc_cdiv.c **** {
 172              		.loc 1 92 0
 173              		@ args = 0, pretend = 0, frame = 0
 174              		@ frame_needed = 0, uses_anonymous_args = 0
 175              		@ link register save eliminated.
 176              		@ lr needed for prologue
  93:src/os/tc_cdiv.c **** 	DEBUGP("TCB_BMR=0x%08x ", tcb->TCB_BMR);
  94:src/os/tc_cdiv.c **** 	DEBUGP("TC0_CV=0x%08x ", tcb->TCB_TC0.TC_CV);
  95:src/os/tc_cdiv.c **** 	DEBUGP("TC0_CMR=0x%08x ", tcb->TCB_TC0.TC_CMR);
  96:src/os/tc_cdiv.c **** 	DEBUGPCR("TC0_SR=0x%08x", tcb->TCB_TC0.TC_SR);
  97:src/os/tc_cdiv.c **** 
  98:src/os/tc_cdiv.c **** 	DEBUGPCR("TC0_RA=0x%04x, TC0_RB=0x%04x, TC0_RC=0x%04x",
  99:src/os/tc_cdiv.c **** 		 tcb->TCB_TC0.TC_RA, tcb->TCB_TC0.TC_RB, tcb->TCB_TC0.TC_RC);
 100:src/os/tc_cdiv.c **** }
 177              		.loc 1 100 0
 178 00ec 1EFF2FE1 		bx	lr
 179              	.LFE280:
 181              		.align	2
 182              		.global	tc_cdiv_fini
 184              	tc_cdiv_fini:
 185              	.LFB281:
 101:src/os/tc_cdiv.c **** 
 102:src/os/tc_cdiv.c **** void tc_cdiv_fini(void)
 103:src/os/tc_cdiv.c **** {
 186              		.loc 1 103 0
 187              		@ args = 0, pretend = 0, frame = 0
 188              		@ frame_needed = 0, uses_anonymous_args = 0
 189              		@ link register save eliminated.
 104:src/os/tc_cdiv.c **** 	tcb->TCB_TC0.TC_CCR = AT91C_TC_CLKDIS;
 190              		.loc 1 104 0
 191 00f0 5F3AE0E3 		mvn	r3, #389120
 192 00f4 0220A0E3 		mov	r2, #2
 193 00f8 FF2F03E5 		str	r2, [r3, #-4095]
 194              	.LBB18:
 195              	.LBB19:
 941:include/lib_AT91SAM7.h **** }
 942:include/lib_AT91SAM7.h **** 
 943:include/lib_AT91SAM7.h **** //*----------------------------------------------------------------------------
 944:include/lib_AT91SAM7.h **** //* \fn    AT91F_PMC_DisablePeriphClock
 945:include/lib_AT91SAM7.h **** //* \brief Disable peripheral clock
 946:include/lib_AT91SAM7.h **** //*----------------------------------------------------------------------------
 947:include/lib_AT91SAM7.h **** static inline void AT91F_PMC_DisablePeriphClock (
 948:include/lib_AT91SAM7.h **** 	AT91PS_PMC pPMC, // \arg pointer to PMC controller
 949:include/lib_AT91SAM7.h **** 	unsigned int periphIds)  // \arg IDs of peripherals to enable
 950:include/lib_AT91SAM7.h **** {
 951:include/lib_AT91SAM7.h **** 	pPMC->PMC_PCDR = periphIds;
 196              		.loc 2 951 0
 197 00fc 011AA0E3 		mov	r1, #4096
 198 0100 033CE0E3 		mvn	r3, #768
 199              	.LBE19:
 200              	.LBE18:
 201              		.loc 1 103 0
 202              		@ lr needed for prologue
 203              	.LBB20:
 204              	.LBB21:
 205              		.loc 2 951 0
 206 0104 EB1003E5 		str	r1, [r3, #-235]
 207              	.LBE21:
 208              	.LBE20:
 105:src/os/tc_cdiv.c **** 	AT91F_PMC_DisablePeriphClock(AT91C_BASE_PMC,
 106:src/os/tc_cdiv.c **** 				     ((unsigned int) 1 << AT91C_ID_TC0));
 107:src/os/tc_cdiv.c **** }
 209              		.loc 1 107 0
 210 0108 1EFF2FE1 		bx	lr
 211              	.LFE281:
 291              	.Letext0:
DEFINED SYMBOLS
                            *ABS*:00000000 tc_cdiv.c
     /tmp/cc3Es29o.s:13     .text:00000000 tc_cdiv_set_divider
     /tmp/cc3Es29o.s:21     .text:00000000 $a
     /tmp/cc3Es29o.s:50     .text:00000028 tc_cdiv_phase_add
     /tmp/cc3Es29o.s:92     .text:00000088 tc_cdiv_init
     /tmp/cc3Es29o.s:164    .text:000000e8 $d
     /tmp/cc3Es29o.s:170    .text:000000ec tc_cdiv_print
     /tmp/cc3Es29o.s:178    .text:000000ec $a
     /tmp/cc3Es29o.s:184    .text:000000f0 tc_cdiv_fini

UNDEFINED SYMBOLS
__umodsi3
