SplineFontDB: 1.0
FontName: KBoard_fantasy
FullName: KBoard_fantasy
FamilyName: KBoard_fantasy
Weight: Medium
Copyright: Created by Monge Maurizio with FontForge 1.0 (http://fontforge.sf.net)
Comments: 2006-10-15: Created.
Version: 001.000
ItalicAngle: 0
UnderlinePosition: -100
UnderlineWidth: 50
Ascent: 800
Descent: 200
NeedsXUIDChange: 1
XUID: [1021 645 1811818106 7095199]
FSType: 0
CreationTime: 1160940435
ModificationTime: 1160942325
OS2TypoAscent: 0
OS2TypoAOffset: 1
OS2TypoDescent: 0
OS2TypoDOffset: 1
OS2TypoLinegap: 90
OS2WinAscent: 0
OS2WinAOffset: 1
OS2WinDescent: 0
OS2WinDOffset: 1
HheadAscent: 0
HheadAOffset: 1
HheadDescent: 0
HheadDOffset: 1
OS2Vendor: 'PfEd'
TtfTable: cvt  4
!$MDh
EndTtf
Encoding: ISO8859-1
UnicodeInterp: none
NameList: Adobe Glyph List
DisplaySize: -36
AntiAlias: 1
FitToEm: 1
WinInfo: 56 28 7
BeginChars: 256 6
StartChar: b
Encoding: 98 98 0
Width: 1000
VWidth: 1050
Flags: HO
TeX: 0 0 0 0
HStem: -8.5625 40<218.008 384.809 471.262 687.496> 46.5817 36.3245<140.961 227.356> 49.1929 39.8071<643.986 719.243> 71.3438 64.5<341.854 507.645> 95.8438 15.5<338.774 509.714> 159.938 40<317.437 525.223> 441.76 40.928<429.74 456.022>
VStem: 175.844 39.937<302.476 412.297> 264.75 39.969<128.658 157.683> 541.219 39.937<127.562 160.272> 623.718 39.8131<342.105 481.557>
Fore
576.375 47.875 m 0
 565.317 50.9414 534.45 73.8389 414.875 71.2812 c 0
 372.666 70.1074 331.72 68.6787 296.656 54.3438 c 1
 252.798 24.0811 191.436 58.0225 149.188 45.375 c 1
 149.178 44.8076 148.574 45.3555 147.531 44.3125 c 1
 148.566 45.3477 149.569 43.498 150.531 42.9688 c 0
 174.341 29.8682 292.742 26.1514 349.156 34.2188 c 0
 393.085 45.0811 408.373 80.1035 464.375 48.5312 c 0
 509.018 23.3633 555.314 32.7598 612.469 31.4375 c 0
 649.476 32.168 685.578 33.5977 717.438 44 c 1
 717.498 44.1338 717.559 44.3184 717.781 44.6562 c 1
 701.376 60.3877 629.589 33.1201 576.375 47.875 c 0
381.906 496.219 m 1
 360.732 491.412 377.284 461.89 367.559 449.711 c 0
 353.561 432.185 323.711 452.908 308 445.031 c 1
 308 445.031 305.977 441.247 310.156 436.125 c 0
 318.301 425.899 362.897 436.405 368.125 410.438 c 0
 378.39 359.451 373.834 302.77 394.119 278.141 c 1
 395.832 277.962 398.241 279.676 398.406 279.656 c 1
 398.406 280.713 398.494 281.768 398.656 282.812 c 0
 406.5 333.346 364.175 421.947 405.094 425.5 c 0
 436.735 428.247 455.249 432.008 453.656 441.531 c 0
 453.523 442.323 453.546 442.491 453.594 442.562 c 1
 432.899 448.518 390.797 428.101 384.812 457.438 c 0
 379.559 483.192 389.352 484.804 381.906 496.219 c 1
330.219 486.344 m 1
 339.836 545.827 415.31 555.271 423.875 496.375 c 0
 424.947 491.104 425.264 486.668 425.312 482.688 c 1
 449.712 486.274 486.838 485.491 493.094 448.125 c 0
 496.731 426.395 482.842 409.954 480.844 408.844 c 1
 465.041 392.308 445.1 388.37 428.094 386.938 c 1
 432.916 344.526 443.375 313.999 438.312 278.281 c 0
 437.522 252.806 414.792 236.56 391.625 238.344 c 1
 391.625 238.219 l 1
 334.832 240.26 335.04 358.478 330.938 389.844 c 1
 304.847 392.782 291.418 395.44 279.375 410.562 c 0
 261.766 430.928 264.103 466.926 289.438 480.438 c 0
 303.958 487.717 318.029 487.892 330.219 486.344 c 1
281.219 187 m 1
 345.416 205.812 479.708 202.001 561.219 190.312 c 1
 581.207 278.339 557.71 348.99 543.25 393.781 c 0
 516.092 472.248 481.029 548.495 429.597 611.387 c 2
 415.938 627.281 l 2
 400.074 644.537 383.198 660.573 365.156 674.438 c 1
 301.601 612.755 220.069 462.872 215.781 364.188 c 2
 215.781 364 l 2
 210.78 269.22 243.053 233.94 264.938 203 c 0
 270.679 195.471 276.316 189.861 281.219 187 c 1
364.5 719.875 m 0
 379.281 719.875 419.698 680.864 430.63 669.858 c 1
 451.122 694.965 486.237 724.805 501.031 725.844 c 0
 511.118 726.553 519.089 721.595 522.344 718.469 c 0
 602.036 641.933 740.501 381.979 612.938 204.938 c 0
 610.607 200.945 607.55 196.837 602.681 193.101 c 1
 601.102 184.759 599.193 176.45 596.844 168.219 c 1
 594.83 160.556 589.16 153.284 583.458 150.643 c 1
 576.94 119.082 588.002 102.822 572.964 92.1699 c 1
 587.781 86.25 l 2
 613.727 79.292 663.701 89.3623 682.156 89 c 0
 704.35 89.0488 734.334 89.5254 746.969 72.0312 c 1
 770.938 48.5918 752.146 13.4727 733 6.96875 c 0
 668.323 -15 509.575 -12.2266 476.156 -0.125 c 0
 455.557 4.72754 442.366 17.8652 426.938 21.6875 c 1
 378.21 10.6992 401.271 -16.9131 219.688 -8.40625 c 0
 161.423 -4.78223 159.365 -4.65723 131.156 7.96875 c 0
 98.4746 22.6074 102.601 70.9287 131.5 81.7812 c 0
 188.639 103.239 241.317 66.6006 276.982 89.21 c 1
 267.453 93.8242 265.855 102.91 265.719 106.438 c 2
 263.979 150.613 l 1
 237.575 163.593 202.265 223.066 196.844 234.938 c 0
 108.795 430.657 321.654 719.875 364.5 719.875 c 0
393.995 278.153 m 1
 393.978 278.164 393.969 278.156 393.969 278.156 c 2
 393.995 278.153 l 1
304.844 129.562 m 1
 374.982 137.23 447.402 138.557 541.219 130.438 c 1
 541.378 137.378 541.639 144.842 542.878 152.464 c 1
 464.841 162.359 354.342 163.141 303.966 151.702 c 1
 304.719 132.906 l 2
 304.785 131.234 304.779 131.204 304.844 129.562 c 1
607.938 279.5 m 1
 661.873 418.16 571.25 609.487 502.062 682.125 c 1
 485.429 670.79 470.646 656.264 457.938 639.844 c 1
 515.251 571.07 552.508 489.28 580.969 407.125 c 1
 595.68 366.56 605.516 323.297 607.938 279.5 c 1
EndSplineSet
EndChar
StartChar: k
Encoding: 107 107 1
Width: 1000
VWidth: 1050
Flags: HO
TeX: 0 0 0 0
Fore
483.125 761.844 m 1
 468.862 765.948 453.15 765.812 445.656 765.812 c 0
 439.344 765.812 419.415 764.378 414.094 761.625 c 1
 412.661 732.961 438.275 684.119 420.453 668.75 c 0
 405.175 655.574 351.876 683.04 305.5 672.281 c 1
 302.491 669.165 301.612 661.915 301.281 646.25 c 0
 301.47 634.042 303.75 622.746 308.531 615.031 c 1
 347.581 609.231 420.423 649.468 422.406 611.625 c 0
 423.532 590.146 419.194 570.889 414.718 553.07 c 1
 419.561 553.551 424.282 553.81 428.781 553.938 c 2
 429.031 553.938 l 2
 434.711 554.025 440.301 553.949 446.173 553.51 c 1
 441.772 572.787 429.074 628.699 458.594 630.156 c 0
 498.794 632.139 532.185 619.32 560.312 624.531 c 1
 567.778 631.726 571.53 664.904 562.969 680.062 c 1
 524.688 683.501 444.517 643.26 465.281 701.156 c 2
 472.594 721.781 l 2
 477.091 735.016 481.423 750.648 483.125 761.844 c 1
445.469 801.562 m 0
 537.137 801.562 524.904 764.375 506.281 709.719 c 1
 551.253 719.925 576.984 717.597 585.094 709.719 c 0
 618.906 676.79 603.192 597.638 571.5 590.156 c 0
 535.46 581.646 503.402 591.331 475.969 593.875 c 1
 476.882 570.475 485.228 546.39 485.698 544.762 c 1
 495.802 540.45 505.326 534.23 512.912 525.42 c 1
 598.413 559.422 743.518 537.442 799.062 455.75 c 0
 824.473 421.421 826.775 376.365 812.406 338.688 c 0
 778.33 250.768 710.828 210.229 670.812 140.875 c 0
 658.8 120.056 654.895 97.7393 636.247 91.8066 c 1
 620.077 23.8467 627.825 -2.79297 602.781 -3.53125 c 0
 512.726 -6.1875 371.207 -7.06445 274.719 -3.03125 c 0
 249.16 -1.95117 258.43 26.5059 242.86 89.2256 c 1
 232.008 91.5312 221.57 97.9336 218.375 107.438 c 0
 207.96 138.416 197.853 141.945 162.438 187.719 c 0
 130.559 232.865 89.2324 278.182 70.2188 338.656 c 0
 45.7598 406.424 78.7549 468.3 108.688 491.094 c 0
 127.101 506.084 175.025 541.094 274.531 541.094 c 0
 301.033 541.443 328.12 537.545 353.565 527.523 c 1
 360.115 534.088 367.492 539.048 375.26 542.79 c 1
 378.897 559.539 383.215 574.859 385.375 589.281 c 1
 369.947 585.665 303.176 567.326 285.219 586.75 c 0
 268.94 604.375 265.845 627.087 265.531 645.688 c 2
 265.531 646.344 l 2
 265.647 651.833 265.016 698.671 293.406 706.25 c 0
 327.001 715.218 358.962 709.449 387.906 704.062 c 1
 377.194 752.29 356.144 801.562 445.469 801.562 c 0
335.331 491.595 m 1
 315.711 498.688 294.874 501.58 272.719 501.031 c 2
 272.375 501.031 l 2
 181.065 500.449 75.5928 461.4 108.344 350.719 c 0
 124.094 300.926 161.169 258.826 194.875 211.094 c 0
 215.694 182.807 238.332 165.814 253.188 128.156 c 1
 326.853 128.949 474.298 126.203 621.531 130.656 c 1
 624.938 136.523 628.43 150.519 636.406 161.25 c 0
 682.201 240.385 746.252 278.696 775.062 353.031 c 0
 801.1 421.279 740.844 476.582 663.031 493.5 c 0
 617.838 503.573 569.757 504.413 528.56 488.341 c 1
 530.976 469.945 527.425 452.27 522.7 436.562 c 1
 524.373 436.672 587.869 444.339 616.156 426.062 c 0
 652.549 402.465 661.97 356.093 649.219 318.625 c 0
 628.606 258.054 566.659 236.066 551.55 236.561 c 0
 536.462 236.204 478.241 272.003 473.688 337.25 c 0
 455.596 434.975 501.496 447.63 486.32 493.448 c 0
 474.323 519.447 400.447 521.589 379.781 496.844 c 1
 363.219 466.955 381.57 434.173 386.452 419.79 c 0
 417.565 328.116 360.239 256.024 339.526 241.812 c 0
 314.128 224.386 236.216 292.894 228.219 334.438 c 0
 217.361 371.723 236.206 412.675 276.781 427.844 c 0
 277.091 427.943 277.376 428.092 277.688 428.125 c 1
 299.843 436.26 320.362 435.288 338.316 434.158 c 1
 332.938 452.38 331.028 472.285 335.331 491.595 c 1
510.153 395.816 m 1
 506.479 369.176 512.84 352.054 513.5 340.844 c 0
 515.01 315.196 531.266 290.866 553.896 277.685 c 1
 614.361 296.185 631.49 366.121 595.438 391.625 c 1
 573.332 401.147 543.841 396.214 510.153 395.816 c 1
324.205 282.732 m 1
 349.946 311.448 360.16 354.6 352.306 392.97 c 1
 314.567 392.41 312.709 397.179 289.438 389.938 c 0
 273.396 384.946 261.748 362.312 266.562 345.781 c 0
 274.613 318.993 297.191 297.676 324.205 282.732 c 1
594.717 89.8779 m 1
 491.03 87.418 387.492 88.2793 284.144 88.5605 c 1
 288.664 68.417 291.529 49.5176 293.281 36.375 c 1
 381.749 33.332 500.989 33.9717 585 36.125 c 1
 586.999 49.2988 590.17 69.126 594.717 89.8779 c 1
EndSplineSet
EndChar
StartChar: n
Encoding: 110 110 2
Width: 1000
VWidth: 1040
Flags: HO
TeX: 0 0 0 0
Fore
151.469 333.469 m 0
 155.799 333.877 160.352 333.456 164.656 331.969 c 0
 173.005 329.195 178.561 321.292 178.346 312.497 c 0
 178.13 303.701 172.193 296.08 163.719 293.719 c 1
 163.345 288.26 160.751 283.191 156.541 279.696 c 0
 152.331 276.2 146.872 274.582 141.438 275.219 c 0
 141.336 275.229 141.234 275.241 141.131 275.253 c 1
 153.652 263.961 163.606 264.513 174.375 268.344 c 0
 181.552 270.897 188.25 276.376 193.312 282 c 1
 195.373 285.921 197.42 289.515 199.188 292.312 c 0
 200.638 294.607 201.627 296.177 203.438 298.375 c 0
 203.891 298.925 204.387 299.524 205.438 300.531 c 0
 206.488 301.538 205.419 304.122 216.094 305.969 c 0
 218.763 306.431 222.804 306.521 227.125 304.75 c 0
 231.446 302.979 235.161 299.244 236.969 296.031 c 0
 240.585 289.605 239.649 286.333 239.469 284.344 c 0
 239.106 280.364 238.514 279.639 238.156 278.688 c 0
 235.661 272.055 232.086 265.799 227.75 259.969 c 1
 239.896 267.127 255.235 277.74 270.625 288.906 c 0
 287.182 300.919 303.711 313.377 317.469 322.875 c 0
 324.348 327.624 330.446 331.617 336.219 334.719 c 0
 339.105 336.27 341.865 337.626 345.375 338.75 c 0
 348.885 339.874 353.463 342.062 362.219 338.719 c 0
 434.666 311.051 506.009 367.375 505.844 426.375 c 0
 505.585 437.421 514.329 446.585 525.375 446.844 c 0
 536.421 447.103 545.585 438.358 545.844 427.312 c 0
 545.856 427.036 545.832 426.776 545.844 426.5 c 0
 547.061 397.716 545.097 371.343 534.125 346.625 c 0
 523.048 321.67 503.157 299.879 473.031 279.625 c 0
 418.236 242.786 312.323 169.768 288.562 74.5 c 0
 287.335 69.5781 288.375 58.1074 292.344 50.375 c 0
 296.312 42.6426 300.172 39.5615 305.969 39.4688 c 0
 424.381 37.582 565.449 37.0996 683.031 39.2812 c 0
 685.438 39.3262 690.168 41.2314 696.906 53.3125 c 0
 703.645 65.3936 710.031 85.4707 713.969 110.531 c 0
 721.844 160.653 720.672 230.701 706.062 303.594 c 0
 676.843 449.379 595.579 604.517 433.969 654.25 c 0
 431.537 654.998 429.266 656.189 427.281 657.781 c 0
 409.005 672.532 396.66 692.898 386.031 709.125 c 0
 384.161 711.98 382.464 714.472 380.75 717 c 1
 379.326 700.725 379.759 681.503 371.969 663.469 c 0
 369.401 657.527 364.117 653.196 357.788 651.843 c 0
 351.459 650.49 344.865 652.283 340.094 656.656 c 0
 327.966 667.784 320.94 680.703 312.25 690.875 c 0
 310.379 693.064 308.532 695.042 306.656 696.906 c 1
 307.43 692.214 308.333 687.384 309.469 682.5 c 0
 311.413 674.145 313.543 665.913 314.656 657.531 c 0
 315.77 649.149 317.721 638.943 308.719 627.656 c 0
 283.543 596.088 274.868 581.807 268.594 566.594 c 0
 262.319 551.381 257.951 532.617 244.25 496.312 c 0
 229.625 457.561 195.308 396.661 159.219 354.344 c 0
 153.053 347.113 148.087 339.501 144.235 331.984 c 1
 146.499 332.716 148.947 333.231 151.469 333.469 c 0
338.094 552.5 m 0
 342.301 552.246 346.559 551.722 350.812 550.938 c 0
 361.677 548.934 368.861 538.505 366.859 527.641 c 0
 364.857 516.776 354.427 509.592 343.562 511.594 c 0
 342.947 511.707 342.337 511.812 341.731 511.912 c 1
 344.078 508.032 345.055 503.435 344.438 498.875 c 0
 343.706 492.836 341.959 486.771 337.875 481.219 c 0
 333.791 475.666 326.848 471.243 319.969 470.094 c 0
 306.21 467.795 296.568 474.454 289.5 481.656 c 0
 286.866 484.257 285.084 487.444 284.2 490.839 c 1
 279.527 487.799 273.725 486.809 268.202 488.262 c 0
 261.198 490.104 255.738 495.59 253.926 502.602 c 0
 252.114 509.613 254.234 517.058 259.469 522.062 c 0
 280.737 543.23 308.647 554.277 338.094 552.5 c 0
371.281 771.531 m 0
 373.35 771.747 375.395 771.719 377.312 771.406 c 0
 390.752 769.213 397.098 761.37 403 754.312 c 0
 408.902 747.255 414.107 739.295 419.5 731.062 c 0
 429.577 715.678 440.533 699.756 450.312 690.938 c 1
 627.471 633.981 714.58 464.648 745.281 311.469 c 0
 760.765 234.216 762.307 160.588 753.469 104.344 c 0
 749.05 76.2217 742.212 52.4326 731.844 33.8438 c 0
 721.476 15.2549 705.23 -0.320312 683.75 -0.71875 c 0
 565.464 -2.91309 424.149 -2.42285 305.344 -0.53125 c 0
 282.402 -0.166016 265.232 15.5977 256.75 32.125 c 0
 248.268 48.6523 245.436 66.8906 249.75 84.1875 c 0
 274.365 182.881 361.806 251.63 421.281 292.781 c 1
 399.838 289.834 377.165 291.562 354.531 299.062 c 1
 351.254 297.26 346.258 294.138 340.219 289.969 c 0
 327.609 281.264 311.019 268.81 294.094 256.531 c 0
 277.169 244.252 259.965 232.135 244.625 223.438 c 0
 236.955 219.089 229.89 215.527 222.281 213.25 c 0
 214.673 210.973 203.976 208.323 192.969 216.844 c 0
 188.307 220.453 185.401 224.89 183.625 229.5 c 1
 159.831 222.733 129.83 228.257 107.281 252.562 c 0
 92.5352 268.457 91.417 289.854 95.4375 312.094 c 0
 99.458 334.334 110.216 358.511 128.781 380.281 c 0
 160.388 417.345 194.83 478.688 206.812 510.438 c 0
 219.869 545.036 223.64 562.48 231.625 581.844 c 0
 239.329 600.523 250.813 618.832 275.031 649.469 c 1
 275.119 650.062 275.18 650.924 275 652.281 c 0
 274.367 657.046 272.557 664.732 270.531 673.438 c 0
 266.48 690.848 260.581 712.629 267.438 735.469 c 0
 270.361 745.204 280.118 751.195 290.125 749.406 c 0
 313.004 745.315 329.197 731.893 340.688 718.969 c 1
 340.829 720.367 340.988 721.656 341.125 723.031 c 0
 342.049 732.302 342.939 741.087 346.094 750.094 c 0
 347.671 754.597 349.732 759.521 354.844 764.406 c 0
 358.677 768.069 365.076 770.884 371.281 771.531 c 0
EndSplineSet
EndChar
StartChar: q
Encoding: 113 113 3
Width: 1000
VWidth: 1040
Flags: HO
TeX: 0 0 0 0
Fore
115.125 474.719 m 0
 99.7812 474.719 87.4443 455.043 93.1562 441.062 c 0
 98.4014 428.224 121.023 421.274 133.515 432.582 c 0
 149.388 446.95 138.55 475.837 115.125 474.719 c 0
56.125 425.938 m 1
 56.1562 425.969 l 1
 37.6289 466.669 69.1982 513.902 113.219 514.625 c 1
 113.219 514.656 l 1
 113.625 514.656 l 2
 113.795 514.658 113.955 514.688 114.125 514.656 c 1
 143.925 515.666 161.199 497.272 164.562 493.625 c 1
 164.531 493.594 l 1
 185.954 472.207 186.8 439.896 171.762 416.359 c 1
 191.233 392.181 210.862 368.746 231.906 347.312 c 1
 222.834 411.217 216.43 476.043 217.013 541.339 c 1
 201.923 547.531 188.982 559.244 182 575.312 c 1
 181.969 575.281 l 1
 181.922 575.379 181.615 576.08 181.531 576.281 c 1
 181.562 576.281 l 1
 163.265 616.246 193.118 667.031 243.969 665.281 c 0
 260.842 664.697 276.899 657.585 288.75 645.25 c 1
 288.781 645.281 l 1
 288.98 645.093 289.658 644.413 289.75 644.312 c 1
 289.719 644.281 l 1
 315.129 619.177 311.907 578.594 287.487 555.231 c 1
 287.683 554.524 315.245 437.864 357.031 375.125 c 1
 367.561 452.847 383.829 530.352 408.895 605.317 c 1
 402.273 611.266 396.786 618.669 393.031 627.344 c 1
 392.969 627.312 l 1
 392.921 627.413 392.616 628.136 392.531 628.344 c 1
 392.562 628.344 l 1
 363.46 691.921 450.876 749.154 500.25 696.812 c 1
 500.281 696.844 l 1
 526.363 671.668 523.628 626.754 494.062 603.406 c 1
 494.094 603.375 l 1
 493.997 603.291 493.299 602.718 493.094 602.562 c 1
 493.062 602.594 l 1
 489.417 599.57 485.549 597.05 481.53 595.013 c 1
 480.367 491.137 486.014 427.452 493.812 386.844 c 1
 525.616 452.681 572.493 529.854 601.203 566.851 c 1
 601 567.312 l 1
 600.969 567.281 l 1
 600.922 567.379 600.615 568.08 600.531 568.281 c 1
 600.562 568.281 l 1
 582.265 608.246 612.118 659.031 662.969 657.281 c 0
 679.842 656.697 695.899 649.585 707.75 637.25 c 1
 707.781 637.281 l 1
 707.98 637.093 708.658 636.413 708.75 636.312 c 1
 708.719 636.281 l 1
 735.542 609.781 730.46 566.033 702.219 543.5 c 1
 702.25 543.469 l 1
 702.156 543.387 701.479 542.839 701.281 542.688 c 1
 701.25 542.719 l 1
 689.535 532.929 675.506 528.372 661.554 528.319 c 1
 644.643 486.175 631.903 442.367 623.781 397.688 c 1
 623.781 397.625 l 1
 619.435 374.081 616.274 350.712 617.219 328.656 c 1
 644.406 357.782 686.581 416.552 720.248 450.207 c 1
 708.467 488.745 738.507 530.559 779.75 531.438 c 1
 779.75 531.469 l 1
 779.956 531.48 780.678 531.5 780.781 531.5 c 1
 780.781 531.469 l 1
 800.157 532.273 818.938 524.166 831.625 510.344 c 1
 831.594 510.312 l 1
 858.193 483.574 852.942 439.881 824.562 417.531 c 1
 824.594 417.5 l 1
 824.503 417.422 823.847 416.895 823.656 416.75 c 1
 823.625 416.781 l 1
 808.222 404.072 788.892 400.307 771 403.881 c 1
 715.619 322.125 669.789 188.215 668.844 133.875 c 0
 668.524 115.465 650.369 114.214 646.735 113.733 c 1
 637.768 63.3037 638.882 20.4844 622.875 9.28125 c 1
 599.686 -13.2461 311.864 -5.35156 267.844 8.625 c 0
 249.778 14.3613 248.798 17.4971 236.906 84.2812 c 0
 233.959 100.838 232.794 110.921 232.336 117.62 c 1
 219.878 120.409 215.005 129.479 214.969 137.438 c 0
 214.751 185.638 122.017 357.464 107.665 386.422 c 1
 86.0176 389.516 65.9248 403.272 56.625 424.906 c 1
 56.543 424.98 56.2129 425.723 56.125 425.938 c 1
239.656 625.25 m 0
 226.849 625.25 211.767 607.076 218.5 591.594 c 0
 222.11 582.884 242.543 570.62 257.969 582.438 c 0
 262.568 585.961 273.319 603.284 260.312 617.219 c 0
 255.212 622.683 247.223 625.848 239.656 625.25 c 0
782.031 491.531 m 0
 768.335 491.531 753.513 473.652 760.312 457.469 c 0
 764.095 448.764 783.917 436.832 799.5 448.625 c 0
 803.175 451.407 815.012 469.363 802.219 483.219 c 0
 797.245 488.607 789.116 491.939 782.031 491.531 c 0
658.656 617.25 m 0
 645.849 617.25 630.767 599.079 637.5 583.594 c 0
 641.11 574.884 661.543 562.62 676.969 574.438 c 0
 681.568 577.961 692.319 595.283 679.312 609.219 c 0
 674.212 614.684 666.223 617.848 658.656 617.25 c 0
450.625 677.25 m 0
 436.164 677.25 423.491 657.874 429.5 643.594 c 0
 433.182 634.843 453.419 622.639 468.938 634.438 c 0
 485.986 647.4 475.794 679.202 450.625 677.25 c 0
279.562 301.094 m 0
 280.768 292.753 278.044 276.641 259.75 275.625 c 0
 259.7 275.625 259.651 275.616 259.641 275.62 c 2
 249.302 275.179 243.871 282.099 242.25 283.438 c 0
 213.372 307.297 188.359 334.129 164.969 361.844 c 1
 216.462 261.086 247.155 197.644 253.531 154.5 c 1
 324.67 144.145 531.624 142.048 630.125 152.094 c 1
 637.498 218.552 675.808 315.064 706.844 374 c 1
 698.562 364.156 l 2
 674.3 334.251 649.885 299.337 615.906 272.844 c 0
 604.105 263.647 588.364 270.21 584.5 282.719 c 0
 564.271 348.203 591.549 452.666 614.531 516.969 c 1
 595.669 489.249 541.335 402.162 507.5 319.5 c 0
 500.317 301.95 475.906 303.788 470.094 320.5 c 0
 443.57 396.782 443.084 476.584 441.281 552.062 c 2
 441.281 552.344 l 2
 441.209 560.361 441.365 568.089 441.438 576 c 1
 426.127 527.438 399.382 425.993 392.344 324.531 c 0
 391.191 307.911 371.495 299.604 358.875 311.156 c 0
 327.574 339.809 293.128 385.459 257.25 514.375 c 1
 259.136 418.209 273.411 343.627 279.562 301.094 c 0
259.601 275.616 m 1
 259.263 275.595 l 1
 259.406 275.594 l 2
 259.471 275.6 259.536 275.609 259.601 275.616 c 1
259.263 275.595 m 1
 259.25 275.594 l 2
 259.245 275.594 259.251 275.595 259.263 275.595 c 1
605.47 109.806 m 1
 542.544 105.411 463.487 105.288 447.703 105.288 c 0
 343.004 105.288 290.516 109.848 273.205 111.602 c 1
 275.808 90.4492 281.647 63.5137 285.625 45.5 c 1
 345.234 33 558.176 34.0234 595.531 40.875 c 1
 599.128 55.3643 601.526 83.8633 605.47 109.806 c 1
EndSplineSet
EndChar
StartChar: r
Encoding: 114 114 4
Width: 1000
VWidth: 1040
Flags: HO
TeX: 0 0 0 0
Fore
544.438 529.344 m 0
 592.861 527.902 641.225 523.675 665.375 521.688 c 1
 674.098 556.74 713.491 573.99 724.25 581.281 c 1
 724.883 593.125 732.899 631.462 733.438 653.062 c 1
 707.387 659.666 665.192 674.268 638.406 677.531 c 1
 637.002 653.691 646.57 607.23 618 605.75 c 0
 584.486 604.014 550.146 606.203 516.75 614.812 c 0
 494.802 620.47 503.216 642.743 502.5 694.25 c 1
 462.874 697.486 412.455 695.792 402.781 694.344 c 1
 401.564 680.234 403.852 662.729 402.5 642.125 c 1
 404.877 628.618 395.146 614.376 380.344 613.375 c 1
 349.426 606.654 319.709 608.114 292.875 606.812 c 0
 263.269 605.375 272.088 650.49 273.656 674.75 c 1
 259.603 672.111 225.836 669.717 174.875 655.656 c 1
 176.435 648.14 182.536 594.577 185.875 579.625 c 1
 203.079 568.255 228.481 552.426 234.969 521.188 c 1
 252.167 523.306 304.373 530.44 408.531 530.844 c 2
 410.781 530.844 l 2
 455.667 530.98 500.004 529.98 544.156 529.344 c 0
 544.25 529.345 544.344 529.345 544.438 529.344 c 0
362.688 650.781 m 1
 361.89 726.611 355.454 736.312 438.469 736.312 c 0
 552.857 736.312 543.673 735.39 541.781 650.25 c 1
 560.192 646.723 579.176 645.251 598.312 645.312 c 1
 598.43 665.075 597.395 671.828 598.438 678.25 c 1
 598.438 678.25 598.507 707.335 615.5 716.25 c 0
 635.252 726.59 719.566 698.636 719.594 698.625 c 0
 725.68 696.207 771.24 692.609 773.125 667.469 c 0
 775.609 634.201 767.295 604.338 764.094 577.812 c 0
 763.729 565.128 756.048 554.067 746.75 548.188 c 0
 702.53 518.167 714.467 528.285 703.844 511.094 c 1
 705.583 513.896 704.552 512.029 703.406 506.188 c 0
 701.073 494.302 691.068 479.481 675.938 480.719 c 2
 646.224 483.134 l 1
 646.95 373.977 646.42 268.827 647.951 159.457 c 1
 662.752 147.172 679.995 126.037 752.281 112.844 c 0
 791.677 105.653 780.242 1.76172 742.5 1.625 c 0
 580.679 1.08984 418.8 0.318359 256.875 0.53125 c 0
 161.555 -0.864258 142.425 1.01758 135.469 8 c 0
 110.129 33.5029 116.7 101.589 143.938 109.188 c 0
 215.728 129.215 239.509 155.576 244.581 158.813 c 1
 244.014 267.977 244.216 373.031 246.912 482.481 c 1
 219.802 479.376 221.611 478.944 216.312 480.875 c 0
 195.469 488.472 195.781 513.452 195.312 514.875 c 0
 189.33 535.558 153.459 545.971 149 561.938 c 0
 140.979 590.774 140.646 618.429 136.125 642.281 c 0
 132.811 659.765 129.012 683.776 149.656 690.125 c 0
 204.546 707.006 257.815 713.521 273.719 715.281 c 0
 319.471 720.343 316.312 683.798 312.438 647.469 c 1
 330.01 647.935 347.142 648.402 362.688 650.781 c 1
600.688 125.125 m 0
 589.812 125.125 578.368 124.851 566.469 125.062 c 0
 467.086 124.699 367.893 125.488 268.906 124.719 c 1
 251.742 109.62 213.122 87.0703 162.969 72.0938 c 1
 159.418 54.9023 160.33 47.8477 161.906 42.4375 c 1
 190.205 40.9102 731.393 42.623 732.062 42.625 c 1
 732.881 46.1396 733.382 52.0967 735.5 59.7188 c 1
 736.479 68.3359 736.519 71.3486 736.188 74.1875 c 1
 697.688 81.8711 657.095 95.082 625.781 123.938 c 1
 617.803 124.752 609.496 125.125 600.688 125.125 c 0
284.591 165.909 m 1
 316.202 166.102 537.493 166.312 600.719 166.312 c 0
 603.08 166.312 605.462 166.294 607.865 166.252 c 1
 606.142 274.514 606.834 378.753 606.125 486.094 c 1
 518.801 492 367.903 492.644 287.094 486.25 c 1
 284.36 378.05 284.062 273.913 284.591 165.909 c 1
EndSplineSet
EndChar
StartChar: p
Encoding: 112 112 5
Width: 800
VWidth: 1035
Flags: HWO
TeX: 0 0 0 0
HStem: -2.1562 40<141.649 512.429> -1.1875 39.9062<165.43 262.793> 89.5938 40<222.924 439.496> 309.188 40<182.406 499.938> 391.375 42.789<284.745 392.096> 394.119 36.756<279.775 398.357> 619.727 40.044<260.275 414.492>
VStem: 192.332 39.962<461.645 592.247> 442.474 39.963<461.645 592.247>
Fore
236.812 129.594 m 2
 428.812 129.594 l 2
 444.23 129.811 454.142 112.826 446.37 99.5117 c 0
 442.733 93.2812 436.025 89.4922 428.812 89.5938 c 2
 236.812 89.5938 l 2
 221.395 89.377 211.483 106.361 219.255 119.676 c 0
 222.892 125.906 229.6 129.695 236.812 129.594 c 2
499.938 349.188 m 1
 412.297 409.343 250.04 399.293 182.406 349.188 c 1
 499.938 349.188 l 1
337.384 619.727 m 0
 278.069 619.727 232.294 577.177 232.294 526.945 c 0
 232.294 476.714 278.069 434.164 337.384 434.164 c 0
 396.698 434.164 442.474 476.714 442.474 526.945 c 0
 442.474 577.177 396.698 619.727 337.384 619.727 c 0
337.384 659.771 m 0
 416.156 659.771 482.438 601.249 482.438 526.945 c 0
 482.438 483.394 459.666 445.264 424.956 421.162 c 1
 532.073 400.061 563.75 343.174 568.875 342.031 c 1
 579.847 328.663 570.411 309.188 553.531 309.188 c 2
 400.365 309.188 l 1
 415.294 190.678 471.331 161.622 528.938 125.812 c 0
 582.077 92.7803 567.705 7.16992 500.469 -0.25 c 0
 469.363 -3.68164 216.203 -3.25195 184.656 -1.1875 c 0
 121.68 2.93457 102.395 85.7266 154.062 122.25 c 0
 193.172 149.896 259.381 185.425 273.712 309.188 c 1
 135.781 309.188 l 2
 120.011 309.199 111.092 325.796 118.281 338.844 c 0
 131.664 362.468 166.085 401.021 250.957 420.375 c 1
 215.604 444.429 192.332 482.917 192.332 526.945 c 0
 192.332 601.249 258.611 659.771 337.384 659.771 c 0
360.312 309.188 m 1
 313.844 309.188 l 1
 298.334 168.232 213.108 115.01 177.156 89.5938 c 0
 158.824 76.6338 157.959 40.6387 187.281 38.7188 c 0
 217.137 36.7646 469.681 36.5869 496.094 39.5 c 0
 533.419 43.6191 522.42 82.7832 507.844 91.8438 c 0
 449.701 127.987 376.982 165.747 360.312 309.188 c 1
EndSplineSet
EndChar
EndChars
EndSplineFont
