SplineFontDB: 1.0
FontName: KBoard_Yahoo
FullName: KBoard_Yahoo
FamilyName: KBoard_Yahoo
Weight: Medium
Copyright: Created by Io with FontForge 1.0 (http://fontforge.sf.net)
Version: 001.000
ItalicAngle: 0
UnderlinePosition: -100
UnderlineWidth: 50
Ascent: 819
Descent: 205
Order2: 1
XUID: [1021 645 1811818106 9845185]
FSType: 0
CreationTime: 1156082481
ModificationTime: 1160236016
PfmFamily: 17
TTFWeight: 500
TTFWidth: 5
LineGap: 92
VLineGap: 0
Panose: 2 0 6 9 0 0 0 0 0 0
OS2TypoAscent: 0
OS2TypoAOffset: 1
OS2TypoDescent: 0
OS2TypoDOffset: 1
OS2TypoLinegap: 0
OS2WinAscent: 0
OS2WinAOffset: 1
OS2WinDescent: 0
OS2WinDOffset: 1
HheadAscent: 0
HheadAOffset: 1
HheadDescent: 0
HheadDOffset: 1
OS2SubXSize: 665
OS2SubYSize: 716
OS2SubXOff: 0
OS2SubYOff: 491
OS2SupXSize: 665
OS2SupYSize: 716
OS2SupXOff: 0
OS2SupYOff: 0
OS2StrikeYSize: 51
OS2StrikeYPos: 265
OS2Vendor: 'PfEd'
TtfTable: cvt  4
!$VK#
EndTtf
TtfTable: maxp 32
!!*'"!"&ar!#>P7!!!!#!!!!"!!*'"!'gN:z
EndTtf
LangName: 1033 
Encoding: UnicodeBmp
UnicodeInterp: none
NameList: Adobe Glyph List
DisplaySize: -36
AntiAlias: 1
FitToEm: 1
WinInfo: 63 21 11
BeginChars: 65539 10
StartChar: .notdef
Encoding: 65536 -1 0
Width: 1024
Flags: W
TtfInstrs: 46
YlOhX4L,1p!:;PH"pNdEZ3(..m4n[H!rsu:Z3:@2m4tsP"p+WaZ2k",m4nYA
EndTtf
Fore
34 0 m 1,0,-1
 34 682 l 1,1,-1
 375 682 l 1,2,-1
 375 0 l 1,3,-1
 34 0 l 1,0,-1
68 34 m 1,4,-1
 341 34 l 1,5,-1
 341 648 l 1,6,-1
 68 648 l 1,7,-1
 68 34 l 1,4,-1
EndSplineSet
EndChar
StartChar: .null
Encoding: 65537 0 1
Width: 0
Flags: W
EndChar
StartChar: nonmarkingreturn
Encoding: 65538 12 2
Width: 1024
Flags: W
EndChar
StartChar: plus
Encoding: 43 43 3
Width: 1024
Flags: W
Fore
0 817 m 1,0,-1
 1024 817 l 1,1,-1
 1024 -203 l 1,2,-1
 0 -203 l 1,3,-1
 0 817 l 1,0,-1
EndSplineSet
EndChar
StartChar: b
Encoding: 98 98 4
Width: 1024
Flags: W
Fore
500 785 m 0,0,1
 523 804 523 804 532 802 c 128,-1,2
 541 800 541 800 570 772 c 0,3,4
 641 703 641 703 581 703 c 0,5,6
 570 703 570 703 562 698 c 128,-1,7
 554 693 554 693 554 686 c 0,8,9
 554 666 554 666 568.5 646.5 c 128,-1,10
 583 627 583 627 598 627 c 0,11,12
 618 625 618 625 683.5 560.5 c 128,-1,13
 749 496 749 496 742 484 c 0,14,15
 736 472 736 472 754 462 c 1,16,17
 771 456 771 456 773 422 c 128,-1,18
 775 388 775 388 765.5 348 c 128,-1,19
 756 308 756 308 736 268 c 128,-1,20
 716 228 716 228 693 210 c 0,21,22
 679 200 679 200 679.5 193 c 128,-1,23
 680 186 680 186 696 172 c 1,24,25
 720 144 720 144 720 123 c 0,26,27
 720 99 720 99 735 84 c 0,28,29
 752 67 752 67 739 52.5 c 128,-1,30
 726 38 726 38 699 44 c 0,31,32
 669 53 669 53 643 25 c 0,33,34
 625 6 625 6 628.5 -0.5 c 128,-1,35
 632 -7 632 -7 664 -8 c 1,36,37
 685 -12 685 -12 685 -37 c 0,38,39
 685 -54 685 -54 693 -58.5 c 128,-1,40
 701 -63 701 -63 726 -61 c 0,41,42
 768 -56 768 -56 796 -54 c 0,43,44
 813 -52 813 -52 818 -60.5 c 128,-1,45
 823 -69 823 -69 823 -100 c 2,46,-1
 823 -147 l 1,47,-1
 516 -148 l 2,48,49
 374 -148 374 -148 304 -145.5 c 128,-1,50
 234 -143 234 -143 214 -136.5 c 128,-1,51
 194 -130 194 -130 228 -119 c 0,52,53
 250 -109 250 -109 235 -93 c 0,54,55
 216 -71 216 -71 243.5 -63.5 c 128,-1,56
 271 -56 271 -56 356 -59 c 0,57,58
 460 -66 460 -66 466 -47 c 0,59,60
 469 -39 469 -39 462.5 -34.5 c 128,-1,61
 456 -30 456 -30 443 -30 c 0,62,63
 423 -30 423 -30 421 -27 c 128,-1,64
 419 -24 419 -24 429 -10 c 0,65,66
 447 10 447 10 435 14 c 1,67,68
 399 19 399 19 374 29 c 0,69,70
 353 37 353 37 311 42 c 0,71,72
 295 43 295 43 284.5 49 c 128,-1,73
 274 55 274 55 277 60 c 0,74,75
 283 71 283 71 390.5 73 c 128,-1,76
 498 75 498 75 498 64 c 128,-1,77
 498 53 498 53 536 71 c 0,78,79
 558 80 558 80 566 80 c 128,-1,80
 574 80 574 80 577 71 c 0,81,82
 580 64 580 64 583 61.5 c 128,-1,83
 586 59 586 59 590 61 c 128,-1,84
 594 63 594 63 601 69 c 0,85,86
 617 87 617 87 603 102 c 0,87,88
 588 120 588 120 578 102 c 0,89,90
 570 86 570 86 552 104 c 0,91,92
 536 120 536 120 558 141 c 0,93,94
 578 161 578 161 593.5 162.5 c 128,-1,95
 609 164 609 164 609 147 c 0,96,97
 609 129 609 129 623 149 c 0,98,99
 631 162 631 162 620.5 167.5 c 128,-1,100
 610 173 610 173 570 177 c 0,101,102
 513 183 513 183 494 173 c 128,-1,103
 475 163 475 163 504 143 c 0,104,105
 528 122 528 122 522 112 c 0,106,107
 518 106 518 106 418 104 c 128,-1,108
 318 102 318 102 292 107 c 1,109,110
 287 109 287 109 304 129 c 128,-1,111
 321 149 321 149 397 149 c 0,112,113
 423 149 423 149 439.5 151 c 128,-1,114
 456 153 456 153 462.5 156.5 c 128,-1,115
 469 160 469 160 468 166 c 1,116,117
 461 184 461 184 428 184 c 0,118,119
 356 187 356 187 336.5 191 c 128,-1,120
 317 195 317 195 325 203 c 0,121,122
 341 218 341 218 384 223 c 128,-1,123
 427 228 427 228 439 217 c 0,124,125
 448 208 448 208 542.5 294.5 c 128,-1,126
 637 381 637 381 637 400 c 0,127,128
 637 405 637 405 613.5 384 c 128,-1,129
 590 363 590 363 558 329 c 0,130,131
 475 246 475 246 465 246 c 0,132,133
 452 246 452 246 418 278 c 2,134,-1
 385 309 l 1,135,-1
 396 267 l 2,136,137
 403 239 403 239 401 235.5 c 128,-1,138
 399 232 399 232 383 245 c 0,139,140
 360 263 360 263 360 248 c 0,141,142
 360 232 360 232 340 233 c 128,-1,143
 320 234 320 234 307 250 c 0,144,145
 294 265 294 265 284 309 c 0,146,147
 280 324 280 324 279.5 331 c 128,-1,148
 279 338 279 338 281 338 c 128,-1,149
 283 338 283 338 288 331 c 0,150,151
 299 312 299 312 327 321 c 0,152,153
 340 326 340 326 343 329 c 128,-1,154
 346 332 346 332 343.5 335 c 128,-1,155
 341 338 341 338 328 345 c 0,156,157
 303 359 303 359 318 378 c 128,-1,158
 333 397 333 397 318 405 c 0,159,160
 302 415 302 415 327 441 c 0,161,162
 348 470 348 470 343 475 c 0,163,164
 336 483 336 483 313.5 473.5 c 128,-1,165
 291 464 291 464 291 453 c 0,166,167
 291 448 291 448 285.5 444 c 128,-1,168
 280 440 280 440 274 440 c 0,169,170
 257 442 257 442 291 471 c 0,171,172
 324 500 324 500 309 505 c 0,173,174
 292 511 292 511 290.5 531 c 128,-1,175
 289 551 289 551 304 551 c 0,176,177
 317 551 317 551 351.5 514.5 c 128,-1,178
 386 478 386 478 387 464 c 0,179,180
 387 452 387 452 433 399 c 0,181,182
 479 343 479 343 516 343 c 0,183,184
 538 343 538 343 546 349.5 c 128,-1,185
 554 356 554 356 554 375 c 0,186,187
 554 407 554 407 520 426 c 0,188,189
 485 448 485 448 415.5 514.5 c 128,-1,190
 346 581 346 581 346 592 c 0,191,192
 346 601 346 601 352 604 c 128,-1,193
 358 607 358 607 366.5 603.5 c 128,-1,194
 375 600 375 600 381 591 c 0,195,196
 390 577 390 577 410 584 c 0,197,198
 429 591 429 591 429 572 c 0,199,200
 429 559 429 559 434.5 554 c 128,-1,201
 440 549 440 549 449.5 554 c 128,-1,202
 459 559 459 559 470 572 c 0,203,204
 477 580 477 580 479 585 c 128,-1,205
 481 590 481 590 478 593 c 128,-1,206
 475 596 475 596 466 599 c 0,207,208
 453 605 453 605 454 616 c 128,-1,209
 455 627 455 627 473 663 c 0,210,211
 489 696 489 696 491 711.5 c 128,-1,212
 493 727 493 727 483 739 c 0,213,214
 473 750 473 750 476.5 759.5 c 128,-1,215
 480 769 480 769 500 785 c 0,0,1
530 -51 m 0,216,217
 540 -33 540 -33 529 -26 c 0,218,219
 516 -19 516 -19 500 -28.5 c 128,-1,220
 484 -38 484 -38 484 -53 c 0,221,222
 484 -72 484 -72 503 -71.5 c 128,-1,223
 522 -71 522 -71 530 -51 c 0,216,217
606 -55 m 0,224,225
 600 -36 600 -36 583.5 -34 c 128,-1,226
 567 -32 567 -32 567 -50 c 0,227,228
 567 -59 567 -59 573.5 -65.5 c 128,-1,229
 580 -72 580 -72 589 -72 c 0,230,231
 611 -72 611 -72 606 -55 c 0,224,225
664 -59 m 128,-1,233
 664 -46 664 -46 651.5 -39 c 128,-1,234
 639 -32 639 -32 631 -40 c 0,235,236
 620 -51 620 -51 624 -61.5 c 128,-1,237
 628 -72 628 -72 643 -72 c 0,238,232
 664 -72 664 -72 664 -59 c 128,-1,233
408 732 m 0,239,240
 416 745 416 745 436.5 745 c 128,-1,241
 457 745 457 745 457 732 c 0,242,243
 457 718 457 718 442.5 710 c 128,-1,244
 428 702 428 702 415 710 c 0,245,246
 401 719 401 719 408 732 c 0,239,240
360 -32 m 0,247,248
 360 -26 360 -26 364.5 -21.5 c 128,-1,249
 369 -17 369 -17 374 -17 c 0,250,251
 387 -17 387 -17 387 -22 c 0,252,253
 387 -30 387 -30 374 -37 c 0,254,255
 369 -40 369 -40 364.5 -38.5 c 128,-1,256
 360 -37 360 -37 360 -32 c 0,247,248
EndSplineSet
EndChar
StartChar: k
Encoding: 107 107 5
Width: 1024
Flags: W
Fore
473 743 m 0,0,1
 489 768 489 768 507.5 771.5 c 128,-1,2
 526 775 526 775 526 753 c 0,3,4
 526 744 526 744 534 735.5 c 128,-1,5
 542 727 542 727 554 724 c 0,6,7
 571 719 571 719 578 703.5 c 128,-1,8
 585 688 585 688 578.5 674.5 c 128,-1,9
 572 661 572 661 554 661 c 0,10,11
 537 661 537 661 531.5 646.5 c 128,-1,12
 526 632 526 632 523 576 c 128,-1,13
 520 520 520 520 525 497.5 c 128,-1,14
 530 475 530 475 552 451 c 0,15,16
 573 427 573 427 583.5 423.5 c 128,-1,17
 594 420 594 420 614 430 c 0,18,19
 646 450 646 450 655 465 c 0,20,21
 668 485 668 485 689 479.5 c 128,-1,22
 710 474 710 474 729 445 c 0,23,24
 745 422 745 422 751 419.5 c 128,-1,25
 757 417 757 417 768 432 c 0,26,27
 786 454 786 454 801 454 c 128,-1,28
 816 454 816 454 816 468 c 0,29,30
 816 481 816 481 837 481 c 0,31,32
 855 481 855 481 858 455.5 c 128,-1,33
 861 430 861 430 844 419 c 0,34,35
 830 411 830 411 830 362 c 0,36,37
 830 315 830 315 816 315 c 0,38,39
 811 315 811 315 807 295 c 128,-1,40
 803 275 803 275 803 248 c 0,41,42
 803 180 803 180 782 163 c 0,43,44
 767 151 767 151 767 143.5 c 128,-1,45
 767 136 767 136 783 120 c 0,46,47
 802 100 802 100 797.5 76 c 128,-1,48
 793 52 793 52 769 52 c 0,49,50
 762 52 762 52 753.5 42 c 128,-1,51
 745 32 745 32 742 19 c 128,-1,52
 739 6 739 6 727.5 -6 c 128,-1,53
 716 -18 716 -18 703 -21 c 0,54,55
 683 -26 683 -26 678.5 -32.5 c 128,-1,56
 674 -39 674 -39 684.5 -43 c 128,-1,57
 695 -47 695 -47 712.5 -48.5 c 128,-1,58
 730 -50 730 -50 754 -44 c 0,59,60
 800 -34 800 -34 815 -45.5 c 128,-1,61
 830 -57 830 -57 830 -101 c 2,62,-1
 830 -137 l 1,63,-1
 505 -137 l 2,64,65
 356 -137 356 -137 282 -134 c 128,-1,66
 208 -131 208 -131 187 -124 c 128,-1,67
 166 -117 166 -117 201 -105 c 0,68,69
 223 -95 223 -95 206 -78 c 0,70,71
 199 -69 199 -69 198.5 -66 c 128,-1,72
 198 -63 198 -63 198.5 -59.5 c 128,-1,73
 199 -56 199 -56 217.5 -55 c 128,-1,74
 236 -54 236 -54 253.5 -53.5 c 128,-1,75
 271 -53 271 -53 318 -53 c 0,76,77
 422 -50 422 -50 422 -38 c 128,-1,78
 422 -26 422 -26 394 -22 c 1,79,80
 388 -22 388 -22 358 -20.5 c 128,-1,81
 328 -19 328 -19 311 -18 c 0,82,83
 279 -17 279 -17 272.5 -13.5 c 128,-1,84
 266 -10 266 -10 280 -3 c 0,85,86
 302 12 302 12 333 8 c 0,87,88
 346 6 346 6 356.5 10 c 128,-1,89
 367 14 367 14 369 22 c 1,90,91
 374 33 374 33 360.5 35 c 128,-1,92
 347 37 347 37 306 32 c 0,93,94
 262 27 262 27 248.5 30 c 128,-1,95
 235 33 235 33 235 46 c 0,96,97
 235 54 235 54 229 60 c 128,-1,98
 223 66 223 66 213 66 c 0,99,100
 199 66 199 66 198.5 70 c 128,-1,101
 198 74 198 74 208 87 c 0,102,103
 219 100 219 100 225.5 100 c 128,-1,104
 232 100 232 100 245 87 c 0,105,106
 278 51 278 51 299 83 c 0,107,108
 308 98 308 98 327 75 c 1,109,110
 333 64 333 64 340.5 61 c 128,-1,111
 348 58 348 58 351 65 c 1,112,113
 361 78 361 78 316 123 c 0,114,115
 309 130 309 130 303 136.5 c 128,-1,116
 297 143 297 143 293.5 147.5 c 128,-1,117
 290 152 290 152 288 155 c 128,-1,118
 286 158 286 158 287 159 c 128,-1,119
 288 160 288 160 291 159 c 0,120,121
 301 156 301 156 306 162 c 128,-1,122
 311 168 311 168 311 184 c 0,123,124
 311 197 311 197 308.5 204.5 c 128,-1,125
 306 212 306 212 302 210 c 0,126,127
 291 203 291 203 263 218 c 0,128,129
 251 225 251 225 247 227.5 c 128,-1,130
 243 230 243 230 244 236 c 128,-1,131
 245 242 245 242 250.5 247.5 c 128,-1,132
 256 253 256 253 273 267 c 0,133,134
 288 280 288 280 294 287 c 128,-1,135
 300 294 300 294 299 297.5 c 128,-1,136
 298 301 298 301 289 302 c 0,137,138
 268 302 268 302 249 281 c 0,139,140
 233 261 233 261 205 275 c 0,141,142
 179 289 179 289 192 307 c 0,143,144
 207 325 207 325 177 355 c 2,145,-1
 148 387 l 1,146,-1
 180 378 l 2,147,148
 200 373 200 373 203.5 377.5 c 128,-1,149
 207 382 207 382 193 393 c 128,-1,150
 179 404 179 404 158 412 c 0,151,152
 135 422 135 422 132.5 428.5 c 128,-1,153
 130 435 130 435 141 454 c 0,154,155
 172 505 172 505 205 452 c 2,156,-1
 223 423 l 1,157,-1
 255 452 l 2,158,159
 285 480 285 480 302 479 c 128,-1,160
 319 478 319 478 339 448 c 0,161,162
 355 425 355 425 363.5 423 c 128,-1,163
 372 421 372 421 396 433 c 0,164,165
 423 446 423 446 453.5 475.5 c 128,-1,166
 484 505 484 505 484 517 c 0,167,168
 484 526 484 526 465 510 c 0,169,170
 443 495 443 495 437 508 c 0,171,172
 430 519 430 519 439 545 c 128,-1,173
 448 571 448 571 462 581 c 0,174,175
 478 592 478 592 461.5 617 c 128,-1,176
 445 642 445 642 410 660 c 0,177,178
 370 677 370 677 386 693 c 0,179,180
 400 707 400 707 443 685 c 0,181,182
 473 666 473 666 482.5 671 c 128,-1,183
 492 676 492 676 469 699 c 0,184,185
 454 714 454 714 473 743 c 0,0,1
511 407 m 0,186,187
 477 447 477 447 443 405 c 0,188,189
 428 388 428 388 431.5 363 c 128,-1,190
 435 338 435 338 452 333 c 0,191,192
 471 329 471 329 498 357 c 0,193,194
 516 374 516 374 518.5 384 c 128,-1,195
 521 394 521 394 511 407 c 0,186,187
298 386 m 0,196,197
 289 399 289 399 278 397.5 c 128,-1,198
 267 396 267 396 246 379 c 0,199,200
 231 368 231 368 225 356.5 c 128,-1,201
 219 345 219 345 223.5 337 c 128,-1,202
 228 329 228 329 241 329 c 0,203,204
 260 329 260 329 282.5 351 c 128,-1,205
 305 373 305 373 298 386 c 0,196,197
738 390 m 0,206,207
 729 398 729 398 712.5 398 c 128,-1,208
 696 398 696 398 688 389 c 0,209,210
 675 376 675 376 679 352.5 c 128,-1,211
 683 329 683 329 699 329 c 128,-1,212
 715 329 715 329 731.5 354 c 128,-1,213
 748 379 748 379 738 390 c 0,206,207
360 293 m 0,214,215
 360 303 360 303 353.5 309 c 128,-1,216
 347 315 347 315 338 315 c 0,217,218
 320 315 320 315 322 299 c 128,-1,219
 324 283 324 283 343 277 c 0,220,221
 350 275 350 275 355 279.5 c 128,-1,222
 360 284 360 284 360 293 c 0,214,215
415 295 m 128,-1,224
 415 303 415 303 408.5 309 c 128,-1,225
 402 315 402 315 394 315 c 128,-1,226
 386 315 386 315 380 309 c 128,-1,227
 374 303 374 303 374 295 c 128,-1,228
 374 287 374 287 380 280.5 c 128,-1,229
 386 274 386 274 394 274 c 128,-1,230
 402 274 402 274 408.5 280.5 c 128,-1,223
 415 287 415 287 415 295 c 128,-1,224
498 286 m 0,231,232
 498 299 498 299 485.5 306.5 c 128,-1,233
 473 314 473 314 465 306 c 0,234,235
 454 294 454 294 458 284 c 128,-1,236
 462 274 462 274 477 274 c 0,237,238
 498 274 498 274 498 286 c 0,231,232
581 295 m 128,-1,240
 581 303 581 303 575 309 c 128,-1,241
 569 315 569 315 560 315 c 0,242,243
 552 315 552 315 546 309 c 128,-1,244
 540 303 540 303 540 295 c 128,-1,245
 540 287 540 287 546 280.5 c 128,-1,246
 552 274 552 274 560 274 c 0,247,248
 569 274 569 274 575 280.5 c 128,-1,239
 581 287 581 287 581 295 c 128,-1,240
664 295 m 128,-1,250
 664 303 664 303 658 309 c 128,-1,251
 652 315 652 315 643 315 c 0,252,253
 635 315 635 315 629 309 c 128,-1,254
 623 303 623 303 623 295 c 128,-1,255
 623 287 623 287 629 280.5 c 128,-1,256
 635 274 635 274 643 274 c 0,257,258
 652 274 652 274 658 280.5 c 128,-1,249
 664 287 664 287 664 295 c 128,-1,250
671 232 m 1,259,260
 668 238 668 238 664.5 242 c 128,-1,261
 661 246 661 246 660 245 c 1,262,263
 659 243 659 243 623 232 c 0,264,265
 598 224 598 224 599.5 222.5 c 128,-1,266
 601 221 601 221 634 220 c 0,267,268
 654 219 654 219 665 222.5 c 128,-1,269
 676 226 676 226 671 232 c 1,259,260
577 174 m 0,270,271
 584 191 584 191 576 201 c 0,272,273
 573 205 573 205 570.5 199.5 c 128,-1,274
 568 194 568 194 569 183 c 0,275,276
 569 170 569 170 572 168 c 0,277,278
 574 167 574 167 577 174 c 0,270,271
720 120 m 0,279,280
 720 139 720 139 693 149 c 128,-1,281
 666 159 666 159 634.5 154 c 128,-1,282
 603 149 603 149 592 131 c 0,283,284
 581 112 581 112 597.5 96.5 c 128,-1,285
 614 81 614 81 631 95 c 0,286,287
 652 112 652 112 643 122 c 1,288,289
 637 133 637 133 649 142 c 0,290,291
 655 146 655 146 663.5 140 c 128,-1,292
 672 134 672 134 678 122 c 0,293,294
 687 105 687 105 697 98.5 c 128,-1,295
 707 92 707 92 713.5 97.5 c 128,-1,296
 720 103 720 103 720 120 c 0,279,280
387 133 m 0,297,298
 387 139 387 139 379 144 c 128,-1,299
 371 149 371 149 360 149 c 0,300,301
 341 149 341 149 336.5 144 c 128,-1,302
 332 139 332 139 339 126 c 128,-1,303
 346 113 346 113 368 87 c 0,304,305
 395 57 395 57 398.5 56 c 128,-1,306
 402 55 402 55 396 80 c 0,307,308
 387 123 387 123 387 133 c 0,297,298
470 122 m 0,309,310
 470 133 470 133 464 141 c 128,-1,311
 458 149 458 149 450 149 c 128,-1,312
 442 149 442 149 435.5 142 c 128,-1,313
 429 135 429 135 429 126 c 0,314,315
 429 108 429 108 440 89.5 c 128,-1,316
 451 71 451 71 464 61 c 128,-1,317
 477 51 477 51 487.5 53 c 128,-1,318
 498 55 498 55 498 73 c 0,319,320
 498 94 498 94 484 94 c 0,321,322
 479 94 479 94 474.5 102 c 128,-1,323
 470 110 470 110 470 122 c 0,309,310
554 122 m 0,324,325
 554 133 554 133 547.5 141 c 128,-1,326
 541 149 541 149 533 149 c 128,-1,327
 525 149 525 149 518.5 141 c 128,-1,328
 512 133 512 133 512 122 c 0,329,330
 512 110 512 110 518.5 102 c 128,-1,331
 525 94 525 94 533 94 c 128,-1,332
 541 94 541 94 547.5 102 c 128,-1,333
 554 110 554 110 554 122 c 0,324,325
443 28 m 0,334,335
 443 32 443 32 439 35.5 c 128,-1,336
 435 39 435 39 430 39 c 0,337,338
 416 39 416 39 409 25.5 c 128,-1,339
 402 12 402 12 412 5 c 0,340,341
 422 -1 422 -1 432.5 6.5 c 128,-1,342
 443 14 443 14 443 28 c 0,334,335
498 18 m 0,343,344
 498 39 498 39 486 39 c 0,345,346
 473 39 473 39 465.5 26 c 128,-1,347
 458 13 458 13 466 5 c 0,348,349
 478 -6 478 -6 488 -2 c 128,-1,350
 498 2 498 2 498 18 c 0,343,344
540 18 m 128,-1,352
 540 39 540 39 526 39 c 0,353,354
 521 39 521 39 516.5 32.5 c 128,-1,355
 512 26 512 26 512 18 c 128,-1,356
 512 10 512 10 516.5 3.5 c 128,-1,357
 521 -3 521 -3 526 -3 c 0,358,351
 540 -3 540 -3 540 18 c 128,-1,352
609 11 m 0,359,360
 609 25 609 25 595 25 c 0,361,362
 590 25 590 25 585.5 21 c 128,-1,363
 581 17 581 17 581 11 c 0,364,365
 581 6 581 6 585.5 1.5 c 128,-1,366
 590 -3 590 -3 595 -3 c 0,367,368
 601 -3 601 -3 605 1.5 c 128,-1,369
 609 6 609 6 609 11 c 0,359,360
498 -28 m 0,370,371
 498 -17 498 -17 486 -17 c 0,372,373
 471 -17 471 -17 464 -30.5 c 128,-1,374
 457 -44 457 -44 468 -50 c 0,375,376
 478 -56 478 -56 488 -49 c 128,-1,377
 498 -42 498 -42 498 -28 c 0,370,371
606 -33 m 0,378,379
 608 -26 608 -26 603.5 -21.5 c 128,-1,380
 599 -17 599 -17 589 -17 c 0,381,382
 580 -17 580 -17 573.5 -23 c 128,-1,383
 567 -29 567 -29 567 -39 c 0,384,385
 567 -56 567 -56 583.5 -54 c 128,-1,386
 600 -52 600 -52 606 -33 c 0,378,379
661 -33 m 0,387,388
 663 -27 663 -27 658 -22 c 128,-1,389
 653 -17 653 -17 643 -17 c 0,390,391
 634 -17 634 -17 629 -22 c 128,-1,392
 624 -27 624 -27 627 -33 c 1,393,394
 632 -51 632 -51 643 -51 c 128,-1,395
 654 -51 654 -51 661 -33 c 0,387,388
EndSplineSet
EndChar
StartChar: n
Encoding: 110 110 6
Width: 1024
Flags: W
Fore
421 757 m 0,0,1
 420 771 420 771 423.5 773.5 c 128,-1,2
 427 776 427 776 441 768 c 0,3,4
 467 755 467 755 483 734 c 128,-1,5
 499 713 499 713 495 697 c 1,6,7
 494 687 494 687 503 683 c 128,-1,8
 512 679 512 679 536 681 c 0,9,10
 554 682 554 682 581 675 c 128,-1,11
 608 668 608 668 628 657 c 0,12,13
 672 633 672 633 751.5 552.5 c 128,-1,14
 831 472 831 472 826 456 c 1,15,16
 821 446 821 446 854 376 c 0,17,18
 887 311 887 311 879 297 c 0,19,20
 869 283 869 283 893 248 c 0,21,22
 916 209 916 209 912 140 c 0,23,24
 907 36 907 36 913 1.5 c 128,-1,25
 919 -33 919 -33 942 -39 c 0,26,27
 960 -44 960 -44 964.5 -55.5 c 128,-1,28
 969 -67 969 -67 966 -100 c 2,29,-1
 962 -152 l 1,30,-1
 627 -155 l 2,31,32
 550 -155 550 -155 491.5 -155 c 128,-1,33
 433 -155 433 -155 393 -153.5 c 128,-1,34
 353 -152 353 -152 328 -150 c 128,-1,35
 303 -148 303 -148 294 -144 c 128,-1,36
 285 -140 285 -140 289.5 -135 c 128,-1,37
 294 -130 294 -130 311 -123 c 0,38,39
 333 -113 333 -113 318 -97 c 0,40,41
 299 -75 299 -75 325 -68 c 128,-1,42
 351 -61 351 -61 433 -65 c 0,43,44
 533 -70 533 -70 533 -56 c 128,-1,45
 533 -42 533 -42 505 -42 c 0,46,47
 479 -42 479 -42 461 -31 c 128,-1,48
 443 -20 443 -20 443 -33 c 0,49,50
 443 -52 443 -52 422 -47.5 c 128,-1,51
 401 -43 401 -43 381 -21 c 0,52,53
 363 -2 363 -2 363 3.5 c 128,-1,54
 363 9 363 9 382 16 c 0,55,56
 405 26 405 26 412 10 c 0,57,58
 416 0 416 0 423 0 c 128,-1,59
 430 0 430 0 446 8 c 0,60,61
 477 24 477 24 519 16 c 0,62,63
 565 9 565 9 580 25 c 0,64,65
 595 40 595 40 595 25 c 128,-1,66
 595 10 595 10 683.5 -0.5 c 128,-1,67
 772 -11 772 -11 811 -2 c 0,68,69
 839 7 839 7 840 17 c 128,-1,70
 841 27 841 27 813.5 34 c 128,-1,71
 786 41 786 41 747 39 c 0,72,73
 706 35 706 35 692 38.5 c 128,-1,74
 678 42 678 42 678 55 c 0,75,76
 678 75 678 75 710 77 c 0,77,78
 722 77 722 77 726 79.5 c 128,-1,79
 730 82 730 82 724 86 c 1,80,81
 705 93 705 93 706.5 112 c 128,-1,82
 708 131 708 131 726 131 c 0,83,84
 735 131 735 131 741 126.5 c 128,-1,85
 747 122 747 122 747 117 c 0,86,87
 747 104 747 104 767 120 c 0,88,89
 775 127 775 127 777 134.5 c 128,-1,90
 779 142 779 142 774 142 c 1,91,92
 760 147 760 147 762 162 c 128,-1,93
 764 177 764 177 782 195 c 0,94,95
 801 214 801 214 793 238 c 0,96,97
 784 261 784 261 778 245 c 0,98,99
 773 229 773 229 753 228.5 c 128,-1,100
 733 228 733 228 733 243 c 0,101,102
 733 256 733 256 754 279 c 0,103,104
 769 293 769 293 767.5 302 c 128,-1,105
 766 311 766 311 747 335 c 0,106,107
 731 354 731 354 724 369 c 128,-1,108
 717 384 717 384 721 388 c 128,-1,109
 725 392 725 392 738 386 c 1,110,111
 740 384 740 384 739.5 385.5 c 128,-1,112
 739 387 739 387 737 389.5 c 128,-1,113
 735 392 735 392 731 397.5 c 128,-1,114
 727 403 727 403 721.5 409 c 128,-1,115
 716 415 716 415 708.5 423.5 c 128,-1,116
 701 432 701 432 693 440 c 0,117,118
 668 465 668 465 645.5 481.5 c 128,-1,119
 623 498 623 498 617 495 c 0,120,121
 600 484 600 484 565.5 485.5 c 128,-1,122
 531 487 531 487 523 498 c 0,123,124
 519 504 519 504 515.5 501 c 128,-1,125
 512 498 512 498 512 488 c 128,-1,126
 512 478 512 478 505.5 470.5 c 128,-1,127
 499 463 499 463 491 463 c 0,128,129
 480 463 480 463 478.5 456.5 c 128,-1,130
 477 450 477 450 484 430 c 0,131,132
 495 397 495 397 482 383 c 0,133,134
 462 363 462 363 481.5 362 c 128,-1,135
 501 361 501 361 523 380 c 0,136,137
 548 404 548 404 565 407 c 128,-1,138
 582 410 582 410 583 391 c 0,139,140
 583 374 583 374 591 391 c 0,141,142
 597 407 597 407 617 408 c 128,-1,143
 637 409 637 409 637 394 c 0,144,145
 637 378 637 378 598 341.5 c 128,-1,146
 559 305 559 305 545 308 c 0,147,148
 527 312 527 312 519 297 c 0,149,150
 512 284 512 284 486 284 c 0,151,152
 459 284 459 284 416 260.5 c 128,-1,153
 373 237 373 237 346 207 c 0,154,155
 314 173 314 173 296 173 c 0,156,157
 290 173 290 173 270 156 c 128,-1,158
 250 139 250 139 230 117 c 0,159,160
 188 72 188 72 156.5 64 c 128,-1,161
 125 56 125 56 125 91 c 0,162,163
 125 119 125 119 102 112 c 0,164,165
 88 108 88 108 88 113 c 0,166,167
 88 115 88 115 90 119 c 0,168,169
 99 132 99 132 86 149 c 0,170,171
 72 167 72 167 65.5 197 c 128,-1,172
 59 227 59 227 71 221 c 0,173,174
 83 213 83 213 112 230 c 0,175,176
 128 238 128 238 131.5 241.5 c 128,-1,177
 135 245 135 245 133 248.5 c 128,-1,178
 131 252 131 252 118 259 c 0,179,180
 101 268 101 268 107 279.5 c 128,-1,181
 113 291 113 291 154 328 c 0,182,183
 190 361 190 361 198 374.5 c 128,-1,184
 206 388 206 388 194 396 c 0,185,186
 181 404 181 404 181.5 409 c 128,-1,187
 182 414 182 414 199 425 c 0,188,189
 219 436 219 436 219.5 440.5 c 128,-1,190
 220 445 220 445 201 459 c 0,191,192
 191 466 191 466 187.5 470.5 c 128,-1,193
 184 475 184 475 189.5 485 c 128,-1,194
 195 495 195 495 206 506 c 128,-1,195
 217 517 217 517 245 544 c 2,196,-1
 317 609 l 1,197,-1
 284 647 l 2,198,199
 251 685 251 685 230 685 c 0,200,201
 217 685 217 685 216.5 691 c 128,-1,202
 216 697 216 697 226 719 c 0,203,204
 238 745 238 745 257.5 753 c 128,-1,205
 277 761 277 761 277 740 c 0,206,207
 277 726 277 726 299 736 c 0,208,209
 319 745 319 745 328 714 c 0,210,211
 333 693 333 693 346.5 685.5 c 128,-1,212
 360 678 360 678 360 696 c 0,213,214
 360 700 360 700 369.5 707 c 128,-1,215
 379 714 379 714 392 719 c 0,216,217
 421 735 421 735 421 757 c 0,0,1
325 657 m 0,218,219
 332 671 332 671 320 671 c 0,220,221
 305 671 305 671 298 657 c 1,222,223
 294 652 294 652 295.5 647.5 c 128,-1,224
 297 643 297 643 303 643 c 0,225,226
 317 643 317 643 325 657 c 0,218,219
381 602 m 0,227,228
 408 632 408 632 400 634 c 128,-1,229
 392 636 392 636 363 607 c 0,230,231
 332 574 332 574 343 574 c 0,232,233
 355 574 355 574 381 602 c 0,227,228
595 629 m 0,234,235
 595 643 595 643 560 643 c 0,236,237
 526 643 526 643 526 629 c 0,238,239
 526 624 526 624 536 620 c 128,-1,240
 546 616 546 616 560 616 c 128,-1,241
 574 616 574 616 584.5 620 c 128,-1,242
 595 624 595 624 595 629 c 0,234,235
443 498 m 0,243,244
 443 511 443 511 435 515.5 c 128,-1,245
 427 520 427 520 415 515.5 c 128,-1,246
 403 511 403 511 392 498 c 0,247,248
 370 474 370 474 374 448 c 128,-1,249
 378 422 378 422 403 422 c 0,250,251
 419 422 419 422 424 428 c 128,-1,252
 429 434 429 434 425 450 c 0,253,254
 418 477 418 477 430 477 c 0,255,256
 443 477 443 477 443 498 c 0,243,244
304 470 m 0,257,258
 336 505 336 505 324 505 c 0,259,260
 308 505 308 505 280 470 c 0,261,262
 250 436 250 436 260 436 c 0,263,264
 272 436 272 436 304 470 c 0,257,258
131 173 m 1,265,266
 124 187 124 187 116 187 c 0,267,268
 111 187 111 187 111 173 c 0,269,270
 111 168 111 168 115.5 163.5 c 128,-1,271
 120 159 120 159 126 159 c 0,272,273
 131 159 131 159 133 163.5 c 128,-1,274
 135 168 135 168 131 173 c 1,265,266
798 -54 m 0,275,276
 745 -57 745 -57 735 -38 c 0,277,278
 730 -29 730 -29 727 -27 c 128,-1,279
 724 -25 724 -25 721 -28 c 128,-1,280
 718 -31 718 -31 714 -42 c 0,281,282
 706 -66 706 -66 706 -71 c 0,283,284
 706 -79 706 -79 760.5 -75.5 c 128,-1,285
 815 -72 815 -72 830 -62 c 0,286,287
 841 -55 841 -55 833.5 -53 c 128,-1,288
 826 -51 826 -51 798 -54 c 0,275,276
609 -62 m 0,289,290
 609 -49 609 -49 587 -49 c 0,291,292
 568 -49 568 -49 574 -62 c 0,293,294
 582 -76 582 -76 596 -76 c 0,295,296
 601 -76 601 -76 605 -71.5 c 128,-1,297
 609 -67 609 -67 609 -62 c 0,289,290
540 443 m 128,-1,299
 540 451 540 451 546 457 c 128,-1,300
 552 463 552 463 560 463 c 0,301,302
 569 463 569 463 575 457 c 128,-1,303
 581 451 581 451 581 443 c 128,-1,304
 581 435 581 435 575 428.5 c 128,-1,305
 569 422 569 422 560 422 c 0,306,307
 552 422 552 422 546 428.5 c 128,-1,298
 540 435 540 435 540 443 c 128,-1,299
623 443 m 128,-1,309
 623 451 623 451 629 457 c 128,-1,310
 635 463 635 463 643 463 c 0,311,312
 652 463 652 463 658 457 c 128,-1,313
 664 451 664 451 664 443 c 128,-1,314
 664 435 664 435 658 428.5 c 128,-1,315
 652 422 652 422 643 422 c 0,316,317
 635 422 635 422 629 428.5 c 128,-1,308
 623 435 623 435 623 443 c 128,-1,309
605 296 m 0,318,319
 617 311 617 311 622 313.5 c 128,-1,320
 627 316 627 316 631.5 311.5 c 128,-1,321
 636 307 636 307 646 288 c 0,322,323
 664 254 664 254 664.5 179 c 128,-1,324
 665 104 665 104 648 104 c 0,325,326
 630 104 630 104 648 87 c 0,327,328
 662 73 662 73 663.5 47 c 128,-1,329
 665 21 665 21 652 21 c 0,330,331
 636 21 636 21 617 51 c 0,332,333
 596 82 596 82 580 66 c 0,334,335
 570 57 570 57 560 58 c 128,-1,336
 550 59 550 59 531 70 c 0,337,338
 509 86 509 86 506 84 c 128,-1,339
 503 82 503 82 508 59 c 256,340,341
 513 36 513 36 511.5 35.5 c 128,-1,342
 510 35 510 35 498 49 c 1,343,344
 497 51 497 51 494 55 c 0,345,346
 475 79 475 79 486 100 c 128,-1,347
 497 121 497 121 523 111 c 0,348,349
 545 102 545 102 563 118.5 c 128,-1,350
 581 135 581 135 567 152 c 0,351,352
 552 170 552 170 567 180 c 128,-1,353
 582 190 582 190 566 209 c 0,354,355
 551 228 551 228 566 228 c 0,356,357
 572 228 572 228 576.5 234.5 c 128,-1,358
 581 241 581 241 581 249 c 0,359,360
 581 270 581 270 605 296 c 0,318,319
515 180 m 0,361,362
 541 209 541 209 540 194 c 0,363,364
 539 190 539 190 536 181 c 1,365,366
 527 163 527 163 542 148 c 0,367,368
 557 134 557 134 541 126 c 0,369,370
 535 122 535 122 530.5 125.5 c 128,-1,371
 526 129 526 129 526 137 c 0,372,373
 526 146 526 146 521.5 152.5 c 128,-1,374
 517 159 517 159 512 159 c 0,375,376
 499 159 499 159 515 180 c 0,361,362
706 166 m 128,-1,378
 706 174 706 174 712 180.5 c 128,-1,379
 718 187 718 187 726 187 c 0,380,381
 735 187 735 187 741 180.5 c 128,-1,382
 747 174 747 174 747 166 c 128,-1,383
 747 158 747 158 741 151.5 c 128,-1,384
 735 145 735 145 726 145 c 0,385,386
 718 145 718 145 712 151.5 c 128,-1,377
 706 158 706 158 706 166 c 128,-1,378
21 159 m 0,387,388
 14 173 14 173 26 173 c 0,389,390
 42 173 42 173 42 159 c 128,-1,391
 42 145 42 145 36 145 c 0,392,393
 29 145 29 145 21 159 c 0,387,388
448 124 m 0,394,395
 485 153 485 153 482 142 c 0,396,397
 481 137 481 137 470 124 c 0,398,399
 454 104 454 104 437 104 c 0,400,401
 424 104 424 104 448 124 c 0,394,395
415 48 m 0,402,403
 415 62 415 62 437 62 c 0,404,405
 456 62 456 62 450 48 c 0,406,407
 442 34 442 34 428 34 c 0,408,409
 423 34 423 34 419 38.5 c 128,-1,410
 415 43 415 43 415 48 c 0,402,403
EndSplineSet
EndChar
StartChar: p
Encoding: 112 112 7
Width: 1024
Flags: W
Fore
491 696 m 0,0,1
 555 705 555 705 579 702 c 128,-1,2
 603 699 603 699 617 682 c 0,3,4
 634 659 634 659 635.5 614.5 c 128,-1,5
 637 570 637 570 621 559 c 0,6,7
 605 551 605 551 621 535 c 0,8,9
 631 525 631 525 634.5 516.5 c 128,-1,10
 638 508 638 508 633 503 c 128,-1,11
 628 498 628 498 616 498 c 0,12,13
 595 498 595 498 595 484 c 0,14,15
 595 453 595 453 639 494 c 0,16,17
 657 510 657 510 665 509.5 c 128,-1,18
 673 509 673 509 692 491 c 0,19,20
 720 467 720 467 720 400 c 0,21,22
 720 357 720 357 711.5 336.5 c 128,-1,23
 703 316 703 316 673 288 c 0,24,25
 627 242 627 242 637 216 c 0,26,27
 643 197 643 197 645.5 196.5 c 128,-1,28
 648 196 648 196 655 213 c 0,29,30
 662 229 662 229 669 226.5 c 128,-1,31
 676 224 676 224 703 198 c 0,32,33
 746 155 746 155 774.5 111 c 128,-1,34
 803 67 803 67 803 45 c 0,35,36
 803 19 803 19 818 4 c 0,37,38
 832 -10 832 -10 828 -71 c 2,39,-1
 823 -132 l 1,40,-1
 516 -134 l 2,41,42
 336 -135 336 -135 272 -132 c 128,-1,43
 208 -129 208 -129 208 -118 c 0,44,45
 208 -101 208 -101 228 -83 c 0,46,47
 250 -65 250 -65 234 -47 c 0,48,49
 218 -27 218 -27 242 -21 c 128,-1,50
 266 -15 266 -15 353 -18 c 0,51,52
 394 -19 394 -19 423.5 -16 c 128,-1,53
 453 -13 453 -13 455 -7 c 0,54,55
 459 2 459 2 434.5 9.5 c 128,-1,56
 410 17 410 17 384 16.5 c 128,-1,57
 358 16 358 16 345 8 c 1,58,59
 329 -7 329 -7 322 11 c 0,60,61
 314 29 314 29 299 14 c 0,62,63
 281 0 281 0 256 27 c 0,64,65
 231 55 231 55 240.5 62.5 c 128,-1,66
 250 70 250 70 296 58 c 0,67,68
 344 44 344 44 353 55 c 0,69,70
 360 66 360 66 432 59 c 0,71,72
 474 54 474 54 487 56.5 c 128,-1,73
 500 59 500 59 495 70 c 0,74,75
 491 82 491 82 468 84.5 c 128,-1,76
 445 87 445 87 385 84 c 0,77,78
 282 79 282 79 271 94 c 0,79,80
 261 111 261 111 288.5 122 c 128,-1,81
 316 133 316 133 351 126 c 0,82,83
 397 116 397 116 437 117.5 c 128,-1,84
 477 119 477 119 477 131 c 0,85,86
 477 145 477 145 447 145 c 0,87,88
 424 145 424 145 414 150 c 128,-1,89
 404 155 404 155 410 163.5 c 128,-1,90
 416 172 416 172 436 180 c 0,91,92
 475 192 475 192 493 178 c 0,93,94
 510 164 510 164 533 184 c 0,95,96
 546 197 546 197 550.5 209 c 128,-1,97
 555 221 555 221 550.5 228 c 128,-1,98
 546 235 546 235 533 235 c 0,99,100
 525 235 525 235 518.5 230 c 128,-1,101
 512 225 512 225 512 218 c 0,102,103
 512 202 512 202 495 218 c 0,104,105
 480 235 480 235 439 235 c 0,106,107
 413 235 413 235 389 243.5 c 128,-1,108
 365 252 365 252 354 262 c 128,-1,109
 343 272 343 272 348 281.5 c 128,-1,110
 353 291 353 291 378 292 c 0,111,112
 401 293 401 293 373 300 c 0,113,114
 367 302 367 302 360 303 c 0,115,116
 334 308 334 308 321 316 c 128,-1,117
 308 324 308 324 313.5 332 c 128,-1,118
 319 340 319 340 342 343 c 0,119,120
 374 348 374 348 388.5 367.5 c 128,-1,121
 403 387 403 387 381 396 c 0,122,123
 367 402 367 402 372 411 c 128,-1,124
 377 420 377 420 407 445 c 2,125,-1
 457 487 l 1,126,-1
 422 528 l 2,127,128
 387 572 387 572 400 585 c 0,129,130
 415 600 415 600 415 631 c 0,131,132
 415 685 415 685 491 696 c 0,0,1
549 448 m 128,-1,134
 558 457 558 457 544 472 c 0,135,136
 529 485 529 485 520 473 c 1,137,138
 513 460 513 460 526.5 449.5 c 128,-1,133
 540 439 540 439 549 448 c 128,-1,134
498 465 m 0,139,140
 498 470 498 470 484 470 c 0,141,142
 479 470 479 470 474.5 465.5 c 128,-1,143
 470 461 470 461 470 455 c 0,144,145
 470 450 470 450 474.5 448 c 128,-1,146
 479 446 479 446 484 449 c 0,147,148
 498 457 498 457 498 465 c 0,139,140
443 354 m 0,149,150
 443 360 443 360 429 360 c 0,151,152
 424 360 424 360 419.5 355.5 c 128,-1,153
 415 351 415 351 415 344 c 0,154,155
 415 339 415 339 419.5 337.5 c 128,-1,156
 424 336 424 336 429 339 c 0,157,158
 443 346 443 346 443 354 c 0,149,150
452 288 m 1,159,160
 461 304 461 304 451 314 c 1,161,162
 448 318 448 318 445.5 312.5 c 128,-1,163
 443 307 443 307 444 296 c 0,164,165
 444 281 444 281 448 282 c 1,166,167
 450 282 450 282 452 288 c 1,159,160
595 228 m 0,168,169
 595 255 595 255 591.5 259.5 c 128,-1,170
 588 264 588 264 577 253 c 128,-1,171
 566 242 566 242 568 217.5 c 128,-1,172
 570 193 570 193 581 193 c 0,173,174
 595 193 595 193 595 228 c 0,168,169
554 131 m 128,-1,176
 554 139 554 139 547.5 145.5 c 128,-1,177
 541 152 541 152 533 152 c 128,-1,178
 525 152 525 152 518.5 145.5 c 128,-1,179
 512 139 512 139 512 131 c 128,-1,180
 512 123 512 123 518.5 116.5 c 128,-1,181
 525 110 525 110 533 110 c 128,-1,182
 541 110 541 110 547.5 116.5 c 128,-1,175
 554 123 554 123 554 131 c 128,-1,176
609 131 m 128,-1,184
 609 139 609 139 602.5 145.5 c 128,-1,185
 596 152 596 152 588 152 c 128,-1,186
 580 152 580 152 573.5 145.5 c 128,-1,187
 567 139 567 139 567 131 c 128,-1,188
 567 123 567 123 573.5 116.5 c 128,-1,189
 580 110 580 110 588 110 c 128,-1,190
 596 110 596 110 602.5 116.5 c 128,-1,183
 609 123 609 123 609 131 c 128,-1,184
650 124 m 128,-1,192
 650 138 650 138 637 138 c 0,193,194
 623 138 623 138 623 124 c 0,195,196
 623 119 623 119 627.5 114.5 c 128,-1,197
 632 110 632 110 637 110 c 0,198,191
 650 110 650 110 650 124 c 128,-1,192
554 76 m 128,-1,200
 554 84 554 84 547.5 90.5 c 128,-1,201
 541 97 541 97 533 97 c 128,-1,202
 525 97 525 97 518.5 90.5 c 128,-1,203
 512 84 512 84 512 76 c 128,-1,204
 512 68 512 68 518.5 61.5 c 128,-1,205
 525 55 525 55 533 55 c 128,-1,206
 541 55 541 55 547.5 61.5 c 128,-1,199
 554 68 554 68 554 76 c 128,-1,200
649 63 m 0,207,208
 635 80 635 80 630 81.5 c 128,-1,209
 625 83 625 83 617 70 c 0,210,211
 614 65 614 65 619.5 59.5 c 128,-1,212
 625 54 625 54 638 51 c 0,213,214
 655 46 655 46 657 48.5 c 128,-1,215
 659 51 659 51 649 63 c 0,207,208
720 -15 m 128,-1,217
 720 -2 720 -2 707 5 c 128,-1,218
 694 12 694 12 686 4 c 0,219,220
 675 -7 675 -7 679 -17.5 c 128,-1,221
 683 -28 683 -28 699 -28 c 0,222,216
 720 -28 720 -28 720 -15 c 128,-1,217
526 -14 m 0,223,224
 526 0 526 0 505 0 c 128,-1,225
 484 0 484 0 484 -14 c 0,226,227
 484 -19 484 -19 490.5 -23.5 c 128,-1,228
 497 -28 497 -28 505 -28 c 128,-1,229
 513 -28 513 -28 519.5 -23.5 c 128,-1,230
 526 -19 526 -19 526 -14 c 0,223,224
664 -14 m 0,231,232
 664 0 664 0 643 0 c 0,233,234
 623 0 623 0 623 -14 c 0,235,236
 623 -19 623 -19 629 -23.5 c 128,-1,237
 635 -28 635 -28 643 -28 c 0,238,239
 652 -28 652 -28 658 -23.5 c 128,-1,240
 664 -19 664 -19 664 -14 c 0,231,232
761 -14 m 128,-1,242
 761 0 761 0 747 0 c 0,243,244
 742 0 742 0 737.5 -4 c 128,-1,245
 733 -8 733 -8 733 -14 c 0,246,247
 733 -19 733 -19 737.5 -23.5 c 128,-1,248
 742 -28 742 -28 747 -28 c 0,249,241
 761 -28 761 -28 761 -14 c 128,-1,242
EndSplineSet
EndChar
StartChar: q
Encoding: 113 113 8
Width: 1024
Flags: W
Fore
462 632 m 0,0,1
 470 654 470 654 508 649 c 128,-1,2
 546 644 546 644 551 621 c 0,3,4
 555 598 555 598 533 576 c 128,-1,5
 511 554 511 554 488 558 c 0,6,7
 469 562 469 562 461 584.5 c 128,-1,8
 453 607 453 607 462 632 c 0,0,1
241 605 m 0,9,10
 249 627 249 627 287 622 c 128,-1,11
 325 617 325 617 329 594 c 0,12,13
 333 570 333 570 311.5 548 c 128,-1,14
 290 526 290 526 267 530 c 0,15,16
 247 535 247 535 239 557.5 c 128,-1,17
 231 580 231 580 241 605 c 0,9,10
684 605 m 0,18,19
 692 627 692 627 730 622 c 128,-1,20
 768 617 768 617 772 594 c 0,21,22
 776 570 776 570 754.5 548 c 128,-1,23
 733 526 733 526 710 530 c 0,24,25
 690 535 690 535 682 557.5 c 128,-1,26
 674 580 674 580 684 605 c 0,18,19
47 549 m 0,27,28
 55 571 55 571 93 566 c 128,-1,29
 131 561 131 561 136 538 c 0,30,31
 140 515 140 515 118 493 c 128,-1,32
 96 471 96 471 73 475 c 0,33,34
 54 479 54 479 46 501.5 c 128,-1,35
 38 524 38 524 47 549 c 0,27,28
877 549 m 0,36,37
 885 571 885 571 923 566 c 128,-1,38
 961 561 961 561 966 538 c 0,39,40
 970 515 970 515 948 493 c 128,-1,41
 926 471 926 471 904 475 c 0,42,43
 884 479 884 479 876 501.5 c 128,-1,44
 868 524 868 524 877 549 c 0,36,37
493 443 m 0,45,46
 502 472 502 472 513.5 445.5 c 128,-1,47
 525 419 525 419 527 364 c 0,48,49
 531 292 531 292 544 292 c 0,50,51
 556 292 556 292 551 251 c 0,52,53
 546 215 546 215 555.5 211 c 128,-1,54
 565 207 565 207 584 237 c 0,55,56
 597 259 597 259 617 263.5 c 128,-1,57
 637 268 637 268 637 251 c 0,58,59
 637 239 637 239 609 220 c 0,60,61
 593 210 593 210 586 197.5 c 128,-1,62
 579 185 579 185 583.5 176 c 128,-1,63
 588 167 588 167 602 167 c 0,64,65
 629 167 629 167 659 219 c 128,-1,66
 689 271 689 271 699 338 c 0,67,68
 707 387 707 387 716.5 408.5 c 128,-1,69
 726 430 726 430 734.5 417.5 c 128,-1,70
 743 405 743 405 747 361 c 0,71,72
 755 294 755 294 767 279 c 128,-1,73
 779 264 779 264 810 284 c 0,74,75
 839 304 839 304 850 296 c 1,76,77
 860 286 860 286 857.5 220 c 128,-1,78
 855 154 855 154 844 147 c 0,79,80
 830 139 830 139 830 94 c 0,81,82
 829 46 829 46 801.5 17 c 128,-1,83
 774 -12 774 -12 728 -12 c 0,84,85
 678 -12 678 -12 678 -32 c 128,-1,86
 678 -52 678 -52 754 -44 c 2,87,-1
 830 -39 l 1,88,-1
 830 -86 l 1,89,-1
 830 -134 l 1,90,-1
 505 -134 l 2,91,92
 282 -134 282 -134 216 -127 c 128,-1,93
 150 -120 150 -120 201 -101 c 0,94,95
 223 -91 223 -91 206 -73 c 0,96,97
 202 -68 202 -68 199.5 -65.5 c 128,-1,98
 197 -63 197 -63 198 -60 c 128,-1,99
 199 -57 199 -57 199.5 -55.5 c 128,-1,100
 200 -54 200 -54 208.5 -52.5 c 128,-1,101
 217 -51 217 -51 222.5 -50.5 c 128,-1,102
 228 -50 228 -50 247.5 -49.5 c 128,-1,103
 267 -49 267 -49 280 -48.5 c 128,-1,104
 293 -48 293 -48 325 -48 c 0,105,106
 420 -46 420 -46 426 -33 c 0,107,108
 428 -27 428 -27 415 -20.5 c 128,-1,109
 402 -14 402 -14 384.5 -10.5 c 128,-1,110
 367 -7 367 -7 349 -7.5 c 128,-1,111
 331 -8 331 -8 324 -14 c 0,112,113
 309 -27 309 -27 299 -17 c 1,114,115
 292 -7 292 -7 238 -7 c 0,116,117
 187 -4 187 -4 187 15 c 0,118,119
 187 27 187 27 201 31.5 c 128,-1,120
 215 36 215 36 252 36 c 0,121,122
 317 36 317 36 327 46 c 0,123,124
 331 50 331 50 339 49 c 128,-1,125
 347 48 347 48 354 42 c 0,126,127
 370 27 370 27 381 44 c 0,128,129
 391 59 391 59 371.5 71 c 128,-1,130
 352 83 352 83 329 76 c 0,131,132
 307 70 307 70 298 84 c 0,133,134
 289 100 289 100 264 79 c 0,135,136
 248 63 248 63 236.5 63 c 128,-1,137
 225 63 225 63 194 79 c 0,138,139
 162 96 162 96 158.5 102 c 128,-1,140
 155 108 155 108 173 120 c 0,141,142
 195 139 195 139 234 133 c 0,143,144
 254 129 254 129 254 131 c 0,145,146
 254 132 254 132 249 134 c 0,147,148
 220 148 220 148 194.5 181.5 c 128,-1,149
 169 215 169 215 176 231 c 0,150,151
 181 244 181 244 176 247 c 128,-1,152
 171 250 171 250 151 245 c 0,153,154
 138 242 138 242 133 242 c 128,-1,155
 128 242 128 242 136 245 c 1,156,157
 150 253 150 253 151.5 272.5 c 128,-1,158
 153 292 153 292 138 292 c 0,159,160
 125 292 125 292 125 334 c 0,161,162
 125 355 125 355 135 367.5 c 128,-1,163
 145 380 145 380 155.5 376 c 128,-1,164
 166 372 166 372 167 352 c 0,165,166
 167 330 167 330 195 285 c 0,167,168
 227 234 227 234 244 184 c 1,169,170
 245 177 245 177 251 173.5 c 128,-1,171
 257 170 257 170 262 173 c 0,172,173
 273 181 273 181 279.5 216 c 128,-1,174
 286 251 286 251 277 257 c 1,175,176
 269 260 269 260 270 281 c 128,-1,177
 271 302 271 302 284 379 c 0,178,179
 288 409 288 409 300 423.5 c 128,-1,180
 312 438 312 438 322 428.5 c 128,-1,181
 332 419 332 419 332 390 c 0,182,183
 332 350 332 350 346 340 c 0,184,185
 359 332 359 332 354 285 c 0,186,187
 352 237 352 237 363 237 c 0,188,189
 368 237 368 237 375.5 226 c 128,-1,190
 383 215 383 215 387 201 c 1,191,192
 394 186 394 186 403 177 c 128,-1,193
 412 168 412 168 419 170 c 0,194,195
 436 177 436 177 455 234 c 128,-1,196
 474 291 474 291 479 354 c 0,197,198
 487 429 487 429 493 443 c 0,45,46
789 210 m 0,199,200
 789 226 789 226 775.5 222 c 128,-1,201
 762 218 762 218 756 201 c 0,202,203
 746 176 746 176 749 171.5 c 128,-1,204
 752 167 752 167 768 181 c 0,205,206
 789 200 789 200 789 210 c 0,199,200
354 165 m 0,207,208
 345 181 345 181 324 181 c 0,209,210
 305 181 305 181 296 159.5 c 128,-1,211
 287 138 287 138 300 125 c 128,-1,212
 313 112 313 112 338.5 130.5 c 128,-1,213
 364 149 364 149 354 165 c 0,207,208
551 152 m 0,214,215
 548 169 548 169 514 177.5 c 128,-1,216
 480 186 480 186 466 173 c 0,217,218
 457 162 457 162 457 123 c 0,219,220
 457 101 457 101 463 92.5 c 128,-1,221
 469 84 469 84 483 84 c 0,222,223
 509 84 509 84 532 107 c 128,-1,224
 555 130 555 130 551 152 c 0,214,215
713 167 m 0,225,226
 703 181 703 181 677 181 c 0,227,228
 662 181 662 181 656 173.5 c 128,-1,229
 650 166 650 166 650 147 c 0,230,231
 650 132 650 132 656 122 c 128,-1,232
 662 112 662 112 670 112 c 0,233,234
 689 112 689 112 705 133 c 128,-1,235
 721 154 721 154 713 167 c 0,225,226
423 33 m 0,236,237
 431 40 431 40 426 58 c 0,238,239
 421 74 421 74 415 66 c 0,240,241
 413 64 413 64 410 58 c 1,242,243
 400 45 400 45 406.5 33.5 c 128,-1,244
 413 22 413 22 423 33 c 0,236,237
495 -29 m 0,245,246
 497 -23 497 -23 491.5 -17.5 c 128,-1,247
 486 -12 486 -12 477 -12 c 128,-1,248
 468 -12 468 -12 463 -17.5 c 128,-1,249
 458 -23 458 -23 461 -29 c 1,250,251
 466 -47 466 -47 477 -47 c 128,-1,252
 488 -47 488 -47 495 -29 c 0,245,246
609 -33 m 128,-1,254
 609 -25 609 -25 602.5 -18.5 c 128,-1,255
 596 -12 596 -12 588 -12 c 128,-1,256
 580 -12 580 -12 573.5 -18.5 c 128,-1,257
 567 -25 567 -25 567 -33 c 128,-1,258
 567 -41 567 -41 573.5 -47.5 c 128,-1,259
 580 -54 580 -54 588 -54 c 128,-1,260
 596 -54 596 -54 602.5 -47.5 c 128,-1,253
 609 -41 609 -41 609 -33 c 128,-1,254
664 -33 m 128,-1,262
 664 -25 664 -25 658 -18.5 c 128,-1,263
 652 -12 652 -12 643 -12 c 0,264,265
 635 -12 635 -12 629 -18.5 c 128,-1,266
 623 -25 623 -25 623 -33 c 128,-1,267
 623 -41 623 -41 629 -47.5 c 128,-1,268
 635 -54 635 -54 643 -54 c 0,269,270
 652 -54 652 -54 658 -47.5 c 128,-1,261
 664 -41 664 -41 664 -33 c 128,-1,262
852 365 m 0,271,272
 862 375 862 375 874 366 c 128,-1,273
 886 357 886 357 886 339 c 0,274,275
 886 331 886 331 879.5 325.5 c 128,-1,276
 873 320 873 320 865 320 c 0,277,278
 849 320 849 320 844.5 336.5 c 128,-1,279
 840 353 840 353 852 365 c 0,271,272
581 320 m 0,280,281
 581 334 581 334 617 334 c 0,282,283
 651 334 651 334 648 317 c 1,284,285
 639 299 639 299 632 303 c 1,286,287
 617 306 617 306 602 306 c 0,288,289
 594 306 594 306 587.5 310.5 c 128,-1,290
 581 315 581 315 581 320 c 0,280,281
127 179 m 0,291,292
 124 190 124 190 129.5 193.5 c 128,-1,293
 135 197 135 197 145.5 191.5 c 128,-1,294
 156 186 156 186 167 173 c 0,295,296
 180 159 180 159 179 155.5 c 128,-1,297
 178 152 178 152 161 155 c 0,298,299
 135 160 135 160 127 179 c 0,291,292
EndSplineSet
EndChar
StartChar: r
Encoding: 114 114 9
Width: 1024
Flags: W
Fore
298 750 m 0,0,1
 309 769 309 769 320.5 753.5 c 128,-1,2
 332 738 332 738 332 702 c 0,3,4
 332 665 332 665 349 652 c 128,-1,5
 366 639 366 639 414 639 c 0,6,7
 451 639 451 639 466 624 c 0,8,9
 482 608 482 608 490 624 c 0,10,11
 499 639 499 639 486 639 c 0,12,13
 472 639 472 639 475 681 c 0,14,15
 476 722 476 722 512 733 c 0,16,17
 521 736 521 736 539 743 c 128,-1,18
 557 750 557 750 560 751 c 0,19,20
 567 753 567 753 572.5 739 c 128,-1,21
 578 725 578 725 581 702 c 0,22,23
 586 660 586 660 595 653 c 128,-1,24
 604 646 604 646 650 646 c 0,25,26
 694 646 694 646 704.5 652.5 c 128,-1,27
 715 659 715 659 720 688 c 0,28,29
 726 730 726 730 754 733 c 0,30,31
 779 738 779 738 796 751 c 0,32,33
 816 771 816 771 823 755 c 128,-1,34
 830 739 830 739 830 673 c 0,35,36
 830 608 830 608 826 595.5 c 128,-1,37
 822 583 822 583 803 588 c 0,38,39
 775 595 775 595 775 580 c 0,40,41
 775 564 775 564 747 529 c 0,42,43
 730 506 730 506 725 470.5 c 128,-1,44
 720 435 720 435 721 328 c 0,45,46
 721 233 721 233 725.5 195 c 128,-1,47
 730 157 730 157 743.5 138 c 128,-1,48
 757 119 757 119 793 104 c 0,49,50
 815 94 815 94 822.5 81 c 128,-1,51
 830 68 830 68 830 39 c 0,52,53
 830 13 830 13 836 1 c 128,-1,54
 842 -11 842 -11 858 -15 c 128,-1,55
 874 -19 874 -19 880 -32 c 128,-1,56
 886 -45 886 -45 886 -76 c 2,57,-1
 886 -130 l 1,58,-1
 519 -131 l 2,59,60
 288 -132 288 -132 220 -129 c 128,-1,61
 152 -126 152 -126 152 -113 c 0,62,63
 152 -105 152 -105 159 -99.5 c 128,-1,64
 166 -94 166 -94 176 -94 c 0,65,66
 189 -94 189 -94 190.5 -90.5 c 128,-1,67
 192 -87 192 -87 183 -77 c 0,68,69
 144 -39 144 -39 205 -39 c 0,70,71
 244 -39 244 -39 252.5 -28.5 c 128,-1,72
 261 -18 261 -18 239 6 c 0,73,74
 232 14 232 14 230 17 c 128,-1,75
 228 20 228 20 225 24.5 c 128,-1,76
 222 29 222 29 228 30 c 128,-1,77
 234 31 234 31 237 33 c 128,-1,78
 240 35 240 35 257.5 35 c 128,-1,79
 275 35 275 35 287.5 35.5 c 128,-1,80
 300 36 300 36 332 36 c 0,81,82
 422 38 422 38 422 51 c 0,83,84
 422 66 422 66 364 61 c 0,85,86
 307 56 307 56 277 65 c 0,87,88
 239 78 239 78 261.5 89 c 128,-1,89
 284 100 284 100 346 100 c 0,90,91
 401 100 401 100 413.5 103.5 c 128,-1,92
 426 107 426 107 419 123 c 0,93,94
 415 132 415 132 416.5 134.5 c 128,-1,95
 418 137 418 137 424 132.5 c 128,-1,96
 430 128 430 128 443 116 c 0,97,98
 462 99 462 99 472.5 96 c 128,-1,99
 483 93 483 93 494 101 c 0,100,101
 512 118 512 118 512 101 c 0,102,103
 512 95 512 95 516.5 90.5 c 128,-1,104
 521 86 521 86 526 86 c 0,105,106
 544 86 544 86 536.5 103.5 c 128,-1,107
 529 121 529 121 491 165 c 0,108,109
 443 223 443 223 457 231 c 0,110,111
 470 239 470 239 456.5 259.5 c 128,-1,112
 443 280 443 280 425 280 c 0,113,114
 409 280 409 280 426 263 c 0,115,116
 457 232 457 232 421 219 c 0,117,118
 399 210 399 210 372 230 c 0,119,120
 359 238 359 238 355 242.5 c 128,-1,121
 351 247 351 247 354 250 c 128,-1,122
 357 253 357 253 368 257 c 0,123,124
 379 262 379 262 381.5 265.5 c 128,-1,125
 384 269 384 269 380.5 275.5 c 128,-1,126
 377 282 377 282 363 295 c 0,127,128
 347 309 347 309 338.5 332 c 128,-1,129
 330 355 330 355 333 371.5 c 128,-1,130
 336 388 336 388 350 385 c 0,131,132
 356 383 356 383 358.5 383.5 c 128,-1,133
 361 384 361 384 357 386 c 0,134,135
 345 394 345 394 347 413 c 128,-1,136
 349 432 349 432 361 432 c 0,137,138
 376 432 376 432 357 450 c 128,-1,139
 338 468 338 468 314 477 c 0,140,141
 292 485 292 485 297.5 499.5 c 128,-1,142
 303 514 303 514 329 516 c 0,143,144
 339 517 339 517 329.5 520.5 c 128,-1,145
 320 524 320 524 298 527 c 0,146,147
 266 532 266 532 252.5 540 c 128,-1,148
 239 548 239 548 247.5 557 c 128,-1,149
 256 566 256 566 284 572 c 256,150,151
 312 578 312 578 313 580 c 1,152,-1
 300 583 l 1,153,154
 297 583 297 583 291 584 c 0,155,156
 242 586 242 586 232 585 c 0,157,158
 212 583 212 583 202 596 c 128,-1,159
 192 609 192 609 206 619 c 1,160,161
 220 626 220 626 213 645 c 0,162,163
 204 669 204 669 222 702.5 c 128,-1,164
 240 736 240 736 262 736 c 0,165,166
 288 736 288 736 298 750 c 0,0,1
408 530 m 0,167,168
 399 544 399 544 393 541.5 c 128,-1,169
 387 539 387 539 387 520 c 0,170,171
 387 512 387 512 391.5 508.5 c 128,-1,172
 396 505 396 505 401 508 c 0,173,174
 416 516 416 516 408 530 c 0,167,168
616 487 m 0,175,176
 609 501 609 501 602 501 c 128,-1,177
 595 501 595 501 588 487 c 0,178,179
 585 482 585 482 589 477.5 c 128,-1,180
 593 473 593 473 602 473 c 128,-1,181
 611 473 611 473 615 477.5 c 128,-1,182
 619 482 619 482 616 487 c 0,175,176
408 473 m 0,183,184
 402 487 402 487 393 487 c 0,185,186
 387 487 387 487 387 473 c 0,187,188
 387 468 387 468 391.5 463.5 c 128,-1,189
 396 459 396 459 403 459 c 0,190,191
 408 459 408 459 409.5 463.5 c 128,-1,192
 411 468 411 468 408 473 c 0,183,184
470 383 m 0,193,194
 470 404 470 404 458 404 c 0,195,196
 445 404 445 404 438 391.5 c 128,-1,197
 431 379 431 379 439 371 c 0,198,199
 450 360 450 360 460 364 c 128,-1,200
 470 368 470 368 470 383 c 0,193,194
436 335 m 0,201,202
 429 349 429 349 421 349 c 0,203,204
 415 349 415 349 415 335 c 0,205,206
 415 330 415 330 419.5 325.5 c 128,-1,207
 424 321 424 321 430 321 c 0,208,209
 435 321 435 321 437 325.5 c 128,-1,210
 439 330 439 330 436 335 c 0,201,202
498 300 m 0,211,212
 498 321 498 321 486 321 c 0,213,214
 473 321 473 321 465.5 308.5 c 128,-1,215
 458 296 458 296 466 288 c 0,216,217
 478 277 478 277 488 281 c 128,-1,218
 498 285 498 285 498 300 c 0,211,212
526 217 m 0,219,220
 526 238 526 238 513 238 c 128,-1,221
 500 238 500 238 493 225.5 c 128,-1,222
 486 213 486 213 494 205 c 0,223,224
 505 194 505 194 515.5 197.5 c 128,-1,225
 526 201 526 201 526 217 c 0,219,220
581 149 m 0,226,227
 581 155 581 155 567 155 c 0,228,229
 554 155 554 155 554 140 c 0,230,231
 554 127 554 127 567 134 c 0,232,233
 581 140 581 140 581 149 c 0,226,227
623 107 m 0,234,235
 623 127 623 127 609 127 c 0,236,237
 604 127 604 127 599.5 121 c 128,-1,238
 595 115 595 115 595 107 c 0,239,240
 595 98 595 98 599.5 92 c 128,-1,241
 604 86 604 86 609 86 c 0,242,243
 623 86 623 86 623 107 c 0,234,235
498 51 m 0,244,245
 498 68 498 68 488 71.5 c 128,-1,246
 478 75 478 75 466 62 c 0,247,248
 454 51 454 51 457.5 40.5 c 128,-1,249
 461 30 461 30 477 30 c 0,250,251
 485 30 485 30 491.5 36.5 c 128,-1,252
 498 43 498 43 498 51 c 0,244,245
609 51 m 128,-1,254
 609 59 609 59 602.5 65.5 c 128,-1,255
 596 72 596 72 588 72 c 128,-1,256
 580 72 580 72 573.5 65.5 c 128,-1,257
 567 59 567 59 567 51 c 128,-1,258
 567 43 567 43 573.5 36.5 c 128,-1,259
 580 30 580 30 588 30 c 128,-1,260
 596 30 596 30 602.5 36.5 c 128,-1,253
 609 43 609 43 609 51 c 128,-1,254
668 53 m 0,261,262
 661 71 661 71 642 71 c 128,-1,263
 623 71 623 71 623 53 c 0,264,265
 623 38 623 38 641 27 c 128,-1,266
 659 16 659 16 668 26 c 1,267,268
 677 33 677 33 668 53 c 0,261,262
706 58 m 0,269,270
 706 72 706 72 692 72 c 0,271,272
 687 72 687 72 682.5 68 c 128,-1,273
 678 64 678 64 678 58 c 0,274,275
 678 53 678 53 682.5 48.5 c 128,-1,276
 687 44 687 44 692 44 c 0,277,278
 698 44 698 44 702 48.5 c 128,-1,279
 706 53 706 53 706 58 c 0,269,270
374 -18 m 0,280,281
 347 -27 347 -27 328 -14 c 1,282,283
 313 0 313 0 293 -19 c 0,284,285
 282 -32 282 -32 286.5 -35.5 c 128,-1,286
 291 -39 291 -39 317 -39 c 0,287,288
 355 -39 355 -39 379 -47 c 0,289,290
 401 -56 401 -56 401 -32 c 0,291,292
 401 -19 401 -19 395 -16 c 128,-1,293
 389 -13 389 -13 374 -18 c 0,280,281
462 -40 m 1,294,295
 472 -29 472 -29 458 -19 c 0,296,297
 445 -10 445 -10 437 -24 c 1,298,299
 428 -35 428 -35 441 -44 c 0,300,301
 446 -48 446 -48 452.5 -46.5 c 128,-1,302
 459 -45 459 -45 462 -40 c 1,294,295
637 -40 m 128,-1,304
 637 -27 637 -27 624 -20 c 128,-1,305
 611 -13 611 -13 603 -21 c 0,306,307
 592 -32 592 -32 596 -42.5 c 128,-1,308
 600 -53 600 -53 616 -53 c 0,309,303
 637 -53 637 -53 637 -40 c 128,-1,304
692 -39 m 0,310,311
 692 -25 692 -25 671 -25 c 128,-1,312
 650 -25 650 -25 650 -39 c 0,313,314
 650 -44 650 -44 656.5 -48.5 c 128,-1,315
 663 -53 663 -53 671 -53 c 128,-1,316
 679 -53 679 -53 685.5 -48.5 c 128,-1,317
 692 -44 692 -44 692 -39 c 0,310,311
740 -39 m 0,318,319
 746 -25 746 -25 728 -25 c 0,320,321
 706 -25 706 -25 706 -39 c 128,-1,322
 706 -53 706 -53 718 -53 c 0,323,324
 732 -53 732 -53 740 -39 c 0,318,319
803 -30 m 0,325,326
 803 -25 803 -25 780 -25 c 0,327,328
 772 -25 772 -25 768.5 -29.5 c 128,-1,329
 765 -34 765 -34 768 -39 c 0,330,331
 774 -48 774 -48 788.5 -45 c 128,-1,332
 803 -42 803 -42 803 -30 c 0,325,326
415 202 m 128,-1,334
 415 210 415 210 429 210 c 128,-1,335
 443 210 443 210 443 205 c 0,336,337
 443 198 443 198 452 173 c 0,338,339
 458 156 458 156 457 155 c 128,-1,340
 456 154 456 154 439 172 c 0,341,333
 415 194 415 194 415 202 c 128,-1,334
353 127 m 0,342,343
 347 141 347 141 358 141 c 0,344,345
 374 141 374 141 374 127 c 128,-1,346
 374 113 374 113 368 113 c 0,347,348
 361 113 361 113 353 127 c 0,342,343
EndSplineSet
EndChar
EndChars
EndSplineFont
