%!PS-Adobe-3.0 EPSF-3.0
%%Creator: inkscape 0.46
%%Pages: 1
%%Orientation: Portrait
%%BoundingBox: 29 424 185 815
%%HiResBoundingBox: 29.714288 424.57096 184.02955 814.53383
%%EndComments
%%BeginSetup
%%EndSetup
%%Page: 1 1
0 842 translate
0.8 -0.8 scale
0 0 0 setrgbcolor
[] 0 setdash
1 setlinewidth
0 setlinejoin
0 setlinecap
gsave [1 0 0 1 0 0] concat
gsave
0.9137255 0.9137255 1 setrgbcolor
newpath
110.63413 305.58359 moveto
230.03694 174.12954 lineto
230.03694 463.17715 lineto
110.63413 521.64849 lineto
110.63413 305.58359 lineto
closepath
eofill
grestore
gsave
0.20784314 0.20784314 0.39215687 setrgbcolor
newpath
37.142861 232.36218 moveto
37.142861 489.07928 lineto
110.63413 521.64849 lineto
110.63413 305.58359 lineto
37.142861 232.36218 lineto
closepath
eofill
grestore
gsave
0.3019608 0.3019608 0.62352943 setrgbcolor
newpath
37.142861 232.36218 moveto
157.14286 34.19489 lineto
230.03694 174.12954 lineto
110.63413 305.58359 lineto
37.142861 232.36218 lineto
closepath
eofill
grestore
gsave
0.68627453 0.68627453 0.87058824 setrgbcolor
newpath
37.142861 489.07928 moveto
157.14286 400.93361 lineto
230.03694 463.17715 lineto
110.63413 521.64849 lineto
37.142861 489.07928 lineto
closepath
eofill
grestore
gsave
0.84313726 0.84313726 1 setrgbcolor
newpath
157.14286 34.19489 moveto
157.14286 400.93361 lineto
230.03694 463.17715 lineto
230.03694 174.12954 lineto
157.14286 34.19489 lineto
closepath
eofill
grestore
gsave
0.52549022 0.52549022 0.74901962 setrgbcolor
newpath
37.142861 232.36218 moveto
157.14286 34.19489 lineto
157.14286 400.93361 lineto
37.142861 489.07928 lineto
37.142861 232.36218 lineto
closepath
eofill
grestore
grestore
showpage
%%EOF
