%!PS-Adobe-2.0 EPSF-2.0
%%BoundingBox:  0 0 567 400
%%Title: Pb208Proton1GeV.eps: c1
%%Creator: ROOT Version 5.16/00
%%CreationDate: Mon Aug 13 11:12:53 2007
%%EndComments
%%BeginProlog
80 dict begin
/s {stroke} def /l {lineto} def /m {moveto} def /t {translate} def
/sw {stringwidth} def /r {rotate} def /rl {roll}  def /R {repeat} def
/d {rlineto} def /rm {rmoveto} def /gr {grestore} def /f {eofill} def
/c {setrgbcolor} def /black {0 setgray} def /sd {setdash} def
/cl {closepath} def /sf {scalefont setfont} def /lw {setlinewidth} def
/box {m dup 0 exch d exch 0 d 0 exch neg d cl} def
/NC{systemdict begin initclip end}def/C{NC box clip newpath}def
/bl {box s} def /bf {box f} def /Y { 0 exch d} def /X { 0 d} def 
/mp {newpath /y exch def /x exch def} def
/side {[w .77 mul w .23 mul] .385 w mul sd w 0 l currentpoint t -144 r} def
/mr {mp x y w2 0 360 arc} def /m24 {mr s} def /m20 {mr f} def
/mb {mp x y w2 add m w2 neg 0 d 0 w neg d w 0 d 0 w d cl} def
/mt {mp x y w2 add m w2 neg w neg d w 0 d cl} def
/m21 {mb f} def /m25 {mb s} def /m22 {mt f} def /m26{mt s} def
/m23 {mp x y w2 sub m w2 w d w neg 0 d cl f} def
/m27 {mp x y w2 add m w3 neg w2 neg d w3 w2 neg d w3 w2 d cl s} def
/m28 {mp x w2 sub y w2 sub w3 add m w3 0 d  0 w3 neg d w3 0 d 0 w3 d w3 0 d  0 w3 d w3 neg 0 d 0 w3 d w3 neg 0 d
 0 w3 neg d w3 neg 0 d cl s } def
/m29 {mp gsave x w2 sub y w2 add w3 sub m currentpoint t
 4 {side} repeat cl fill gr} def
/m30 {mp gsave x w2 sub y w2 add w3 sub m currentpoint t
 4 {side} repeat cl s gr} def
/m31 {mp x y w2 sub m 0 w d x w2 sub y m w 0 d x w2 sub y w2 add m w w neg d x w2 sub y w2
 sub m w w d s} def
/m2 {mp x y w2 sub m 0 w d x w2 sub y m w 0 d s} def
/m5 {mp x w2 sub y w2 sub m w w d x w2 sub y w2 add m w w neg d s} def
/reencdict 24 dict def /ReEncode {reencdict begin /nco&na exch def
/nfnam exch def /basefontname exch def /basefontdict basefontname findfont def
/newfont basefontdict maxlength dict def basefontdict {exch dup /FID ne
{dup /Encoding eq {exch dup length array copy newfont 3 1 roll put} {exch 
newfont 3 1 roll put} ifelse} {pop pop} ifelse } forall newfont
/FontName nfnam put nco&na aload pop nco&na length 2 idiv {newfont
/Encoding get 3 1 roll put} repeat nfnam newfont definefont pop end } def
/accvec [ 176 /agrave 181 /Agrave 190 /acircumflex 192 /Acircumflex
201 /adieresis 204 /Adieresis 209 /ccedilla 210 /Ccedilla 211 /eacute
212 /Eacute 213 /egrave 214 /Egrave 215 /ecircumflex 216 /Ecircumflex
217 /edieresis 218 /Edieresis 219 /icircumflex 220 /Icircumflex
221 /idieresis 222 /Idieresis 223 /ntilde 224 /Ntilde 226 /ocircumflex
228 /Ocircumflex 230 /Odieresis 231 /ucircumflex 236 /Ucircumflex
237 /udieresis 238 /Udieresis 239 /aring 240 /odieresis 242 /Aring 243 /ydieresis
244 /Ydieresis 246 /aacute 247 /Aacute 252 /ugrave 253 /Ugrave
127 /atilde 128 /Atilde 129 /oacute 130 /Oacute 131 /iacute
132 /Iacute 133 /igrave 134 /Igrave 135 /otilde 136 /Otilde
137 /uacute 138 /Uacute] def
/Times-Roman /Times-Roman accvec ReEncode
/Times-Italic /Times-Italic accvec ReEncode
/Times-Bold /Times-Bold accvec ReEncode
/Times-BoldItalic /Times-BoldItalic accvec ReEncode
/Helvetica /Helvetica accvec ReEncode
/Helvetica-Oblique /Helvetica-Oblique accvec ReEncode
/Helvetica-Bold /Helvetica-Bold accvec ReEncode
/Helvetica-BoldOblique /Helvetica-BoldOblique  accvec ReEncode
/Courier /Courier accvec ReEncode
/Courier-Oblique /Courier-Oblique accvec ReEncode
/Courier-Bold /Courier-Bold accvec ReEncode
/Courier-BoldOblique /Courier-BoldOblique accvec ReEncode
/oshow {gsave [] 0 sd true charpath stroke gr} def
/stwn { /fs exch def /fn exch def /text exch def fn findfont fs sf
 text sw pop xs add /xs exch def} def
/stwb { /fs exch def /fn exch def /nbas exch def /textf exch deftextf length /tlen exch def nbas tlen gt {/nbas tlendef} iffn findfont fs sf textf dup length nbas sub nbas getinterval sw
pop neg xs add /xs exch def} def
/accspe [ 65 /plusminus  66 /bar  67 /existential  68 /universal 
69 /exclam  70 /numbersign 71 /greater  72 /question  73 /integral 
74 /colon  75 /semicolon  76 /less  77 /bracketleft  78 /bracketright
79 /greaterequal 80 /braceleft 81 /braceright 82 /radical
83 /spade 84 /heart 85 /diamond 86 /club 87 /lessequal
88 /multiply 89 /percent 90 /infinity 48 /circlemultiply 49 /circleplus
50 /emptyset  51 /lozenge 52 /bullet 53 /arrowright 54 /arrowup
55 /arrowleft 56 /arrowdown 57 /arrowboth 48 /degree 44 /comma 43 /plus 45 /angle 42 /angleleft 47 /divide 61 /notequal 40 /equivalence 41 /second 97 /approxequal 98 /congruent 99 /perpendicular 100 /partialdiff 101 /florin 102 /intersection
 103 /union 104 /propersuperset 105 /reflexsuperset 106 /notsubset 107 /propersubset 108 /reflexsubset 109 /element 110 /notelement 111 /gradient 112 /logicaland 113 /logicalor 114 /arrowdblboth 115 /arrowdblleft 116 /arrowdblup 117 /arrowdblright
 118 /arrowdbldown 119 /ampersand 120 /omega1 121 /similar 122 /aleph ] def
/Symbol /Special accspe ReEncode
%%EndProlog
%%BeginSetup
%%EndSetup
newpath  gsave  .25 .25 scale  gsave  0 0 t black[  ] 0 sd 3 lw 1 1 1 c 0.999 0.999 0.999 c 2268 1602 0 0 bf black 1 1 1 c 0.999 0.999 0.999 c 1814 1282 227 160 bf black 1814 1282 227 160 bl 1 0 0 c 1 1 1 c black 1 0 0 c 227 160 m 79 X 818 Y 16 X
 378 Y 16 X -1196 Y 1512 X 93 Y 16 X 262 Y 16 X 190 Y 16 X 115 Y 16 X 60 Y 16 X 14 Y 15 X -17 Y 16 X 30 Y 16 X -267 Y 16 X -480 Y 48 X s black 227 160 m 1814 X s 322 179 m -19 Y s 402 170 m -10 Y s 481 170 m -10 Y s 561 170 m -10 Y s 641 170 m -10 Y
 s 720 179 m -19 Y s 800 170 m -10 Y s 879 170 m -10 Y s 959 170 m -10 Y s 1038 170 m -10 Y s 1118 179 m -19 Y s 1198 170 m -10 Y s 1277 170 m -10 Y s 1357 170 m -10 Y s 1436 170 m -10 Y s 1516 179 m -19 Y s 1595 170 m -10 Y s 1675 170 m -10 Y s
 1754 170 m -10 Y s 1834 170 m -10 Y s 1914 179 m -19 Y s 322 179 m -19 Y s 243 170 m -10 Y s 1914 179 m -19 Y s 1993 170 m -10 Y s
 gsave  2268 1602 0 0 C 306 108 t 0 r /Courier-Bold findfont 50.9936 sf 0 0 m (0) show NC gr 
 gsave  2268 1602 0 0 C 690 108 t 0 r /Courier-Bold findfont 50.9936 sf 0 0 m (50) show NC gr 
 gsave  2268 1602 0 0 C 1071 108 t 0 r /Courier-Bold findfont 50.9936 sf 0 0 m (100) show NC gr 
 gsave  2268 1602 0 0 C 1470 108 t 0 r /Courier-Bold findfont 50.9936 sf 0 0 m (150) show NC gr 
 gsave  2268 1602 0 0 C 1866 108 t 0 r /Courier-Bold findfont 50.9936 sf 0 0 m (200) show NC gr  227 160 m 1282 Y s 236 190 m -9 X s 236 215 m -9 X s 236 235 m -9 X s 236 253 m -9 X s 236 269 m -9 X s 245 283 m -18 X s
 gsave  2268 1602 0 0 C 209 262 t 0 r  -60 0 t /Courier-Bold findfont 50.9936 sf 0 0 m (10) show NC gr  236 377 m -9 X s 236 431 m -9 X s 236 470 m -9 X s 236 500 m -9 X s 236 524 m -9 X s 236 545 m -9 X s 236 563 m -9 X s 236 579 m -9 X s 245 593 m
 -18 X s
 gsave  2268 1602 0 0 C 186 588 t 0 r /Courier-Bold findfont 35.9955 sf 0 0 m (2) show NC gr 
 gsave  2268 1602 0 0 C 126 567 t 0 r /Courier-Bold findfont 50.9936 sf 0 0 m (10) show NC gr  236 686 m -9 X s 236 741 m -9 X s 236 780 m -9 X s 236 810 m -9 X s 236 834 m -9 X s 236 855 m -9 X s 236 873 m -9 X s 236 889 m -9 X s 245 903 m -18 X s
 gsave  2268 1602 0 0 C 186 900 t 0 r /Courier-Bold findfont 35.9955 sf 0 0 m (3) show NC gr 
 gsave  2268 1602 0 0 C 126 876 t 0 r /Courier-Bold findfont 50.9936 sf 0 0 m (10) show NC gr  236 996 m -9 X s 236 1051 m -9 X s 236 1089 m -9 X s 236 1119 m -9 X s 236 1144 m -9 X s 236 1164 m -9 X s 236 1182 m -9 X s 236 1198 m -9 X s 245 1212 m
 -18 X s
 gsave  2268 1602 0 0 C 186 1209 t 0 r /Courier-Bold findfont 35.9955 sf 0 0 m (4) show NC gr 
 gsave  2268 1602 0 0 C 126 1188 t 0 r /Courier-Bold findfont 50.9936 sf 0 0 m (10) show NC gr  236 1306 m -9 X s 236 1360 m -9 X s 236 1399 m -9 X s 236 1429 m -9 X s 1 1 1 c black 227 160 m 79 X 823 Y 16 X 367 Y 16 X -1190 Y 1512 X 55 Y 16 X 268 Y
 16 X 202 Y 16 X 109 Y 16 X 79 Y 16 X 24 Y 15 X -8 Y 16 X 22 Y 16 X -160 Y 16 X -591 Y 48 X s 1 1 1 c 1133 241 454 1121 bf black
 gsave  2268 1602 0 0 C 735 1278 t 0 r /Courier-Bold findfont 59.9925 sf 0 0 m (FORTRAN INCL 4.2) show NC gr  1 1 1 c 496 1259 m 198 X 85 Y -198 X f 1 0 0 c 496 1301 m 198 X s black /w 2 def /w2 {w 2 div} def /w3 {w 3 div} def 595 1301 m20
 gsave  2268 1602 0 0 C 735 1158 t 0 r /Courier-Bold findfont 59.9925 sf 0 0 m (C++ INCL 4.2) show NC gr  1 1 1 c 496 1139 m 198 X 84 Y -198 X f black 496 1181 m 198 X s 595 1181 m20
 gsave  2268 1602 0 0 C 1134 1497 t 0 r  -289 0 t /Courier-Bold findfont 59.9925 sf 0 0 m (p\(1 GeV\) + 208Pb) show NC gr 
 gr  gr 
showpage
end
%%EOF
