%!PS-Adobe-2.0 EPSF-2.0
%%BoundingBox:  0 0 567 477
%%Title: /home/mael/CERN/INCL_ABLA/GSIResidues/ncrosssect.eps: n Cross-section
%%Creator: ROOT Version 5.14/00g
%%CreationDate: Tue Dec  4 18:00:52 2007
%%EndComments
%%BeginProlog
80 dict begin
/s {stroke} def /l {lineto} def /m {moveto} def /t {translate} def
/sw {stringwidth} def /r {rotate} def /rl {roll}  def /R {repeat} def
/d {rlineto} def /rm {rmoveto} def /gr {grestore} def /f {eofill} def
/c {setrgbcolor} def /black {0 setgray} def /sd {setdash} def
/cl {closepath} def /sf {scalefont setfont} def /lw {setlinewidth} def
/box {m dup 0 exch d exch 0 d 0 exch neg d cl} def
/NC{systemdict begin initclip end}def/C{NC box clip newpath}def
/bl {box s} def /bf {box f} def /Y { 0 exch d} def /X { 0 d} def 
/mp {newpath /y exch def /x exch def} def
/side {[w .77 mul w .23 mul] .385 w mul sd w 0 l currentpoint t -144 r} def
/mr {mp x y w2 0 360 arc} def /m24 {mr s} def /m20 {mr f} def
/mb {mp x y w2 add m w2 neg 0 d 0 w neg d w 0 d 0 w d cl} def
/mt {mp x y w2 add m w2 neg w neg d w 0 d cl} def
/m21 {mb f} def /m25 {mb s} def /m22 {mt f} def /m26{mt s} def
/m23 {mp x y w2 sub m w2 w d w neg 0 d cl f} def
/m27 {mp x y w2 add m w3 neg w2 neg d w3 w2 neg d w3 w2 d cl s} def
/m28 {mp x w2 sub y w2 sub w3 add m w3 0 d  0 w3 neg d w3 0 d 0 w3 d w3 0 d  0 w3 d w3 neg 0 d 0 w3 d w3 neg 0 d
 0 w3 neg d w3 neg 0 d cl s } def
/m29 {mp gsave x w2 sub y w2 add w3 sub m currentpoint t
 4 {side} repeat cl fill gr} def
/m30 {mp gsave x w2 sub y w2 add w3 sub m currentpoint t
 4 {side} repeat cl s gr} def
/m31 {mp x y w2 sub m 0 w d x w2 sub y m w 0 d x w2 sub y w2 add m w w neg d x w2 sub y w2
 sub m w w d s} def
/m2 {mp x y w2 sub m 0 w d x w2 sub y m w 0 d s} def
/m5 {mp x w2 sub y w2 sub m w w d x w2 sub y w2 add m w w neg d s} def
/reencdict 24 dict def /ReEncode {reencdict begin /nco&na exch def
/nfnam exch def /basefontname exch def /basefontdict basefontname findfont def
/newfont basefontdict maxlength dict def basefontdict {exch dup /FID ne
{dup /Encoding eq {exch dup length array copy newfont 3 1 roll put} {exch 
newfont 3 1 roll put} ifelse} {pop pop} ifelse } forall newfont
/FontName nfnam put nco&na aload pop nco&na length 2 idiv {newfont
/Encoding get 3 1 roll put} repeat nfnam newfont definefont pop end } def
/accvec [ 176 /agrave 181 /Agrave 190 /acircumflex 192 /Acircumflex
201 /adieresis 204 /Adieresis 209 /ccedilla 210 /Ccedilla 211 /eacute
212 /Eacute 213 /egrave 214 /Egrave 215 /ecircumflex 216 /Ecircumflex
217 /edieresis 218 /Edieresis 219 /icircumflex 220 /Icircumflex
221 /idieresis 222 /Idieresis 223 /ntilde 224 /Ntilde 226 /ocircumflex
228 /Ocircumflex 230 /Odieresis 231 /ucircumflex 236 /Ucircumflex
237 /udieresis 238 /Udieresis 239 /aring 240 /odieresis 242 /Aring 243 /ydieresis
244 /Ydieresis 246 /aacute 247 /Aacute 252 /ugrave 253 /Ugrave
127 /atilde 128 /Atilde 129 /oacute 130 /Oacute 131 /iacute
132 /Iacute 133 /igrave 134 /Igrave 135 /otilde 136 /Otilde
137 /uacute 138 /Uacute] def
/Times-Roman /Times-Roman accvec ReEncode
/Times-Italic /Times-Italic accvec ReEncode
/Times-Bold /Times-Bold accvec ReEncode
/Times-BoldItalic /Times-BoldItalic accvec ReEncode
/Helvetica /Helvetica accvec ReEncode
/Helvetica-Oblique /Helvetica-Oblique accvec ReEncode
/Helvetica-Bold /Helvetica-Bold accvec ReEncode
/Helvetica-BoldOblique /Helvetica-BoldOblique  accvec ReEncode
/Courier /Courier accvec ReEncode
/Courier-Oblique /Courier-Oblique accvec ReEncode
/Courier-Bold /Courier-Bold accvec ReEncode
/Courier-BoldOblique /Courier-BoldOblique accvec ReEncode
/oshow {gsave [] 0 sd true charpath stroke gr} def
/stwn { /fs exch def /fn exch def /text exch def fn findfont fs sf
 text sw pop xs add /xs exch def} def
/stwb { /fs exch def /fn exch def /nbas exch def /textf exch deftextf length /tlen exch def nbas tlen gt {/nbas tlendef} iffn findfont fs sf textf dup length nbas sub nbas getinterval sw
pop neg xs add /xs exch def} def
/accspe [ 65 /plusminus  66 /bar  67 /existential  68 /universal 
69 /exclam  70 /numbersign 71 /greater  72 /question  73 /integral 
74 /colon  75 /semicolon  76 /less  77 /bracketleft  78 /bracketright
79 /greaterequal 80 /braceleft 81 /braceright 82 /radical
83 /spade 84 /heart 85 /diamond 86 /club 87 /lessequal
88 /multiply 89 /percent 90 /infinity 48 /circlemultiply 49 /circleplus
50 /emptyset  51 /lozenge 52 /bullet 53 /arrowright 54 /arrowup
55 /arrowleft 56 /arrowdown 57 /arrowboth 48 /degree 44 /comma 43 /plus 45 /angle 42 /angleleft 47 /divide 61 /notequal 40 /equivalence 41 /second 97 /approxequal 98 /congruent 99 /perpendicular 100 /partialdiff 101 /florin 102 /intersection
 103 /union 104 /propersuperset 105 /reflexsuperset 106 /notsubset 107 /propersubset 108 /reflexsubset 109 /element 110 /notelement 111 /gradient 112 /logicaland 113 /logicalor 114 /arrowdblboth 115 /arrowdblleft 116 /arrowdblup 117 /arrowdblright
 118 /arrowdbldown 119 /ampersand 120 /omega1 121 /similar 122 /aleph ] def
/Symbol /Special accspe ReEncode
%%EndProlog
%%BeginSetup
%%EndSetup
newpath  gsave  .25 .25 scale  gsave  0 0 t black[  ] 0 sd 3 lw 1 1 1 c 2268 1909 0 0 bf black 6 lw 1 1 1 c 1814 1527 227 191 bf black 1814 1527 227 191 bl 1 1 1 c 1814 1527 227 191 bf black 1814 1527 227 191 bl 3 lw 227 191 m 1814 X s[ 4 8] 0 sd
 227 1718 m -1527 Y s 399 1718 m -1527 Y s 499 1718 m -1527 Y s 571 1718 m -1527 Y s 626 1718 m -1527 Y s 671 1718 m -1527 Y s 709 1718 m -1527 Y s 743 1718 m -1527 Y s 772 1718 m -1527 Y s 798 1718 m -1527 Y s 970 1718 m -1527 Y s 1070 1718 m -1527
 Y s 1142 1718 m -1527 Y s 1197 1718 m -1527 Y s 1242 1718 m -1527 Y s 1281 1718 m -1527 Y s 1314 1718 m -1527 Y s 1343 1718 m -1527 Y s 1369 1718 m -1527 Y s 1541 1718 m -1527 Y s 1642 1718 m -1527 Y s 1713 1718 m -1527 Y s 1768 1718 m -1527 Y s
 1814 1718 m -1527 Y s 1852 1718 m -1527 Y s 1885 1718 m -1527 Y s 1914 1718 m -1527 Y s 1940 1718 m -1527 Y s[  ] 0 sd 227 1718 m 1814 X s 227 191 m 1527 Y s[ 4 8] 0 sd 2041 191 m -1814 X s 2041 286 m -1814 X s 2041 382 m -1814 X s 2041 477 m -1814
 X s 2041 573 m -1814 X s 2041 668 m -1814 X s 2041 764 m -1814 X s 2041 859 m -1814 X s 2041 954 m -1814 X s 2041 1050 m -1814 X s 2041 1145 m -1814 X s 2041 1241 m -1814 X s 2041 1336 m -1814 X s 2041 1432 m -1814 X s 2041 1527 m -1814 X s 2041
 1623 m -1814 X s 2041 1718 m -1814 X s[  ] 0 sd 2041 191 m 1527 Y s 1 0 0 c 1 1 1 c black 1 0 0 c 230 1533 m 15 X 23 Y 18 X 2 Y 19 X -15 Y 18 X 19 Y 18 X -24 Y 19 X 18 Y 18 X -8 Y 18 X 13 Y 19 X 1 Y 18 X -1 Y 18 X 3 Y 37 X 10 Y 18 X 1 Y 19 X -7 Y
 18 X -2 Y 18 X 4 Y 19 X -3 Y 18 X 5 Y 18 X -4 Y 19 X -3 Y 18 X 4 Y 18 X -3 Y 19 X -10 Y 18 X -1 Y 18 X -11 Y 19 X -10 Y 18 X 1 Y 18 X -17 Y 19 X -12 Y 18 X -5 Y 18 X -24 Y 18 X -5 Y 19 X -17 Y 18 X -5 Y 18 X -21 Y 19 X 3 Y 18 X -19 Y 18 X 13 Y 19 X
 -6 Y 18 X -2 Y 18 X -8 Y 19 X 16 Y 18 X -10 Y 18 X 13 Y 19 X -11 Y 18 X -17 Y 18 X 7 Y 19 X -10 Y 18 X 8 Y 18 X -2 Y 37 X -20 Y 18 X 13 Y 19 X -12 Y 18 X 11 Y 18 X -14 Y 19 X 6 Y 55 X -7 Y 18 X -8 Y 18 X 3 Y 19 X 6 Y 18 X -19 Y 18 X -3 Y 19 X 3 Y
 36 X -10 Y 19 X 4 Y 18 X -2 Y 18 X -14 Y 18 X 4 Y 19 X -11 Y 18 X 9 Y 18 X -5 Y 19 X -10 Y 18 X 1 Y 18 X -13 Y 19 X 15 Y 18 X -9 Y 18 X 2 Y 19 X -2 Y 18 X 3 Y 18 X -10 Y 19 X 18 Y 18 X -4 Y 18 X -6 Y 19 X -34 Y 18 X -26 Y 18 X 15 Y 19 X 26 Y 18 X
 -32 Y 18 X -1078 Y 92 X s black 227 191 m 1814 X s
 gsave  2268 1909 0 0 C 880 67 t 0 r /Courier-Bold findfont 61.6684 sf 0 0 m (n Energy \(MeV\)) show NC gr  227 214 m -23 Y s
 gsave  2268 1909 0 0 C 213 115 t 0 r /Courier-Bold findfont 53.2591 sf 0 0 m (1) show NC gr  399 202 m -11 Y s 499 202 m -11 Y s 571 202 m -11 Y s 626 202 m -11 Y s 671 202 m -11 Y s 709 202 m -11 Y s 743 202 m -11 Y s 772 202 m -11 Y s 798 214 m
 -23 Y s
 gsave  2268 1909 0 0 C 767 115 t 0 r /Courier-Bold findfont 53.2591 sf 0 0 m (10) show NC gr  970 202 m -11 Y s 1070 202 m -11 Y s 1142 202 m -11 Y s 1197 202 m -11 Y s 1242 202 m -11 Y s 1281 202 m -11 Y s 1314 202 m -11 Y s 1343 202 m -11 Y s
 1369 214 m -23 Y s
 gsave  2268 1909 0 0 C 1388 140 t 0 r /Courier-Bold findfont 36.4404 sf 0 0 m (2) show NC gr 
 gsave  2268 1909 0 0 C 1326 118 t 0 r /Courier-Bold findfont 53.2591 sf 0 0 m (10) show NC gr  1541 202 m -11 Y s 1642 202 m -11 Y s 1713 202 m -11 Y s 1768 202 m -11 Y s 1814 202 m -11 Y s 1852 202 m -11 Y s 1885 202 m -11 Y s 1914 202 m -11 Y s
 1940 214 m -23 Y s
 gsave  2268 1909 0 0 C 1959 143 t 0 r /Courier-Bold findfont 36.4404 sf 0 0 m (3) show NC gr 
 gsave  2268 1909 0 0 C 1898 118 t 0 r /Courier-Bold findfont 53.2591 sf 0 0 m (10) show NC gr  227 1718 m 1814 X s 227 1695 m 23 Y s 399 1707 m 11 Y s 499 1707 m 11 Y s 571 1707 m 11 Y s 626 1707 m 11 Y s 671 1707 m 11 Y s 709 1707 m 11 Y s 743
 1707 m 11 Y s 772 1707 m 11 Y s 798 1695 m 23 Y s 970 1707 m 11 Y s 1070 1707 m 11 Y s 1142 1707 m 11 Y s 1197 1707 m 11 Y s 1242 1707 m 11 Y s 1281 1707 m 11 Y s 1314 1707 m 11 Y s 1343 1707 m 11 Y s 1369 1695 m 23 Y s 1541 1707 m 11 Y s 1642 1707
 m 11 Y s 1713 1707 m 11 Y s 1768 1707 m 11 Y s 1814 1707 m 11 Y s 1852 1707 m 11 Y s 1885 1707 m 11 Y s 1914 1707 m 11 Y s 1940 1695 m 23 Y s 227 191 m 1527 Y s
 gsave  2268 1909 0 0 C 81 631 t 90 r /Courier-Bold findfont 61.6684 sf 0 0 m (Cross section \(mb\)) show NC gr  245 191 m -18 X s
 gsave  2268 1909 0 0 C 143 191 t 0 r /Courier-Bold findfont 36.4404 sf 0 0 m (-13) show NC gr 
 gsave  2268 1909 0 0 C 81 165 t 0 r /Courier-Bold findfont 53.2591 sf 0 0 m (10) show NC gr  236 220 m -9 X s 236 236 m -9 X s 236 248 m -9 X s 236 258 m -9 X s 236 265 m -9 X s 236 272 m -9 X s 236 277 m -9 X s 236 282 m -9 X s 245 286 m -18 X s
 gsave  2268 1909 0 0 C 143 283 t 0 r /Courier-Bold findfont 36.4404 sf 0 0 m (-12) show NC gr 
 gsave  2268 1909 0 0 C 81 261 t 0 r /Courier-Bold findfont 53.2591 sf 0 0 m (10) show NC gr  236 315 m -9 X s 236 332 m -9 X s 236 344 m -9 X s 236 353 m -9 X s 236 361 m -9 X s 236 367 m -9 X s 236 373 m -9 X s 236 377 m -9 X s 245 382 m -18 X s
 gsave  2268 1909 0 0 C 143 378 t 0 r /Courier-Bold findfont 36.4404 sf 0 0 m (-11) show NC gr 
 gsave  2268 1909 0 0 C 81 356 t 0 r /Courier-Bold findfont 53.2591 sf 0 0 m (10) show NC gr  236 411 m -9 X s 236 427 m -9 X s 236 439 m -9 X s 236 448 m -9 X s 236 456 m -9 X s 236 462 m -9 X s 236 468 m -9 X s 236 473 m -9 X s 245 477 m -18 X s
 gsave  2268 1909 0 0 C 143 477 t 0 r /Courier-Bold findfont 36.4404 sf 0 0 m (-10) show NC gr 
 gsave  2268 1909 0 0 C 81 451 t 0 r /Courier-Bold findfont 53.2591 sf 0 0 m (10) show NC gr  236 506 m -9 X s 236 523 m -9 X s 236 535 m -9 X s 236 544 m -9 X s 236 552 m -9 X s 236 558 m -9 X s 236 563 m -9 X s 236 568 m -9 X s 245 573 m -18 X s
 gsave  2268 1909 0 0 C 165 572 t 0 r /Courier-Bold findfont 36.4404 sf 0 0 m (-9) show NC gr 
 gsave  2268 1909 0 0 C 104 547 t 0 r /Courier-Bold findfont 53.2591 sf 0 0 m (10) show NC gr  236 601 m -9 X s 236 618 m -9 X s 236 630 m -9 X s 236 639 m -9 X s 236 647 m -9 X s 236 653 m -9 X s 236 659 m -9 X s 236 664 m -9 X s 245 668 m -18 X s
 gsave  2268 1909 0 0 C 165 667 t 0 r /Courier-Bold findfont 36.4404 sf 0 0 m (-8) show NC gr 
 gsave  2268 1909 0 0 C 104 642 t 0 r /Courier-Bold findfont 53.2591 sf 0 0 m (10) show NC gr  236 697 m -9 X s 236 714 m -9 X s 236 726 m -9 X s 236 735 m -9 X s 236 742 m -9 X s 236 749 m -9 X s 236 754 m -9 X s 236 759 m -9 X s 245 764 m -18 X s
 gsave  2268 1909 0 0 C 165 762 t 0 r /Courier-Bold findfont 36.4404 sf 0 0 m (-7) show NC gr 
 gsave  2268 1909 0 0 C 104 737 t 0 r /Courier-Bold findfont 53.2591 sf 0 0 m (10) show NC gr  236 792 m -9 X s 236 809 m -9 X s 236 821 m -9 X s 236 830 m -9 X s 236 838 m -9 X s 236 844 m -9 X s 236 850 m -9 X s 236 855 m -9 X s 245 859 m -18 X s
 gsave  2268 1909 0 0 C 165 858 t 0 r /Courier-Bold findfont 36.4404 sf 0 0 m (-6) show NC gr 
 gsave  2268 1909 0 0 C 104 833 t 0 r /Courier-Bold findfont 53.2591 sf 0 0 m (10) show NC gr  236 888 m -9 X s 236 905 m -9 X s 236 916 m -9 X s 236 926 m -9 X s 236 933 m -9 X s 236 940 m -9 X s 236 945 m -9 X s 236 950 m -9 X s 245 954 m -18 X s
 gsave  2268 1909 0 0 C 165 953 t 0 r /Courier-Bold findfont 36.4404 sf 0 0 m (-5) show NC gr 
 gsave  2268 1909 0 0 C 104 928 t 0 r /Courier-Bold findfont 53.2591 sf 0 0 m (10) show NC gr  236 983 m -9 X s 236 1000 m -9 X s 236 1012 m -9 X s 236 1021 m -9 X s 236 1029 m -9 X s 236 1035 m -9 X s 236 1041 m -9 X s 236 1046 m -9 X s 245 1050 m
 -18 X s
 gsave  2268 1909 0 0 C 165 1046 t 0 r /Courier-Bold findfont 36.4404 sf 0 0 m (-4) show NC gr 
 gsave  2268 1909 0 0 C 104 1023 t 0 r /Courier-Bold findfont 53.2591 sf 0 0 m (10) show NC gr  236 1079 m -9 X s 236 1095 m -9 X s 236 1107 m -9 X s 236 1117 m -9 X s 236 1124 m -9 X s 236 1131 m -9 X s 236 1136 m -9 X s 236 1141 m -9 X s 245 1145
 m -18 X s
 gsave  2268 1909 0 0 C 165 1144 t 0 r /Courier-Bold findfont 36.4404 sf 0 0 m (-3) show NC gr 
 gsave  2268 1909 0 0 C 104 1118 t 0 r /Courier-Bold findfont 53.2591 sf 0 0 m (10) show NC gr  236 1174 m -9 X s 236 1191 m -9 X s 236 1203 m -9 X s 236 1212 m -9 X s 236 1220 m -9 X s 236 1226 m -9 X s 236 1232 m -9 X s 236 1236 m -9 X s 245 1241
 m -18 X s
 gsave  2268 1909 0 0 C 165 1236 t 0 r /Courier-Bold findfont 36.4404 sf 0 0 m (-2) show NC gr 
 gsave  2268 1909 0 0 C 104 1214 t 0 r /Courier-Bold findfont 53.2591 sf 0 0 m (10) show NC gr  236 1270 m -9 X s 236 1286 m -9 X s 236 1298 m -9 X s 236 1308 m -9 X s 236 1315 m -9 X s 236 1321 m -9 X s 236 1327 m -9 X s 236 1332 m -9 X s 245 1336
 m -18 X s
 gsave  2268 1909 0 0 C 165 1331 t 0 r /Courier-Bold findfont 36.4404 sf 0 0 m (-1) show NC gr 
 gsave  2268 1909 0 0 C 104 1309 t 0 r /Courier-Bold findfont 53.2591 sf 0 0 m (10) show NC gr  236 1365 m -9 X s 236 1382 m -9 X s 236 1394 m -9 X s 236 1403 m -9 X s 236 1411 m -9 X s 236 1417 m -9 X s 236 1422 m -9 X s 236 1427 m -9 X s 245 1432
 m -18 X s
 gsave  2268 1909 0 0 C 182 1409 t 0 r /Courier-Bold findfont 53.2591 sf 0 0 m (1) show NC gr  236 1460 m -9 X s 236 1477 m -9 X s 236 1489 m -9 X s 236 1498 m -9 X s 236 1506 m -9 X s 236 1512 m -9 X s 236 1518 m -9 X s 236 1523 m -9 X s 245 1527 m
 -18 X s
 gsave  2268 1909 0 0 C 148 1505 t 0 r /Courier-Bold findfont 53.2591 sf 0 0 m (10) show NC gr  236 1556 m -9 X s 236 1573 m -9 X s 236 1585 m -9 X s 236 1594 m -9 X s 236 1601 m -9 X s 236 1608 m -9 X s 236 1613 m -9 X s 236 1618 m -9 X s 245 1623
 m -18 X s
 gsave  2268 1909 0 0 C 188 1617 t 0 r /Courier-Bold findfont 36.4404 sf 0 0 m (2) show NC gr 
 gsave  2268 1909 0 0 C 126 1595 t 0 r /Courier-Bold findfont 53.2591 sf 0 0 m (10) show NC gr  236 1651 m -9 X s 236 1668 m -9 X s 236 1680 m -9 X s 236 1689 m -9 X s 236 1697 m -9 X s 236 1703 m -9 X s 236 1709 m -9 X s 236 1714 m -9 X s 245 1718
 m -18 X s
 gsave  2268 1909 0 0 C 188 1716 t 0 r /Courier-Bold findfont 36.4404 sf 0 0 m (3) show NC gr 
 gsave  2268 1909 0 0 C 126 1690 t 0 r /Courier-Bold findfont 53.2591 sf 0 0 m (10) show NC gr  2041 191 m 1527 Y s 2023 191 m 18 X s 2032 220 m 9 X s 2032 236 m 9 X s 2032 248 m 9 X s 2032 258 m 9 X s 2032 265 m 9 X s 2032 272 m 9 X s 2032 277 m 9
 X s 2032 282 m 9 X s 2023 286 m 18 X s 2032 315 m 9 X s 2032 332 m 9 X s 2032 344 m 9 X s 2032 353 m 9 X s 2032 361 m 9 X s 2032 367 m 9 X s 2032 373 m 9 X s 2032 377 m 9 X s 2023 382 m 18 X s 2032 411 m 9 X s 2032 427 m 9 X s 2032 439 m 9 X s 2032
 448 m 9 X s 2032 456 m 9 X s 2032 462 m 9 X s 2032 468 m 9 X s 2032 473 m 9 X s 2023 477 m 18 X s 2032 506 m 9 X s 2032 523 m 9 X s 2032 535 m 9 X s 2032 544 m 9 X s 2032 552 m 9 X s 2032 558 m 9 X s 2032 563 m 9 X s 2032 568 m 9 X s 2023 573 m 18
 X s 2032 601 m 9 X s 2032 618 m 9 X s 2032 630 m 9 X s 2032 639 m 9 X s 2032 647 m 9 X s 2032 653 m 9 X s 2032 659 m 9 X s 2032 664 m 9 X s 2023 668 m 18 X s 2032 697 m 9 X s 2032 714 m 9 X s 2032 726 m 9 X s 2032 735 m 9 X s 2032 742 m 9 X s 2032
 749 m 9 X s 2032 754 m 9 X s 2032 759 m 9 X s 2023 764 m 18 X s 2032 792 m 9 X s 2032 809 m 9 X s 2032 821 m 9 X s 2032 830 m 9 X s 2032 838 m 9 X s 2032 844 m 9 X s 2032 850 m 9 X s 2032 855 m 9 X s 2023 859 m 18 X s 2032 888 m 9 X s 2032 905 m 9
 X s 2032 916 m 9 X s 2032 926 m 9 X s 2032 933 m 9 X s 2032 940 m 9 X s 2032 945 m 9 X s 2032 950 m 9 X s 2023 954 m 18 X s 2032 983 m 9 X s 2032 1000 m 9 X s 2032 1012 m 9 X s 2032 1021 m 9 X s 2032 1029 m 9 X s 2032 1035 m 9 X s 2032 1041 m 9 X s
 2032 1046 m 9 X s 2023 1050 m 18 X s 2032 1079 m 9 X s 2032 1095 m 9 X s 2032 1107 m 9 X s 2032 1117 m 9 X s 2032 1124 m 9 X s 2032 1131 m 9 X s 2032 1136 m 9 X s 2032 1141 m 9 X s 2023 1145 m 18 X s 2032 1174 m 9 X s 2032 1191 m 9 X s 2032 1203 m
 9 X s 2032 1212 m 9 X s 2032 1220 m 9 X s 2032 1226 m 9 X s 2032 1232 m 9 X s 2032 1236 m 9 X s 2023 1241 m 18 X s 2032 1270 m 9 X s 2032 1286 m 9 X s 2032 1298 m 9 X s 2032 1308 m 9 X s 2032 1315 m 9 X s 2032 1321 m 9 X s 2032 1327 m 9 X s 2032
 1332 m 9 X s 2023 1336 m 18 X s 2032 1365 m 9 X s 2032 1382 m 9 X s 2032 1394 m 9 X s 2032 1403 m 9 X s 2032 1411 m 9 X s 2032 1417 m 9 X s 2032 1422 m 9 X s 2032 1427 m 9 X s 2023 1432 m 18 X s 2032 1460 m 9 X s 2032 1477 m 9 X s 2032 1489 m 9 X s
 2032 1498 m 9 X s 2032 1506 m 9 X s 2032 1512 m 9 X s 2032 1518 m 9 X s 2032 1523 m 9 X s 2023 1527 m 18 X s 2032 1556 m 9 X s 2032 1573 m 9 X s 2032 1585 m 9 X s 2032 1594 m 9 X s 2032 1601 m 9 X s 2032 1608 m 9 X s 2032 1613 m 9 X s 2032 1618 m 9
 X s 2023 1623 m 18 X s 2032 1651 m 9 X s 2032 1668 m 9 X s 2032 1680 m 9 X s 2032 1689 m 9 X s 2032 1697 m 9 X s 2032 1703 m 9 X s 2032 1709 m 9 X s 2032 1714 m 9 X s 2023 1718 m 18 X s 1 1 1 c 83 29 626 1556 bf black
 gsave  2268 1909 0 0 C 625 1564 t 0 r /Helvetica-Bold findfont 25.228 sf 0 0 m (10 Deg) show NC gr  1 0 0 c 1 1 1 c black 1 0 0 c 230 1432 m 15 X 6 Y 18 X 2 Y 19 X 18 Y 18 X -2 Y 18 X 11 Y 19 X -11 Y 18 X 10 Y 18 X -3 Y 19 X 3 Y 18 X 1 Y 18 X -5 Y
 19 X 10 Y 18 X 3 Y 18 X -1 Y 19 X 1 Y 18 X 3 Y 37 X -4 Y 18 X -2 Y 18 X 3 Y 19 X -4 Y 18 X 1 Y 18 X -5 Y 19 X -4 Y 18 X -7 Y 18 X -6 Y 19 X -12 Y 18 X -4 Y 18 X -10 Y 19 X -8 Y 18 X -19 Y 18 X -7 Y 18 X -16 Y 19 X 2 Y 18 X -22 Y 18 X -20 Y 19 X -1
 Y 18 X -1 Y 18 X -12 Y 19 X 2 Y 18 X 3 Y 18 X -2 Y 19 X 4 Y 36 X -6 Y 19 X -8 Y 18 X 3 Y 18 X 3 Y 19 X -3 Y 18 X -9 Y 18 X 6 Y 19 X -9 Y 18 X 1 Y 18 X 6 Y 19 X -19 Y 36 X -2 Y 19 X 4 Y 18 X -4 Y 18 X -14 Y 19 X 6 Y 18 X -11 Y 18 X -1 Y 19 X 7 Y 18
 X -14 Y 18 X 3 Y 19 X -6 Y 18 X -5 Y 18 X 6 Y 19 X -8 Y 18 X -10 Y 18 X -4 Y 37 X 1 Y 18 X -6 Y 18 X -5 Y 19 X -9 Y 18 X -2 Y 18 X 4 Y 19 X -6 Y 18 X -16 Y 18 X -3 Y 19 X -5 Y 18 X -7 Y 18 X 2 Y 19 X -10 Y 18 X 1 Y 18 X -29 Y 19 X -14 Y 18 X -5 Y
 18 X 7 Y 19 X -35 Y 18 X -908 Y 110 X s black 1 1 1 c 83 29 626 1460 bf black
 gsave  2268 1909 0 0 C 625 1469 t 0 r /Helvetica-Bold findfont 25.228 sf 0 0 m (25 Deg) show NC gr  1 0 0 c 1 1 1 c black 1 0 0 c 230 1350 m 15 X -6 Y 18 X 12 Y 19 X 7 Y 18 X -11 Y 18 X 14 Y 19 X -6 Y 18 X 7 Y 18 X 3 Y 37 X 1 Y 18 X 5 Y 19 X -3 Y
 18 X 1 Y 37 X 6 Y 73 X -1 Y 37 X -3 Y 18 X -2 Y 18 X -2 Y 19 X -6 Y 18 X -5 Y 18 X -8 Y 19 X -9 Y 18 X -9 Y 18 X -12 Y 19 X -7 Y 18 X -9 Y 18 X -19 Y 18 X -4 Y 19 X -16 Y 18 X -11 Y 18 X -19 Y 19 X -5 Y 18 X -8 Y 18 X 2 Y 19 X 5 Y 18 X -2 Y 18 X
 -12 Y 19 X 5 Y 18 X 1 Y 18 X -3 Y 19 X -5 Y 18 X -1 Y 18 X 5 Y 19 X -4 Y 18 X -1 Y 18 X -5 Y 37 X -7 Y 55 X -5 Y 18 X -6 Y 19 X -1 Y 18 X -8 Y 18 X -1 Y 19 X -2 Y 18 X -7 Y 18 X -3 Y 19 X 4 Y 18 X -10 Y 37 X -5 Y 36 X -9 Y 19 X -7 Y 18 X -4 Y 18 X
 1 Y 18 X -8 Y 19 X -3 Y 18 X -6 Y 18 X -8 Y 19 X -5 Y 36 X -12 Y 19 X -13 Y 18 X -6 Y 18 X -6 Y 19 X -12 Y 18 X -1 Y 18 X -8 Y 19 X -10 Y 18 X -30 Y 18 X -5 Y 19 X -28 Y 18 X -3 Y 18 X -41 Y 19 X -741 Y 128 X s black 1 1 1 c 83 29 626 1365 bf black
 gsave  2268 1909 0 0 C 619 1374 t 0 r /Helvetica-Bold findfont 28.0311 sf 0 0 m (40 Deg) show NC gr  1 0 0 c 1 1 1 c black 1 0 0 c 230 1256 m 15 X -3 Y 18 X 7 Y 19 X 6 Y 18 X -8 Y 18 X 10 Y 19 X 8 Y 18 X -6 Y 18 X -1 Y 19 X 8 Y 18 X -2 Y 37 X 3 Y
 18 X -3 Y 18 X 6 Y 19 X -1 Y 18 X 2 Y 18 X 3 Y 37 X -2 Y 18 X -2 Y 19 X -2 Y 18 X -2 Y 18 X -2 Y 19 X -4 Y 18 X -8 Y 18 X -6 Y 19 X -8 Y 18 X -16 Y 18 X -4 Y 19 X -11 Y 18 X -13 Y 18 X -9 Y 18 X -13 Y 19 X -13 Y 18 X -9 Y 18 X -11 Y 19 X -16 Y 18 X
 -2 Y 18 X 1 Y 55 X -5 Y 19 X -4 Y 18 X 6 Y 18 X -7 Y 19 X -1 Y 18 X -2 Y 18 X -1 Y 19 X -1 Y 18 X -4 Y 18 X -3 Y 19 X -4 Y 18 X 2 Y 18 X -8 Y 19 X -1 Y 18 X -6 Y 37 X 2 Y 18 X -7 Y 18 X -9 Y 19 X 1 Y 18 X -1 Y 18 X -6 Y 19 X -2 Y 18 X -9 Y 18 X -4
 Y 19 X -5 Y 18 X 1 Y 18 X -7 Y 19 X -3 Y 18 X -9 Y 18 X -9 Y 18 X -5 Y 19 X -6 Y 18 X -3 Y 18 X -5 Y 19 X -18 Y 36 X -21 Y 19 X -9 Y 18 X -12 Y 18 X -12 Y 19 X -19 Y 18 X -6 Y 18 X -14 Y 19 X -29 Y 18 X -26 Y 18 X -15 Y 19 X -633 Y 183 X s black 1
 1 1 c 83 28 626 1270 bf black
 gsave  2268 1909 0 0 C 619 1278 t 0 r /Helvetica-Bold findfont 28.0311 sf 0 0 m (55 Deg) show NC gr  1 0 0 c 1 1 1 c black 1 0 0 c 230 1166 m 15 X -1 Y 18 X -3 Y 19 X -1 Y 18 X 9 Y 18 X 3 Y 19 X -2 Y 18 X 5 Y 55 X 4 Y 18 X -4 Y 19 X 7 Y 18 X 3 Y 18
 X -1 Y 19 X 3 Y 36 X 3 Y 19 X -1 Y 18 X -3 Y 37 X -5 Y 18 X -2 Y 18 X -4 Y 19 X -3 Y 18 X -8 Y 18 X -4 Y 19 X -11 Y 18 X -9 Y 18 X -10 Y 19 X -17 Y 18 X -5 Y 18 X -10 Y 18 X -16 Y 19 X -12 Y 18 X -11 Y 18 X -13 Y 19 X 1 Y 18 X -14 Y 18 X -1 Y 19 X
 1 Y 18 X -5 Y 18 X 3 Y 19 X -2 Y 18 X -3 Y 18 X -4 Y 19 X 3 Y 18 X -1 Y 18 X -3 Y 19 X -2 Y 18 X -6 Y 18 X -6 Y 19 X 2 Y 18 X -7 Y 18 X -1 Y 19 X -8 Y 18 X 4 Y 18 X -2 Y 19 X -10 Y 18 X -6 Y 18 X 6 Y 19 X -5 Y 18 X -6 Y 18 X -1 Y 19 X -12 Y 18 X -6
 Y 18 X -4 Y 19 X -2 Y 18 X -10 Y 18 X -2 Y 19 X -11 Y 18 X -5 Y 36 X -18 Y 19 X -3 Y 18 X -10 Y 18 X -9 Y 19 X -24 Y 18 X 3 Y 18 X -17 Y 19 X -33 Y 36 X -26 Y 19 X -9 Y 18 X -55 Y 18 X -3 Y 19 X -32 Y 18 X -492 Y 220 X s black 1 1 1 c 83 29 626
 1174 bf black
 gsave  2268 1909 0 0 C 619 1180 t 0 r /Helvetica-Bold findfont 28.0311 sf 0 0 m (70 Deg) show NC gr  1 0 0 c 1 1 1 c black 1 0 0 c 230 1057 m 15 X 14 Y 18 X -6 Y 19 X 7 Y 18 X 2 Y 18 X 2 Y 19 X -2 Y 18 X 6 Y 18 X 3 Y 19 X -4 Y 18 X 7 Y 18 X 1 Y 19
 X 4 Y 18 X -2 Y 18 X -1 Y 19 X 4 Y 36 X -1 Y 19 X 1 Y 18 X -2 Y 37 X -1 Y 18 X -3 Y 18 X -6 Y 19 X -6 Y 18 X -3 Y 18 X -11 Y 19 X -9 Y 18 X -7 Y 18 X -14 Y 19 X -13 Y 18 X -8 Y 18 X -7 Y 18 X -17 Y 19 X -13 Y 18 X -10 Y 18 X -11 Y 19 X -6 Y 18 X -7
 Y 18 X 1 Y 19 X -8 Y 36 X -1 Y 19 X -7 Y 18 X -1 Y 18 X 7 Y 19 X -5 Y 18 X -1 Y 18 X -5 Y 19 X -4 Y 18 X -2 Y 18 X 1 Y 19 X -1 Y 18 X -4 Y 18 X -5 Y 19 X -2 Y 18 X -9 Y 18 X -4 Y 19 X 2 Y 18 X -9 Y 18 X -8 Y 37 X -9 Y 37 X -6 Y 18 X -10 Y 18 X -2 Y
 19 X -5 Y 18 X -9 Y 18 X -10 Y 19 X -11 Y 18 X -2 Y 18 X -12 Y 18 X -19 Y 19 X -25 Y 18 X 15 Y 18 X -17 Y 19 X -3 Y 18 X -29 Y 18 X -18 Y 19 X -27 Y 18 X -13 Y 18 X -467 Y 312 X s black 1 1 1 c 83 28 626 1079 bf black
 gsave  2268 1909 0 0 C 619 1085 t 0 r /Helvetica-Bold findfont 28.0311 sf 0 0 m (85 Deg) show NC gr  1 0 0 c 1 1 1 c black 1 0 0 c 230 965 m 15 X 8 Y 18 X 6 Y 19 X -3 Y 18 X 3 Y 37 X 6 Y 18 X -1 Y 18 X 5 Y 19 X -3 Y 18 X 5 Y 18 X 4 Y 19 X 1 Y 36 X
 1 Y 19 X 2 Y 36 X -3 Y 19 X -2 Y 36 X -2 Y 19 X 1 Y 18 X -5 Y 18 X -5 Y 19 X -4 Y 18 X -6 Y 18 X -12 Y 19 X -10 Y 18 X -9 Y 18 X -8 Y 19 X -16 Y 18 X 2 Y 18 X -15 Y 18 X -12 Y 19 X -13 Y 18 X -20 Y 18 X -8 Y 19 X -10 Y 18 X -7 Y 18 X -3 Y 19 X -1 Y
 18 X 1 Y 18 X -3 Y 19 X -6 Y 18 X 2 Y 18 X 4 Y 19 X -13 Y 18 X 11 Y 18 X -6 Y 19 X -5 Y 18 X -7 Y 18 X 2 Y 37 X -13 Y 18 X 5 Y 19 X -14 Y 18 X -2 Y 18 X -3 Y 19 X -9 Y 18 X -3 Y 18 X -6 Y 19 X -9 Y 18 X -14 Y 18 X 5 Y 37 X -19 Y 18 X -11 Y 19 X 5 Y
 18 X -17 Y 18 X -11 Y 19 X -1 Y 18 X -14 Y 36 X -27 Y 19 X -3 Y 18 X -48 Y 18 X 18 Y 19 X -18 Y 18 X -26 Y 18 X -15 Y 19 X 25 Y 18 X -392 Y 330 X s black 1 1 1 c 83 29 626 983 bf black
 gsave  2268 1909 0 0 C 614 989 t 0 r /Helvetica-Bold findfont 28.0311 sf 0 0 m (100 Deg) show NC gr  1 0 0 c 1 1 1 c black 1 0 0 c 230 874 m 33 X 8 Y 19 X 4 Y 18 X -3 Y 37 X 4 Y 18 X 4 Y 18 X -7 Y 19 X 7 Y 18 X 8 Y 18 X -3 Y 19 X -2 Y 18 X 7 Y 18 X
 -4 Y 19 X -1 Y 18 X 6 Y 18 X -4 Y 19 X 1 Y 18 X -1 Y 18 X 3 Y 19 X -8 Y 18 X -5 Y 18 X 1 Y 19 X -9 Y 18 X -7 Y 18 X -9 Y 19 X -5 Y 18 X -14 Y 18 X -1 Y 19 X -17 Y 18 X -10 Y 18 X -15 Y 18 X -10 Y 19 X -15 Y 18 X -9 Y 18 X -31 Y 19 X 7 Y 18 X -13 Y
 18 X 14 Y 19 X -20 Y 18 X -1 Y 18 X 8 Y 19 X -10 Y 18 X 2 Y 18 X -2 Y 37 X -3 Y 18 X 1 Y 19 X -17 Y 18 X 5 Y 18 X -4 Y 37 X -9 Y 18 X -10 Y 19 X -3 Y 18 X -2 Y 37 X -11 Y 18 X -3 Y 18 X -11 Y 19 X -3 Y 18 X -11 Y 18 X -1 Y 19 X -6 Y 18 X -10 Y 18 X
 -2 Y 19 X -27 Y 18 X -2 Y 18 X -6 Y 19 X -14 Y 18 X 8 Y 18 X -17 Y 18 X -32 Y 19 X -19 Y 18 X 8 Y 18 X -43 Y 19 X -49 Y 18 X -235 Y 18 X 229 Y 19 X -3 Y 18 X -226 Y 330 X s black 1 1 1 c 83 28 626 888 bf black
 gsave  2268 1909 0 0 C 619 894 t 0 r /Helvetica-Bold findfont 25.228 sf 0 0 m (115 Deg) show NC gr  1 0 0 c 1 1 1 c black 1 0 0 c 230 782 m 15 X 12 Y 18 X -14 Y 19 X 8 Y 18 X 2 Y 18 X 4 Y 37 X -2 Y 18 X 7 Y 55 X 1 Y 19 X 3 Y 36 X 3 Y 19 X -2 Y 18 X
 1 Y 18 X 1 Y 19 X -1 Y 18 X -2 Y 18 X -1 Y 19 X -4 Y 18 X -5 Y 18 X -1 Y 19 X -12 Y 18 X -3 Y 18 X -12 Y 19 X -5 Y 18 X -11 Y 18 X -12 Y 19 X -8 Y 18 X -11 Y 18 X -10 Y 18 X -19 Y 19 X -9 Y 18 X -14 Y 18 X -18 Y 19 X -3 Y 18 X -21 Y 18 X 5 Y 19 X 1
 Y 18 X -9 Y 18 X 1 Y 19 X -6 Y 18 X 2 Y 18 X 3 Y 19 X -12 Y 18 X 11 Y 18 X -8 Y 19 X -7 Y 18 X -10 Y 18 X 4 Y 19 X -5 Y 18 X -9 Y 18 X 1 Y 19 X 1 Y 36 X -23 Y 19 X 2 Y 18 X -3 Y 18 X -14 Y 19 X -12 Y 36 X -14 Y 19 X -13 Y 18 X -6 Y 18 X 8 Y 19 X
 -28 Y 18 X -20 Y 18 X 13 Y 19 X -24 Y 18 X -48 Y 18 X 32 Y 18 X -10 Y 19 X -32 Y 18 X -48 Y 18 X -3 Y 19 X -3 Y 18 X -147 Y 385 X s black 1 1 1 c 83 29 626 792 bf black
 gsave  2268 1909 0 0 C 619 799 t 0 r /Helvetica-Bold findfont 25.228 sf 0 0 m (130 Deg) show NC gr  1 0 0 c 1 1 1 c black 1 0 0 c 230 689 m 15 X 2 Y 18 X -7 Y 19 X 3 Y 18 X 10 Y 18 X -5 Y 19 X 6 Y 18 X 2 Y 18 X 6 Y 19 X -4 Y 18 X 2 Y 18 X 2 Y 19 X
 1 Y 36 X 3 Y 19 X -3 Y 36 X 3 Y 19 X -5 Y 18 X 5 Y 18 X -6 Y 19 X -2 Y 18 X -6 Y 18 X -4 Y 19 X -6 Y 18 X -10 Y 18 X -4 Y 19 X -12 Y 18 X -6 Y 18 X -15 Y 19 X -11 Y 18 X -14 Y 18 X -5 Y 18 X -16 Y 19 X -14 Y 18 X -31 Y 18 X -1 Y 19 X -3 Y 18 X -14
 Y 18 X 11 Y 19 X -7 Y 18 X -7 Y 18 X 2 Y 19 X -6 Y 18 X 1 Y 18 X -1 Y 19 X -2 Y 18 X -10 Y 18 X 9 Y 19 X -15 Y 18 X -1 Y 18 X -10 Y 19 X -5 Y 18 X 3 Y 18 X -18 Y 19 X -2 Y 18 X 1 Y 18 X -1 Y 19 X -16 Y 18 X 2 Y 18 X -5 Y 19 X -21 Y 18 X 5 Y 18 X -7
 Y 19 X -27 Y 18 X 11 Y 18 X -14 Y 19 X -32 Y 18 X -3 Y 18 X 20 Y 19 X -78 Y 18 X -3 Y 18 X 14 Y 18 X -3 Y 19 X -20 Y 18 X -101 Y 440 X s black 1 1 1 c 83 29 626 697 bf black
 gsave  2268 1909 0 0 C 619 704 t 0 r /Helvetica-Bold findfont 25.228 sf 0 0 m (145 Deg) show NC gr  1 0 0 c 1 1 1 c black 1 0 0 c 230 594 m 15 X 3 Y 18 X -5 Y 19 X 3 Y 18 X 6 Y 18 X -8 Y 19 X 9 Y 18 X 3 Y 18 X 4 Y 19 X -5 Y 18 X 8 Y 18 X -1 Y 19 X
 1 Y 18 X 2 Y 18 X -3 Y 19 X 7 Y 18 X 2 Y 18 X -5 Y 19 X -3 Y 18 X -1 Y 18 X -1 Y 37 X -11 Y 18 X -1 Y 19 X -6 Y 18 X -9 Y 18 X -10 Y 19 X -9 Y 18 X -9 Y 18 X -7 Y 19 X -13 Y 18 X -14 Y 18 X -9 Y 18 X -20 Y 19 X -21 Y 18 X -11 Y 18 X -6 Y 19 X -9 Y
 18 X -7 Y 18 X 8 Y 19 X -11 Y 18 X 2 Y 18 X -25 Y 19 X 3 Y 18 X -5 Y 18 X 20 Y 19 X -11 Y 18 X -12 Y 18 X 6 Y 19 X -2 Y 18 X -15 Y 18 X -11 Y 19 X 6 Y 18 X -10 Y 18 X 6 Y 19 X -22 Y 18 X -5 Y 18 X 6 Y 19 X -12 Y 18 X -3 Y 18 X -1 Y 19 X -22 Y 18 X
 -32 Y 18 X -3 Y 19 X 21 Y 18 X -8 Y 18 X -22 Y 19 X 4 Y 18 X -20 Y 18 X -32 Y 19 X 14 Y 18 X -20 Y 18 X -32 Y 18 X -3 Y 19 X -1 Y 458 X s black 1 1 1 c 83 29 626 601 bf black
 gsave  2268 1909 0 0 C 619 608 t 0 r /Helvetica-Bold findfont 25.228 sf 0 0 m (160 Deg) show NC gr  1 1 1 c 1590 94 348 1749 bf black
 gsave  2268 1909 0 0 C 838 1786 t 0 r /Courier-Bold findfont 36.4404 sf 0 0 m (p\(1GeV\) + 208Pb \(INCL4+ABLA\)) show NC gr  1 1 1 c 114 38 2154 1871 bf black
 gsave  2268 1909 0 0 C 1763 1884 t 0 r /Courier-Bold findfont 28.0311 sf 0 0 m (Tue, 04 Dec 2007 17:59:27 +0200 \(EET\) + 29666000 nsec) show NC gr 
 gr  gr 
showpage
end
%%EOF
