
typedef struct {
%immutable;
	Model* model; /*model object*/
	double *parameters; /*model parameters*/
	Raster* raster; /*raster data*/
	int attractorLimit; /*no. iterations for transient*/
	int attractorIterations; /*no. iterations for describing an attractor*/
	/*Internal data: */
	int dataLength; /*total number of cells*/
	int currId; /*current cell pointer*/
	int index; /*iteration index*/
%mutable;

%extend{
	Basin(Model *m, double parameters[],
		double xmin, double xmax, int xres,
		double ymin, double ymax, int yres, 
		int attractorLimit, int attractorIterations) {
		Basin *ans;
		int ians = idmc_basin_alloc(m, parameters, xmin, xmax, xres,
			ymin, ymax, yres, attractorLimit, attractorIterations, &ans);
		return ans;
	}
	~Basin() {
		idmc_basin_free(self);
	}

	int step() {
		return idmc_basin_step(self);
	}
	int step_n(int n) {
		int ians;
		while(n--) {
			ians = idmc_basin_step(self);
			if(ians!=IDMC_OK) return ians;
		}
		return ians;
	}
	int finished() {
		return idmc_basin_finished(self);
	}
	int *getData() {
		return self->raster->data;
	}
}
} Basin;
