<?xml version="1.0" encoding="UTF-8" standalone="no"?>
<!-- Created with Inkscape (http://www.inkscape.org/) -->
<svg
   xmlns:dc="http://purl.org/dc/elements/1.1/"
   xmlns:cc="http://web.resource.org/cc/"
   xmlns:rdf="http://www.w3.org/1999/02/22-rdf-syntax-ns#"
   xmlns:svg="http://www.w3.org/2000/svg"
   xmlns="http://www.w3.org/2000/svg"
   xmlns:xlink="http://www.w3.org/1999/xlink"
   xmlns:sodipodi="http://sodipodi.sourceforge.net/DTD/sodipodi-0.dtd"
   xmlns:inkscape="http://www.inkscape.org/namespaces/inkscape"
   width="200"
   height="100"
   id="svg2"
   sodipodi:version="0.32"
   inkscape:version="0.45"
   version="1.0"
   sodipodi:docname="compare.svg"
   inkscape:output_extension="org.inkscape.output.svg.inkscape"
   sodipodi:docbase="C:\DOCUME~1\Edward\MYDOCU~1\MYWEBS~1\HTMLPU~2\media"
   inkscape:export-filename="C:\Documents and Settings\Edward\My Documents\My Webs\htmlpurifier-web\media\download.png"
   inkscape:export-xdpi="90"
   inkscape:export-ydpi="90"
   sodipodi:modified="true">
  <defs
     id="defs4">
    <linearGradient
       id="linearGradient9117">
      <stop
         style="stop-color:#bcc8d8;stop-opacity:1;"
         offset="0"
         id="stop9119" />
      <stop
         style="stop-color:#556c9a;stop-opacity:1;"
         offset="1"
         id="stop9121" />
    </linearGradient>
    <linearGradient
       inkscape:collect="always"
       xlink:href="#linearGradient9117"
       id="linearGradient9123"
       x1="81.321426"
       y1="5.9874816"
       x2="81.321426"
       y2="94.726807"
       gradientUnits="userSpaceOnUse"
       gradientTransform="matrix(1.2777242,0,0,1.0676138,-3.5849262,-3.4048362)" />
  </defs>
  <sodipodi:namedview
     id="base"
     pagecolor="#f9f9ff"
     bordercolor="#666666"
     borderopacity="1.0"
     gridtolerance="10000"
     guidetolerance="10"
     objecttolerance="10"
     inkscape:pageopacity="0"
     inkscape:pageshadow="2"
     inkscape:zoom="1"
     inkscape:cx="39.951533"
     inkscape:cy="103.9447"
     inkscape:document-units="px"
     inkscape:current-layer="layer1"
     width="200px"
     height="100px"
     inkscape:window-width="744"
     inkscape:window-height="573"
     inkscape:window-x="38"
     inkscape:window-y="222" />
  <metadata
     id="metadata7">
    <rdf:RDF>
      <cc:Work
         rdf:about="">
        <dc:format>image/svg+xml</dc:format>
        <dc:type
           rdf:resource="http://purl.org/dc/dcmitype/StillImage" />
      </cc:Work>
    </rdf:RDF>
  </metadata>
  <g
     inkscape:label="Layer 1"
     inkscape:groupmode="layer"
     id="layer1">
    <rect
       style="opacity:1;fill:url(#linearGradient9123);fill-opacity:1;fill-rule:evenodd;stroke:none;stroke-width:6;stroke-linecap:round;stroke-linejoin:miter;stroke-miterlimit:4;stroke-dasharray:none;stroke-dashoffset:0;stroke-opacity:1"
       id="rect3131"
       width="193.22919"
       height="94.739326"
       x="3.7068357"
       y="2.9874816"
       ry="6.4285727"
       rx="8.5714293" />
    <rect
       style="opacity:1;fill:#bcc8d8;fill-opacity:1;fill-rule:evenodd;stroke:#556c9a;stroke-width:2.5;stroke-linecap:round;stroke-linejoin:round;stroke-miterlimit:4;stroke-dasharray:none;stroke-dashoffset:0;stroke-opacity:1"
       id="rect4120"
       width="15"
       height="0"
       x="-12.857142"
       y="24.642857"
       rx="6.4285722"
       ry="0" />
    <path
       style="fill:none;fill-opacity:0.75;fill-rule:evenodd;stroke:#000000;stroke-width:1px;stroke-linecap:butt;stroke-linejoin:miter;stroke-opacity:1"
       d="M -1.558637,-106.82157 L -1.558637,-106.82157 z "
       id="path1319" />
    <g
       id="g9108"
       transform="translate(28,8)">
      <flowRoot
         transform="matrix(0.9870436,0,0,0.9782288,-18.317563,40.942462)"
         style="font-size:18px;font-weight:normal"
         id="flowRoot4110"
         xml:space="preserve"><flowRegion
           id="flowRegion4112"><rect
             style="font-size:18px;font-weight:normal"
             y="14.285714"
             x="15.714286"
             height="28.928574"
             width="159.64285"
             id="rect4114" /></flowRegion><flowPara
           style="font-size:24px;font-weight:bold;text-align:end;text-anchor:end;fill:#ffffff;fill-opacity:1"
           id="flowPara4118">compare</flowPara></flowRoot>    </g>
  </g>
</svg>
