what,kind,bundleId,bundleVersion,description,time
started,bundle,org.eclipse.wst.internet.cache,1.0.301.v200805140020,org.eclipse.wst.internet.cache,1240606510953
started,bundle,org.eclipse.jdt.apt.core,3.3.101.R34x_v20090114-1205,org.eclipse.jdt.apt.core,1240606512125
started,bundle,org.eclipse.jdt.debug,3.4.1.v20081216_r342,org.eclipse.jdt.debug,1240606515125
started,bundle,org.eclipse.jdt.launching,3.4.1.v20080729_r341,org.eclipse.jdt.launching,1240606516281
started,bundle,org.eclipse.jdt.debug.ui,3.3.1.v20080730_r341,org.eclipse.jdt.debug.ui,1240606518953
started,bundle,org.eclipse.jdt.junit,3.4.0.v20080603-2000,org.eclipse.jdt.junit,1240606519531
deactivated,workbench,org.eclipse.ui.workbench,3.4.2.M20090127-1700,,1240606520859
activated,workbench,org.eclipse.ui.workbench,3.4.2.M20090127-1700,,1240606523046
deactivated,workbench,org.eclipse.ui.workbench,3.4.2.M20090127-1700,,1240606524765
opened,view,org.eclipse.ui.console,3.3.1.v20090128_r342,org.eclipse.ui.console.ConsoleView,1240606527781
activated,workbench,org.eclipse.ui.workbench,3.4.2.M20090127-1700,,1240606528281
activated,view,org.eclipse.ui.console,3.3.1.v20090128_r342,org.eclipse.ui.console.ConsoleView,1240606536015
started,bundle,org.eclipse.mylyn.ide.ant,3.0.5.v20090218-1800-e3x,org.eclipse.mylyn.ide.ant,1240606553640
started,bundle,org.eclipse.mylyn.java.ui,3.0.5.v20090218-1800-e3x,org.eclipse.mylyn.java.ui,1240606553640
started,bundle,org.eclipse.mylyn.resources.ui,3.0.5.v20090218-1800-e3x,org.eclipse.mylyn.resources.ui,1240606553671
closed,workbench,org.eclipse.ui.workbench,3.4.2.M20090127-1700,,1240606553812
stopped,bundle,org.eclipse.mylyn.ide.ant,3.0.5.v20090218-1800-e3x,org.eclipse.mylyn.ide.ant,1240606554140
stopped,bundle,org.eclipse.ant.ui,3.3.1.v20090120_r342,org.eclipse.ant.ui,1240606554156
stopped,bundle,org.eclipse.mylyn.java.tasks,3.0.5.v20090218-1800-e3x,org.eclipse.mylyn.java.tasks,1240606554156
stopped,bundle,org.eclipse.mylyn.java.ui,3.0.5.v20090218-1800-e3x,org.eclipse.mylyn.java.ui,1240606554156
stopped,bundle,org.eclipse.jdt.junit,3.4.0.v20080603-2000,org.eclipse.jdt.junit,1240606554156
stopped,bundle,org.eclipse.jdt.debug.ui,3.3.1.v20080730_r341,org.eclipse.jdt.debug.ui,1240606554156
stopped,bundle,org.eclipse.jdt.apt.ui,3.3.100.v20080407-1345,org.eclipse.jdt.apt.ui,1240606554171
stopped,bundle,com.android.ide.eclipse.adt,0.8.0.v200809220836-110569,com.android.ide.eclipse.adt,1240606554171
stopped,bundle,com.android.ide.eclipse.editors,0.8.0.v200809220836-110569,com.android.ide.eclipse.editors,1240606554171
