/* XPM */
static char * envelope_xpm[] = {
"21 19 179 2",
"  	c None",
". 	c #000000",
"+ 	c #878787",
"@ 	c #868686",
"# 	c #838283",
"$ 	c #807F80",
"% 	c #7C7D7C",
"& 	c #797A7A",
"* 	c #767777",
"= 	c #747474",
"- 	c #717171",
"; 	c #6D6D6E",
"> 	c #6A6B6B",
", 	c #676767",
"' 	c #646464",
") 	c #616262",
"! 	c #5E5F5E",
"~ 	c #5B5C5C",
"{ 	c #595859",
"] 	c #565655",
"^ 	c #959595",
"/ 	c #919292",
"( 	c #8F8F8F",
"_ 	c #8D8D8D",
": 	c #8A8A8A",
"< 	c #888888",
"[ 	c #FFFFFF",
"} 	c #828282",
"| 	c #7D7D7D",
"1 	c #7A7A7A",
"2 	c #787878",
"3 	c #747475",
"4 	c #727272",
"5 	c #70706F",
"6 	c #6D6D6D",
"7 	c #6B6B6A",
"8 	c #525353",
"9 	c #868786",
"0 	c #929292",
"a 	c #7D7E7D",
"b 	c #757575",
"c 	c #707170",
"d 	c #6B6B6B",
"e 	c #686868",
"f 	c #505050",
"g 	c #838384",
"h 	c #8F908F",
"i 	c #8D8D8E",
"j 	c #8B8A8A",
"k 	c #858585",
"l 	c #787979",
"m 	c #727372",
"n 	c #707071",
"o 	c #686869",
"p 	c #666565",
"q 	c #4D4D4E",
"r 	c #808181",
"s 	c #838383",
"t 	c #808080",
"u 	c #7E7E7D",
"v 	c #7A7B7B",
"w 	c #6D6E6E",
"x 	c #686969",
"y 	c #656566",
"z 	c #636363",
"A 	c #4B4A4B",
"B 	c #7E7E7E",
"C 	c #8A8B8B",
"D 	c #7D7E7E",
"E 	c #7A7A7B",
"F 	c #797878",
"G 	c #767676",
"H 	c #737272",
"I 	c #707070",
"J 	c #666665",
"K 	c #606161",
"L 	c #484748",
"M 	c #7C7C7B",
"N 	c #7B7B7B",
"O 	c #797979",
"P 	c #737373",
"Q 	c #6E6E6E",
"R 	c #5E5E5E",
"S 	c #454545",
"T 	c #878786",
"U 	c #818080",
"V 	c #7F7F7E",
"W 	c #7B7C7B",
"X 	c #737474",
"Y 	c #6C6B6B",
"Z 	c #696A69",
"` 	c #666766",
" .	c #616161",
"..	c #5F5E5E",
"+.	c #5C5C5C",
"@.	c #424242",
"#.	c #767576",
"$.	c #818181",
"%.	c #737473",
"&.	c #6F6F6E",
"*.	c #6C6C6C",
"=.	c #6A696A",
"-.	c #666666",
";.	c #616162",
">.	c #5F5E5F",
",.	c #5A5959",
"'.	c #3F3F3F",
").	c #818081",
"!.	c #7F7F7F",
"~.	c #7C7C7C",
"{.	c #6F6F6F",
"].	c #6B6C6C",
"^.	c #696A6A",
"/.	c #676666",
"(.	c #626262",
"_.	c #595A5A",
":.	c #575757",
"<.	c #3C3D3D",
"[.	c #777777",
"}.	c #6A6A6A",
"|.	c #5F5F5F",
"1.	c #555555",
"2.	c #3A3A3A",
"3.	c #6E6D6E",
"4.	c #757574",
"5.	c #6F6F70",
"6.	c #5A5A5A",
"7.	c #575758",
"8.	c #525252",
"9.	c #373737",
"0.	c #787777",
"a.	c #6D6C6D",
"b.	c #6A6A6B",
"c.	c #676768",
"d.	c #656464",
"e.	c #5A5B5A",
"f.	c #535352",
"g.	c #4F504F",
"h.	c #353435",
"i.	c #747575",
"j.	c #6D6D6C",
"k.	c #676867",
"l.	c #5F6060",
"m.	c #5D5C5D",
"n.	c #5B5B5B",
"o.	c #585757",
"p.	c #535353",
"q.	c #4E4E4E",
"r.	c #313131",
"s.	c #656565",
"t.	c #60605F",
"u.	c #585858",
"v.	c #504F50",
"w.	c #4B4B4B",
"x.	c #2F2E2F",
"y.	c #717070",
"z.	c #696868",
"A.	c #656665",
"B.	c #606060",
"C.	c #5D5D5D",
"D.	c #4C4B4B",
"E.	c #484848",
"F.	c #2C2C2C",
"G.	c #5A5A59",
"H.	c #565657",
"I.	c #545454",
"J.	c #505150",
"K.	c #4A4A4A",
"L.	c #474848",
"M.	c #444445",
"N.	c #424142",
"O.	c #3E3E3E",
"P.	c #3B3C3C",
"Q.	c #383838",
"R.	c #363535",
"S.	c #323232",
"T.	c #2F2F2F",
"U.	c #2C2D2C",
"V.	c #2A2A2A",
". . . . . . . . . . . . . . . . . . . . . ",
". + + @ # $ % & * = - ; > , ' ) ! ~ { ] . ",
". + ^ / ( _ : < [ } $ | 1 2 3 4 5 6 7 8 . ",
". 9 0 . . . . [ . [ a 1 2 b 4 c 6 d e f . ",
". g h i j < k } [ . . l b m n ; d o p q . ",
". r i j < @ s t u v l . . - w d x y z A . ",
". B C < @ # t D E F G H I . . [ J ' K L . ",
". M < @ s t B N O G P - Q d [ . [ . R S . ",
". F T g U V W O G X - Q Y Z ` [  ...+.@.. ",
". #.g $.B M O * %.4 &.*.=.-.' ;.>.+.,.'.. ",
". P ).!.~.O * = 4 {.].^./.' (.>.+._.:.<.. ",
". I !.~.O [.= 4 {.*.}., ' (.|.. . . 1.2.. ",
". 3.~.O [.4.4 5.*.}., ' (.. . 6.7.1.8.9.. ",
". d 1 0.3 4 5.a.b.c.d.. . +.e.:.1.f.g.h.. ",
". e 2 i.4 I j.d k.. . l.m.n.o.1.p.g.q.r.. ",
". s.b . . . . . . z t.m.n.u.1.p.v.q.w.x.. ",
". (.m y.3.d z.A.z B.C.n.u.1.p.f q.D.E.F.. ",
". t.C.G.H.I.J.q K.L.M.N.O.P.Q.R.S.T.U.V.. ",
". . . . . . . . . . . . . . . . . . . . . "};
