/* XPM */
static char * start_xpm[] = {
"21 19 159 2",
"  	c None",
". 	c #000000",
"+ 	c #878787",
"@ 	c #868686",
"# 	c #838283",
"$ 	c #807F80",
"% 	c #7C7D7C",
"& 	c #797A7A",
"* 	c #767777",
"= 	c #747474",
"- 	c #717171",
"; 	c #6D6D6E",
"> 	c #6A6B6B",
", 	c #676767",
"' 	c #646464",
") 	c #616262",
"! 	c #5E5F5E",
"~ 	c #5B5C5C",
"{ 	c #595859",
"] 	c #565655",
"^ 	c #959595",
"/ 	c #919292",
"( 	c #8F8F8F",
"_ 	c #8D8D8D",
": 	c #8A8A8A",
"< 	c #888888",
"[ 	c #858585",
"} 	c #828282",
"| 	c #7D7D7D",
"1 	c #7A7A7A",
"2 	c #787878",
"3 	c #747475",
"4 	c #727272",
"5 	c #70706F",
"6 	c #6D6D6D",
"7 	c #6B6B6A",
"8 	c #525353",
"9 	c #868786",
"0 	c #929292",
"a 	c #8F908F",
"b 	c #8B8A8A",
"c 	c #868585",
"d 	c #808080",
"e 	c #7D7E7D",
"f 	c #757575",
"g 	c #707170",
"h 	c #6B6B6B",
"i 	c #686868",
"j 	c #505050",
"k 	c #838384",
"l 	c #8D8D8E",
"m 	c #7B7A7A",
"n 	c #787979",
"o 	c #727372",
"p 	c #686869",
"q 	c #666565",
"r 	c #4D4D4E",
"s 	c #808181",
"t 	c #838383",
"u 	c #7A7B7B",
"v 	c #767576",
"w 	c #727273",
"x 	c #686969",
"y 	c #656566",
"z 	c #636363",
"A 	c #4B4A4B",
"B 	c #7E7E7E",
"C 	c #8A8B8B",
"D 	c #797878",
"E 	c #767676",
"F 	c #737272",
"G 	c #666665",
"H 	c #606161",
"I 	c #484748",
"J 	c #7C7C7B",
"K 	c #737373",
"L 	c #666666",
"M 	c #616161",
"N 	c #5E5E5E",
"O 	c #454545",
"P 	c #878786",
"Q 	c #737474",
"R 	c #5F5E5E",
"S 	c #5C5C5C",
"T 	c #424242",
"U 	c #616162",
"V 	c #5F5E5F",
"W 	c #5A5959",
"X 	c #3F3F3F",
"Y 	c #818081",
"Z 	c #7F7F7F",
"` 	c #6F6F6F",
" .	c #595A5A",
"..	c #575757",
"+.	c #3C3D3D",
"@.	c #707070",
"#.	c #7C7C7C",
"$.	c #797979",
"%.	c #6C6C6C",
"&.	c #6A6A6A",
"*.	c #5A5A59",
"=.	c #575657",
"-.	c #555555",
";.	c #3A3A3A",
">.	c #6E6D6E",
",.	c #777777",
"'.	c #757574",
").	c #5A5A5A",
"!.	c #575758",
"~.	c #525252",
"{.	c #373737",
"].	c #787777",
"^.	c #6F6F70",
"/.	c #676768",
"(.	c #656464",
"_.	c #626263",
":.	c #5F5F60",
"<.	c #535352",
"[.	c #4F504F",
"}.	c #353435",
"|.	c #747575",
"1.	c #6D6D6C",
"2.	c #656565",
"3.	c #626363",
"4.	c #5F6060",
"5.	c #5D5C5D",
"6.	c #5B5B5B",
"7.	c #535353",
"8.	c #4E4E4E",
"9.	c #313131",
"0.	c #60605F",
"a.	c #585858",
"b.	c #504F50",
"c.	c #4B4B4B",
"d.	c #2F2E2F",
"e.	c #626262",
"f.	c #717070",
"g.	c #696868",
"h.	c #656665",
"i.	c #606060",
"j.	c #5D5D5D",
"k.	c #4C4B4B",
"l.	c #484848",
"m.	c #2C2C2C",
"n.	c #565657",
"o.	c #545454",
"p.	c #505150",
"q.	c #4A4A4A",
"r.	c #474848",
"s.	c #444445",
"t.	c #424142",
"u.	c #3E3E3E",
"v.	c #3B3C3C",
"w.	c #383838",
"x.	c #363535",
"y.	c #323232",
"z.	c #2F2F2F",
"A.	c #2C2D2C",
"B.	c #2A2A2A",
". . . . . . . . . . . . . . . . . . . . . ",
". + + @ # $ % & * = - ; > , ' ) ! ~ { ] . ",
". + ^ / ( _ : < [ } $ | 1 2 3 4 5 6 7 8 . ",
". 9 0 a _ b < c } d e 1 2 f 4 g 6 h i j . ",
". k a l b < [ } . e m n f o . ; h p q r . ",
". s l b < @ t . . u n v w . . h x y z A . ",
". B C < @ # . . . D E F . . . p G ' H I . ",
". J < @ t . . . . E K . . . . L ' M N O . ",
". D P k . . . . . Q . . . . . ' M R S T . ",
". v k . . . . . . . . . . . . U V S W X . ",
". K Y Z . . . . . ` . . . . . V S  ...+.. ",
". @.Z #.$.. . . . %.&.. . . . S *.=.-.;.. ",
". >.#.$.,.'.. . . &., ' . . . ).!.-.~.{.. ",
". h 1 ].3 4 ^.. . /.(._.:.. . ..-.<.[.}.. ",
". i 2 |.4 @.1.h . 2.3.4.5.6.. -.7.[.8.9.. ",
". 2.f 4 @.1.h i 2.z 0.5.6.a.-.7.b.8.c.d.. ",
". e.o f.>.h g.h.z i.j.6.a.-.7.j 8.k.l.m.. ",
". 0.j.*.n.o.p.r q.r.s.t.u.v.w.x.y.z.A.B.. ",
". . . . . . . . . . . . . . . . . . . . . "};
