a:50:{i:0;a:3:{i:0;s:14:"document_start";i:1;a:0:{}i:2;i:0;}i:1;a:3:{i:0;s:6:"p_open";i:1;a:0:{}i:2;i:0;}i:2;a:3:{i:0;s:7:"p_close";i:1;a:0:{}i:2;i:1;}i:3;a:3:{i:0;s:12:"section_edit";i:1;a:4:{i:0;i:-1;i:1;i:0;i:2;i:1;i:3;s:0:"";}i:2;i:1;}i:4;a:3:{i:0;s:6:"header";i:1;a:3:{i:0;s:9:"Libraries";i:1;i:1;i:2;i:1;}i:2;i:1;}i:5;a:3:{i:0;s:12:"section_open";i:1;a:1:{i:0;i:1;}i:2;i:1;}i:6;a:3:{i:0;s:6:"p_open";i:1;a:0:{}i:2;i:24;}i:7;a:3:{i:0;s:5:"cdata";i:1;a:1:{i:0;s:1:"
";}i:2;i:25;}i:8;a:3:{i:0;s:6:"plugin";i:1;a:4:{i:0;s:11:"htmlcomment";i:1;a:2:{i:0;i:5;i:1;s:7:" [[|]] ";}i:2;i:5;i:3;s:14:"<!-- [[|]] -->";}i:2;i:26;}i:9;a:3:{i:0;s:5:"cdata";i:1;a:1:{i:0;s:1:"
";}i:2;i:40;}i:10;a:3:{i:0;s:12:"externallink";i:1;a:2:{i:0;s:21:"http://www.boost.org/";i:1;s:5:"Boost";}i:2;i:41;}i:11;a:3:{i:0;s:5:"cdata";i:1;a:1:{i:0;s:33:" - Portable C++ source libraries ";}i:2;i:72;}i:12;a:3:{i:0;s:9:"linebreak";i:1;a:0:{}i:2;i:105;}i:13;a:3:{i:0;s:5:"cdata";i:1;a:1:{i:0;s:1:"
";}i:2;i:107;}i:14;a:3:{i:0;s:12:"externallink";i:1;a:2:{i:0;s:19:"http://www.gtk.org/";i:1;s:4:"Gtk+";}i:2;i:108;}i:15;a:3:{i:0;s:5:"cdata";i:1;a:1:{i:0;s:50:" - Toolkit for creating graphical user interfaces ";}i:2;i:136;}i:16;a:3:{i:0;s:9:"linebreak";i:1;a:0:{}i:2;i:186;}i:17;a:3:{i:0;s:5:"cdata";i:1;a:1:{i:0;s:1:"
";}i:2;i:188;}i:18;a:3:{i:0;s:12:"externallink";i:1;a:2:{i:0;s:21:"http://www.gtkmm.org/";i:1;s:5:"Gtkmm";}i:2;i:189;}i:19;a:3:{i:0;s:5:"cdata";i:1;a:1:{i:0;s:29:" - The C++ Interface for Gtk ";}i:2;i:220;}i:20;a:3:{i:0;s:9:"linebreak";i:1;a:0:{}i:2;i:249;}i:21;a:3:{i:0;s:5:"cdata";i:1;a:1:{i:0;s:1:"
";}i:2;i:251;}i:22;a:3:{i:0;s:12:"externallink";i:1;a:2:{i:0;s:32:"http://irrlicht.sourceforge.net/";i:1;s:8:"Irrlicht";}i:2;i:252;}i:23;a:3:{i:0;s:5:"cdata";i:1;a:1:{i:0;s:13:" - 3D Engine ";}i:2;i:297;}i:24;a:3:{i:0;s:9:"linebreak";i:1;a:0:{}i:2;i:310;}i:25;a:3:{i:0;s:5:"cdata";i:1;a:1:{i:0;s:1:"
";}i:2;i:312;}i:26;a:3:{i:0;s:12:"externallink";i:1;a:2:{i:0;s:22:"http://www.opengl.org/";i:1;s:6:"OpenGL";}i:2;i:313;}i:27;a:3:{i:0;s:5:"cdata";i:1;a:1:{i:0;s:25:" - Open Graphics Library ";}i:2;i:346;}i:28;a:3:{i:0;s:9:"linebreak";i:1;a:0:{}i:2;i:371;}i:29;a:3:{i:0;s:5:"cdata";i:1;a:1:{i:0;s:1:"
";}i:2;i:373;}i:30;a:3:{i:0;s:12:"externallink";i:1;a:2:{i:0;s:47:"http://www.opengl.org/resources/libraries/glut/";i:1;s:4:"GLUT";}i:2;i:374;}i:31;a:3:{i:0;s:5:"cdata";i:1;a:1:{i:0;s:30:" - The OpenGL Utility Toolkit ";}i:2;i:430;}i:32;a:3:{i:0;s:9:"linebreak";i:1;a:0:{}i:2;i:460;}i:33;a:3:{i:0;s:5:"cdata";i:1;a:1:{i:0;s:1:"
";}i:2;i:462;}i:34;a:3:{i:0;s:12:"externallink";i:1;a:2:{i:0;s:28:"http://glui.sourceforge.net/";i:1;s:4:"GLUI";}i:2;i:463;}i:35;a:3:{i:0;s:5:"cdata";i:1;a:1:{i:0;s:41:" - GLUT-based C++ user interface library ";}i:2;i:500;}i:36;a:3:{i:0;s:9:"linebreak";i:1;a:0:{}i:2;i:541;}i:37;a:3:{i:0;s:5:"cdata";i:1;a:1:{i:0;s:1:"
";}i:2;i:543;}i:38;a:3:{i:0;s:12:"externallink";i:1;a:2:{i:0;s:64:"http://flinflon.brandonu.ca/Dueck/1999/62306/sockets/Default.htm";i:1;s:16:"Portable Sockets";}i:2;i:544;}i:39;a:3:{i:0;s:5:"cdata";i:1;a:1:{i:0;s:38:" - Communication using TCP/IP and UDP ";}i:2;i:629;}i:40;a:3:{i:0;s:9:"linebreak";i:1;a:0:{}i:2;i:667;}i:41;a:3:{i:0;s:5:"cdata";i:1;a:1:{i:0;s:1:"
";}i:2;i:669;}i:42;a:3:{i:0;s:12:"externallink";i:1;a:2:{i:0;s:37:"http://sourceware.org/pthreads-win32/";i:1;s:14:"Pthreads Win32";}i:2;i:670;}i:43;a:3:{i:0;s:5:"cdata";i:1;a:1:{i:0;s:59:" - Open Source POSIX Threads implementation for Windows 32 ";}i:2;i:726;}i:44;a:3:{i:0;s:9:"linebreak";i:1;a:0:{}i:2;i:785;}i:45;a:3:{i:0;s:7:"p_close";i:1;a:0:{}i:2;i:787;}i:46;a:3:{i:0;s:6:"plugin";i:1;a:4:{i:0;s:7:"tag_tag";i:1;a:2:{i:0;s:5:"links";i:1;s:11:"programming";}i:2;i:5;i:3;s:25:"{{tag>links programming}}";}i:2;i:789;}i:47;a:2:{i:0;s:6:"plugin";i:1;a:4:{i:0;s:7:"uparrow";i:1;a:1:{i:0;s:42:"lib/plugins/uparrow/images/tango-small.png";}i:2;i:1;i:3;s:6:"~~UP~~";}}i:48;a:3:{i:0;s:13:"section_close";i:1;a:0:{}i:2;i:814;}i:49;a:3:{i:0;s:12:"document_end";i:1;a:0:{}i:2;i:814;}}