a:24:{i:0;a:3:{i:0;s:14:"document_start";i:1;a:0:{}i:2;i:0;}i:1;a:3:{i:0;s:6:"p_open";i:1;a:0:{}i:2;i:0;}i:2;a:3:{i:0;s:7:"p_close";i:1;a:0:{}i:2;i:1;}i:3;a:3:{i:0;s:12:"section_edit";i:1;a:4:{i:0;i:-1;i:1;i:0;i:2;i:1;i:3;s:0:"";}i:2;i:1;}i:4;a:3:{i:0;s:6:"header";i:1;a:3:{i:0;s:11:"Java Script";i:1;i:1;i:2;i:1;}i:2;i:1;}i:5;a:3:{i:0;s:12:"section_open";i:1;a:1:{i:0;i:1;}i:2;i:1;}i:6;a:3:{i:0;s:6:"p_open";i:1;a:0:{}i:2;i:26;}i:7;a:3:{i:0;s:5:"cdata";i:1;a:1:{i:0;s:1:"
";}i:2;i:27;}i:8;a:3:{i:0;s:13:"interwikilink";i:1;a:4:{i:0;s:13:"wp>JavaScript";i:1;N;i:2;s:2:"wp";i:3;s:10:"JavaScript";}i:2;i:28;}i:9;a:3:{i:0;s:7:"p_close";i:1;a:0:{}i:2;i:45;}i:10;a:2:{i:0;s:6:"plugin";i:1;a:4:{i:0;s:7:"uparrow";i:1;a:1:{i:0;s:42:"lib/plugins/uparrow/images/tango-small.png";}i:2;i:1;i:3;s:6:"~~UP~~";}}i:11;a:3:{i:0;s:13:"section_close";i:1;a:0:{}i:2;i:47;}i:12;a:3:{i:0;s:12:"section_edit";i:1;a:4:{i:0;i:1;i:1;i:46;i:2;i:1;i:3;s:11:"Java Script";}i:2;i:47;}i:13;a:3:{i:0;s:6:"header";i:1;a:3:{i:0;s:17:"Character Counter";i:1;i:2;i:2;i:47;}i:2;i:47;}i:14;a:3:{i:0;s:12:"section_open";i:1;a:1:{i:0;i:2;}i:2;i:47;}i:15;a:3:{i:0;s:4:"code";i:1;a:3:{i:0;s:815:"
<html>
<head>
<title>Character Counter</title>
</head>
<script language="JavaScript">
//Character count script- by http://www.inf.ufrgs.br/~kssilveira
//Credit must stay intact for use
</script>
<body>
<h1>Character Counter</h1>
<form method="POST">
<table border="0" cellspacing="0" cellpadding="0">
  <tr>
    <td width="100%">
      <textarea
        rows="12"
        name="charcount"
        cols="60"
        wrap="virtual"
        onkeyup="this.form.displaycount.value = this.form.charcount.value.length">
      </textarea>
    </td>
  </tr>
  <tr>
    <td width="100%">
      <div align="right">
        <p>
          Character Count:
          <input type="text"
                 name="displaycount"
                 size="20">
        </p>
      </div>
    </td>
  </tr>
</table>
</form>
</body>
</html>
";i:1;s:11:"html4strict";i:2;N;}i:2;i:83;}i:16;a:3:{i:0;s:6:"p_open";i:1;a:0:{}i:2;i:911;}i:17;a:3:{i:0;s:4:"html";i:1;a:1:{i:0;s:95:"
<object data=character_counter.html height=500 width=500 hspace=0 vspace=0 border=0></object>
";}i:2;i:919;}i:18;a:3:{i:0;s:5:"cdata";i:1;a:1:{i:0;s:1:"
";}i:2;i:1021;}i:19;a:3:{i:0;s:7:"p_close";i:1;a:0:{}i:2;i:1021;}i:20;a:2:{i:0;s:6:"plugin";i:1;a:4:{i:0;s:7:"uparrow";i:1;a:1:{i:0;s:42:"lib/plugins/uparrow/images/tango-small.png";}i:2;i:1;i:3;s:6:"~~UP~~";}}i:21;a:3:{i:0;s:13:"section_close";i:1;a:0:{}i:2;i:1021;}i:22;a:3:{i:0;s:12:"section_edit";i:1;a:4:{i:0;i:47;i:1;i:0;i:2;i:2;i:3;s:17:"Character Counter";}i:2;i:1021;}i:23;a:3:{i:0;s:12:"document_end";i:1;a:0:{}i:2;i:1021;}}