a:227:{i:0;a:3:{i:0;s:14:"document_start";i:1;a:0:{}i:2;i:0;}i:1;a:3:{i:0;s:6:"p_open";i:1;a:0:{}i:2;i:0;}i:2;a:3:{i:0;s:7:"p_close";i:1;a:0:{}i:2;i:1;}i:3;a:3:{i:0;s:12:"section_edit";i:1;a:4:{i:0;i:-1;i:1;i:0;i:2;i:1;i:3;s:0:"";}i:2;i:1;}i:4;a:3:{i:0;s:6:"header";i:1;a:3:{i:0;s:14:"Intermédiaire";i:1;i:1;i:2;i:1;}i:2;i:1;}i:5;a:3:{i:0;s:12:"section_open";i:1;a:1:{i:0;i:1;}i:2;i:1;}i:6;a:3:{i:0;s:6:"p_open";i:1;a:0:{}i:2;i:29;}i:7;a:3:{i:0;s:5:"cdata";i:1;a:1:{i:0;s:1:"
";}i:2;i:30;}i:8;a:3:{i:0;s:12:"internallink";i:1;a:2:{i:0;s:25:".:intermediate:sequence01";i:1;N;}i:2;i:31;}i:9;a:3:{i:0;s:5:"cdata";i:1;a:1:{i:0;s:1:" ";}i:2;i:60;}i:10;a:3:{i:0;s:9:"linebreak";i:1;a:0:{}i:2;i:61;}i:11;a:3:{i:0;s:5:"cdata";i:1;a:1:{i:0;s:1:"
";}i:2;i:63;}i:12;a:3:{i:0;s:12:"internallink";i:1;a:2:{i:0;s:25:".:intermediate:sequence02";i:1;N;}i:2;i:64;}i:13;a:3:{i:0;s:5:"cdata";i:1;a:1:{i:0;s:1:" ";}i:2;i:93;}i:14;a:3:{i:0;s:9:"linebreak";i:1;a:0:{}i:2;i:94;}i:15;a:3:{i:0;s:5:"cdata";i:1;a:1:{i:0;s:1:"
";}i:2;i:96;}i:16;a:3:{i:0;s:12:"internallink";i:1;a:2:{i:0;s:25:".:intermediate:sequence03";i:1;N;}i:2;i:97;}i:17;a:3:{i:0;s:5:"cdata";i:1;a:1:{i:0;s:1:" ";}i:2;i:126;}i:18;a:3:{i:0;s:9:"linebreak";i:1;a:0:{}i:2;i:127;}i:19;a:3:{i:0;s:5:"cdata";i:1;a:1:{i:0;s:1:"
";}i:2;i:129;}i:20;a:3:{i:0;s:12:"internallink";i:1;a:2:{i:0;s:25:".:intermediate:sequence04";i:1;N;}i:2;i:130;}i:21;a:3:{i:0;s:5:"cdata";i:1;a:1:{i:0;s:1:" ";}i:2;i:159;}i:22;a:3:{i:0;s:9:"linebreak";i:1;a:0:{}i:2;i:160;}i:23;a:3:{i:0;s:5:"cdata";i:1;a:1:{i:0;s:1:"
";}i:2;i:162;}i:24;a:3:{i:0;s:12:"internallink";i:1;a:2:{i:0;s:25:".:intermediate:sequence05";i:1;N;}i:2;i:163;}i:25;a:3:{i:0;s:5:"cdata";i:1;a:1:{i:0;s:1:" ";}i:2;i:192;}i:26;a:3:{i:0;s:9:"linebreak";i:1;a:0:{}i:2;i:193;}i:27;a:3:{i:0;s:5:"cdata";i:1;a:1:{i:0;s:1:"
";}i:2;i:195;}i:28;a:3:{i:0;s:12:"internallink";i:1;a:2:{i:0;s:25:".:intermediate:sequence06";i:1;N;}i:2;i:196;}i:29;a:3:{i:0;s:5:"cdata";i:1;a:1:{i:0;s:1:" ";}i:2;i:225;}i:30;a:3:{i:0;s:9:"linebreak";i:1;a:0:{}i:2;i:226;}i:31;a:3:{i:0;s:5:"cdata";i:1;a:1:{i:0;s:1:"
";}i:2;i:228;}i:32;a:3:{i:0;s:12:"internallink";i:1;a:2:{i:0;s:25:".:intermediate:sequence07";i:1;N;}i:2;i:229;}i:33;a:3:{i:0;s:5:"cdata";i:1;a:1:{i:0;s:1:" ";}i:2;i:258;}i:34;a:3:{i:0;s:9:"linebreak";i:1;a:0:{}i:2;i:259;}i:35;a:3:{i:0;s:5:"cdata";i:1;a:1:{i:0;s:1:"
";}i:2;i:261;}i:36;a:3:{i:0;s:12:"internallink";i:1;a:2:{i:0;s:25:".:intermediate:sequence08";i:1;N;}i:2;i:262;}i:37;a:3:{i:0;s:5:"cdata";i:1;a:1:{i:0;s:1:" ";}i:2;i:291;}i:38;a:3:{i:0;s:9:"linebreak";i:1;a:0:{}i:2;i:292;}i:39;a:3:{i:0;s:5:"cdata";i:1;a:1:{i:0;s:1:"
";}i:2;i:294;}i:40;a:3:{i:0;s:12:"internallink";i:1;a:2:{i:0;s:25:".:intermediate:sequence09";i:1;N;}i:2;i:295;}i:41;a:3:{i:0;s:5:"cdata";i:1;a:1:{i:0;s:1:" ";}i:2;i:324;}i:42;a:3:{i:0;s:9:"linebreak";i:1;a:0:{}i:2;i:325;}i:43;a:3:{i:0;s:5:"cdata";i:1;a:1:{i:0;s:1:"
";}i:2;i:327;}i:44;a:3:{i:0;s:12:"internallink";i:1;a:2:{i:0;s:25:".:intermediate:sequence10";i:1;N;}i:2;i:328;}i:45;a:3:{i:0;s:5:"cdata";i:1;a:1:{i:0;s:1:" ";}i:2;i:357;}i:46;a:3:{i:0;s:9:"linebreak";i:1;a:0:{}i:2;i:358;}i:47;a:3:{i:0;s:5:"cdata";i:1;a:1:{i:0;s:1:"
";}i:2;i:360;}i:48;a:3:{i:0;s:12:"internallink";i:1;a:2:{i:0;s:25:".:intermediate:sequence11";i:1;N;}i:2;i:361;}i:49;a:3:{i:0;s:5:"cdata";i:1;a:1:{i:0;s:1:" ";}i:2;i:390;}i:50;a:3:{i:0;s:9:"linebreak";i:1;a:0:{}i:2;i:391;}i:51;a:3:{i:0;s:5:"cdata";i:1;a:1:{i:0;s:1:"
";}i:2;i:393;}i:52;a:3:{i:0;s:12:"internallink";i:1;a:2:{i:0;s:25:".:intermediate:sequence12";i:1;N;}i:2;i:394;}i:53;a:3:{i:0;s:5:"cdata";i:1;a:1:{i:0;s:1:" ";}i:2;i:423;}i:54;a:3:{i:0;s:9:"linebreak";i:1;a:0:{}i:2;i:424;}i:55;a:3:{i:0;s:5:"cdata";i:1;a:1:{i:0;s:1:"
";}i:2;i:426;}i:56;a:3:{i:0;s:12:"internallink";i:1;a:2:{i:0;s:25:".:intermediate:sequence13";i:1;N;}i:2;i:427;}i:57;a:3:{i:0;s:5:"cdata";i:1;a:1:{i:0;s:1:" ";}i:2;i:456;}i:58;a:3:{i:0;s:9:"linebreak";i:1;a:0:{}i:2;i:457;}i:59;a:3:{i:0;s:5:"cdata";i:1;a:1:{i:0;s:1:"
";}i:2;i:459;}i:60;a:3:{i:0;s:12:"internallink";i:1;a:2:{i:0;s:25:".:intermediate:sequence14";i:1;N;}i:2;i:460;}i:61;a:3:{i:0;s:5:"cdata";i:1;a:1:{i:0;s:1:" ";}i:2;i:489;}i:62;a:3:{i:0;s:9:"linebreak";i:1;a:0:{}i:2;i:490;}i:63;a:3:{i:0;s:5:"cdata";i:1;a:1:{i:0;s:1:"
";}i:2;i:492;}i:64;a:3:{i:0;s:12:"internallink";i:1;a:2:{i:0;s:25:".:intermediate:sequence15";i:1;N;}i:2;i:493;}i:65;a:3:{i:0;s:5:"cdata";i:1;a:1:{i:0;s:1:" ";}i:2;i:522;}i:66;a:3:{i:0;s:9:"linebreak";i:1;a:0:{}i:2;i:523;}i:67;a:3:{i:0;s:5:"cdata";i:1;a:1:{i:0;s:1:"
";}i:2;i:525;}i:68;a:3:{i:0;s:12:"internallink";i:1;a:2:{i:0;s:25:".:intermediate:sequence16";i:1;N;}i:2;i:526;}i:69;a:3:{i:0;s:5:"cdata";i:1;a:1:{i:0;s:1:" ";}i:2;i:555;}i:70;a:3:{i:0;s:9:"linebreak";i:1;a:0:{}i:2;i:556;}i:71;a:3:{i:0;s:7:"p_close";i:1;a:0:{}i:2;i:558;}i:72;a:2:{i:0;s:6:"plugin";i:1;a:4:{i:0;s:7:"uparrow";i:1;a:1:{i:0;s:42:"lib/plugins/uparrow/images/tango-small.png";}i:2;i:1;i:3;s:6:"~~UP~~";}}i:73;a:3:{i:0;s:13:"section_close";i:1;a:0:{}i:2;i:560;}i:74;a:3:{i:0;s:12:"section_edit";i:1;a:4:{i:0;i:1;i:1;i:559;i:2;i:1;i:3;s:14:"Intermédiaire";}i:2;i:560;}i:75;a:3:{i:0;s:6:"header";i:1;a:3:{i:0;s:48:"Verbes: conjugués avec être au passé composé";i:1;i:2;i:2;i:560;}i:2;i:560;}i:76;a:3:{i:0;s:12:"section_open";i:1;a:1:{i:0;i:2;}i:2;i:560;}i:77;a:3:{i:0;s:10:"table_open";i:1;a:2:{i:0;i:2;i:1;i:18;}i:2;i:621;}i:78;a:3:{i:0;s:13:"tablerow_open";i:1;a:0:{}i:2;i:621;}i:79;a:3:{i:0;s:16:"tableheader_open";i:1;a:3:{i:0;i:1;i:1;N;i:2;i:1;}i:2;i:621;}i:80;a:3:{i:0;s:5:"cdata";i:1;a:1:{i:0;s:11:" Infinitif ";}i:2;i:623;}i:81;a:3:{i:0;s:17:"tableheader_close";i:1;a:0:{}i:2;i:634;}i:82;a:3:{i:0;s:16:"tableheader_open";i:1;a:3:{i:0;i:1;i:1;N;i:2;i:1;}i:2;i:634;}i:83;a:3:{i:0;s:5:"cdata";i:1;a:1:{i:0;s:18:" Participe Passé ";}i:2;i:635;}i:84;a:3:{i:0;s:17:"tableheader_close";i:1;a:0:{}i:2;i:653;}i:85;a:3:{i:0;s:14:"tablerow_close";i:1;a:0:{}i:2;i:654;}i:86;a:3:{i:0;s:13:"tablerow_open";i:1;a:0:{}i:2;i:654;}i:87;a:3:{i:0;s:14:"tablecell_open";i:1;a:3:{i:0;i:1;i:1;N;i:2;i:1;}i:2;i:654;}i:88;a:3:{i:0;s:5:"cdata";i:1;a:1:{i:0;s:11:" descendre ";}i:2;i:656;}i:89;a:3:{i:0;s:15:"tablecell_close";i:1;a:0:{}i:2;i:667;}i:90;a:3:{i:0;s:14:"tablecell_open";i:1;a:3:{i:0;i:1;i:1;N;i:2;i:1;}i:2;i:667;}i:91;a:3:{i:0;s:5:"cdata";i:1;a:1:{i:0;s:10:" descendu ";}i:2;i:668;}i:92;a:3:{i:0;s:15:"tablecell_close";i:1;a:0:{}i:2;i:678;}i:93;a:3:{i:0;s:14:"tablerow_close";i:1;a:0:{}i:2;i:679;}i:94;a:3:{i:0;s:13:"tablerow_open";i:1;a:0:{}i:2;i:679;}i:95;a:3:{i:0;s:14:"tablecell_open";i:1;a:3:{i:0;i:1;i:1;N;i:2;i:1;}i:2;i:679;}i:96;a:3:{i:0;s:5:"cdata";i:1;a:1:{i:0;s:9:" revenir ";}i:2;i:681;}i:97;a:3:{i:0;s:15:"tablecell_close";i:1;a:0:{}i:2;i:690;}i:98;a:3:{i:0;s:14:"tablecell_open";i:1;a:3:{i:0;i:1;i:1;N;i:2;i:1;}i:2;i:690;}i:99;a:3:{i:0;s:5:"cdata";i:1;a:1:{i:0;s:8:" revenu ";}i:2;i:691;}i:100;a:3:{i:0;s:15:"tablecell_close";i:1;a:0:{}i:2;i:699;}i:101;a:3:{i:0;s:14:"tablerow_close";i:1;a:0:{}i:2;i:700;}i:102;a:3:{i:0;s:13:"tablerow_open";i:1;a:0:{}i:2;i:700;}i:103;a:3:{i:0;s:14:"tablecell_open";i:1;a:3:{i:0;i:1;i:1;N;i:2;i:1;}i:2;i:700;}i:104;a:3:{i:0;s:5:"cdata";i:1;a:1:{i:0;s:8:" mourir ";}i:2;i:702;}i:105;a:3:{i:0;s:15:"tablecell_close";i:1;a:0:{}i:2;i:710;}i:106;a:3:{i:0;s:14:"tablecell_open";i:1;a:3:{i:0;i:1;i:1;N;i:2;i:1;}i:2;i:710;}i:107;a:3:{i:0;s:5:"cdata";i:1;a:1:{i:0;s:6:" mort ";}i:2;i:711;}i:108;a:3:{i:0;s:15:"tablecell_close";i:1;a:0:{}i:2;i:717;}i:109;a:3:{i:0;s:14:"tablerow_close";i:1;a:0:{}i:2;i:718;}i:110;a:3:{i:0;s:13:"tablerow_open";i:1;a:0:{}i:2;i:718;}i:111;a:3:{i:0;s:14:"tablecell_open";i:1;a:3:{i:0;i:1;i:1;N;i:2;i:1;}i:2;i:718;}i:112;a:3:{i:0;s:5:"cdata";i:1;a:1:{i:0;s:11:" retourner ";}i:2;i:720;}i:113;a:3:{i:0;s:15:"tablecell_close";i:1;a:0:{}i:2;i:731;}i:114;a:3:{i:0;s:14:"tablecell_open";i:1;a:3:{i:0;i:1;i:1;N;i:2;i:1;}i:2;i:731;}i:115;a:3:{i:0;s:5:"cdata";i:1;a:1:{i:0;s:11:" retourné ";}i:2;i:732;}i:116;a:3:{i:0;s:15:"tablecell_close";i:1;a:0:{}i:2;i:743;}i:117;a:3:{i:0;s:14:"tablerow_close";i:1;a:0:{}i:2;i:744;}i:118;a:3:{i:0;s:13:"tablerow_open";i:1;a:0:{}i:2;i:744;}i:119;a:3:{i:0;s:14:"tablecell_open";i:1;a:3:{i:0;i:1;i:1;N;i:2;i:1;}i:2;i:744;}i:120;a:3:{i:0;s:5:"cdata";i:1;a:1:{i:0;s:8:" sortir ";}i:2;i:746;}i:121;a:3:{i:0;s:15:"tablecell_close";i:1;a:0:{}i:2;i:754;}i:122;a:3:{i:0;s:14:"tablecell_open";i:1;a:3:{i:0;i:1;i:1;N;i:2;i:1;}i:2;i:754;}i:123;a:3:{i:0;s:5:"cdata";i:1;a:1:{i:0;s:7:" sorti ";}i:2;i:755;}i:124;a:3:{i:0;s:15:"tablecell_close";i:1;a:0:{}i:2;i:762;}i:125;a:3:{i:0;s:14:"tablerow_close";i:1;a:0:{}i:2;i:763;}i:126;a:3:{i:0;s:13:"tablerow_open";i:1;a:0:{}i:2;i:763;}i:127;a:3:{i:0;s:14:"tablecell_open";i:1;a:3:{i:0;i:1;i:1;N;i:2;i:1;}i:2;i:763;}i:128;a:3:{i:0;s:5:"cdata";i:1;a:1:{i:0;s:7:" venir ";}i:2;i:765;}i:129;a:3:{i:0;s:15:"tablecell_close";i:1;a:0:{}i:2;i:772;}i:130;a:3:{i:0;s:14:"tablecell_open";i:1;a:3:{i:0;i:1;i:1;N;i:2;i:1;}i:2;i:772;}i:131;a:3:{i:0;s:5:"cdata";i:1;a:1:{i:0;s:6:" venu ";}i:2;i:773;}i:132;a:3:{i:0;s:15:"tablecell_close";i:1;a:0:{}i:2;i:779;}i:133;a:3:{i:0;s:14:"tablerow_close";i:1;a:0:{}i:2;i:780;}i:134;a:3:{i:0;s:13:"tablerow_open";i:1;a:0:{}i:2;i:780;}i:135;a:3:{i:0;s:14:"tablecell_open";i:1;a:3:{i:0;i:1;i:1;N;i:2;i:1;}i:2;i:780;}i:136;a:3:{i:0;s:5:"cdata";i:1;a:1:{i:0;s:9:" arriver ";}i:2;i:782;}i:137;a:3:{i:0;s:15:"tablecell_close";i:1;a:0:{}i:2;i:791;}i:138;a:3:{i:0;s:14:"tablecell_open";i:1;a:3:{i:0;i:1;i:1;N;i:2;i:1;}i:2;i:791;}i:139;a:3:{i:0;s:5:"cdata";i:1;a:1:{i:0;s:9:" arrivé ";}i:2;i:792;}i:140;a:3:{i:0;s:15:"tablecell_close";i:1;a:0:{}i:2;i:801;}i:141;a:3:{i:0;s:14:"tablerow_close";i:1;a:0:{}i:2;i:802;}i:142;a:3:{i:0;s:13:"tablerow_open";i:1;a:0:{}i:2;i:802;}i:143;a:3:{i:0;s:14:"tablecell_open";i:1;a:3:{i:0;i:1;i:1;N;i:2;i:1;}i:2;i:802;}i:144;a:3:{i:0;s:5:"cdata";i:1;a:1:{i:0;s:8:" naitre ";}i:2;i:804;}i:145;a:3:{i:0;s:15:"tablecell_close";i:1;a:0:{}i:2;i:812;}i:146;a:3:{i:0;s:14:"tablecell_open";i:1;a:3:{i:0;i:1;i:1;N;i:2;i:1;}i:2;i:812;}i:147;a:3:{i:0;s:5:"cdata";i:1;a:1:{i:0;s:5:" né ";}i:2;i:813;}i:148;a:3:{i:0;s:15:"tablecell_close";i:1;a:0:{}i:2;i:818;}i:149;a:3:{i:0;s:14:"tablerow_close";i:1;a:0:{}i:2;i:819;}i:150;a:3:{i:0;s:13:"tablerow_open";i:1;a:0:{}i:2;i:819;}i:151;a:3:{i:0;s:14:"tablecell_open";i:1;a:3:{i:0;i:1;i:1;N;i:2;i:1;}i:2;i:819;}i:152;a:3:{i:0;s:5:"cdata";i:1;a:1:{i:0;s:9:" devenir ";}i:2;i:821;}i:153;a:3:{i:0;s:15:"tablecell_close";i:1;a:0:{}i:2;i:830;}i:154;a:3:{i:0;s:14:"tablecell_open";i:1;a:3:{i:0;i:1;i:1;N;i:2;i:1;}i:2;i:830;}i:155;a:3:{i:0;s:5:"cdata";i:1;a:1:{i:0;s:8:" devenu ";}i:2;i:831;}i:156;a:3:{i:0;s:15:"tablecell_close";i:1;a:0:{}i:2;i:839;}i:157;a:3:{i:0;s:14:"tablerow_close";i:1;a:0:{}i:2;i:840;}i:158;a:3:{i:0;s:13:"tablerow_open";i:1;a:0:{}i:2;i:840;}i:159;a:3:{i:0;s:14:"tablecell_open";i:1;a:3:{i:0;i:1;i:1;N;i:2;i:1;}i:2;i:840;}i:160;a:3:{i:0;s:5:"cdata";i:1;a:1:{i:0;s:8:" entrer ";}i:2;i:842;}i:161;a:3:{i:0;s:15:"tablecell_close";i:1;a:0:{}i:2;i:850;}i:162;a:3:{i:0;s:14:"tablecell_open";i:1;a:3:{i:0;i:1;i:1;N;i:2;i:1;}i:2;i:850;}i:163;a:3:{i:0;s:5:"cdata";i:1;a:1:{i:0;s:8:" entré ";}i:2;i:851;}i:164;a:3:{i:0;s:15:"tablecell_close";i:1;a:0:{}i:2;i:859;}i:165;a:3:{i:0;s:14:"tablerow_close";i:1;a:0:{}i:2;i:860;}i:166;a:3:{i:0;s:13:"tablerow_open";i:1;a:0:{}i:2;i:860;}i:167;a:3:{i:0;s:14:"tablecell_open";i:1;a:3:{i:0;i:1;i:1;N;i:2;i:1;}i:2;i:860;}i:168;a:3:{i:0;s:5:"cdata";i:1;a:1:{i:0;s:9:" rentrer ";}i:2;i:862;}i:169;a:3:{i:0;s:15:"tablecell_close";i:1;a:0:{}i:2;i:871;}i:170;a:3:{i:0;s:14:"tablecell_open";i:1;a:3:{i:0;i:1;i:1;N;i:2;i:1;}i:2;i:871;}i:171;a:3:{i:0;s:5:"cdata";i:1;a:1:{i:0;s:9:" rentré ";}i:2;i:872;}i:172;a:3:{i:0;s:15:"tablecell_close";i:1;a:0:{}i:2;i:881;}i:173;a:3:{i:0;s:14:"tablerow_close";i:1;a:0:{}i:2;i:882;}i:174;a:3:{i:0;s:13:"tablerow_open";i:1;a:0:{}i:2;i:882;}i:175;a:3:{i:0;s:14:"tablecell_open";i:1;a:3:{i:0;i:1;i:1;N;i:2;i:1;}i:2;i:882;}i:176;a:3:{i:0;s:5:"cdata";i:1;a:1:{i:0;s:8:" tomber ";}i:2;i:884;}i:177;a:3:{i:0;s:15:"tablecell_close";i:1;a:0:{}i:2;i:892;}i:178;a:3:{i:0;s:14:"tablecell_open";i:1;a:3:{i:0;i:1;i:1;N;i:2;i:1;}i:2;i:892;}i:179;a:3:{i:0;s:5:"cdata";i:1;a:1:{i:0;s:8:" tombé ";}i:2;i:893;}i:180;a:3:{i:0;s:15:"tablecell_close";i:1;a:0:{}i:2;i:901;}i:181;a:3:{i:0;s:14:"tablerow_close";i:1;a:0:{}i:2;i:902;}i:182;a:3:{i:0;s:13:"tablerow_open";i:1;a:0:{}i:2;i:902;}i:183;a:3:{i:0;s:14:"tablecell_open";i:1;a:3:{i:0;i:1;i:1;N;i:2;i:1;}i:2;i:902;}i:184;a:3:{i:0;s:5:"cdata";i:1;a:1:{i:0;s:8:" rester ";}i:2;i:904;}i:185;a:3:{i:0;s:15:"tablecell_close";i:1;a:0:{}i:2;i:912;}i:186;a:3:{i:0;s:14:"tablecell_open";i:1;a:3:{i:0;i:1;i:1;N;i:2;i:1;}i:2;i:912;}i:187;a:3:{i:0;s:5:"cdata";i:1;a:1:{i:0;s:8:" resté ";}i:2;i:913;}i:188;a:3:{i:0;s:15:"tablecell_close";i:1;a:0:{}i:2;i:921;}i:189;a:3:{i:0;s:14:"tablerow_close";i:1;a:0:{}i:2;i:922;}i:190;a:3:{i:0;s:13:"tablerow_open";i:1;a:0:{}i:2;i:922;}i:191;a:3:{i:0;s:14:"tablecell_open";i:1;a:3:{i:0;i:1;i:1;N;i:2;i:1;}i:2;i:922;}i:192;a:3:{i:0;s:5:"cdata";i:1;a:1:{i:0;s:7:" aller ";}i:2;i:924;}i:193;a:3:{i:0;s:15:"tablecell_close";i:1;a:0:{}i:2;i:931;}i:194;a:3:{i:0;s:14:"tablecell_open";i:1;a:3:{i:0;i:1;i:1;N;i:2;i:1;}i:2;i:931;}i:195;a:3:{i:0;s:5:"cdata";i:1;a:1:{i:0;s:7:" allé ";}i:2;i:932;}i:196;a:3:{i:0;s:15:"tablecell_close";i:1;a:0:{}i:2;i:939;}i:197;a:3:{i:0;s:14:"tablerow_close";i:1;a:0:{}i:2;i:940;}i:198;a:3:{i:0;s:13:"tablerow_open";i:1;a:0:{}i:2;i:940;}i:199;a:3:{i:0;s:14:"tablecell_open";i:1;a:3:{i:0;i:1;i:1;N;i:2;i:1;}i:2;i:940;}i:200;a:3:{i:0;s:5:"cdata";i:1;a:1:{i:0;s:8:" monter ";}i:2;i:942;}i:201;a:3:{i:0;s:15:"tablecell_close";i:1;a:0:{}i:2;i:950;}i:202;a:3:{i:0;s:14:"tablecell_open";i:1;a:3:{i:0;i:1;i:1;N;i:2;i:1;}i:2;i:950;}i:203;a:3:{i:0;s:5:"cdata";i:1;a:1:{i:0;s:8:" monté ";}i:2;i:951;}i:204;a:3:{i:0;s:15:"tablecell_close";i:1;a:0:{}i:2;i:959;}i:205;a:3:{i:0;s:14:"tablerow_close";i:1;a:0:{}i:2;i:960;}i:206;a:3:{i:0;s:13:"tablerow_open";i:1;a:0:{}i:2;i:960;}i:207;a:3:{i:0;s:14:"tablecell_open";i:1;a:3:{i:0;i:1;i:1;N;i:2;i:1;}i:2;i:960;}i:208;a:3:{i:0;s:5:"cdata";i:1;a:1:{i:0;s:8:" partir ";}i:2;i:962;}i:209;a:3:{i:0;s:15:"tablecell_close";i:1;a:0:{}i:2;i:970;}i:210;a:3:{i:0;s:14:"tablecell_open";i:1;a:3:{i:0;i:1;i:1;N;i:2;i:1;}i:2;i:970;}i:211;a:3:{i:0;s:5:"cdata";i:1;a:1:{i:0;s:7:" parti ";}i:2;i:971;}i:212;a:3:{i:0;s:15:"tablecell_close";i:1;a:0:{}i:2;i:978;}i:213;a:3:{i:0;s:14:"tablerow_close";i:1;a:0:{}i:2;i:979;}i:214;a:3:{i:0;s:13:"tablerow_open";i:1;a:0:{}i:2;i:979;}i:215;a:3:{i:0;s:14:"tablecell_open";i:1;a:3:{i:0;i:1;i:1;N;i:2;i:1;}i:2;i:979;}i:216;a:3:{i:0;s:5:"cdata";i:1;a:1:{i:0;s:7:" passe ";}i:2;i:981;}i:217;a:3:{i:0;s:15:"tablecell_close";i:1;a:0:{}i:2;i:988;}i:218;a:3:{i:0;s:14:"tablecell_open";i:1;a:3:{i:0;i:1;i:1;N;i:2;i:1;}i:2;i:988;}i:219;a:3:{i:0;s:5:"cdata";i:1;a:1:{i:0;s:8:" passé ";}i:2;i:989;}i:220;a:3:{i:0;s:15:"tablecell_close";i:1;a:0:{}i:2;i:997;}i:221;a:3:{i:0;s:14:"tablerow_close";i:1;a:0:{}i:2;i:998;}i:222;a:3:{i:0;s:11:"table_close";i:1;a:0:{}i:2;i:998;}i:223;a:2:{i:0;s:6:"plugin";i:1;a:4:{i:0;s:7:"uparrow";i:1;a:1:{i:0;s:42:"lib/plugins/uparrow/images/tango-small.png";}i:2;i:1;i:3;s:6:"~~UP~~";}}i:224;a:3:{i:0;s:13:"section_close";i:1;a:0:{}i:2;i:999;}i:225;a:3:{i:0;s:12:"section_edit";i:1;a:4:{i:0;i:560;i:1;i:0;i:2;i:2;i:3;s:48:"Verbes: conjugués avec être au passé composé";}i:2;i:999;}i:226;a:3:{i:0;s:12:"document_end";i:1;a:0:{}i:2;i:999;}}