a:93:{i:0;a:3:{i:0;s:14:"document_start";i:1;a:0:{}i:2;i:0;}i:1;a:3:{i:0;s:6:"p_open";i:1;a:0:{}i:2;i:0;}i:2;a:3:{i:0;s:7:"p_close";i:1;a:0:{}i:2;i:1;}i:3;a:3:{i:0;s:12:"section_edit";i:1;a:4:{i:0;i:-1;i:1;i:0;i:2;i:1;i:3;s:0:"";}i:2;i:1;}i:4;a:3:{i:0;s:6:"header";i:1;a:3:{i:0;s:8:"DokuWiki";i:1;i:1;i:2;i:1;}i:2;i:1;}i:5;a:3:{i:0;s:12:"section_open";i:1;a:1:{i:0;i:1;}i:2;i:1;}i:6;a:3:{i:0;s:6:"p_open";i:1;a:0:{}i:2;i:23;}i:7;a:3:{i:0;s:5:"cdata";i:1;a:1:{i:0;s:1:"
";}i:2;i:24;}i:8;a:3:{i:0;s:12:"externallink";i:1;a:2:{i:0;s:24:"http://www.dokuwiki.org/";i:1;s:8:"MainPage";}i:2;i:25;}i:9;a:3:{i:0;s:5:"cdata";i:1;a:1:{i:0;s:1:" ";}i:2;i:62;}i:10;a:3:{i:0;s:9:"linebreak";i:1;a:0:{}i:2;i:63;}i:11;a:3:{i:0;s:5:"cdata";i:1;a:1:{i:0;s:1:"
";}i:2;i:65;}i:12;a:3:{i:0;s:12:"externallink";i:1;a:2:{i:0;s:31:"http://www.dokuwiki.org/install";i:1;s:12:"Installation";}i:2;i:66;}i:13;a:3:{i:0;s:5:"cdata";i:1;a:1:{i:0;s:1:" ";}i:2;i:114;}i:14;a:3:{i:0;s:9:"linebreak";i:1;a:0:{}i:2;i:115;}i:15;a:3:{i:0;s:7:"p_close";i:1;a:0:{}i:2;i:117;}i:16;a:3:{i:0;s:10:"listu_open";i:1;a:0:{}i:2;i:117;}i:17;a:3:{i:0;s:13:"listitem_open";i:1;a:1:{i:0;i:1;}i:2;i:117;}i:18;a:3:{i:0;s:16:"listcontent_open";i:1;a:0:{}i:2;i:117;}i:19;a:3:{i:0;s:5:"cdata";i:1;a:1:{i:0;s:71:" Hint: in order to copy the doku to your server you can use scp or sftp";}i:2;i:121;}i:20;a:3:{i:0;s:17:"listcontent_close";i:1;a:0:{}i:2;i:192;}i:21;a:3:{i:0;s:14:"listitem_close";i:1;a:0:{}i:2;i:192;}i:22;a:3:{i:0;s:11:"listu_close";i:1;a:0:{}i:2;i:192;}i:23;a:3:{i:0;s:6:"p_open";i:1;a:0:{}i:2;i:192;}i:24;a:3:{i:0;s:12:"externallink";i:1;a:2:{i:0;s:32:"http://www.dokuwiki.org/security";i:1;s:8:"Security";}i:2;i:193;}i:25;a:3:{i:0;s:5:"cdata";i:1;a:1:{i:0;s:1:" ";}i:2;i:238;}i:26;a:3:{i:0;s:9:"linebreak";i:1;a:0:{}i:2;i:239;}i:27;a:3:{i:0;s:7:"p_close";i:1;a:0:{}i:2;i:241;}i:28;a:3:{i:0;s:10:"listu_open";i:1;a:0:{}i:2;i:241;}i:29;a:3:{i:0;s:13:"listitem_open";i:1;a:1:{i:0;i:1;}i:2;i:241;}i:30;a:3:{i:0;s:16:"listcontent_open";i:1;a:0:{}i:2;i:241;}i:31;a:3:{i:0;s:5:"cdata";i:1;a:1:{i:0;s:66:" Hint: you can use sftp to recursively change the file permissions";}i:2;i:245;}i:32;a:3:{i:0;s:17:"listcontent_close";i:1;a:0:{}i:2;i:311;}i:33;a:3:{i:0;s:14:"listitem_close";i:1;a:0:{}i:2;i:311;}i:34;a:3:{i:0;s:11:"listu_close";i:1;a:0:{}i:2;i:311;}i:35;a:3:{i:0;s:6:"p_open";i:1;a:0:{}i:2;i:311;}i:36;a:3:{i:0;s:12:"externallink";i:1;a:2:{i:0;s:31:"http://www.dokuwiki.org/plugins";i:1;s:7:"Plugins";}i:2;i:312;}i:37;a:3:{i:0;s:5:"cdata";i:1;a:1:{i:0;s:1:" ";}i:2;i:355;}i:38;a:3:{i:0;s:9:"linebreak";i:1;a:0:{}i:2;i:356;}i:39;a:3:{i:0;s:5:"cdata";i:1;a:1:{i:0;s:1:"
";}i:2;i:358;}i:40;a:3:{i:0;s:12:"externallink";i:1;a:2:{i:0;s:32:"http://www.dokuwiki.org/template";i:1;s:9:"Templates";}i:2;i:359;}i:41;a:3:{i:0;s:5:"cdata";i:1;a:1:{i:0;s:1:" ";}i:2;i:405;}i:42;a:3:{i:0;s:9:"linebreak";i:1;a:0:{}i:2;i:406;}i:43;a:3:{i:0;s:5:"cdata";i:1;a:1:{i:0;s:1:"
";}i:2;i:408;}i:44;a:3:{i:0;s:6:"plugin";i:1;a:4:{i:0;s:11:"htmlcomment";i:1;a:2:{i:0;i:5;i:1;s:7:" [[|]] ";}i:2;i:5;i:3;s:14:"<!-- [[|]] -->";}i:2;i:409;}i:45;a:3:{i:0;s:7:"p_close";i:1;a:0:{}i:2;i:423;}i:46;a:3:{i:0;s:13:"section_close";i:1;a:0:{}i:2;i:425;}i:47;a:3:{i:0;s:12:"section_edit";i:1;a:4:{i:0;i:1;i:1;i:424;i:2;i:1;i:3;s:8:"DokuWiki";}i:2;i:425;}i:48;a:3:{i:0;s:6:"header";i:1;a:3:{i:0;s:12:"Nice Plugins";i:1;i:2;i:2;i:425;}i:2;i:425;}i:49;a:3:{i:0;s:12:"section_open";i:1;a:1:{i:0;i:2;}i:2;i:425;}i:50;a:3:{i:0;s:6:"p_open";i:1;a:0:{}i:2;i:449;}i:51;a:3:{i:0;s:5:"cdata";i:1;a:1:{i:0;s:1:"
";}i:2;i:450;}i:52;a:3:{i:0;s:12:"externallink";i:1;a:2:{i:0;s:46:"http://www.dokuwiki.org/plugin:googleanalytics";i:1;s:16:"Google Analytics";}i:2;i:451;}i:53;a:3:{i:0;s:5:"cdata";i:1;a:1:{i:0;s:1:" ";}i:2;i:518;}i:54;a:3:{i:0;s:9:"linebreak";i:1;a:0:{}i:2;i:519;}i:55;a:3:{i:0;s:5:"cdata";i:1;a:1:{i:0;s:1:"
";}i:2;i:521;}i:56;a:3:{i:0;s:12:"externallink";i:1;a:2:{i:0;s:42:"http://www.dokuwiki.org/plugin:htmlcomment";i:1;s:12:"Html Comment";}i:2;i:522;}i:57;a:3:{i:0;s:5:"cdata";i:1;a:1:{i:0;s:1:" ";}i:2;i:581;}i:58;a:3:{i:0;s:9:"linebreak";i:1;a:0:{}i:2;i:582;}i:59;a:3:{i:0;s:5:"cdata";i:1;a:1:{i:0;s:1:"
";}i:2;i:584;}i:60;a:3:{i:0;s:12:"externallink";i:1;a:2:{i:0;s:38:"http://www.dokuwiki.org/plugin:changes";i:1;s:7:"Changes";}i:2;i:585;}i:61;a:3:{i:0;s:5:"cdata";i:1;a:1:{i:0;s:1:" ";}i:2;i:635;}i:62;a:3:{i:0;s:9:"linebreak";i:1;a:0:{}i:2;i:636;}i:63;a:3:{i:0;s:5:"cdata";i:1;a:1:{i:0;s:1:"
";}i:2;i:638;}i:64;a:3:{i:0;s:12:"externallink";i:1;a:2:{i:0;s:40:"http://www.dokuwiki.org/plugin:indexmenu";i:1;s:10:"Index Menu";}i:2;i:639;}i:65;a:3:{i:0;s:5:"cdata";i:1;a:1:{i:0;s:1:" ";}i:2;i:694;}i:66;a:3:{i:0;s:9:"linebreak";i:1;a:0:{}i:2;i:695;}i:67;a:3:{i:0;s:5:"cdata";i:1;a:1:{i:0;s:1:"
";}i:2;i:697;}i:68;a:3:{i:0;s:12:"externallink";i:1;a:2:{i:0;s:36:"http://www.dokuwiki.org/plugin:clock";i:1;s:5:"Clock";}i:2;i:698;}i:69;a:3:{i:0;s:5:"cdata";i:1;a:1:{i:0;s:1:" ";}i:2;i:744;}i:70;a:3:{i:0;s:9:"linebreak";i:1;a:0:{}i:2;i:745;}i:71;a:3:{i:0;s:5:"cdata";i:1;a:1:{i:0;s:1:"
";}i:2;i:747;}i:72;a:3:{i:0;s:6:"plugin";i:1;a:4:{i:0;s:11:"htmlcomment";i:1;a:2:{i:0;i:5;i:1;s:7:" [[|]] ";}i:2;i:5;i:3;s:14:"<!-- [[|]] -->";}i:2;i:748;}i:73;a:3:{i:0;s:7:"p_close";i:1;a:0:{}i:2;i:762;}i:74;a:3:{i:0;s:13:"section_close";i:1;a:0:{}i:2;i:764;}i:75;a:3:{i:0;s:12:"section_edit";i:1;a:4:{i:0;i:425;i:1;i:763;i:2;i:2;i:3;s:12:"Nice Plugins";}i:2;i:764;}i:76;a:3:{i:0;s:6:"header";i:1;a:3:{i:0;s:14:"Nice Templates";i:1;i:2;i:2;i:764;}i:2;i:764;}i:77;a:3:{i:0;s:12:"section_open";i:1;a:1:{i:0;i:2;}i:2;i:764;}i:78;a:3:{i:0;s:6:"p_open";i:1;a:0:{}i:2;i:790;}i:79;a:3:{i:0;s:5:"cdata";i:1;a:1:{i:0;s:1:"
";}i:2;i:791;}i:80;a:3:{i:0;s:12:"externallink";i:1;a:2:{i:0;s:40:"http://www.dokuwiki.org/template:sidebar";i:1;s:7:"Sidebar";}i:2;i:792;}i:81;a:3:{i:0;s:5:"cdata";i:1;a:1:{i:0;s:1:" ";}i:2;i:844;}i:82;a:3:{i:0;s:9:"linebreak";i:1;a:0:{}i:2;i:845;}i:83;a:3:{i:0;s:5:"cdata";i:1;a:1:{i:0;s:1:"
";}i:2;i:847;}i:84;a:3:{i:0;s:12:"externallink";i:1;a:2:{i:0;s:42:"http://www.dokuwiki.org/template:freechred";i:1;s:9:"Freechred";}i:2;i:848;}i:85;a:3:{i:0;s:5:"cdata";i:1;a:1:{i:0;s:1:" ";}i:2;i:904;}i:86;a:3:{i:0;s:9:"linebreak";i:1;a:0:{}i:2;i:905;}i:87;a:3:{i:0;s:5:"cdata";i:1;a:1:{i:0;s:1:"
";}i:2;i:907;}i:88;a:3:{i:0;s:6:"plugin";i:1;a:4:{i:0;s:11:"htmlcomment";i:1;a:2:{i:0;i:5;i:1;s:7:" [[|]] ";}i:2;i:5;i:3;s:14:"<!-- [[|]] -->";}i:2;i:908;}i:89;a:3:{i:0;s:7:"p_close";i:1;a:0:{}i:2;i:922;}i:90;a:3:{i:0;s:13:"section_close";i:1;a:0:{}i:2;i:923;}i:91;a:3:{i:0;s:12:"section_edit";i:1;a:4:{i:0;i:764;i:1;i:0;i:2;i:2;i:3;s:14:"Nice Templates";}i:2;i:923;}i:92;a:3:{i:0;s:12:"document_end";i:1;a:0:{}i:2;i:923;}}