a:167:{i:0;a:3:{i:0;s:14:"document_start";i:1;a:0:{}i:2;i:0;}i:1;a:3:{i:0;s:6:"p_open";i:1;a:0:{}i:2;i:0;}i:2;a:3:{i:0;s:7:"p_close";i:1;a:0:{}i:2;i:1;}i:3;a:3:{i:0;s:12:"section_edit";i:1;a:4:{i:0;i:-1;i:1;i:0;i:2;i:1;i:3;s:0:"";}i:2;i:1;}i:4;a:3:{i:0;s:6:"header";i:1;a:3:{i:0;s:3:"Vim";i:1;i:1;i:2;i:1;}i:2;i:1;}i:5;a:3:{i:0;s:12:"section_open";i:1;a:1:{i:0;i:1;}i:2;i:1;}i:6;a:3:{i:0;s:6:"p_open";i:1;a:0:{}i:2;i:18;}i:7;a:3:{i:0;s:5:"cdata";i:1;a:1:{i:0;s:1:"
";}i:2;i:19;}i:8;a:3:{i:0;s:13:"interwikilink";i:1;a:4:{i:0;s:6:"wp>Vim";i:1;N;i:2;s:2:"wp";i:3;s:3:"Vim";}i:2;i:20;}i:9;a:3:{i:0;s:5:"cdata";i:1;a:1:{i:0;s:128:" is an wonderful editor. You have to spent some time to get used to this, but since then you will gain much more in produtivity.";}i:2;i:30;}i:10;a:3:{i:0;s:7:"p_close";i:1;a:0:{}i:2;i:158;}i:11;a:2:{i:0;s:6:"plugin";i:1;a:4:{i:0;s:7:"uparrow";i:1;a:1:{i:0;s:42:"lib/plugins/uparrow/images/tango-small.png";}i:2;i:1;i:3;s:6:"~~UP~~";}}i:12;a:3:{i:0;s:13:"section_close";i:1;a:0:{}i:2;i:160;}i:13;a:3:{i:0;s:12:"section_edit";i:1;a:4:{i:0;i:1;i:1;i:159;i:2;i:1;i:3;s:3:"Vim";}i:2;i:160;}i:14;a:3:{i:0;s:6:"header";i:1;a:3:{i:0;s:31:"How to change vim configuration";i:1;i:2;i:2;i:160;}i:2;i:160;}i:15;a:3:{i:0;s:12:"section_open";i:1;a:1:{i:0;i:2;}i:2;i:160;}i:16;a:3:{i:0;s:6:"p_open";i:1;a:0:{}i:2;i:203;}i:17;a:3:{i:0;s:5:"cdata";i:1;a:1:{i:0;s:226:"
The file ~/.vimrc is read and executed every time you open vim. So if you want that a configuration change (like set number) to be true the next time you open vim, you must append it to the ~/.vimrc. Here is an example code: ";}i:2;i:204;}i:18;a:3:{i:0;s:7:"p_close";i:1;a:0:{}i:2;i:430;}i:19;a:3:{i:0;s:4:"code";i:1;a:3:{i:0;s:54:"
# append to ~/.vimrc
$ echo 'set number' >> ~/.vimrc
";i:1;s:4:"bash";i:2;N;}i:2;i:437;}i:20;a:2:{i:0;s:6:"plugin";i:1;a:4:{i:0;s:7:"uparrow";i:1;a:1:{i:0;s:42:"lib/plugins/uparrow/images/tango-small.png";}i:2;i:1;i:3;s:6:"~~UP~~";}}i:21;a:3:{i:0;s:13:"section_close";i:1;a:0:{}i:2;i:506;}i:22;a:3:{i:0;s:12:"section_edit";i:1;a:4:{i:0;i:160;i:1;i:505;i:2;i:2;i:3;s:31:"How to change vim configuration";}i:2;i:506;}i:23;a:3:{i:0;s:6:"header";i:1;a:3:{i:0;s:25:"Useful Vim Configurations";i:1;i:2;i:2;i:506;}i:2;i:506;}i:24;a:3:{i:0;s:12:"section_open";i:1;a:1:{i:0;i:2;}i:2;i:506;}i:25;a:3:{i:0;s:6:"p_open";i:1;a:0:{}i:2;i:543;}i:26;a:3:{i:0;s:5:"cdata";i:1;a:1:{i:0;s:13:"
Download my ";}i:2;i:544;}i:27;a:3:{i:0;s:12:"externallink";i:1;a:2:{i:0;s:42:"http://www.inf.ufrgs.br/~kssilveira/.vimrc";i:1;s:6:".vimrc";}i:2;i:557;}i:28;a:3:{i:0;s:5:"cdata";i:1;a:1:{i:0;s:27:" file and do the following:";}i:2;i:610;}i:29;a:3:{i:0;s:7:"p_close";i:1;a:0:{}i:2;i:637;}i:30;a:3:{i:0;s:4:"code";i:1;a:3:{i:0;s:84:"
# append to ~/.vimrc
$ echo ':source path/to/my/vimrc/file/on/your/pc' >> ~/.vimrc
";i:1;s:4:"bash";i:2;N;}i:2;i:644;}i:31;a:3:{i:0;s:6:"p_open";i:1;a:0:{}i:2;i:741;}i:32;a:3:{i:0;s:5:"cdata";i:1;a:1:{i:0;s:49:"This loads my .vimrc file everytime you open Vim.";}i:2;i:743;}i:33;a:3:{i:0;s:7:"p_close";i:1;a:0:{}i:2;i:792;}i:34;a:3:{i:0;s:6:"p_open";i:1;a:0:{}i:2;i:792;}i:35;a:3:{i:0;s:5:"cdata";i:1;a:1:{i:0;s:41:"These are the extra configurations I use:";}i:2;i:794;}i:36;a:3:{i:0;s:7:"p_close";i:1;a:0:{}i:2;i:835;}i:37;a:3:{i:0;s:4:"file";i:1;a:3:{i:0;s:698:"
" show line numbers
set number 
" incremental search
set incsearch
" auto indentation
set autoindent
" tab size
set tabstop=2
" indentation size (used on auto indentation)
set shiftwidth=2
" smart indentation (indent beginning of blocks (e.g. '{') and unnindent ending of blocks (e.g. '}'))
set smartindent
" save with Ctrl+S
	map! <C-s> <Esc>:w<CR>
	map  <C-s> <Esc>:w<CR>
" call make with F9
	map! <F9> <Esc>:make<CR><CR>
	map  <F9> <Esc>:make<CR><CR>
" auto save files
set autowrite
set autowriteall
" abreviations
	iab #i #include
	iab #d #define
" reload file automatically when it changes
set autoread
" call make -B with F8
	map! <F8> <Esc>:make -B<CR><CR>
	map  <F8> <Esc>:make -B<CR><CR>
";i:1;s:3:"vim";i:2;s:6:".vimrc";}i:2;i:842;}i:38;a:3:{i:0;s:6:"p_open";i:1;a:0:{}i:2;i:1559;}i:39;a:3:{i:0;s:5:"cdata";i:1;a:1:{i:0;s:93:"If the save with Ctrl+S isn't working, maybe you have to change your bash configuration (see ";}i:2;i:1561;}i:40;a:3:{i:0;s:12:"internallink";i:1;a:2:{i:0;s:4:"Bash";i:1;N;}i:2;i:1654;}i:41;a:3:{i:0;s:5:"cdata";i:1;a:1:{i:0;s:2:").";}i:2;i:1662;}i:42;a:3:{i:0;s:7:"p_close";i:1;a:0:{}i:2;i:1664;}i:43;a:2:{i:0;s:6:"plugin";i:1;a:4:{i:0;s:7:"uparrow";i:1;a:1:{i:0;s:42:"lib/plugins/uparrow/images/tango-small.png";}i:2;i:1;i:3;s:6:"~~UP~~";}}i:44;a:3:{i:0;s:13:"section_close";i:1;a:0:{}i:2;i:1666;}i:45;a:3:{i:0;s:12:"section_edit";i:1;a:4:{i:0;i:506;i:1;i:1665;i:2;i:2;i:3;s:25:"Useful Vim Configurations";}i:2;i:1666;}i:46;a:3:{i:0;s:6:"header";i:1;a:3:{i:0;s:8:"Commands";i:1;i:2;i:2;i:1666;}i:2;i:1666;}i:47;a:3:{i:0;s:12:"section_open";i:1;a:1:{i:0;i:2;}i:2;i:1666;}i:48;a:3:{i:0;s:6:"p_open";i:1;a:0:{}i:2;i:1686;}i:49;a:3:{i:0;s:5:"cdata";i:1;a:1:{i:0;s:1:"
";}i:2;i:1687;}i:50;a:3:{i:0;s:12:"internallink";i:1;a:2:{i:0;s:13:"vim::commands";i:1;s:12:"Vim Commands";}i:2;i:1688;}i:51;a:3:{i:0;s:7:"p_close";i:1;a:0:{}i:2;i:1718;}i:52;a:2:{i:0;s:6:"plugin";i:1;a:4:{i:0;s:7:"uparrow";i:1;a:1:{i:0;s:42:"lib/plugins/uparrow/images/tango-small.png";}i:2;i:1;i:3;s:6:"~~UP~~";}}i:53;a:3:{i:0;s:13:"section_close";i:1;a:0:{}i:2;i:1720;}i:54;a:3:{i:0;s:12:"section_edit";i:1;a:4:{i:0;i:1666;i:1;i:1719;i:2;i:2;i:3;s:8:"Commands";}i:2;i:1720;}i:55;a:3:{i:0;s:6:"header";i:1;a:3:{i:0;s:26:"Edit-Compile-Execute Cycle";i:1;i:2;i:2;i:1720;}i:2;i:1720;}i:56;a:3:{i:0;s:12:"section_open";i:1;a:1:{i:0;i:2;}i:2;i:1720;}i:57;a:3:{i:0;s:10:"table_open";i:1;a:2:{i:0;i:2;i:1;i:14;}i:2;i:1758;}i:58;a:3:{i:0;s:13:"tablerow_open";i:1;a:0:{}i:2;i:1758;}i:59;a:3:{i:0;s:16:"tableheader_open";i:1;a:3:{i:0;i:2;i:1;s:4:"left";i:2;i:1;}i:2;i:1758;}i:60;a:3:{i:0;s:5:"cdata";i:1;a:1:{i:0;s:10:" Session  ";}i:2;i:1760;}i:61;a:3:{i:0;s:17:"tableheader_close";i:1;a:0:{}i:2;i:1770;}i:62;a:3:{i:0;s:14:"tablerow_close";i:1;a:0:{}i:2;i:1772;}i:63;a:3:{i:0;s:13:"tablerow_open";i:1;a:0:{}i:2;i:1772;}i:64;a:3:{i:0;s:14:"tablecell_open";i:1;a:3:{i:0;i:1;i:1;N;i:2;i:1;}i:2;i:1772;}i:65;a:3:{i:0;s:5:"cdata";i:1;a:1:{i:0;s:14:" :mks(ession) ";}i:2;i:1774;}i:66;a:3:{i:0;s:15:"tablecell_close";i:1;a:0:{}i:2;i:1788;}i:67;a:3:{i:0;s:14:"tablecell_open";i:1;a:3:{i:0;i:1;i:1;N;i:2;i:1;}i:2;i:1788;}i:68;a:3:{i:0;s:5:"cdata";i:1;a:1:{i:0;s:23:" create a session file ";}i:2;i:1789;}i:69;a:3:{i:0;s:15:"tablecell_close";i:1;a:0:{}i:2;i:1812;}i:70;a:3:{i:0;s:14:"tablerow_close";i:1;a:0:{}i:2;i:1813;}i:71;a:3:{i:0;s:13:"tablerow_open";i:1;a:0:{}i:2;i:1813;}i:72;a:3:{i:0;s:14:"tablecell_open";i:1;a:3:{i:0;i:1;i:1;N;i:2;i:1;}i:2;i:1813;}i:73;a:3:{i:0;s:5:"cdata";i:1;a:1:{i:0;s:8:" vim -S ";}i:2;i:1815;}i:74;a:3:{i:0;s:15:"tablecell_close";i:1;a:0:{}i:2;i:1823;}i:75;a:3:{i:0;s:14:"tablecell_open";i:1;a:3:{i:0;i:1;i:1;N;i:2;i:1;}i:2;i:1823;}i:76;a:3:{i:0;s:5:"cdata";i:1;a:1:{i:0;s:21:" load a session file ";}i:2;i:1824;}i:77;a:3:{i:0;s:15:"tablecell_close";i:1;a:0:{}i:2;i:1845;}i:78;a:3:{i:0;s:14:"tablerow_close";i:1;a:0:{}i:2;i:1846;}i:79;a:3:{i:0;s:13:"tablerow_open";i:1;a:0:{}i:2;i:1846;}i:80;a:3:{i:0;s:16:"tableheader_open";i:1;a:3:{i:0;i:2;i:1;s:4:"left";i:2;i:1;}i:2;i:1846;}i:81;a:3:{i:0;s:5:"cdata";i:1;a:1:{i:0;s:7:" Make  ";}i:2;i:1848;}i:82;a:3:{i:0;s:17:"tableheader_close";i:1;a:0:{}i:2;i:1855;}i:83;a:3:{i:0;s:14:"tablerow_close";i:1;a:0:{}i:2;i:1857;}i:84;a:3:{i:0;s:13:"tablerow_open";i:1;a:0:{}i:2;i:1857;}i:85;a:3:{i:0;s:14:"tablecell_open";i:1;a:3:{i:0;i:1;i:1;N;i:2;i:1;}i:2;i:1857;}i:86;a:3:{i:0;s:5:"cdata";i:1;a:1:{i:0;s:9:" :mak(e) ";}i:2;i:1859;}i:87;a:3:{i:0;s:15:"tablecell_close";i:1;a:0:{}i:2;i:1868;}i:88;a:3:{i:0;s:14:"tablecell_open";i:1;a:3:{i:0;i:1;i:1;N;i:2;i:1;}i:2;i:1868;}i:89;a:3:{i:0;s:5:"cdata";i:1;a:1:{i:0;s:10:" run make ";}i:2;i:1869;}i:90;a:3:{i:0;s:15:"tablecell_close";i:1;a:0:{}i:2;i:1879;}i:91;a:3:{i:0;s:14:"tablerow_close";i:1;a:0:{}i:2;i:1880;}i:92;a:3:{i:0;s:13:"tablerow_open";i:1;a:0:{}i:2;i:1880;}i:93;a:3:{i:0;s:14:"tablecell_open";i:1;a:3:{i:0;i:1;i:1;N;i:2;i:1;}i:2;i:1880;}i:94;a:3:{i:0;s:5:"cdata";i:1;a:1:{i:0;s:10:" :cl(ist) ";}i:2;i:1882;}i:95;a:3:{i:0;s:15:"tablecell_close";i:1;a:0:{}i:2;i:1892;}i:96;a:3:{i:0;s:14:"tablecell_open";i:1;a:3:{i:0;i:1;i:1;N;i:2;i:1;}i:2;i:1892;}i:97;a:3:{i:0;s:5:"cdata";i:1;a:1:{i:0;s:18:" show make output ";}i:2;i:1893;}i:98;a:3:{i:0;s:15:"tablecell_close";i:1;a:0:{}i:2;i:1911;}i:99;a:3:{i:0;s:14:"tablerow_close";i:1;a:0:{}i:2;i:1912;}i:100;a:3:{i:0;s:13:"tablerow_open";i:1;a:0:{}i:2;i:1912;}i:101;a:3:{i:0;s:14:"tablecell_open";i:1;a:3:{i:0;i:1;i:1;N;i:2;i:1;}i:2;i:1912;}i:102;a:3:{i:0;s:5:"cdata";i:1;a:1:{i:0;s:10:" :cope(n) ";}i:2;i:1914;}i:103;a:3:{i:0;s:15:"tablecell_close";i:1;a:0:{}i:2;i:1924;}i:104;a:3:{i:0;s:14:"tablecell_open";i:1;a:3:{i:0;i:1;i:1;N;i:2;i:1;}i:2;i:1924;}i:105;a:3:{i:0;s:5:"cdata";i:1;a:1:{i:0;s:32:" open a window with make output ";}i:2;i:1925;}i:106;a:3:{i:0;s:15:"tablecell_close";i:1;a:0:{}i:2;i:1957;}i:107;a:3:{i:0;s:14:"tablerow_close";i:1;a:0:{}i:2;i:1958;}i:108;a:3:{i:0;s:13:"tablerow_open";i:1;a:0:{}i:2;i:1958;}i:109;a:3:{i:0;s:14:"tablecell_open";i:1;a:3:{i:0;i:1;i:1;N;i:2;i:1;}i:2;i:1958;}i:110;a:3:{i:0;s:5:"cdata";i:1;a:1:{i:0;s:10:" :cn(ext) ";}i:2;i:1960;}i:111;a:3:{i:0;s:15:"tablecell_close";i:1;a:0:{}i:2;i:1970;}i:112;a:3:{i:0;s:14:"tablecell_open";i:1;a:3:{i:0;i:1;i:1;N;i:2;i:1;}i:2;i:1970;}i:113;a:3:{i:0;s:5:"cdata";i:1;a:1:{i:0;s:18:" go to next error ";}i:2;i:1971;}i:114;a:3:{i:0;s:15:"tablecell_close";i:1;a:0:{}i:2;i:1989;}i:115;a:3:{i:0;s:14:"tablerow_close";i:1;a:0:{}i:2;i:1990;}i:116;a:3:{i:0;s:13:"tablerow_open";i:1;a:0:{}i:2;i:1990;}i:117;a:3:{i:0;s:14:"tablecell_open";i:1;a:3:{i:0;i:1;i:1;N;i:2;i:1;}i:2;i:1990;}i:118;a:3:{i:0;s:5:"cdata";i:1;a:1:{i:0;s:14:" :cp(revious) ";}i:2;i:1992;}i:119;a:3:{i:0;s:15:"tablecell_close";i:1;a:0:{}i:2;i:2006;}i:120;a:3:{i:0;s:14:"tablecell_open";i:1;a:3:{i:0;i:1;i:1;N;i:2;i:1;}i:2;i:2006;}i:121;a:3:{i:0;s:5:"cdata";i:1;a:1:{i:0;s:22:" go to previous error ";}i:2;i:2007;}i:122;a:3:{i:0;s:15:"tablecell_close";i:1;a:0:{}i:2;i:2029;}i:123;a:3:{i:0;s:14:"tablerow_close";i:1;a:0:{}i:2;i:2030;}i:124;a:3:{i:0;s:13:"tablerow_open";i:1;a:0:{}i:2;i:2030;}i:125;a:3:{i:0;s:14:"tablecell_open";i:1;a:3:{i:0;i:1;i:1;N;i:2;i:1;}i:2;i:2030;}i:126;a:3:{i:0;s:5:"cdata";i:1;a:1:{i:0;s:5:" :cc ";}i:2;i:2032;}i:127;a:3:{i:0;s:15:"tablecell_close";i:1;a:0:{}i:2;i:2037;}i:128;a:3:{i:0;s:14:"tablecell_open";i:1;a:3:{i:0;i:1;i:1;N;i:2;i:1;}i:2;i:2037;}i:129;a:3:{i:0;s:5:"cdata";i:1;a:1:{i:0;s:21:" go to current error ";}i:2;i:2038;}i:130;a:3:{i:0;s:15:"tablecell_close";i:1;a:0:{}i:2;i:2059;}i:131;a:3:{i:0;s:14:"tablerow_close";i:1;a:0:{}i:2;i:2060;}i:132;a:3:{i:0;s:13:"tablerow_open";i:1;a:0:{}i:2;i:2060;}i:133;a:3:{i:0;s:14:"tablecell_open";i:1;a:3:{i:0;i:1;i:1;N;i:2;i:1;}i:2;i:2060;}i:134;a:3:{i:0;s:5:"cdata";i:1;a:1:{i:0;s:11:" :ccl(ose) ";}i:2;i:2062;}i:135;a:3:{i:0;s:15:"tablecell_close";i:1;a:0:{}i:2;i:2073;}i:136;a:3:{i:0;s:14:"tablecell_open";i:1;a:3:{i:0;i:1;i:1;N;i:2;i:1;}i:2;i:2073;}i:137;a:3:{i:0;s:5:"cdata";i:1;a:1:{i:0;s:35:" close the window with make output ";}i:2;i:2074;}i:138;a:3:{i:0;s:15:"tablecell_close";i:1;a:0:{}i:2;i:2109;}i:139;a:3:{i:0;s:14:"tablerow_close";i:1;a:0:{}i:2;i:2110;}i:140;a:3:{i:0;s:13:"tablerow_open";i:1;a:0:{}i:2;i:2110;}i:141;a:3:{i:0;s:16:"tableheader_open";i:1;a:3:{i:0;i:2;i:1;s:4:"left";i:2;i:1;}i:2;i:2110;}i:142;a:3:{i:0;s:5:"cdata";i:1;a:1:{i:0;s:9:" Motion  ";}i:2;i:2112;}i:143;a:3:{i:0;s:17:"tableheader_close";i:1;a:0:{}i:2;i:2121;}i:144;a:3:{i:0;s:14:"tablerow_close";i:1;a:0:{}i:2;i:2123;}i:145;a:3:{i:0;s:13:"tablerow_open";i:1;a:0:{}i:2;i:2123;}i:146;a:3:{i:0;s:14:"tablecell_open";i:1;a:3:{i:0;i:1;i:1;N;i:2;i:1;}i:2;i:2123;}i:147;a:3:{i:0;s:5:"cdata";i:1;a:1:{i:0;s:8:" Ctrl+O ";}i:2;i:2125;}i:148;a:3:{i:0;s:15:"tablecell_close";i:1;a:0:{}i:2;i:2133;}i:149;a:3:{i:0;s:14:"tablecell_open";i:1;a:3:{i:0;i:1;i:1;N;i:2;i:1;}i:2;i:2133;}i:150;a:3:{i:0;s:5:"cdata";i:1;a:1:{i:0;s:24:" go to previous edition ";}i:2;i:2134;}i:151;a:3:{i:0;s:15:"tablecell_close";i:1;a:0:{}i:2;i:2158;}i:152;a:3:{i:0;s:14:"tablerow_close";i:1;a:0:{}i:2;i:2159;}i:153;a:3:{i:0;s:13:"tablerow_open";i:1;a:0:{}i:2;i:2159;}i:154;a:3:{i:0;s:14:"tablecell_open";i:1;a:3:{i:0;i:1;i:1;N;i:2;i:1;}i:2;i:2159;}i:155;a:3:{i:0;s:5:"cdata";i:1;a:1:{i:0;s:8:" Ctrl+I ";}i:2;i:2161;}i:156;a:3:{i:0;s:15:"tablecell_close";i:1;a:0:{}i:2;i:2169;}i:157;a:3:{i:0;s:14:"tablecell_open";i:1;a:3:{i:0;i:1;i:1;N;i:2;i:1;}i:2;i:2169;}i:158;a:3:{i:0;s:5:"cdata";i:1;a:1:{i:0;s:20:" go to next edition ";}i:2;i:2170;}i:159;a:3:{i:0;s:15:"tablecell_close";i:1;a:0:{}i:2;i:2190;}i:160;a:3:{i:0;s:14:"tablerow_close";i:1;a:0:{}i:2;i:2191;}i:161;a:3:{i:0;s:11:"table_close";i:1;a:0:{}i:2;i:2191;}i:162;a:3:{i:0;s:6:"plugin";i:1;a:4:{i:0;s:7:"tag_tag";i:1;a:1:{i:0;s:11:"programming";}i:2;i:5;i:3;s:19:"{{tag>programming}}";}i:2;i:2193;}i:163;a:2:{i:0;s:6:"plugin";i:1;a:4:{i:0;s:7:"uparrow";i:1;a:1:{i:0;s:42:"lib/plugins/uparrow/images/tango-small.png";}i:2;i:1;i:3;s:6:"~~UP~~";}}i:164;a:3:{i:0;s:13:"section_close";i:1;a:0:{}i:2;i:2212;}i:165;a:3:{i:0;s:12:"section_edit";i:1;a:4:{i:0;i:1720;i:1;i:0;i:2;i:2;i:3;s:26:"Edit-Compile-Execute Cycle";}i:2;i:2212;}i:166;a:3:{i:0;s:12:"document_end";i:1;a:0:{}i:2;i:2212;}}