a:41:{i:0;a:3:{i:0;s:14:"document_start";i:1;a:0:{}i:2;i:0;}i:1;a:3:{i:0;s:6:"p_open";i:1;a:0:{}i:2;i:0;}i:2;a:3:{i:0;s:5:"cdata";i:1;a:1:{i:0;s:1:"
";}i:2;i:1;}i:3;a:3:{i:0;s:7:"p_close";i:1;a:0:{}i:2;i:2;}i:4;a:3:{i:0;s:12:"section_edit";i:1;a:4:{i:0;i:-1;i:1;i:1;i:2;i:1;i:3;s:0:"";}i:2;i:2;}i:5;a:3:{i:0;s:6:"header";i:1;a:3:{i:0;s:5:"Books";i:1;i:1;i:2;i:2;}i:2;i:2;}i:6;a:3:{i:0;s:12:"section_open";i:1;a:1:{i:0;i:1;}i:2;i:2;}i:7;a:3:{i:0;s:6:"p_open";i:1;a:0:{}i:2;i:21;}i:8;a:3:{i:0;s:5:"cdata";i:1;a:1:{i:0;s:1:"
";}i:2;i:22;}i:9;a:3:{i:0;s:12:"externallink";i:1;a:2:{i:0;s:28:"http://gog.gateit.net/books/";i:1;s:12:" 2500+ books";}i:2;i:23;}i:10;a:3:{i:0;s:5:"cdata";i:1;a:1:{i:0;s:1:" ";}i:2;i:68;}i:11;a:3:{i:0;s:9:"linebreak";i:1;a:0:{}i:2;i:69;}i:12;a:3:{i:0;s:5:"cdata";i:1;a:1:{i:0;s:1:"
";}i:2;i:71;}i:13;a:3:{i:0;s:12:"externallink";i:1;a:2:{i:0;s:240:"http://www.google.com.br/url?sa=t&source=web&ct=res&cd=16&ved=0CCcQFjAFOAo&url=http%3A%2F%2Furanos.cto.us.edu.pl%2F~jnykiel%2Fcraft-of-research.pdf&ei=dgXJS7rlEYGduAf7ueTtDA&usg=AFQjCNGt7I4Hey745sbPcKrCL9nzxNF6Pw&sig2=EmPUPQvY_B98mdnKN5NFIA";i:1;s:21:"The Craft of Research";}i:2;i:72;}i:14;a:3:{i:0;s:5:"cdata";i:1;a:1:{i:0;s:1:" ";}i:2;i:338;}i:15;a:3:{i:0;s:9:"linebreak";i:1;a:0:{}i:2;i:339;}i:16;a:3:{i:0;s:7:"p_close";i:1;a:0:{}i:2;i:341;}i:17;a:2:{i:0;s:6:"plugin";i:1;a:4:{i:0;s:7:"uparrow";i:1;a:1:{i:0;s:42:"lib/plugins/uparrow/images/tango-small.png";}i:2;i:1;i:3;s:6:"~~UP~~";}}i:18;a:3:{i:0;s:13:"section_close";i:1;a:0:{}i:2;i:343;}i:19;a:3:{i:0;s:12:"section_edit";i:1;a:4:{i:0;i:2;i:1;i:342;i:2;i:1;i:3;s:5:"Books";}i:2;i:343;}i:20;a:3:{i:0;s:6:"header";i:1;a:3:{i:0;s:9:"Magazines";i:1;i:2;i:2;i:343;}i:2;i:343;}i:21;a:3:{i:0;s:12:"section_open";i:1;a:1:{i:0;i:2;}i:2;i:343;}i:22;a:3:{i:0;s:6:"p_open";i:1;a:0:{}i:2;i:364;}i:23;a:3:{i:0;s:5:"cdata";i:1;a:1:{i:0;s:1:"
";}i:2;i:365;}i:24;a:3:{i:0;s:12:"externallink";i:1;a:2:{i:0;s:33:"http://info.abril.com.br/arquivo/";i:1;s:13:"Info Magazine";}i:2;i:366;}i:25;a:3:{i:0;s:5:"cdata";i:1;a:1:{i:0;s:1:" ";}i:2;i:417;}i:26;a:3:{i:0;s:9:"linebreak";i:1;a:0:{}i:2;i:418;}i:27;a:3:{i:0;s:5:"cdata";i:1;a:1:{i:0;s:1:"
";}i:2;i:420;}i:28;a:3:{i:0;s:12:"externallink";i:1;a:2:{i:0;s:39:"http://veja.abril.com.br/acervodigital/";i:1;s:13:"Veja Magazine";}i:2;i:421;}i:29;a:3:{i:0;s:5:"cdata";i:1;a:1:{i:0;s:1:" ";}i:2;i:478;}i:30;a:3:{i:0;s:9:"linebreak";i:1;a:0:{}i:2;i:479;}i:31;a:3:{i:0;s:5:"cdata";i:1;a:1:{i:0;s:1:"
";}i:2;i:481;}i:32;a:3:{i:0;s:12:"externallink";i:1;a:2:{i:0;s:63:"http://super.abril.com.br/superarquivo/index_superarquivo.shtml";i:1;s:27:"Super Interessante Magazine";}i:2;i:482;}i:33;a:3:{i:0;s:5:"cdata";i:1;a:1:{i:0;s:1:" ";}i:2;i:577;}i:34;a:3:{i:0;s:9:"linebreak";i:1;a:0:{}i:2;i:578;}i:35;a:3:{i:0;s:7:"p_close";i:1;a:0:{}i:2;i:580;}i:36;a:3:{i:0;s:6:"plugin";i:1;a:4:{i:0;s:7:"tag_tag";i:1;a:1:{i:0;s:5:"links";}i:2;i:5;i:3;s:13:"{{tag>links}}";}i:2;i:592;}i:37;a:2:{i:0;s:6:"plugin";i:1;a:4:{i:0;s:7:"uparrow";i:1;a:1:{i:0;s:42:"lib/plugins/uparrow/images/tango-small.png";}i:2;i:1;i:3;s:6:"~~UP~~";}}i:38;a:3:{i:0;s:13:"section_close";i:1;a:0:{}i:2;i:605;}i:39;a:3:{i:0;s:12:"section_edit";i:1;a:4:{i:0;i:343;i:1;i:0;i:2;i:2;i:3;s:9:"Magazines";}i:2;i:605;}i:40;a:3:{i:0;s:12:"document_end";i:1;a:0:{}i:2;i:605;}}