a:30:{i:0;a:3:{i:0;s:14:"document_start";i:1;a:0:{}i:2;i:0;}i:1;a:3:{i:0;s:6:"p_open";i:1;a:0:{}i:2;i:0;}i:2;a:3:{i:0;s:7:"p_close";i:1;a:0:{}i:2;i:1;}i:3;a:3:{i:0;s:12:"section_edit";i:1;a:4:{i:0;i:-1;i:1;i:0;i:2;i:1;i:3;s:0:"";}i:2;i:1;}i:4;a:3:{i:0;s:6:"header";i:1;a:3:{i:0;s:5:"Gprof";i:1;i:1;i:2;i:1;}i:2;i:1;}i:5;a:3:{i:0;s:12:"section_open";i:1;a:1:{i:0;i:1;}i:2;i:1;}i:6;a:3:{i:0;s:6:"p_open";i:1;a:0:{}i:2;i:20;}i:7;a:3:{i:0;s:5:"cdata";i:1;a:1:{i:0;s:1:"
";}i:2;i:21;}i:8;a:3:{i:0;s:12:"externallink";i:1;a:2:{i:0;s:53:"http://www.cs.utah.edu/dept/old/texinfo/as/gprof.html";i:1;s:5:"Gprof";}i:2;i:22;}i:9;a:3:{i:0;s:5:"cdata";i:1;a:1:{i:0;s:76:" - determine which parts of a program are taking most of the execution time ";}i:2;i:85;}i:10;a:3:{i:0;s:9:"linebreak";i:1;a:0:{}i:2;i:161;}i:11;a:3:{i:0;s:7:"p_close";i:1;a:0:{}i:2;i:163;}i:12;a:2:{i:0;s:6:"plugin";i:1;a:4:{i:0;s:7:"uparrow";i:1;a:1:{i:0;s:42:"lib/plugins/uparrow/images/tango-small.png";}i:2;i:1;i:3;s:6:"~~UP~~";}}i:13;a:3:{i:0;s:13:"section_close";i:1;a:0:{}i:2;i:165;}i:14;a:3:{i:0;s:12:"section_edit";i:1;a:4:{i:0;i:1;i:1;i:164;i:2;i:1;i:3;s:5:"Gprof";}i:2;i:165;}i:15;a:3:{i:0;s:6:"header";i:1;a:3:{i:0;s:14:"How to compile";i:1;i:2;i:2;i:165;}i:2;i:165;}i:16;a:3:{i:0;s:12:"section_open";i:1;a:1:{i:0;i:2;}i:2;i:165;}i:17;a:3:{i:0;s:6:"p_open";i:1;a:0:{}i:2;i:191;}i:18;a:3:{i:0;s:5:"cdata";i:1;a:1:{i:0;s:48:"
Just add -pg option when compiling and linking.";}i:2;i:192;}i:19;a:3:{i:0;s:7:"p_close";i:1;a:0:{}i:2;i:240;}i:20;a:2:{i:0;s:6:"plugin";i:1;a:4:{i:0;s:7:"uparrow";i:1;a:1:{i:0;s:42:"lib/plugins/uparrow/images/tango-small.png";}i:2;i:1;i:3;s:6:"~~UP~~";}}i:21;a:3:{i:0;s:13:"section_close";i:1;a:0:{}i:2;i:242;}i:22;a:3:{i:0;s:12:"section_edit";i:1;a:4:{i:0;i:165;i:1;i:241;i:2;i:2;i:3;s:14:"How to compile";}i:2;i:242;}i:23;a:3:{i:0;s:6:"header";i:1;a:3:{i:0;s:29:"How to interpret profile data";i:1;i:2;i:2;i:242;}i:2;i:242;}i:24;a:3:{i:0;s:12:"section_open";i:1;a:1:{i:0;i:2;}i:2;i:242;}i:25;a:3:{i:0;s:4:"code";i:1;a:3:{i:0;s:25:"
$ gprof -c program_name
";i:1;s:4:"bash";i:2;N;}i:2;i:290;}i:26;a:2:{i:0;s:6:"plugin";i:1;a:4:{i:0;s:7:"uparrow";i:1;a:1:{i:0;s:42:"lib/plugins/uparrow/images/tango-small.png";}i:2;i:1;i:3;s:6:"~~UP~~";}}i:27;a:3:{i:0;s:13:"section_close";i:1;a:0:{}i:2;i:329;}i:28;a:3:{i:0;s:12:"section_edit";i:1;a:4:{i:0;i:242;i:1;i:0;i:2;i:2;i:3;s:29:"How to interpret profile data";}i:2;i:329;}i:29;a:3:{i:0;s:12:"document_end";i:1;a:0:{}i:2;i:329;}}