a:26:{i:0;a:3:{i:0;s:14:"document_start";i:1;a:0:{}i:2;i:0;}i:1;a:3:{i:0;s:6:"p_open";i:1;a:0:{}i:2;i:0;}i:2;a:3:{i:0;s:7:"p_close";i:1;a:0:{}i:2;i:1;}i:3;a:3:{i:0;s:12:"section_edit";i:1;a:4:{i:0;i:-1;i:1;i:0;i:2;i:1;i:3;s:0:"";}i:2;i:1;}i:4;a:3:{i:0;s:6:"header";i:1;a:3:{i:0;s:14:"Summer Of Code";i:1;i:1;i:2;i:1;}i:2;i:1;}i:5;a:3:{i:0;s:12:"section_open";i:1;a:1:{i:0;i:1;}i:2;i:1;}i:6;a:3:{i:0;s:6:"p_open";i:1;a:0:{}i:2;i:29;}i:7;a:3:{i:0;s:5:"cdata";i:1;a:1:{i:0;s:1:"
";}i:2;i:30;}i:8;a:3:{i:0;s:12:"externallink";i:1;a:2:{i:0;s:27:"http://code.google.com/soc/";i:1;s:21:"Google Summer of Code";}i:2;i:31;}i:9;a:3:{i:0;s:5:"cdata";i:1;a:1:{i:0;s:2:": ";}i:2;i:84;}i:10;a:3:{i:0;s:13:"interwikilink";i:1;a:4:{i:0;s:24:"wp>Google_Summer_of_Code";i:1;s:21:"Google Summer of Code";i:2;s:2:"wp";i:3;s:21:"Google_Summer_of_Code";}i:2;i:86;}i:11;a:3:{i:0;s:5:"cdata";i:1;a:1:{i:0;s:1:" ";}i:2;i:136;}i:12;a:3:{i:0;s:9:"linebreak";i:1;a:0:{}i:2;i:137;}i:13;a:3:{i:0;s:7:"p_close";i:1;a:0:{}i:2;i:139;}i:14;a:2:{i:0;s:6:"plugin";i:1;a:4:{i:0;s:7:"uparrow";i:1;a:1:{i:0;s:42:"lib/plugins/uparrow/images/tango-small.png";}i:2;i:1;i:3;s:6:"~~UP~~";}}i:15;a:3:{i:0;s:13:"section_close";i:1;a:0:{}i:2;i:141;}i:16;a:3:{i:0;s:12:"section_edit";i:1;a:4:{i:0;i:1;i:1;i:140;i:2;i:1;i:3;s:14:"Summer Of Code";}i:2;i:141;}i:17;a:3:{i:0;s:6:"header";i:1;a:3:{i:0;s:15:"My Performances";i:1;i:2;i:2;i:141;}i:2;i:141;}i:18;a:3:{i:0;s:12:"section_open";i:1;a:1:{i:0;i:2;}i:2;i:141;}i:19;a:3:{i:0;s:6:"p_open";i:1;a:0:{}i:2;i:168;}i:20;a:3:{i:0;s:5:"cdata";i:1;a:1:{i:0;s:11:"
None yet!
";}i:2;i:169;}i:21;a:3:{i:0;s:7:"p_close";i:1;a:0:{}i:2;i:179;}i:22;a:2:{i:0;s:6:"plugin";i:1;a:4:{i:0;s:7:"uparrow";i:1;a:1:{i:0;s:42:"lib/plugins/uparrow/images/tango-small.png";}i:2;i:1;i:3;s:6:"~~UP~~";}}i:23;a:3:{i:0;s:13:"section_close";i:1;a:0:{}i:2;i:179;}i:24;a:3:{i:0;s:12:"section_edit";i:1;a:4:{i:0;i:141;i:1;i:0;i:2;i:2;i:3;s:15:"My Performances";}i:2;i:179;}i:25;a:3:{i:0;s:12:"document_end";i:1;a:0:{}i:2;i:179;}}