a:138:{i:0;a:3:{i:0;s:14:"document_start";i:1;a:0:{}i:2;i:0;}i:1;a:3:{i:0;s:6:"p_open";i:1;a:0:{}i:2;i:0;}i:2;a:3:{i:0;s:7:"p_close";i:1;a:0:{}i:2;i:1;}i:3;a:3:{i:0;s:12:"section_edit";i:1;a:4:{i:0;i:-1;i:1;i:0;i:2;i:1;i:3;s:0:"";}i:2;i:1;}i:4;a:3:{i:0;s:6:"header";i:1;a:3:{i:0;s:6:"Comics";i:1;i:1;i:2;i:1;}i:2;i:1;}i:5;a:3:{i:0;s:12:"section_open";i:1;a:1:{i:0;i:1;}i:2;i:1;}i:6;a:2:{i:0;s:6:"plugin";i:1;a:4:{i:0;s:7:"uparrow";i:1;a:1:{i:0;s:42:"lib/plugins/uparrow/images/tango-small.png";}i:2;i:1;i:3;s:6:"~~UP~~";}}i:7;a:3:{i:0;s:13:"section_close";i:1;a:0:{}i:2;i:23;}i:8;a:3:{i:0;s:12:"section_edit";i:1;a:4:{i:0;i:1;i:1;i:22;i:2;i:1;i:3;s:6:"Comics";}i:2;i:23;}i:9;a:3:{i:0;s:6:"header";i:1;a:3:{i:0;s:4:"xkcd";i:1;i:2;i:2;i:23;}i:2;i:23;}i:10;a:3:{i:0;s:12:"section_open";i:1;a:1:{i:0;i:2;}i:2;i:23;}i:11;a:3:{i:0;s:6:"p_open";i:1;a:0:{}i:2;i:39;}i:12;a:3:{i:0;s:5:"cdata";i:1;a:1:{i:0;s:1:"
";}i:2;i:40;}i:13;a:3:{i:0;s:12:"externallink";i:1;a:2:{i:0;s:19:"http://xkcd.com/26/";i:1;s:7:"Fourier";}i:2;i:41;}i:14;a:3:{i:0;s:5:"cdata";i:1;a:1:{i:0;s:1:" ";}i:2;i:72;}i:15;a:3:{i:0;s:9:"linebreak";i:1;a:0:{}i:2;i:73;}i:16;a:3:{i:0;s:5:"cdata";i:1;a:1:{i:0;s:1:"
";}i:2;i:75;}i:17;a:3:{i:0;s:12:"externallink";i:1;a:2:{i:0;s:19:"http://xkcd.com/45/";i:1;s:12:"Schrödinger";}i:2;i:76;}i:18;a:3:{i:0;s:5:"cdata";i:1;a:1:{i:0;s:1:" ";}i:2;i:112;}i:19;a:3:{i:0;s:9:"linebreak";i:1;a:0:{}i:2;i:113;}i:20;a:3:{i:0;s:5:"cdata";i:1;a:1:{i:0;s:1:"
";}i:2;i:115;}i:21;a:3:{i:0;s:12:"externallink";i:1;a:2:{i:0;s:19:"http://xkcd.com/69/";i:1;s:11:"Pillow Talk";}i:2;i:116;}i:22;a:3:{i:0;s:5:"cdata";i:1;a:1:{i:0;s:1:" ";}i:2;i:151;}i:23;a:3:{i:0;s:9:"linebreak";i:1;a:0:{}i:2;i:152;}i:24;a:3:{i:0;s:5:"cdata";i:1;a:1:{i:0;s:1:"
";}i:2;i:154;}i:25;a:3:{i:0;s:12:"externallink";i:1;a:2:{i:0;s:19:"http://xkcd.com/85/";i:1;s:4:"Path";}i:2;i:155;}i:26;a:3:{i:0;s:5:"cdata";i:1;a:1:{i:0;s:1:" ";}i:2;i:183;}i:27;a:3:{i:0;s:9:"linebreak";i:1;a:0:{}i:2;i:184;}i:28;a:3:{i:0;s:5:"cdata";i:1;a:1:{i:0;s:1:"
";}i:2;i:186;}i:29;a:3:{i:0;s:12:"externallink";i:1;a:2:{i:0;s:20:"http://xkcd.com/113/";i:1;s:12:"Riemann-Zeta";}i:2;i:187;}i:30;a:3:{i:0;s:5:"cdata";i:1;a:1:{i:0;s:1:" ";}i:2;i:224;}i:31;a:3:{i:0;s:9:"linebreak";i:1;a:0:{}i:2;i:225;}i:32;a:3:{i:0;s:5:"cdata";i:1;a:1:{i:0;s:1:"
";}i:2;i:227;}i:33;a:3:{i:0;s:12:"externallink";i:1;a:2:{i:0;s:20:"http://xkcd.com/125/";i:1;s:19:"Marketing Interview";}i:2;i:228;}i:34;a:3:{i:0;s:5:"cdata";i:1;a:1:{i:0;s:1:" ";}i:2;i:272;}i:35;a:3:{i:0;s:9:"linebreak";i:1;a:0:{}i:2;i:273;}i:36;a:3:{i:0;s:5:"cdata";i:1;a:1:{i:0;s:1:"
";}i:2;i:275;}i:37;a:3:{i:0;s:12:"externallink";i:1;a:2:{i:0;s:20:"http://xkcd.com/138/";i:1;s:8:"Pointers";}i:2;i:276;}i:38;a:3:{i:0;s:5:"cdata";i:1;a:1:{i:0;s:1:" ";}i:2;i:309;}i:39;a:3:{i:0;s:9:"linebreak";i:1;a:0:{}i:2;i:310;}i:40;a:3:{i:0;s:5:"cdata";i:1;a:1:{i:0;s:1:"
";}i:2;i:312;}i:41;a:3:{i:0;s:12:"externallink";i:1;a:2:{i:0;s:20:"http://xkcd.com/149/";i:1;s:8:"Sandwich";}i:2;i:313;}i:42;a:3:{i:0;s:5:"cdata";i:1;a:1:{i:0;s:1:" ";}i:2;i:346;}i:43;a:3:{i:0;s:9:"linebreak";i:1;a:0:{}i:2;i:347;}i:44;a:3:{i:0;s:5:"cdata";i:1;a:1:{i:0;s:1:"
";}i:2;i:349;}i:45;a:3:{i:0;s:12:"externallink";i:1;a:2:{i:0;s:20:"http://xkcd.com/156/";i:1;s:9:"Commented";}i:2;i:350;}i:46;a:3:{i:0;s:5:"cdata";i:1;a:1:{i:0;s:1:" ";}i:2;i:384;}i:47;a:3:{i:0;s:9:"linebreak";i:1;a:0:{}i:2;i:385;}i:48;a:3:{i:0;s:5:"cdata";i:1;a:1:{i:0;s:1:"
";}i:2;i:387;}i:49;a:3:{i:0;s:12:"externallink";i:1;a:2:{i:0;s:20:"http://xkcd.com/163/";i:1;s:12:"Donald Knuth";}i:2;i:388;}i:50;a:3:{i:0;s:5:"cdata";i:1;a:1:{i:0;s:1:" ";}i:2;i:425;}i:51;a:3:{i:0;s:9:"linebreak";i:1;a:0:{}i:2;i:426;}i:52;a:3:{i:0;s:5:"cdata";i:1;a:1:{i:0;s:1:"
";}i:2;i:428;}i:53;a:3:{i:0;s:12:"externallink";i:1;a:2:{i:0;s:20:"http://xkcd.com/171/";i:1;s:13:"String Theory";}i:2;i:429;}i:54;a:3:{i:0;s:5:"cdata";i:1;a:1:{i:0;s:1:" ";}i:2;i:467;}i:55;a:3:{i:0;s:9:"linebreak";i:1;a:0:{}i:2;i:468;}i:56;a:3:{i:0;s:5:"cdata";i:1;a:1:{i:0;s:1:"
";}i:2;i:470;}i:57;a:3:{i:0;s:12:"externallink";i:1;a:2:{i:0;s:20:"http://xkcd.com/179/";i:1;s:19:"e to the pi times i";}i:2;i:471;}i:58;a:3:{i:0;s:5:"cdata";i:1;a:1:{i:0;s:1:" ";}i:2;i:515;}i:59;a:3:{i:0;s:9:"linebreak";i:1;a:0:{}i:2;i:516;}i:60;a:3:{i:0;s:5:"cdata";i:1;a:1:{i:0;s:1:"
";}i:2;i:518;}i:61;a:3:{i:0;s:12:"externallink";i:1;a:2:{i:0;s:20:"http://xkcd.com/182/";i:1;s:4:"Nash";}i:2;i:519;}i:62;a:3:{i:0;s:5:"cdata";i:1;a:1:{i:0;s:1:" ";}i:2;i:548;}i:63;a:3:{i:0;s:9:"linebreak";i:1;a:0:{}i:2;i:549;}i:64;a:3:{i:0;s:5:"cdata";i:1;a:1:{i:0;s:1:"
";}i:2;i:551;}i:65;a:3:{i:0;s:12:"externallink";i:1;a:2:{i:0;s:20:"http://xkcd.com/184/";i:1;s:16:"Matrix Transform";}i:2;i:552;}i:66;a:3:{i:0;s:5:"cdata";i:1;a:1:{i:0;s:1:" ";}i:2;i:593;}i:67;a:3:{i:0;s:9:"linebreak";i:1;a:0:{}i:2;i:594;}i:68;a:3:{i:0;s:5:"cdata";i:1;a:1:{i:0;s:1:"
";}i:2;i:596;}i:69;a:3:{i:0;s:12:"externallink";i:1;a:2:{i:0;s:20:"http://xkcd.com/189/";i:1;s:8:"Exercise";}i:2;i:597;}i:70;a:3:{i:0;s:5:"cdata";i:1;a:1:{i:0;s:1:" ";}i:2;i:630;}i:71;a:3:{i:0;s:9:"linebreak";i:1;a:0:{}i:2;i:631;}i:72;a:3:{i:0;s:5:"cdata";i:1;a:1:{i:0;s:1:"
";}i:2;i:633;}i:73;a:3:{i:0;s:12:"externallink";i:1;a:2:{i:0;s:20:"http://xkcd.com/192/";i:1;s:18:"Working for Google";}i:2;i:634;}i:74;a:3:{i:0;s:5:"cdata";i:1;a:1:{i:0;s:1:" ";}i:2;i:677;}i:75;a:3:{i:0;s:9:"linebreak";i:1;a:0:{}i:2;i:678;}i:76;a:3:{i:0;s:5:"cdata";i:1;a:1:{i:0;s:1:"
";}i:2;i:680;}i:77;a:3:{i:0;s:12:"externallink";i:1;a:2:{i:0;s:20:"http://xkcd.com/199/";i:1;s:15:"Right-Hand Rule";}i:2;i:681;}i:78;a:3:{i:0;s:5:"cdata";i:1;a:1:{i:0;s:1:" ";}i:2;i:721;}i:79;a:3:{i:0;s:9:"linebreak";i:1;a:0:{}i:2;i:722;}i:80;a:3:{i:0;s:5:"cdata";i:1;a:1:{i:0;s:1:"
";}i:2;i:724;}i:81;a:3:{i:0;s:12:"externallink";i:1;a:2:{i:0;s:20:"http://xkcd.com/208/";i:1;s:19:"Regular Expressions";}i:2;i:725;}i:82;a:3:{i:0;s:5:"cdata";i:1;a:1:{i:0;s:1:" ";}i:2;i:769;}i:83;a:3:{i:0;s:9:"linebreak";i:1;a:0:{}i:2;i:770;}i:84;a:3:{i:0;s:6:"plugin";i:1;a:4:{i:0;s:11:"htmlcomment";i:1;a:2:{i:0;i:5;i:1;s:13:" parei nesta ";}i:2;i:5;i:3;s:20:"<!-- parei nesta -->";}i:2;i:773;}i:85;a:3:{i:0;s:5:"cdata";i:1;a:1:{i:0;s:1:"
";}i:2;i:793;}i:86;a:3:{i:0;s:12:"externallink";i:1;a:2:{i:0;s:20:"http://xkcd.com/230/";i:1;s:11:"Hamiltonian";}i:2;i:794;}i:87;a:3:{i:0;s:5:"cdata";i:1;a:1:{i:0;s:1:" ";}i:2;i:830;}i:88;a:3:{i:0;s:9:"linebreak";i:1;a:0:{}i:2;i:831;}i:89;a:3:{i:0;s:5:"cdata";i:1;a:1:{i:0;s:1:"
";}i:2;i:833;}i:90;a:3:{i:0;s:12:"externallink";i:1;a:2:{i:0;s:20:"http://xkcd.com/287/";i:1;s:11:"NP-Complete";}i:2;i:834;}i:91;a:3:{i:0;s:5:"cdata";i:1;a:1:{i:0;s:1:" ";}i:2;i:870;}i:92;a:3:{i:0;s:9:"linebreak";i:1;a:0:{}i:2;i:871;}i:93;a:3:{i:0;s:5:"cdata";i:1;a:1:{i:0;s:1:"
";}i:2;i:873;}i:94;a:3:{i:0;s:12:"externallink";i:1;a:2:{i:0;s:20:"http://xkcd.com/303/";i:1;s:9:"Compiling";}i:2;i:874;}i:95;a:3:{i:0;s:5:"cdata";i:1;a:1:{i:0;s:1:" ";}i:2;i:908;}i:96;a:3:{i:0;s:9:"linebreak";i:1;a:0:{}i:2;i:909;}i:97;a:3:{i:0;s:5:"cdata";i:1;a:1:{i:0;s:1:"
";}i:2;i:911;}i:98;a:3:{i:0;s:12:"externallink";i:1;a:2:{i:0;s:20:"http://xkcd.com/309/";i:1;s:14:"Shopping Teams";}i:2;i:912;}i:99;a:3:{i:0;s:5:"cdata";i:1;a:1:{i:0;s:1:" ";}i:2;i:951;}i:100;a:3:{i:0;s:9:"linebreak";i:1;a:0:{}i:2;i:952;}i:101;a:3:{i:0;s:5:"cdata";i:1;a:1:{i:0;s:1:"
";}i:2;i:954;}i:102;a:3:{i:0;s:12:"externallink";i:1;a:2:{i:0;s:20:"http://xkcd.com/320/";i:1;s:11:"28-Hour Day";}i:2;i:955;}i:103;a:3:{i:0;s:5:"cdata";i:1;a:1:{i:0;s:1:" ";}i:2;i:991;}i:104;a:3:{i:0;s:9:"linebreak";i:1;a:0:{}i:2;i:992;}i:105;a:3:{i:0;s:5:"cdata";i:1;a:1:{i:0;s:1:"
";}i:2;i:994;}i:106;a:3:{i:0;s:12:"externallink";i:1;a:2:{i:0;s:20:"http://xkcd.com/399/";i:1;s:26:"Traveling Salesman Problem";}i:2;i:995;}i:107;a:3:{i:0;s:5:"cdata";i:1;a:1:{i:0;s:1:" ";}i:2;i:1046;}i:108;a:3:{i:0;s:9:"linebreak";i:1;a:0:{}i:2;i:1047;}i:109;a:3:{i:0;s:5:"cdata";i:1;a:1:{i:0;s:1:"
";}i:2;i:1049;}i:110;a:3:{i:0;s:12:"externallink";i:1;a:2:{i:0;s:20:"http://xkcd.com/435/";i:1;s:25:"Fields Arranged By Purity";}i:2;i:1050;}i:111;a:3:{i:0;s:5:"cdata";i:1;a:1:{i:0;s:1:" ";}i:2;i:1100;}i:112;a:3:{i:0;s:9:"linebreak";i:1;a:0:{}i:2;i:1101;}i:113;a:3:{i:0;s:5:"cdata";i:1;a:1:{i:0;s:1:"
";}i:2;i:1103;}i:114;a:3:{i:0;s:12:"externallink";i:1;a:2:{i:0;s:20:"http://xkcd.com/557/";i:1;s:14:"Students Dream";}i:2;i:1104;}i:115;a:3:{i:0;s:5:"cdata";i:1;a:1:{i:0;s:1:" ";}i:2;i:1143;}i:116;a:3:{i:0;s:9:"linebreak";i:1;a:0:{}i:2;i:1144;}i:117;a:3:{i:0;s:7:"p_close";i:1;a:0:{}i:2;i:1146;}i:118;a:2:{i:0;s:6:"plugin";i:1;a:4:{i:0;s:7:"uparrow";i:1;a:1:{i:0;s:42:"lib/plugins/uparrow/images/tango-small.png";}i:2;i:1;i:3;s:6:"~~UP~~";}}i:119;a:3:{i:0;s:13:"section_close";i:1;a:0:{}i:2;i:1148;}i:120;a:3:{i:0;s:12:"section_edit";i:1;a:4:{i:0;i:23;i:1;i:1147;i:2;i:2;i:3;s:4:"xkcd";}i:2;i:1148;}i:121;a:3:{i:0;s:6:"header";i:1;a:3:{i:0;s:6:"Others";i:1;i:2;i:2;i:1148;}i:2;i:1148;}i:122;a:3:{i:0;s:12:"section_open";i:1;a:1:{i:0;i:2;}i:2;i:1148;}i:123;a:3:{i:0;s:6:"p_open";i:1;a:0:{}i:2;i:1166;}i:124;a:3:{i:0;s:5:"cdata";i:1;a:1:{i:0;s:1:"
";}i:2;i:1167;}i:125;a:3:{i:0;s:12:"externallink";i:1;a:2:{i:0;s:54:"http://www.phdcomics.com/comics/archive/phd112009s.gif";i:1;s:30:"PhD: Changes wrote on my draft";}i:2;i:1168;}i:126;a:3:{i:0;s:5:"cdata";i:1;a:1:{i:0;s:1:" ";}i:2;i:1257;}i:127;a:3:{i:0;s:9:"linebreak";i:1;a:0:{}i:2;i:1258;}i:128;a:3:{i:0;s:5:"cdata";i:1;a:1:{i:0;s:1:"
";}i:2;i:1260;}i:129;a:3:{i:0;s:12:"externallink";i:1;a:2:{i:0;s:28:"http://abstrusegoose.com/249";i:1;s:49:"Abstruse Goose: How to teach yourself programming";}i:2;i:1261;}i:130;a:3:{i:0;s:5:"cdata";i:1;a:1:{i:0;s:1:" ";}i:2;i:1343;}i:131;a:3:{i:0;s:9:"linebreak";i:1;a:0:{}i:2;i:1344;}i:132;a:3:{i:0;s:7:"p_close";i:1;a:0:{}i:2;i:1346;}i:133;a:3:{i:0;s:6:"plugin";i:1;a:4:{i:0;s:7:"tag_tag";i:1;a:1:{i:0;s:5:"links";}i:2;i:5;i:3;s:13:"{{tag>links}}";}i:2;i:1348;}i:134;a:2:{i:0;s:6:"plugin";i:1;a:4:{i:0;s:7:"uparrow";i:1;a:1:{i:0;s:42:"lib/plugins/uparrow/images/tango-small.png";}i:2;i:1;i:3;s:6:"~~UP~~";}}i:135;a:3:{i:0;s:13:"section_close";i:1;a:0:{}i:2;i:1361;}i:136;a:3:{i:0;s:12:"section_edit";i:1;a:4:{i:0;i:1148;i:1;i:0;i:2;i:2;i:3;s:6:"Others";}i:2;i:1361;}i:137;a:3:{i:0;s:12:"document_end";i:1;a:0:{}i:2;i:1361;}}