a:310:{i:0;a:3:{i:0;s:14:"document_start";i:1;a:0:{}i:2;i:0;}i:1;a:3:{i:0;s:6:"p_open";i:1;a:0:{}i:2;i:0;}i:2;a:3:{i:0;s:7:"p_close";i:1;a:0:{}i:2;i:1;}i:3;a:3:{i:0;s:12:"section_edit";i:1;a:4:{i:0;i:-1;i:1;i:0;i:2;i:1;i:3;s:0:"";}i:2;i:1;}i:4;a:3:{i:0;s:6:"header";i:1;a:3:{i:0;s:6:"Others";i:1;i:1;i:2;i:1;}i:2;i:1;}i:5;a:3:{i:0;s:12:"section_open";i:1;a:1:{i:0;i:1;}i:2;i:1;}i:6;a:2:{i:0;s:6:"plugin";i:1;a:4:{i:0;s:7:"uparrow";i:1;a:1:{i:0;s:42:"lib/plugins/uparrow/images/tango-small.png";}i:2;i:1;i:3;s:6:"~~UP~~";}}i:7;a:3:{i:0;s:13:"section_close";i:1;a:0:{}i:2;i:23;}i:8;a:3:{i:0;s:12:"section_edit";i:1;a:4:{i:0;i:1;i:1;i:22;i:2;i:1;i:3;s:6:"Others";}i:2;i:23;}i:9;a:3:{i:0;s:6:"header";i:1;a:3:{i:0;s:9:"Languages";i:1;i:2;i:2;i:23;}i:2;i:23;}i:10;a:3:{i:0;s:12:"section_open";i:1;a:1:{i:0;i:2;}i:2;i:23;}i:11;a:3:{i:0;s:6:"p_open";i:1;a:0:{}i:2;i:44;}i:12;a:3:{i:0;s:5:"cdata";i:1;a:1:{i:0;s:1:"
";}i:2;i:45;}i:13;a:3:{i:0;s:12:"externallink";i:1;a:2:{i:0;s:30:"http://www.curry-language.org/";i:1;s:5:"Curry";}i:2;i:46;}i:14;a:3:{i:0;s:5:"cdata";i:1;a:1:{i:0;s:48:" - A Truly Integrated Functional Logic Language ";}i:2;i:86;}i:15;a:3:{i:0;s:9:"linebreak";i:1;a:0:{}i:2;i:134;}i:16;a:3:{i:0;s:5:"cdata";i:1;a:1:{i:0;s:1:"
";}i:2;i:136;}i:17;a:3:{i:0;s:12:"externallink";i:1;a:2:{i:0;s:18:"http://golang.org/";i:1;s:2:"Go";}i:2;i:137;}i:18;a:3:{i:0;s:5:"cdata";i:1;a:1:{i:0;s:34:" - A Systems Programming Language ";}i:2;i:162;}i:19;a:3:{i:0;s:9:"linebreak";i:1;a:0:{}i:2;i:196;}i:20;a:3:{i:0;s:5:"cdata";i:1;a:1:{i:0;s:1:"
";}i:2;i:198;}i:21;a:3:{i:0;s:12:"externallink";i:1;a:2:{i:0;s:34:"http://meyerweb.com/eric/tools/s5/";i:1;s:2:"S5";}i:2;i:199;}i:22;a:3:{i:0;s:5:"cdata";i:1;a:1:{i:0;s:46:" - A Simple Standards-Based Slide Show System ";}i:2;i:240;}i:23;a:3:{i:0;s:9:"linebreak";i:1;a:0:{}i:2;i:286;}i:24;a:3:{i:0;s:5:"cdata";i:1;a:1:{i:0;s:1:"
";}i:2;i:288;}i:25;a:3:{i:0;s:12:"externallink";i:1;a:2:{i:0;s:35:"http://www.cplusplus.com/reference/";i:1;s:13:"C++ Reference";}i:2;i:289;}i:26;a:3:{i:0;s:5:"cdata";i:1;a:1:{i:0;s:1:" ";}i:2;i:342;}i:27;a:3:{i:0;s:9:"linebreak";i:1;a:0:{}i:2;i:343;}i:28;a:3:{i:0;s:5:"cdata";i:1;a:1:{i:0;s:1:"
";}i:2;i:345;}i:29;a:3:{i:0;s:12:"externallink";i:1;a:2:{i:0;s:41:"http://live.gnome.org/C%2B%2B%20resources";i:1;s:19:"GNOME C++ Resources";}i:2;i:346;}i:30;a:3:{i:0;s:5:"cdata";i:1;a:1:{i:0;s:1:" ";}i:2;i:411;}i:31;a:3:{i:0;s:9:"linebreak";i:1;a:0:{}i:2;i:412;}i:32;a:3:{i:0;s:7:"p_close";i:1;a:0:{}i:2;i:414;}i:33;a:2:{i:0;s:6:"plugin";i:1;a:4:{i:0;s:7:"uparrow";i:1;a:1:{i:0;s:42:"lib/plugins/uparrow/images/tango-small.png";}i:2;i:1;i:3;s:6:"~~UP~~";}}i:34;a:3:{i:0;s:13:"section_close";i:1;a:0:{}i:2;i:416;}i:35;a:3:{i:0;s:12:"section_edit";i:1;a:4:{i:0;i:23;i:1;i:415;i:2;i:2;i:3;s:9:"Languages";}i:2;i:416;}i:36;a:3:{i:0;s:6:"header";i:1;a:3:{i:0;s:26:"Coding and Style Standards";i:1;i:2;i:2;i:416;}i:2;i:416;}i:37;a:3:{i:0;s:12:"section_open";i:1;a:1:{i:0;i:2;}i:2;i:416;}i:38;a:3:{i:0;s:6:"p_open";i:1;a:0:{}i:2;i:454;}i:39;a:3:{i:0;s:5:"cdata";i:1;a:1:{i:0;s:1:"
";}i:2;i:455;}i:40;a:3:{i:0;s:12:"externallink";i:1;a:2:{i:0;s:48:"http://www.gnu.org/prep/standards/standards.html";i:1;s:20:"GNU Coding Standards";}i:2;i:456;}i:41;a:3:{i:0;s:5:"cdata";i:1;a:1:{i:0;s:1:" ";}i:2;i:529;}i:42;a:3:{i:0;s:9:"linebreak";i:1;a:0:{}i:2;i:530;}i:43;a:3:{i:0;s:5:"cdata";i:1;a:1:{i:0;s:1:"
";}i:2;i:532;}i:44;a:3:{i:0;s:12:"externallink";i:1;a:2:{i:0;s:47:"http://kernel.org/doc/Documentation/CodingStyle";i:1;s:25:"Linux kernel coding style";}i:2;i:533;}i:45;a:3:{i:0;s:5:"cdata";i:1;a:1:{i:0;s:1:" ";}i:2;i:610;}i:46;a:3:{i:0;s:9:"linebreak";i:1;a:0:{}i:2;i:611;}i:47;a:3:{i:0;s:5:"cdata";i:1;a:1:{i:0;s:1:"
";}i:2;i:613;}i:48;a:3:{i:0;s:12:"externallink";i:1;a:2:{i:0;s:62:"http://google-styleguide.googlecode.com/svn/trunk/cppguide.xml";i:1;s:22:"Google C++ Style Guide";}i:2;i:614;}i:49;a:3:{i:0;s:5:"cdata";i:1;a:1:{i:0;s:1:" ";}i:2;i:703;}i:50;a:3:{i:0;s:9:"linebreak";i:1;a:0:{}i:2;i:704;}i:51;a:3:{i:0;s:7:"p_close";i:1;a:0:{}i:2;i:706;}i:52;a:2:{i:0;s:6:"plugin";i:1;a:4:{i:0;s:7:"uparrow";i:1;a:1:{i:0;s:42:"lib/plugins/uparrow/images/tango-small.png";}i:2;i:1;i:3;s:6:"~~UP~~";}}i:53;a:3:{i:0;s:13:"section_close";i:1;a:0:{}i:2;i:708;}i:54;a:3:{i:0;s:12:"section_edit";i:1;a:4:{i:0;i:416;i:1;i:707;i:2;i:2;i:3;s:26:"Coding and Style Standards";}i:2;i:708;}i:55;a:3:{i:0;s:6:"header";i:1;a:3:{i:0;s:5:"Tools";i:1;i:2;i:2;i:708;}i:2;i:708;}i:56;a:3:{i:0;s:12:"section_open";i:1;a:1:{i:0;i:2;}i:2;i:708;}i:57;a:3:{i:0;s:6:"p_open";i:1;a:0:{}i:2;i:725;}i:58;a:3:{i:0;s:12:"externallink";i:1;a:2:{i:0;s:37:"http://www.gnu.org/software/autoconf/";i:1;s:25:"Autoconf GNU Project Page";}i:2;i:726;}i:59;a:3:{i:0;s:5:"cdata";i:1;a:1:{i:0;s:119:" - Extensible package of M4 macros that produce shell scripts to automatically configure software source code packages ";}i:2;i:793;}i:60;a:3:{i:0;s:9:"linebreak";i:1;a:0:{}i:2;i:912;}i:61;a:3:{i:0;s:5:"cdata";i:1;a:1:{i:0;s:1:"
";}i:2;i:914;}i:62;a:3:{i:0;s:12:"externallink";i:1;a:2:{i:0;s:37:"http://www.gnu.org/software/automake/";i:1;s:25:"Automake GNU Project Page";}i:2;i:915;}i:63;a:3:{i:0;s:5:"cdata";i:1;a:1:{i:0;s:88:" - Automatically generating `Makefile.in' files compliant with the GNU Coding Standards ";}i:2;i:982;}i:64;a:3:{i:0;s:9:"linebreak";i:1;a:0:{}i:2;i:1070;}i:65;a:3:{i:0;s:5:"cdata";i:1;a:1:{i:0;s:1:"
";}i:2;i:1072;}i:66;a:3:{i:0;s:12:"externallink";i:1;a:2:{i:0;s:47:"http://www.stack.nl/~dimitri/doxygen/index.html";i:1;s:21:"Doxygen Official Page";}i:2;i:1073;}i:67;a:3:{i:0;s:5:"cdata";i:1;a:1:{i:0;s:113:" - Documentation system for C++, C, Java, Objective-C, Python, IDL (Corba and Microsoft flavors), Fortran, VHDL, ";}i:2;i:1146;}i:68;a:3:{i:0;s:7:"acronym";i:1;a:1:{i:0;s:3:"PHP";}i:2;i:1259;}i:69;a:3:{i:0;s:5:"cdata";i:1;a:1:{i:0;s:27:", C#, and to some extent D ";}i:2;i:1262;}i:70;a:3:{i:0;s:9:"linebreak";i:1;a:0:{}i:2;i:1289;}i:71;a:3:{i:0;s:5:"cdata";i:1;a:1:{i:0;s:1:"
";}i:2;i:1291;}i:72;a:3:{i:0;s:12:"externallink";i:1;a:2:{i:0;s:49:"https://www.getdropbox.com/referrals/NTI2OTY0MTM5";i:1;s:7:"Dropbox";}i:2;i:1292;}i:73;a:3:{i:0;s:5:"cdata";i:1;a:1:{i:0;s:184:" - Synchronizing files between multiple computers, backing of versions and allowing sharing and various other features. It's like Google Docs, but for any type of file and for folders ";}i:2;i:1353;}i:74;a:3:{i:0;s:9:"linebreak";i:1;a:0:{}i:2;i:1537;}i:75;a:3:{i:0;s:5:"cdata";i:1;a:1:{i:0;s:1:"
";}i:2;i:1539;}i:76;a:3:{i:0;s:12:"externallink";i:1;a:2:{i:0;s:32:"http://gnuwin32.sourceforge.net/";i:1;s:21:"GnuWin32 Oficial Page";}i:2;i:1540;}i:77;a:3:{i:0;s:5:"cdata";i:1;a:1:{i:0;s:73:" - Provides ports of tools with a GNU or similar open source license, to ";}i:2;i:1598;}i:78;a:3:{i:0;s:7:"acronym";i:1;a:1:{i:0;s:2:"MS";}i:2;i:1671;}i:79;a:3:{i:0;s:5:"cdata";i:1;a:1:{i:0;s:9:"-Windows ";}i:2;i:1673;}i:80;a:3:{i:0;s:9:"linebreak";i:1;a:0:{}i:2;i:1682;}i:81;a:3:{i:0;s:5:"cdata";i:1;a:1:{i:0;s:1:"
";}i:2;i:1684;}i:82;a:3:{i:0;s:12:"externallink";i:1;a:2:{i:0;s:33:"http://www.graphviz.org/About.php";i:1;s:22:"Graphviz Official Page";}i:2;i:1685;}i:83;a:3:{i:0;s:5:"cdata";i:1;a:1:{i:0;s:44:" - Open source graph visualization software ";}i:2;i:1745;}i:84;a:3:{i:0;s:9:"linebreak";i:1;a:0:{}i:2;i:1789;}i:85;a:3:{i:0;s:5:"cdata";i:1;a:1:{i:0;s:1:"
";}i:2;i:1791;}i:86;a:3:{i:0;s:12:"externallink";i:1;a:2:{i:0;s:21:"http://www.mingw.org/";i:1;s:18:"MinGW Oficial Page";}i:2;i:1792;}i:87;a:3:{i:0;s:5:"cdata";i:1;a:1:{i:0;s:18:" - Contraction of ";}i:2;i:1836;}i:88;a:3:{i:0;s:18:"doublequoteopening";i:1;a:0:{}i:2;i:1854;}i:89;a:3:{i:0;s:5:"cdata";i:1;a:1:{i:0;s:26:"Minimalist GNU for Windows";}i:2;i:1855;}i:90;a:3:{i:0;s:18:"doublequoteclosing";i:1;a:0:{}i:2;i:1881;}i:91;a:3:{i:0;s:5:"cdata";i:1;a:1:{i:0;s:136:", is a port of the GNU Compiler Collection (GCC), and GNU Binutils, for use in the development of native Microsoft Windows applications ";}i:2;i:1882;}i:92;a:3:{i:0;s:9:"linebreak";i:1;a:0:{}i:2;i:2018;}i:93;a:3:{i:0;s:5:"cdata";i:1;a:1:{i:0;s:1:"
";}i:2;i:2020;}i:94;a:3:{i:0;s:12:"externallink";i:1;a:2:{i:0;s:30:"http://www.mingw.org/wiki/MSYS";i:1;s:4:"MSYS";}i:2;i:2021;}i:95;a:3:{i:0;s:5:"cdata";i:1;a:1:{i:0;s:18:" - Contraction of ";}i:2;i:2060;}i:96;a:3:{i:0;s:18:"doublequoteopening";i:1;a:0:{}i:2;i:2078;}i:97;a:3:{i:0;s:5:"cdata";i:1;a:1:{i:0;s:14:"Minimal SYStem";}i:2;i:2079;}i:98;a:3:{i:0;s:18:"doublequoteclosing";i:1;a:0:{}i:2;i:2093;}i:99;a:3:{i:0;s:5:"cdata";i:1;a:1:{i:0;s:52:", is a Bourne Shell command line interpreter system ";}i:2;i:2094;}i:100;a:3:{i:0;s:9:"linebreak";i:1;a:0:{}i:2;i:2146;}i:101;a:3:{i:0;s:5:"cdata";i:1;a:1:{i:0;s:1:"
";}i:2;i:2148;}i:102;a:3:{i:0;s:12:"externallink";i:1;a:2:{i:0;s:61:"http://www.brothersoft.com/google-book-downloader-290171.html";i:1;s:22:"Google Book Downloader";}i:2;i:2149;}i:103;a:3:{i:0;s:5:"cdata";i:1;a:1:{i:0;s:21:" - Save google books ";}i:2;i:2237;}i:104;a:3:{i:0;s:9:"linebreak";i:1;a:0:{}i:2;i:2258;}i:105;a:3:{i:0;s:5:"cdata";i:1;a:1:{i:0;s:1:"
";}i:2;i:2260;}i:106;a:3:{i:0;s:12:"externallink";i:1;a:2:{i:0;s:18:"http://ninite.com/";i:1;s:6:"Ninite";}i:2;i:2261;}i:107;a:3:{i:0;s:5:"cdata";i:1;a:1:{i:0;s:35:" - Group programs in one installer ";}i:2;i:2290;}i:108;a:3:{i:0;s:9:"linebreak";i:1;a:0:{}i:2;i:2325;}i:109;a:3:{i:0;s:5:"cdata";i:1;a:1:{i:0;s:1:"
";}i:2;i:2327;}i:110;a:3:{i:0;s:12:"externallink";i:1;a:2:{i:0;s:46:"http://sciencesoft.at/latex/flatex.gsp?lang=en";i:1;s:11:"Flash Latex";}i:2;i:2328;}i:111;a:3:{i:0;s:5:"cdata";i:1;a:1:{i:0;s:1:" ";}i:2;i:2390;}i:112;a:3:{i:0;s:9:"linebreak";i:1;a:0:{}i:2;i:2391;}i:113;a:3:{i:0;s:7:"p_close";i:1;a:0:{}i:2;i:2393;}i:114;a:2:{i:0;s:6:"plugin";i:1;a:4:{i:0;s:7:"uparrow";i:1;a:1:{i:0;s:42:"lib/plugins/uparrow/images/tango-small.png";}i:2;i:1;i:3;s:6:"~~UP~~";}}i:115;a:3:{i:0;s:13:"section_close";i:1;a:0:{}i:2;i:2395;}i:116;a:3:{i:0;s:12:"section_edit";i:1;a:4:{i:0;i:708;i:1;i:2394;i:2;i:2;i:3;s:5:"Tools";}i:2;i:2395;}i:117;a:3:{i:0;s:6:"header";i:1;a:3:{i:0;s:5:"Sites";i:1;i:2;i:2;i:2395;}i:2;i:2395;}i:118;a:3:{i:0;s:12:"section_open";i:1;a:1:{i:0;i:2;}i:2;i:2395;}i:119;a:3:{i:0;s:6:"p_open";i:1;a:0:{}i:2;i:2412;}i:120;a:3:{i:0;s:5:"cdata";i:1;a:1:{i:0;s:1:"
";}i:2;i:2413;}i:121;a:3:{i:0;s:12:"externallink";i:1;a:2:{i:0;s:19:"http://www.ted.com/";i:1;s:3:"TED";}i:2;i:2414;}i:122;a:3:{i:0;s:5:"cdata";i:1;a:1:{i:0;s:25:" - Ideas Worth Spreading ";}i:2;i:2441;}i:123;a:3:{i:0;s:9:"linebreak";i:1;a:0:{}i:2;i:2466;}i:124;a:3:{i:0;s:5:"cdata";i:1;a:1:{i:0;s:1:"
";}i:2;i:2468;}i:125;a:3:{i:0;s:12:"externallink";i:1;a:2:{i:0;s:48:"http://www.paris-26-gigapixels.com/index-fr.html";i:1;s:19:"Paris 26 Gigapixels";}i:2;i:2469;}i:126;a:3:{i:0;s:5:"cdata";i:1;a:1:{i:0;s:1:" ";}i:2;i:2541;}i:127;a:3:{i:0;s:9:"linebreak";i:1;a:0:{}i:2;i:2542;}i:128;a:3:{i:0;s:5:"cdata";i:1;a:1:{i:0;s:1:"
";}i:2;i:2544;}i:129;a:3:{i:0;s:12:"externallink";i:1;a:2:{i:0;s:47:"http://10minutemail.com/10MinuteMail/index.html";i:1;s:14:"10 Minute Mail";}i:2;i:2545;}i:130;a:3:{i:0;s:5:"cdata";i:1;a:1:{i:0;s:20:" - Temporary E-mail ";}i:2;i:2611;}i:131;a:3:{i:0;s:9:"linebreak";i:1;a:0:{}i:2;i:2631;}i:132;a:3:{i:0;s:5:"cdata";i:1;a:1:{i:0;s:1:"
";}i:2;i:2633;}i:133;a:3:{i:0;s:12:"externallink";i:1;a:2:{i:0;s:20:"http://hackaday.com/";i:1;s:10:"Hack a Day";}i:2;i:2634;}i:134;a:3:{i:0;s:5:"cdata";i:1;a:1:{i:0;s:82:" - Serves up fresh hacks each day, every day, and a special How-To hack each week ";}i:2;i:2669;}i:135;a:3:{i:0;s:9:"linebreak";i:1;a:0:{}i:2;i:2751;}i:136;a:3:{i:0;s:5:"cdata";i:1;a:1:{i:0;s:1:"
";}i:2;i:2753;}i:137;a:3:{i:0;s:12:"externallink";i:1;a:2:{i:0;s:19:"http://codepad.org/";i:1;s:7:"Codepad";}i:2;i:2754;}i:138;a:3:{i:0;s:5:"cdata";i:1;a:1:{i:0;s:32:" - On-line compiler/interpreter ";}i:2;i:2785;}i:139;a:3:{i:0;s:9:"linebreak";i:1;a:0:{}i:2;i:2817;}i:140;a:3:{i:0;s:5:"cdata";i:1;a:1:{i:0;s:1:"
";}i:2;i:2819;}i:141;a:3:{i:0;s:12:"externallink";i:1;a:2:{i:0;s:30:"http://www.calendario2010.org/";i:1;s:16:"Calendário 2010";}i:2;i:2820;}i:142;a:3:{i:0;s:5:"cdata";i:1;a:1:{i:0;s:1:" ";}i:2;i:2871;}i:143;a:3:{i:0;s:9:"linebreak";i:1;a:0:{}i:2;i:2872;}i:144;a:3:{i:0;s:5:"cdata";i:1;a:1:{i:0;s:1:"
";}i:2;i:2874;}i:145;a:3:{i:0;s:12:"externallink";i:1;a:2:{i:0;s:31:"http://kssilveira.pastebin.com/";i:1;s:8:"Pastebin";}i:2;i:2875;}i:146;a:3:{i:0;s:5:"cdata";i:1;a:1:{i:0;s:32:" - Collaborative Debugging Tool ";}i:2;i:2919;}i:147;a:3:{i:0;s:9:"linebreak";i:1;a:0:{}i:2;i:2951;}i:148;a:3:{i:0;s:5:"cdata";i:1;a:1:{i:0;s:1:"
";}i:2;i:2953;}i:149;a:3:{i:0;s:12:"externallink";i:1;a:2:{i:0;s:33:"http://www.pygments.com/colorize/";i:1;s:8:"Pygments";}i:2;i:2954;}i:150;a:3:{i:0;s:5:"cdata";i:1;a:1:{i:0;s:18:" - Code Colorizer ";}i:2;i:3000;}i:151;a:3:{i:0;s:9:"linebreak";i:1;a:0:{}i:2;i:3018;}i:152;a:3:{i:0;s:5:"cdata";i:1;a:1:{i:0;s:1:"
";}i:2;i:3020;}i:153;a:3:{i:0;s:12:"externallink";i:1;a:2:{i:0;s:18:"http://ideone.com/";i:1;s:6:"Ideone";}i:2;i:3021;}i:154;a:3:{i:0;s:5:"cdata";i:1;a:1:{i:0;s:38:" - Online compiler and debugging tool ";}i:2;i:3050;}i:155;a:3:{i:0;s:9:"linebreak";i:1;a:0:{}i:2;i:3088;}i:156;a:3:{i:0;s:5:"cdata";i:1;a:1:{i:0;s:1:"
";}i:2;i:3090;}i:157;a:3:{i:0;s:12:"externallink";i:1;a:2:{i:0;s:29:"http://news.usethesource.com/";i:1;s:12:"UseTheSource";}i:2;i:3091;}i:158;a:3:{i:0;s:5:"cdata";i:1;a:1:{i:0;s:61:" - A place where we can submit beautiful or fascinating code ";}i:2;i:3137;}i:159;a:3:{i:0;s:9:"linebreak";i:1;a:0:{}i:2;i:3198;}i:160;a:3:{i:0;s:7:"p_close";i:1;a:0:{}i:2;i:3200;}i:161;a:2:{i:0;s:6:"plugin";i:1;a:4:{i:0;s:7:"uparrow";i:1;a:1:{i:0;s:42:"lib/plugins/uparrow/images/tango-small.png";}i:2;i:1;i:3;s:6:"~~UP~~";}}i:162;a:3:{i:0;s:13:"section_close";i:1;a:0:{}i:2;i:3202;}i:163;a:3:{i:0;s:12:"section_edit";i:1;a:4:{i:0;i:2395;i:1;i:3201;i:2;i:2;i:3;s:5:"Sites";}i:2;i:3202;}i:164;a:3:{i:0;s:6:"header";i:1;a:3:{i:0;s:5:"Music";i:1;i:2;i:2;i:3202;}i:2;i:3202;}i:165;a:3:{i:0;s:12:"section_open";i:1;a:1:{i:0;i:2;}i:2;i:3202;}i:166;a:3:{i:0;s:6:"p_open";i:1;a:0:{}i:2;i:3219;}i:167;a:3:{i:0;s:5:"cdata";i:1;a:1:{i:0;s:1:"
";}i:2;i:3220;}i:168;a:3:{i:0;s:12:"externallink";i:1;a:2:{i:0;s:29:"http://listen.grooveshark.com";i:1;s:11:"Grooveshark";}i:2;i:3221;}i:169;a:3:{i:0;s:5:"cdata";i:1;a:1:{i:0;s:16:" - Online Radio ";}i:2;i:3266;}i:170;a:3:{i:0;s:9:"linebreak";i:1;a:0:{}i:2;i:3282;}i:171;a:3:{i:0;s:5:"cdata";i:1;a:1:{i:0;s:1:"
";}i:2;i:3284;}i:172;a:3:{i:0;s:12:"externallink";i:1;a:2:{i:0;s:21:"http://radiotime.com/";i:1;s:9:"RadioTime";}i:2;i:3285;}i:173;a:3:{i:0;s:5:"cdata";i:1;a:1:{i:0;s:57:" - Find and Listen to Talk, Music and Local Radio Online ";}i:2;i:3320;}i:174;a:3:{i:0;s:9:"linebreak";i:1;a:0:{}i:2;i:3377;}i:175;a:3:{i:0;s:5:"cdata";i:1;a:1:{i:0;s:1:"
";}i:2;i:3379;}i:176;a:3:{i:0;s:12:"externallink";i:1;a:2:{i:0;s:23:"http://www.solfege.org/";i:1;s:11:"GNU Solfege";}i:2;i:3380;}i:177;a:3:{i:0;s:5:"cdata";i:1;a:1:{i:0;s:30:" - Free ear training software ";}i:2;i:3419;}i:178;a:3:{i:0;s:9:"linebreak";i:1;a:0:{}i:2;i:3449;}i:179;a:3:{i:0;s:7:"p_close";i:1;a:0:{}i:2;i:3451;}i:180;a:2:{i:0;s:6:"plugin";i:1;a:4:{i:0;s:7:"uparrow";i:1;a:1:{i:0;s:42:"lib/plugins/uparrow/images/tango-small.png";}i:2;i:1;i:3;s:6:"~~UP~~";}}i:181;a:3:{i:0;s:13:"section_close";i:1;a:0:{}i:2;i:3453;}i:182;a:3:{i:0;s:12:"section_edit";i:1;a:4:{i:0;i:3202;i:1;i:3452;i:2;i:2;i:3;s:5:"Music";}i:2;i:3453;}i:183;a:3:{i:0;s:6:"header";i:1;a:3:{i:0;s:8:"Tutorial";i:1;i:2;i:2;i:3453;}i:2;i:3453;}i:184;a:3:{i:0;s:12:"section_open";i:1;a:1:{i:0;i:2;}i:2;i:3453;}i:185;a:3:{i:0;s:6:"p_open";i:1;a:0:{}i:2;i:3473;}i:186;a:3:{i:0;s:5:"cdata";i:1;a:1:{i:0;s:1:"
";}i:2;i:3474;}i:187;a:3:{i:0;s:12:"externallink";i:1;a:2:{i:0;s:34:"http://www.extremeprogramming.org/";i:1;s:17:"Xtreme Programing";}i:2;i:3475;}i:188;a:3:{i:0;s:5:"cdata";i:1;a:1:{i:0;s:1:" ";}i:2;i:3531;}i:189;a:3:{i:0;s:9:"linebreak";i:1;a:0:{}i:2;i:3532;}i:190;a:3:{i:0;s:5:"cdata";i:1;a:1:{i:0;s:1:"
";}i:2;i:3534;}i:191;a:3:{i:0;s:12:"externallink";i:1;a:2:{i:0;s:43:"http://catb.org/~esr/faqs/hacker-howto.html";i:1;s:18:"How To Be A Hacker";}i:2;i:3535;}i:192;a:3:{i:0;s:5:"cdata";i:1;a:1:{i:0;s:1:" ";}i:2;i:3601;}i:193;a:3:{i:0;s:9:"linebreak";i:1;a:0:{}i:2;i:3602;}i:194;a:3:{i:0;s:5:"cdata";i:1;a:1:{i:0;s:1:"
";}i:2;i:3604;}i:195;a:3:{i:0;s:12:"externallink";i:1;a:2:{i:0;s:35:"http://maycon.hacknroll.com/?p=docs";i:1;s:12:"Out Of Bound";}i:2;i:3605;}i:196;a:3:{i:0;s:5:"cdata";i:1;a:1:{i:0;s:52:" - Tutorials about Buffer Overflow, Shellcode, etc. ";}i:2;i:3657;}i:197;a:3:{i:0;s:9:"linebreak";i:1;a:0:{}i:2;i:3709;}i:198;a:3:{i:0;s:5:"cdata";i:1;a:1:{i:0;s:1:"
";}i:2;i:3711;}i:199;a:3:{i:0;s:13:"internalmedia";i:1;a:7:{i:0;s:20:":doxygen_summary.pdf";i:1;s:7:"Doxygen";i:2;N;i:3;N;i:4;N;i:5;s:5:"cache";i:6;s:7:"details";}i:2;i:3712;}i:200;a:3:{i:0;s:5:"cdata";i:1;a:1:{i:0;s:1:" ";}i:2;i:3744;}i:201;a:3:{i:0;s:9:"linebreak";i:1;a:0:{}i:2;i:3745;}i:202;a:3:{i:0;s:5:"cdata";i:1;a:1:{i:0;s:1:"
";}i:2;i:3747;}i:203;a:3:{i:0;s:13:"internalmedia";i:1;a:7:{i:0;s:21:":graphviz_summary.pdf";i:1;s:8:"Graphviz";i:2;N;i:3;N;i:4;N;i:5;s:5:"cache";i:6;s:7:"details";}i:2;i:3748;}i:204;a:3:{i:0;s:5:"cdata";i:1;a:1:{i:0;s:1:" ";}i:2;i:3782;}i:205;a:3:{i:0;s:9:"linebreak";i:1;a:0:{}i:2;i:3783;}i:206;a:3:{i:0;s:5:"cdata";i:1;a:1:{i:0;s:1:"
";}i:2;i:3785;}i:207;a:3:{i:0;s:12:"externallink";i:1;a:2:{i:0;s:49:"http://ocw.mit.edu/OcwWeb/web/home/home/index.htm";i:1;s:20:"MIT Open Source Ware";}i:2;i:3786;}i:208;a:3:{i:0;s:5:"cdata";i:1;a:1:{i:0;s:31:" - Free Online Course Material ";}i:2;i:3860;}i:209;a:3:{i:0;s:9:"linebreak";i:1;a:0:{}i:2;i:3891;}i:210;a:3:{i:0;s:5:"cdata";i:1;a:1:{i:0;s:1:"
";}i:2;i:3893;}i:211;a:3:{i:0;s:12:"externallink";i:1;a:2:{i:0;s:36:"http://see.stanford.edu/default.aspx";i:1;s:31:"Stanford Engineering Everywhere";}i:2;i:3894;}i:212;a:3:{i:0;s:5:"cdata";i:1;a:1:{i:0;s:38:" - Engineering Classes Free of Charge ";}i:2;i:3966;}i:213;a:3:{i:0;s:9:"linebreak";i:1;a:0:{}i:2;i:4004;}i:214;a:3:{i:0;s:5:"cdata";i:1;a:1:{i:0;s:1:"
";}i:2;i:4006;}i:215;a:3:{i:0;s:12:"externallink";i:1;a:2:{i:0;s:49:"http://www.ws.binghamton.edu/fridrich/system.html";i:1;s:12:"Rubik's Cube";}i:2;i:4007;}i:216;a:3:{i:0;s:5:"cdata";i:1;a:1:{i:0;s:44:" - Solving in an average time of 17 seconds ";}i:2;i:4073;}i:217;a:3:{i:0;s:9:"linebreak";i:1;a:0:{}i:2;i:4117;}i:218;a:3:{i:0;s:5:"cdata";i:1;a:1:{i:0;s:1:"
";}i:2;i:4119;}i:219;a:3:{i:0;s:12:"externallink";i:1;a:2:{i:0;s:47:"http://www.speedcubing.com/f2l_crossbottom.html";i:1;s:12:"Rubik's Cube";}i:2;i:4120;}i:220;a:3:{i:0;s:5:"cdata";i:1;a:1:{i:0;s:52:" - Corners of first layer and edges of second layer ";}i:2;i:4184;}i:221;a:3:{i:0;s:9:"linebreak";i:1;a:0:{}i:2;i:4236;}i:222;a:3:{i:0;s:5:"cdata";i:1;a:1:{i:0;s:1:"
";}i:2;i:4238;}i:223;a:3:{i:0;s:12:"externallink";i:1;a:2:{i:0;s:55:"http://www.ws.binghamton.edu/fridrich/Mike/permute.html";i:1;s:12:"Rubik's Cube";}i:2;i:4239;}i:224;a:3:{i:0;s:5:"cdata";i:1;a:1:{i:0;s:28:" - Permuting the last layer ";}i:2;i:4311;}i:225;a:3:{i:0;s:9:"linebreak";i:1;a:0:{}i:2;i:4339;}i:226;a:3:{i:0;s:5:"cdata";i:1;a:1:{i:0;s:1:"
";}i:2;i:4341;}i:227;a:3:{i:0;s:12:"externallink";i:1;a:2:{i:0;s:54:"http://www.ws.binghamton.edu/fridrich/Mike/orient.html";i:1;s:12:"Rubik's Cube";}i:2;i:4342;}i:228;a:3:{i:0;s:5:"cdata";i:1;a:1:{i:0;s:28:" - Orienting the last layer ";}i:2;i:4413;}i:229;a:3:{i:0;s:9:"linebreak";i:1;a:0:{}i:2;i:4441;}i:230;a:3:{i:0;s:5:"cdata";i:1;a:1:{i:0;s:1:"
";}i:2;i:4443;}i:231;a:3:{i:0;s:12:"externallink";i:1;a:2:{i:0;s:48:"http://www.phrack.org/issues.html?id=14&issue=49";i:1;s:15:"Phrack Magazine";}i:2;i:4444;}i:232;a:3:{i:0;s:5:"cdata";i:1;a:1:{i:0;s:41:" - Smashing the stack for fun and profit ";}i:2;i:4512;}i:233;a:3:{i:0;s:9:"linebreak";i:1;a:0:{}i:2;i:4553;}i:234;a:3:{i:0;s:5:"cdata";i:1;a:1:{i:0;s:1:"
";}i:2;i:4555;}i:235;a:3:{i:0;s:13:"internalmedia";i:1;a:7:{i:0;s:28:"languages:canivete-shell.pdf";i:1;s:14:"Canivete Shell";i:2;N;i:3;N;i:4;N;i:5;s:5:"cache";i:6;s:7:"details";}i:2;i:4556;}i:236;a:3:{i:0;s:5:"cdata";i:1;a:1:{i:0;s:1:" ";}i:2;i:4603;}i:237;a:3:{i:0;s:9:"linebreak";i:1;a:0:{}i:2;i:4604;}i:238;a:3:{i:0;s:5:"cdata";i:1;a:1:{i:0;s:1:"
";}i:2;i:4606;}i:239;a:3:{i:0;s:13:"internalmedia";i:1;a:7:{i:0;s:13:"autotools.pdf";i:1;s:19:"Using GNU Autotools";i:2;N;i:3;N;i:4;N;i:5;s:5:"cache";i:6;s:7:"details";}i:2;i:4607;}i:240;a:3:{i:0;s:5:"cdata";i:1;a:1:{i:0;s:1:" ";}i:2;i:4644;}i:241;a:3:{i:0;s:9:"linebreak";i:1;a:0:{}i:2;i:4645;}i:242;a:3:{i:0;s:7:"p_close";i:1;a:0:{}i:2;i:4647;}i:243;a:2:{i:0;s:6:"plugin";i:1;a:4:{i:0;s:7:"uparrow";i:1;a:1:{i:0;s:42:"lib/plugins/uparrow/images/tango-small.png";}i:2;i:1;i:3;s:6:"~~UP~~";}}i:244;a:3:{i:0;s:13:"section_close";i:1;a:0:{}i:2;i:4649;}i:245;a:3:{i:0;s:12:"section_edit";i:1;a:4:{i:0;i:3453;i:1;i:4648;i:2;i:2;i:3;s:8:"Tutorial";}i:2;i:4649;}i:246;a:3:{i:0;s:6:"header";i:1;a:3:{i:0;s:8:"Articles";i:1;i:2;i:2;i:4649;}i:2;i:4649;}i:247;a:3:{i:0;s:12:"section_open";i:1;a:1:{i:0;i:2;}i:2;i:4649;}i:248;a:3:{i:0;s:6:"p_open";i:1;a:0:{}i:2;i:4669;}i:249;a:3:{i:0;s:5:"cdata";i:1;a:1:{i:0;s:1:"
";}i:2;i:4670;}i:250;a:3:{i:0;s:13:"internalmedia";i:1;a:7:{i:0;s:24:":death_by_powerpoint.pdf";i:1;s:58:"Alexei Kapterev, Death By Powerpoint (and how to fight it)";i:2;N;i:3;N;i:4;N;i:5;s:5:"cache";i:6;s:7:"details";}i:2;i:4671;}i:251;a:3:{i:0;s:5:"cdata";i:1;a:1:{i:0;s:1:" ";}i:2;i:4758;}i:252;a:3:{i:0;s:9:"linebreak";i:1;a:0:{}i:2;i:4759;}i:253;a:3:{i:0;s:5:"cdata";i:1;a:1:{i:0;s:1:"
";}i:2;i:4761;}i:254;a:3:{i:0;s:13:"internalmedia";i:1;a:7:{i:0;s:24:":portuguese_research.pdf";i:1;s:67:"Michael Athans, Portuguese Research Universities: Why not the best?";i:2;N;i:3;N;i:4;N;i:5;s:5:"cache";i:6;s:7:"details";}i:2;i:4762;}i:255;a:3:{i:0;s:5:"cdata";i:1;a:1:{i:0;s:1:" ";}i:2;i:4858;}i:256;a:3:{i:0;s:9:"linebreak";i:1;a:0:{}i:2;i:4859;}i:257;a:3:{i:0;s:5:"cdata";i:1;a:1:{i:0;s:1:"
";}i:2;i:4861;}i:258;a:3:{i:0;s:13:"internalmedia";i:1;a:7:{i:0;s:32:":return_oriented_programming.pdf";i:1;s:122:"Erik Buchanan, Ryan Roemer, Stefan Savage, Hovav Shacham, Return-oriented Programming: Exploitation without Code Injection";i:2;N;i:3;N;i:4;N;i:5;s:5:"cache";i:6;s:7:"details";}i:2;i:4862;}i:259;a:3:{i:0;s:5:"cdata";i:1;a:1:{i:0;s:1:" ";}i:2;i:5021;}i:260;a:3:{i:0;s:9:"linebreak";i:1;a:0:{}i:2;i:5022;}i:261;a:3:{i:0;s:7:"p_close";i:1;a:0:{}i:2;i:5024;}i:262;a:3:{i:0;s:6:"p_open";i:1;a:0:{}i:2;i:5024;}i:263;a:3:{i:0;s:6:"plugin";i:1;a:4:{i:0;s:11:"htmlcomment";i:1;a:2:{i:0;i:5;i:1;s:7:" [[|]] ";}i:2;i:5;i:3;s:14:"<!-- [[|]] -->";}i:2;i:5026;}i:264;a:3:{i:0;s:7:"p_close";i:1;a:0:{}i:2;i:5040;}i:265;a:2:{i:0;s:6:"plugin";i:1;a:4:{i:0;s:7:"uparrow";i:1;a:1:{i:0;s:42:"lib/plugins/uparrow/images/tango-small.png";}i:2;i:1;i:3;s:6:"~~UP~~";}}i:266;a:3:{i:0;s:13:"section_close";i:1;a:0:{}i:2;i:5042;}i:267;a:3:{i:0;s:12:"section_edit";i:1;a:4:{i:0;i:4649;i:1;i:5041;i:2;i:2;i:3;s:8:"Articles";}i:2;i:5042;}i:268;a:3:{i:0;s:6:"header";i:1;a:3:{i:0;s:5:"Games";i:1;i:2;i:2;i:5042;}i:2;i:5042;}i:269;a:3:{i:0;s:12:"section_open";i:1;a:1:{i:0;i:2;}i:2;i:5042;}i:270;a:3:{i:0;s:6:"p_open";i:1;a:0:{}i:2;i:5059;}i:271;a:3:{i:0;s:12:"externallink";i:1;a:2:{i:0;s:51:"http://www.bbc.co.uk/science/humanbody/sleep/sheep/";i:1;s:11:"Sheep Dash!";}i:2;i:5060;}i:272;a:3:{i:0;s:5:"cdata";i:1;a:1:{i:0;s:43:" - Test to see how fast are your reactions ";}i:2;i:5127;}i:273;a:3:{i:0;s:9:"linebreak";i:1;a:0:{}i:2;i:5170;}i:274;a:3:{i:0;s:5:"cdata";i:1;a:1:{i:0;s:1:"
";}i:2;i:5172;}i:275;a:3:{i:0;s:12:"externallink";i:1;a:2:{i:0;s:34:"http://nintendo8.com/toplist/more/";i:1;s:13:"Nintendo8.com";}i:2;i:5173;}i:276;a:3:{i:0;s:5:"cdata";i:1;a:1:{i:0;s:39:" - Classic Nintendo 8-bit games online ";}i:2;i:5225;}i:277;a:3:{i:0;s:9:"linebreak";i:1;a:0:{}i:2;i:5264;}i:278;a:3:{i:0;s:7:"p_close";i:1;a:0:{}i:2;i:5266;}i:279;a:2:{i:0;s:6:"plugin";i:1;a:4:{i:0;s:7:"uparrow";i:1;a:1:{i:0;s:42:"lib/plugins/uparrow/images/tango-small.png";}i:2;i:1;i:3;s:6:"~~UP~~";}}i:280;a:3:{i:0;s:13:"section_close";i:1;a:0:{}i:2;i:5268;}i:281;a:3:{i:0;s:12:"section_edit";i:1;a:4:{i:0;i:5042;i:1;i:5267;i:2;i:2;i:3;s:5:"Games";}i:2;i:5268;}i:282;a:3:{i:0;s:6:"header";i:1;a:3:{i:0;s:6:"Movies";i:1;i:2;i:2;i:5268;}i:2;i:5268;}i:283;a:3:{i:0;s:12:"section_open";i:1;a:1:{i:0;i:2;}i:2;i:5268;}i:284;a:3:{i:0;s:6:"p_open";i:1;a:0:{}i:2;i:5286;}i:285;a:3:{i:0;s:13:"interwikilink";i:1;a:4:{i:0;s:12:"wp>Pi_(film)";i:1;s:2:"Pi";i:2;s:2:"wp";i:3;s:9:"Pi_(film)";}i:2;i:5287;}i:286;a:3:{i:0;s:5:"cdata";i:1;a:1:{i:0;s:1:" ";}i:2;i:5306;}i:287;a:3:{i:0;s:9:"linebreak";i:1;a:0:{}i:2;i:5307;}i:288;a:3:{i:0;s:5:"cdata";i:1;a:1:{i:0;s:1:"
";}i:2;i:5309;}i:289;a:3:{i:0;s:13:"interwikilink";i:1;a:4:{i:0;s:15:"wp>Hitch_(film)";i:1;s:5:"Hitch";i:2;s:2:"wp";i:3;s:12:"Hitch_(film)";}i:2;i:5310;}i:290;a:3:{i:0;s:5:"cdata";i:1;a:1:{i:0;s:1:" ";}i:2;i:5335;}i:291;a:3:{i:0;s:9:"linebreak";i:1;a:0:{}i:2;i:5336;}i:292;a:3:{i:0;s:5:"cdata";i:1;a:1:{i:0;s:1:"
";}i:2;i:5338;}i:293;a:3:{i:0;s:13:"interwikilink";i:1;a:4:{i:0;s:17:"wp>Hackers_(film)";i:1;s:7:"Hackers";i:2;s:2:"wp";i:3;s:14:"Hackers_(film)";}i:2;i:5339;}i:294;a:3:{i:0;s:5:"cdata";i:1;a:1:{i:0;s:1:" ";}i:2;i:5368;}i:295;a:3:{i:0;s:9:"linebreak";i:1;a:0:{}i:2;i:5369;}i:296;a:3:{i:0;s:5:"cdata";i:1;a:1:{i:0;s:1:"
";}i:2;i:5371;}i:297;a:3:{i:0;s:13:"interwikilink";i:1;a:4:{i:0;s:28:"wp>Pirates_of_Silicon_Valley";i:1;s:25:"Pirates of Silicon Valley";i:2;s:2:"wp";i:3;s:25:"Pirates_of_Silicon_Valley";}i:2;i:5372;}i:298;a:3:{i:0;s:5:"cdata";i:1;a:1:{i:0;s:1:" ";}i:2;i:5430;}i:299;a:3:{i:0;s:9:"linebreak";i:1;a:0:{}i:2;i:5431;}i:300;a:3:{i:0;s:5:"cdata";i:1;a:1:{i:0;s:1:"
";}i:2;i:5433;}i:301;a:3:{i:0;s:13:"interwikilink";i:1;a:4:{i:0;s:19:"wp>Swordfish_(film)";i:1;s:9:"Swordfish";i:2;s:2:"wp";i:3;s:16:"Swordfish_(film)";}i:2;i:5434;}i:302;a:3:{i:0;s:5:"cdata";i:1;a:1:{i:0;s:1:" ";}i:2;i:5467;}i:303;a:3:{i:0;s:9:"linebreak";i:1;a:0:{}i:2;i:5468;}i:304;a:3:{i:0;s:7:"p_close";i:1;a:0:{}i:2;i:5470;}i:305;a:3:{i:0;s:6:"plugin";i:1;a:4:{i:0;s:7:"tag_tag";i:1;a:1:{i:0;s:5:"links";}i:2;i:5;i:3;s:13:"{{tag>links}}";}i:2;i:5473;}i:306;a:2:{i:0;s:6:"plugin";i:1;a:4:{i:0;s:7:"uparrow";i:1;a:1:{i:0;s:42:"lib/plugins/uparrow/images/tango-small.png";}i:2;i:1;i:3;s:6:"~~UP~~";}}i:307;a:3:{i:0;s:13:"section_close";i:1;a:0:{}i:2;i:5486;}i:308;a:3:{i:0;s:12:"section_edit";i:1;a:4:{i:0;i:5268;i:1;i:0;i:2;i:2;i:3;s:6:"Movies";}i:2;i:5486;}i:309;a:3:{i:0;s:12:"document_end";i:1;a:0:{}i:2;i:5486;}}