a:30:{i:0;a:3:{i:0;s:14:"document_start";i:1;a:0:{}i:2;i:0;}i:1;a:3:{i:0;s:6:"p_open";i:1;a:0:{}i:2;i:0;}i:2;a:3:{i:0;s:7:"p_close";i:1;a:0:{}i:2;i:1;}i:3;a:3:{i:0;s:12:"section_edit";i:1;a:4:{i:0;i:-1;i:1;i:0;i:2;i:1;i:3;s:0:"";}i:2;i:1;}i:4;a:3:{i:0;s:6:"header";i:1;a:3:{i:0;s:6:"OpenGL";i:1;i:1;i:2;i:1;}i:2;i:1;}i:5;a:3:{i:0;s:12:"section_open";i:1;a:1:{i:0;i:1;}i:2;i:1;}i:6;a:3:{i:0;s:6:"p_open";i:1;a:0:{}i:2;i:21;}i:7;a:3:{i:0;s:5:"cdata";i:1;a:1:{i:0;s:1:"
";}i:2;i:22;}i:8;a:3:{i:0;s:12:"externallink";i:1;a:2:{i:0;s:22:"http://www.opengl.org/";i:1;s:6:"OpenGL";}i:2;i:23;}i:9;a:3:{i:0;s:5:"cdata";i:1;a:1:{i:0;s:2:": ";}i:2;i:56;}i:10;a:3:{i:0;s:13:"interwikilink";i:1;a:4:{i:0;s:9:"wp>OpenGL";i:1;N;i:2;s:2:"wp";i:3;s:6:"OpenGL";}i:2;i:58;}i:11;a:3:{i:0;s:5:"cdata";i:1;a:1:{i:0;s:25:" - Open Graphics Library ";}i:2;i:71;}i:12;a:3:{i:0;s:9:"linebreak";i:1;a:0:{}i:2;i:96;}i:13;a:3:{i:0;s:5:"cdata";i:1;a:1:{i:0;s:1:"
";}i:2;i:98;}i:14;a:3:{i:0;s:12:"externallink";i:1;a:2:{i:0;s:47:"http://www.opengl.org/resources/libraries/glut/";i:1;s:4:"GLUT";}i:2;i:99;}i:15;a:3:{i:0;s:5:"cdata";i:1;a:1:{i:0;s:2:": ";}i:2;i:155;}i:16;a:3:{i:0;s:13:"interwikilink";i:1;a:4:{i:0;s:25:"wp>OpenGL_Utility_Toolkit";i:1;s:4:"GLUT";i:2;s:2:"wp";i:3;s:22:"OpenGL_Utility_Toolkit";}i:2;i:157;}i:17;a:3:{i:0;s:5:"cdata";i:1;a:1:{i:0;s:30:" - The OpenGL Utility Toolkit ";}i:2;i:191;}i:18;a:3:{i:0;s:9:"linebreak";i:1;a:0:{}i:2;i:221;}i:19;a:3:{i:0;s:5:"cdata";i:1;a:1:{i:0;s:1:"
";}i:2;i:223;}i:20;a:3:{i:0;s:12:"externallink";i:1;a:2:{i:0;s:28:"http://glui.sourceforge.net/";i:1;s:4:"GLUI";}i:2;i:224;}i:21;a:3:{i:0;s:5:"cdata";i:1;a:1:{i:0;s:2:": ";}i:2;i:261;}i:22;a:3:{i:0;s:13:"interwikilink";i:1;a:4:{i:0;s:32:"wp>OpenGL_User_Interface_Library";i:1;s:4:"GLUI";i:2;s:2:"wp";i:3;s:29:"OpenGL_User_Interface_Library";}i:2;i:263;}i:23;a:3:{i:0;s:5:"cdata";i:1;a:1:{i:0;s:41:" - GLUT-based C++ user interface library ";}i:2;i:304;}i:24;a:3:{i:0;s:9:"linebreak";i:1;a:0:{}i:2;i:345;}i:25;a:3:{i:0;s:5:"cdata";i:1;a:1:{i:0;s:1:"
";}i:2;i:347;}i:26;a:3:{i:0;s:7:"p_close";i:1;a:0:{}i:2;i:347;}i:27;a:2:{i:0;s:6:"plugin";i:1;a:4:{i:0;s:7:"uparrow";i:1;a:1:{i:0;s:42:"lib/plugins/uparrow/images/tango-small.png";}i:2;i:1;i:3;s:6:"~~UP~~";}}i:28;a:3:{i:0;s:13:"section_close";i:1;a:0:{}i:2;i:347;}i:29;a:3:{i:0;s:12:"document_end";i:1;a:0:{}i:2;i:347;}}