a:23:{i:0;a:3:{i:0;s:14:"document_start";i:1;a:0:{}i:2;i:0;}i:1;a:3:{i:0;s:6:"p_open";i:1;a:0:{}i:2;i:0;}i:2;a:3:{i:0;s:7:"p_close";i:1;a:0:{}i:2;i:1;}i:3;a:3:{i:0;s:12:"section_edit";i:1;a:4:{i:0;i:-1;i:1;i:0;i:2;i:1;i:3;s:0:"";}i:2;i:1;}i:4;a:3:{i:0;s:6:"header";i:1;a:3:{i:0;s:3:"PHP";i:1;i:1;i:2;i:1;}i:2;i:1;}i:5;a:3:{i:0;s:12:"section_open";i:1;a:1:{i:0;i:1;}i:2;i:1;}i:6;a:3:{i:0;s:6:"p_open";i:1;a:0:{}i:2;i:18;}i:7;a:3:{i:0;s:5:"cdata";i:1;a:1:{i:0;s:1:"
";}i:2;i:19;}i:8;a:3:{i:0;s:12:"externallink";i:1;a:2:{i:0;s:15:"http://php.net/";i:1;s:3:"PHP";}i:2;i:20;}i:9;a:3:{i:0;s:5:"cdata";i:1;a:1:{i:0;s:2:": ";}i:2;i:43;}i:10;a:3:{i:0;s:13:"interwikilink";i:1;a:4:{i:0;s:6:"wp>PHP";i:1;N;i:2;s:2:"wp";i:3;s:3:"PHP";}i:2;i:45;}i:11;a:3:{i:0;s:7:"p_close";i:1;a:0:{}i:2;i:55;}i:12;a:2:{i:0;s:6:"plugin";i:1;a:4:{i:0;s:7:"uparrow";i:1;a:1:{i:0;s:42:"lib/plugins/uparrow/images/tango-small.png";}i:2;i:1;i:3;s:6:"~~UP~~";}}i:13;a:3:{i:0;s:13:"section_close";i:1;a:0:{}i:2;i:57;}i:14;a:3:{i:0;s:12:"section_edit";i:1;a:4:{i:0;i:1;i:1;i:56;i:2;i:1;i:3;s:3:"PHP";}i:2;i:57;}i:15;a:3:{i:0;s:6:"header";i:1;a:3:{i:0;s:31:"How to get the current page URL";i:1;i:2;i:2;i:57;}i:2;i:57;}i:16;a:3:{i:0;s:12:"section_open";i:1;a:1:{i:0;i:2;}i:2;i:57;}i:17;a:3:{i:0;s:4:"code";i:1;a:3:{i:0;s:240:"
<?php
  echo $_SERVER["REQUEST_URI"]; /* /~kssilveira/site/doku.php?id=php */
  echo $_SERVER["SCRIPT_NAME"]; /* /~kssilveira/site/doku.php */
  echo substr($_SERVER["SCRIPT_NAME"],strrpos($_SERVER["SCRIPT_NAME"],"/")+1) /* doku.php */
?>
";i:1;s:3:"php";i:2;N;}i:2;i:107;}i:18;a:3:{i:0;s:6:"plugin";i:1;a:4:{i:0;s:7:"tag_tag";i:1;a:1:{i:0;s:11:"programming";}i:2;i:5;i:3;s:19:"{{tag>programming}}";}i:2;i:362;}i:19;a:2:{i:0;s:6:"plugin";i:1;a:4:{i:0;s:7:"uparrow";i:1;a:1:{i:0;s:42:"lib/plugins/uparrow/images/tango-small.png";}i:2;i:1;i:3;s:6:"~~UP~~";}}i:20;a:3:{i:0;s:13:"section_close";i:1;a:0:{}i:2;i:382;}i:21;a:3:{i:0;s:12:"section_edit";i:1;a:4:{i:0;i:57;i:1;i:0;i:2;i:2;i:3;s:31:"How to get the current page URL";}i:2;i:382;}i:22;a:3:{i:0;s:12:"document_end";i:1;a:0:{}i:2;i:382;}}