a:34:{i:0;a:3:{i:0;s:14:"document_start";i:1;a:0:{}i:2;i:0;}i:1;a:3:{i:0;s:6:"p_open";i:1;a:0:{}i:2;i:0;}i:2;a:3:{i:0;s:7:"p_close";i:1;a:0:{}i:2;i:1;}i:3;a:3:{i:0;s:12:"section_edit";i:1;a:4:{i:0;i:-1;i:1;i:0;i:2;i:1;i:3;s:0:"";}i:2;i:1;}i:4;a:3:{i:0;s:6:"header";i:1;a:3:{i:0;s:8:"Code Jam";i:1;i:1;i:2;i:1;}i:2;i:1;}i:5;a:3:{i:0;s:12:"section_open";i:1;a:1:{i:0;i:1;}i:2;i:1;}i:6;a:3:{i:0;s:6:"p_open";i:1;a:0:{}i:2;i:23;}i:7;a:3:{i:0;s:5:"cdata";i:1;a:1:{i:0;s:1:"
";}i:2;i:24;}i:8;a:3:{i:0;s:12:"externallink";i:1;a:2:{i:0;s:31:"http://code.google.com/codejam/";i:1;s:15:"Google Code Jam";}i:2;i:25;}i:9;a:3:{i:0;s:5:"cdata";i:1;a:1:{i:0;s:2:": ";}i:2;i:76;}i:10;a:3:{i:0;s:13:"interwikilink";i:1;a:4:{i:0;s:18:"wp>Google_Code_Jam";i:1;s:15:"Google Code Jam";i:2;s:2:"wp";i:3;s:15:"Google_Code_Jam";}i:2;i:78;}i:11;a:3:{i:0;s:5:"cdata";i:1;a:1:{i:0;s:1:" ";}i:2;i:116;}i:12;a:3:{i:0;s:9:"linebreak";i:1;a:0:{}i:2;i:117;}i:13;a:3:{i:0;s:7:"p_close";i:1;a:0:{}i:2;i:119;}i:14;a:2:{i:0;s:6:"plugin";i:1;a:4:{i:0;s:7:"uparrow";i:1;a:1:{i:0;s:42:"lib/plugins/uparrow/images/tango-small.png";}i:2;i:1;i:3;s:6:"~~UP~~";}}i:15;a:3:{i:0;s:13:"section_close";i:1;a:0:{}i:2;i:121;}i:16;a:3:{i:0;s:12:"section_edit";i:1;a:4:{i:0;i:1;i:1;i:120;i:2;i:1;i:3;s:8:"Code Jam";}i:2;i:121;}i:17;a:3:{i:0;s:6:"header";i:1;a:3:{i:0;s:15:"My Performances";i:1;i:2;i:2;i:121;}i:2;i:121;}i:18;a:3:{i:0;s:12:"section_open";i:1;a:1:{i:0;i:2;}i:2;i:121;}i:19;a:3:{i:0;s:6:"p_open";i:1;a:0:{}i:2;i:148;}i:20;a:3:{i:0;s:5:"cdata";i:1;a:1:{i:0;s:1:"
";}i:2;i:149;}i:21;a:3:{i:0;s:12:"externallink";i:1;a:2:{i:0;s:65:"http://code.google.com/codejam/contest/scoreboard?c=544101#sp=521";i:1;s:22:"2010 - Round1A (524th)";}i:2;i:150;}i:22;a:3:{i:0;s:5:"cdata";i:1;a:1:{i:0;s:1:" ";}i:2;i:242;}i:23;a:3:{i:0;s:9:"linebreak";i:1;a:0:{}i:2;i:243;}i:24;a:3:{i:0;s:5:"cdata";i:1;a:1:{i:0;s:1:"
";}i:2;i:245;}i:25;a:3:{i:0;s:12:"externallink";i:1;a:2:{i:0;s:66:"http://code.google.com/codejam/contest/scoreboard?c=635102#sp=1081";i:1;s:22:"2010 - Round2 (1093th)";}i:2;i:246;}i:26;a:3:{i:0;s:5:"cdata";i:1;a:1:{i:0;s:1:" ";}i:2;i:339;}i:27;a:3:{i:0;s:9:"linebreak";i:1;a:0:{}i:2;i:340;}i:28;a:3:{i:0;s:5:"cdata";i:1;a:1:{i:0;s:1:"
";}i:2;i:342;}i:29;a:3:{i:0;s:7:"p_close";i:1;a:0:{}i:2;i:342;}i:30;a:2:{i:0;s:6:"plugin";i:1;a:4:{i:0;s:7:"uparrow";i:1;a:1:{i:0;s:42:"lib/plugins/uparrow/images/tango-small.png";}i:2;i:1;i:3;s:6:"~~UP~~";}}i:31;a:3:{i:0;s:13:"section_close";i:1;a:0:{}i:2;i:342;}i:32;a:3:{i:0;s:12:"section_edit";i:1;a:4:{i:0;i:121;i:1;i:0;i:2;i:2;i:3;s:15:"My Performances";}i:2;i:342;}i:33;a:3:{i:0;s:12:"document_end";i:1;a:0:{}i:2;i:342;}}