a:34:{i:0;a:3:{i:0;s:14:"document_start";i:1;a:0:{}i:2;i:0;}i:1;a:3:{i:0;s:6:"p_open";i:1;a:0:{}i:2;i:0;}i:2;a:3:{i:0;s:7:"p_close";i:1;a:0:{}i:2;i:1;}i:3;a:3:{i:0;s:12:"section_edit";i:1;a:4:{i:0;i:-1;i:1;i:0;i:2;i:1;i:3;s:0:"";}i:2;i:1;}i:4;a:3:{i:0;s:6:"header";i:1;a:3:{i:0;s:12:"Competitions";i:1;i:1;i:2;i:1;}i:2;i:1;}i:5;a:3:{i:0;s:12:"section_open";i:1;a:1:{i:0;i:1;}i:2;i:1;}i:6;a:3:{i:0;s:6:"p_open";i:1;a:0:{}i:2;i:27;}i:7;a:3:{i:0;s:5:"cdata";i:1;a:1:{i:0;s:1:"
";}i:2;i:28;}i:8;a:3:{i:0;s:12:"internallink";i:1;a:2:{i:0;s:21:"competitions:topcoder";i:1;s:8:"TopCoder";}i:2;i:29;}i:9;a:3:{i:0;s:5:"cdata";i:1;a:1:{i:0;s:1:" ";}i:2;i:63;}i:10;a:3:{i:0;s:9:"linebreak";i:1;a:0:{}i:2;i:64;}i:11;a:3:{i:0;s:5:"cdata";i:1;a:1:{i:0;s:1:"
";}i:2;i:66;}i:12;a:3:{i:0;s:12:"externallink";i:1;a:2:{i:0;s:33:"http://cm.baylor.edu/welcome.icpc";i:1;s:48:"ACM Internacional Collegiate Programming Contest";}i:2;i:67;}i:13;a:3:{i:0;s:5:"cdata";i:1;a:1:{i:0;s:1:" ";}i:2;i:153;}i:14;a:3:{i:0;s:9:"linebreak";i:1;a:0:{}i:2;i:154;}i:15;a:3:{i:0;s:5:"cdata";i:1;a:1:{i:0;s:1:"
";}i:2;i:156;}i:16;a:3:{i:0;s:12:"externallink";i:1;a:2:{i:0;s:31:"http://code.google.com/codejam/";i:1;s:15:"Google Code Jam";}i:2;i:157;}i:17;a:3:{i:0;s:5:"cdata";i:1;a:1:{i:0;s:1:" ";}i:2;i:208;}i:18;a:3:{i:0;s:9:"linebreak";i:1;a:0:{}i:2;i:209;}i:19;a:3:{i:0;s:5:"cdata";i:1;a:1:{i:0;s:1:"
";}i:2;i:211;}i:20;a:3:{i:0;s:12:"externallink";i:1;a:2:{i:0;s:27:"http://code.google.com/soc/";i:1;s:21:"Google Summer of Code";}i:2;i:212;}i:21;a:3:{i:0;s:5:"cdata";i:1;a:1:{i:0;s:1:" ";}i:2;i:265;}i:22;a:3:{i:0;s:9:"linebreak";i:1;a:0:{}i:2;i:266;}i:23;a:3:{i:0;s:5:"cdata";i:1;a:1:{i:0;s:1:"
";}i:2;i:268;}i:24;a:3:{i:0;s:12:"externallink";i:1;a:2:{i:0;s:22:"http://www.hacker.org/";i:1;s:10:"Hacker.org";}i:2;i:269;}i:25;a:3:{i:0;s:5:"cdata";i:1;a:1:{i:0;s:1:" ";}i:2;i:306;}i:26;a:3:{i:0;s:9:"linebreak";i:1;a:0:{}i:2;i:307;}i:27;a:3:{i:0;s:5:"cdata";i:1;a:1:{i:0;s:1:"
";}i:2;i:309;}i:28;a:3:{i:0;s:6:"plugin";i:1;a:4:{i:0;s:11:"htmlcomment";i:1;a:2:{i:0;i:5;i:1;s:7:" [[|]] ";}i:2;i:5;i:3;s:14:"<!-- [[|]] -->";}i:2;i:310;}i:29;a:3:{i:0;s:7:"p_close";i:1;a:0:{}i:2;i:324;}i:30;a:3:{i:0;s:6:"plugin";i:1;a:4:{i:0;s:7:"tag_tag";i:1;a:2:{i:0;s:5:"links";i:1;s:12:"competitions";}i:2;i:5;i:3;s:26:"{{tag>links competitions}}";}i:2;i:326;}i:31;a:2:{i:0;s:6:"plugin";i:1;a:4:{i:0;s:7:"uparrow";i:1;a:1:{i:0;s:42:"lib/plugins/uparrow/images/tango-small.png";}i:2;i:1;i:3;s:6:"~~UP~~";}}i:32;a:3:{i:0;s:13:"section_close";i:1;a:0:{}i:2;i:352;}i:33;a:3:{i:0;s:12:"document_end";i:1;a:0:{}i:2;i:352;}}