a:80:{i:0;a:3:{i:0;s:14:"document_start";i:1;a:0:{}i:2;i:0;}i:1;a:3:{i:0;s:6:"p_open";i:1;a:0:{}i:2;i:0;}i:2;a:3:{i:0;s:7:"p_close";i:1;a:0:{}i:2;i:1;}i:3;a:3:{i:0;s:12:"section_edit";i:1;a:4:{i:0;i:-1;i:1;i:0;i:2;i:1;i:3;s:0:"";}i:2;i:1;}i:4;a:3:{i:0;s:6:"header";i:1;a:3:{i:0;s:3:"Git";i:1;i:1;i:2;i:1;}i:2;i:1;}i:5;a:3:{i:0;s:12:"section_open";i:1;a:1:{i:0;i:1;}i:2;i:1;}i:6;a:3:{i:0;s:6:"p_open";i:1;a:0:{}i:2;i:18;}i:7;a:3:{i:0;s:5:"cdata";i:1;a:1:{i:0;s:1:"
";}i:2;i:19;}i:8;a:3:{i:0;s:12:"externallink";i:1;a:2:{i:0;s:19:"http://git-scm.com/";i:1;s:3:"Git";}i:2;i:20;}i:9;a:3:{i:0;s:5:"cdata";i:1;a:1:{i:0;s:2:": ";}i:2;i:47;}i:10;a:3:{i:0;s:13:"interwikilink";i:1;a:4:{i:0;s:17:"wp>Git_(software)";i:1;s:3:"Git";i:2;s:2:"wp";i:3;s:14:"Git_(software)";}i:2;i:49;}i:11;a:3:{i:0;s:5:"cdata";i:1;a:1:{i:0;s:1:" ";}i:2;i:74;}i:12;a:3:{i:0;s:9:"linebreak";i:1;a:0:{}i:2;i:75;}i:13;a:3:{i:0;s:5:"cdata";i:1;a:1:{i:0;s:7:"
Using ";}i:2;i:77;}i:14;a:3:{i:0;s:12:"externallink";i:1;a:2:{i:0;s:17:"http://repo.or.cz";i:1;s:23:"Repo Public Git Hosting";}i:2;i:84;}i:15;a:3:{i:0;s:7:"p_close";i:1;a:0:{}i:2;i:129;}i:16;a:2:{i:0;s:6:"plugin";i:1;a:4:{i:0;s:7:"uparrow";i:1;a:1:{i:0;s:42:"lib/plugins/uparrow/images/tango-small.png";}i:2;i:1;i:3;s:6:"~~UP~~";}}i:17;a:3:{i:0;s:13:"section_close";i:1;a:0:{}i:2;i:131;}i:18;a:3:{i:0;s:12:"section_edit";i:1;a:4:{i:0;i:1;i:1;i:130;i:2;i:1;i:3;s:3:"Git";}i:2;i:131;}i:19;a:3:{i:0;s:6:"header";i:1;a:3:{i:0;s:18:"How to install Git";i:1;i:2;i:2;i:131;}i:2;i:131;}i:20;a:3:{i:0;s:12:"section_open";i:1;a:1:{i:0;i:2;}i:2;i:131;}i:21;a:3:{i:0;s:4:"code";i:1;a:3:{i:0;s:135:"
$ sudo apt-get install git-core
$ git config --global user.name user_name
$ git config --global user.email you@yourdomain.example.com
";i:1;s:4:"bash";i:2;N;}i:2;i:167;}i:22;a:2:{i:0;s:6:"plugin";i:1;a:4:{i:0;s:7:"uparrow";i:1;a:1:{i:0;s:42:"lib/plugins/uparrow/images/tango-small.png";}i:2;i:1;i:3;s:6:"~~UP~~";}}i:23;a:3:{i:0;s:13:"section_close";i:1;a:0:{}i:2;i:317;}i:24;a:3:{i:0;s:12:"section_edit";i:1;a:4:{i:0;i:131;i:1;i:316;i:2;i:2;i:3;s:18:"How to install Git";}i:2;i:317;}i:25;a:3:{i:0;s:6:"header";i:1;a:3:{i:0;s:23:"How to create a SSH key";i:1;i:2;i:2;i:317;}i:2;i:317;}i:26;a:3:{i:0;s:12:"section_open";i:1;a:1:{i:0;i:2;}i:2;i:317;}i:27;a:3:{i:0;s:4:"code";i:1;a:3:{i:0;s:14:"
$ sshkey-gen
";i:1;s:4:"bash";i:2;N;}i:2;i:359;}i:28;a:2:{i:0;s:6:"plugin";i:1;a:4:{i:0;s:7:"uparrow";i:1;a:1:{i:0;s:42:"lib/plugins/uparrow/images/tango-small.png";}i:2;i:1;i:3;s:6:"~~UP~~";}}i:29;a:3:{i:0;s:13:"section_close";i:1;a:0:{}i:2;i:389;}i:30;a:3:{i:0;s:12:"section_edit";i:1;a:4:{i:0;i:317;i:1;i:388;i:2;i:2;i:3;s:23:"How to create a SSH key";}i:2;i:389;}i:31;a:3:{i:0;s:6:"header";i:1;a:3:{i:0;s:23:"How to create a project";i:1;i:2;i:2;i:389;}i:2;i:389;}i:32;a:3:{i:0;s:12:"section_open";i:1;a:1:{i:0;i:2;}i:2;i:389;}i:33;a:3:{i:0;s:4:"code";i:1;a:3:{i:0;s:173:"
$ cd path/to/project
$ git init
$ git add .
$ git commit -a -m"message"
$ git remote add origin ssh://user_name@repo.or.cz/srv/git/project_name.git
$ git push --all origin
";i:1;s:4:"bash";i:2;N;}i:2;i:431;}i:34;a:2:{i:0;s:6:"plugin";i:1;a:4:{i:0;s:7:"uparrow";i:1;a:1:{i:0;s:42:"lib/plugins/uparrow/images/tango-small.png";}i:2;i:1;i:3;s:6:"~~UP~~";}}i:35;a:3:{i:0;s:13:"section_close";i:1;a:0:{}i:2;i:619;}i:36;a:3:{i:0;s:12:"section_edit";i:1;a:4:{i:0;i:389;i:1;i:618;i:2;i:2;i:3;s:23:"How to create a project";}i:2;i:619;}i:37;a:3:{i:0;s:6:"header";i:1;a:3:{i:0;s:25:"How to download a project";i:1;i:2;i:2;i:619;}i:2;i:619;}i:38;a:3:{i:0;s:12:"section_open";i:1;a:1:{i:0;i:2;}i:2;i:619;}i:39;a:3:{i:0;s:4:"code";i:1;a:3:{i:0;s:65:"
$ git clone git://repo.or.cz/project_name.git
$ cd project_name
";i:1;s:4:"bash";i:2;N;}i:2;i:663;}i:40;a:2:{i:0;s:6:"plugin";i:1;a:4:{i:0;s:7:"uparrow";i:1;a:1:{i:0;s:42:"lib/plugins/uparrow/images/tango-small.png";}i:2;i:1;i:3;s:6:"~~UP~~";}}i:41;a:3:{i:0;s:13:"section_close";i:1;a:0:{}i:2;i:743;}i:42;a:3:{i:0;s:12:"section_edit";i:1;a:4:{i:0;i:619;i:1;i:742;i:2;i:2;i:3;s:25:"How to download a project";}i:2;i:743;}i:43;a:3:{i:0;s:6:"header";i:1;a:3:{i:0;s:23:"How to upload a project";i:1;i:2;i:2;i:743;}i:2;i:743;}i:44;a:3:{i:0;s:12:"section_open";i:1;a:1:{i:0;i:2;}i:2;i:743;}i:45;a:3:{i:0;s:6:"p_open";i:1;a:0:{}i:2;i:778;}i:46;a:3:{i:0;s:5:"cdata";i:1;a:1:{i:0;s:22:"
Just the first time:
";}i:2;i:779;}i:47;a:3:{i:0;s:7:"p_close";i:1;a:0:{}i:2;i:806;}i:48;a:3:{i:0;s:4:"code";i:1;a:3:{i:0;s:100:"
$ git remote rm origin
$ git remote add origin ssh://user_name@repo.or.cz/srv/git/project_name.git
";i:1;s:4:"bash";i:2;N;}i:2;i:806;}i:49;a:3:{i:0;s:6:"p_open";i:1;a:0:{}i:2;i:919;}i:50;a:3:{i:0;s:5:"cdata";i:1;a:1:{i:0;s:8:"Always:
";}i:2;i:921;}i:51;a:3:{i:0;s:7:"p_close";i:1;a:0:{}i:2;i:934;}i:52;a:3:{i:0;s:4:"code";i:1;a:3:{i:0;s:90:"
$ git add .
$ git commit -a -m"description of the modifications"
$ git push --all origin
";i:1;s:4:"bash";i:2;N;}i:2;i:934;}i:53;a:2:{i:0;s:6:"plugin";i:1;a:4:{i:0;s:7:"uparrow";i:1;a:1:{i:0;s:42:"lib/plugins/uparrow/images/tango-small.png";}i:2;i:1;i:3;s:6:"~~UP~~";}}i:54;a:3:{i:0;s:13:"section_close";i:1;a:0:{}i:2;i:1039;}i:55;a:3:{i:0;s:12:"section_edit";i:1;a:4:{i:0;i:743;i:1;i:1038;i:2;i:2;i:3;s:23:"How to upload a project";}i:2;i:1039;}i:56;a:3:{i:0;s:6:"header";i:1;a:3:{i:0;s:39:"How to update your version of a project";i:1;i:2;i:2;i:1039;}i:2;i:1039;}i:57;a:3:{i:0;s:12:"section_open";i:1;a:1:{i:0;i:2;}i:2;i:1039;}i:58;a:3:{i:0;s:4:"code";i:1;a:3:{i:0;s:26:"
$ git pull origin master
";i:1;s:4:"bash";i:2;N;}i:2;i:1097;}i:59;a:2:{i:0;s:6:"plugin";i:1;a:4:{i:0;s:7:"uparrow";i:1;a:1:{i:0;s:42:"lib/plugins/uparrow/images/tango-small.png";}i:2;i:1;i:3;s:6:"~~UP~~";}}i:60;a:3:{i:0;s:13:"section_close";i:1;a:0:{}i:2;i:1140;}i:61;a:3:{i:0;s:12:"section_edit";i:1;a:4:{i:0;i:1039;i:1;i:1139;i:2;i:2;i:3;s:39:"How to update your version of a project";}i:2;i:1140;}i:62;a:3:{i:0;s:6:"header";i:1;a:3:{i:0;s:19:"How to create a tag";i:1;i:2;i:2;i:1140;}i:2;i:1140;}i:63;a:3:{i:0;s:12:"section_open";i:1;a:1:{i:0;i:2;}i:2;i:1140;}i:64;a:3:{i:0;s:4:"code";i:1;a:3:{i:0;s:20:"
$ git tag tag_name
";i:1;s:4:"bash";i:2;N;}i:2;i:1178;}i:65;a:2:{i:0;s:6:"plugin";i:1;a:4:{i:0;s:7:"uparrow";i:1;a:1:{i:0;s:42:"lib/plugins/uparrow/images/tango-small.png";}i:2;i:1;i:3;s:6:"~~UP~~";}}i:66;a:3:{i:0;s:13:"section_close";i:1;a:0:{}i:2;i:1213;}i:67;a:3:{i:0;s:12:"section_edit";i:1;a:4:{i:0;i:1140;i:1;i:1212;i:2;i:2;i:3;s:19:"How to create a tag";}i:2;i:1213;}i:68;a:3:{i:0;s:6:"header";i:1;a:3:{i:0;s:19:"How to upload a tag";i:1;i:2;i:2;i:1213;}i:2;i:1213;}i:69;a:3:{i:0;s:12:"section_open";i:1;a:1:{i:0;i:2;}i:2;i:1213;}i:70;a:3:{i:0;s:4:"code";i:1;a:3:{i:0;s:28:"
$ git push origin tag_name
";i:1;s:4:"bash";i:2;N;}i:2;i:1251;}i:71;a:3:{i:0;s:6:"p_open";i:1;a:0:{}i:2;i:1292;}i:72;a:3:{i:0;s:5:"cdata";i:1;a:1:{i:0;s:2:"or";}i:2;i:1294;}i:73;a:3:{i:0;s:7:"p_close";i:1;a:0:{}i:2;i:1296;}i:74;a:3:{i:0;s:4:"code";i:1;a:3:{i:0;s:26:"
$ git push --tags origin
";i:1;s:4:"bash";i:2;N;}i:2;i:1303;}i:75;a:3:{i:0;s:6:"plugin";i:1;a:4:{i:0;s:7:"tag_tag";i:1;a:1:{i:0;s:11:"programming";}i:2;i:5;i:3;s:19:"{{tag>programming}}";}i:2;i:1344;}i:76;a:2:{i:0;s:6:"plugin";i:1;a:4:{i:0;s:7:"uparrow";i:1;a:1:{i:0;s:42:"lib/plugins/uparrow/images/tango-small.png";}i:2;i:1;i:3;s:6:"~~UP~~";}}i:77;a:3:{i:0;s:13:"section_close";i:1;a:0:{}i:2;i:1363;}i:78;a:3:{i:0;s:12:"section_edit";i:1;a:4:{i:0;i:1213;i:1;i:0;i:2;i:2;i:3;s:19:"How to upload a tag";}i:2;i:1363;}i:79;a:3:{i:0;s:12:"document_end";i:1;a:0:{}i:2;i:1363;}}