a:98:{i:0;a:3:{i:0;s:14:"document_start";i:1;a:0:{}i:2;i:0;}i:1;a:3:{i:0;s:6:"p_open";i:1;a:0:{}i:2;i:0;}i:2;a:3:{i:0;s:7:"p_close";i:1;a:0:{}i:2;i:1;}i:3;a:3:{i:0;s:12:"section_edit";i:1;a:4:{i:0;i:-1;i:1;i:0;i:2;i:1;i:3;s:0:"";}i:2;i:1;}i:4;a:3:{i:0;s:6:"header";i:1;a:3:{i:0;s:14:"Kauê Silveira";i:1;i:1;i:2;i:1;}i:2;i:1;}i:5;a:3:{i:0;s:12:"section_open";i:1;a:1:{i:0;i:1;}i:2;i:1;}i:6;a:3:{i:0;s:6:"p_open";i:1;a:0:{}i:2;i:29;}i:7;a:3:{i:0;s:5:"cdata";i:1;a:1:{i:0;s:1:"
";}i:2;i:30;}i:8;a:3:{i:0;s:13:"internalmedia";i:1;a:7:{i:0;s:8:"kaue.jpg";i:1;s:14:"Kauê Silveira";i:2;s:4:"left";i:3;N;i:4;N;i:5;s:5:"cache";i:6;s:7:"details";}i:2;i:31;}i:9;a:3:{i:0;s:7:"p_close";i:1;a:0:{}i:2;i:59;}i:10;a:3:{i:0;s:6:"p_open";i:1;a:0:{}i:2;i:59;}i:11;a:3:{i:0;s:5:"cdata";i:1;a:1:{i:0;s:32:"I'm an undergraduate student of ";}i:2;i:62;}i:12;a:3:{i:0;s:12:"externallink";i:1;a:2:{i:0;s:24:"http://www.inf.ufrgs.br/";i:1;s:16:"Computer Science";}i:2;i:94;}i:13;a:3:{i:0;s:5:"cdata";i:1;a:1:{i:0;s:4:" at ";}i:2;i:139;}i:14;a:3:{i:0;s:12:"externallink";i:1;a:2:{i:0;s:20:"http://www.ufrgs.br/";i:1;s:5:"UFRGS";}i:2;i:143;}i:15;a:3:{i:0;s:5:"cdata";i:1;a:1:{i:0;s:78:" (Federal University of Rio Grande do Sul), Brazil. I'm currently a member of ";}i:2;i:173;}i:16;a:3:{i:0;s:12:"externallink";i:1;a:2:{i:0;s:28:"http://www.inf.ufrgs.br/pet/";i:1;s:19:"PET-Computing Group";}i:2;i:251;}i:17;a:3:{i:0;s:5:"cdata";i:1;a:1:{i:0;s:1:".";}i:2;i:303;}i:18;a:3:{i:0;s:7:"p_close";i:1;a:0:{}i:2;i:304;}i:19;a:3:{i:0;s:6:"p_open";i:1;a:0:{}i:2;i:304;}i:20;a:3:{i:0;s:12:"externallink";i:1;a:2:{i:0;s:38:"http://lattes.cnpq.br/5154068006247589";i:1;s:10:"Curriculum";}i:2;i:306;}i:21;a:3:{i:0;s:5:"cdata";i:1;a:1:{i:0;s:1:" ";}i:2;i:359;}i:22;a:3:{i:0;s:9:"linebreak";i:1;a:0:{}i:2;i:360;}i:23;a:3:{i:0;s:5:"cdata";i:1;a:1:{i:0;s:1:"
";}i:2;i:362;}i:24;a:3:{i:0;s:12:"externallink";i:1;a:2:{i:0;s:29:"http://kaflubes.blogspot.com/";i:1;s:4:"Blog";}i:2;i:363;}i:25;a:3:{i:0;s:5:"cdata";i:1;a:1:{i:0;s:1:" ";}i:2;i:401;}i:26;a:3:{i:0;s:9:"linebreak";i:1;a:0:{}i:2;i:402;}i:27;a:3:{i:0;s:5:"cdata";i:1;a:1:{i:0;s:1:"
";}i:2;i:404;}i:28;a:3:{i:0;s:12:"externallink";i:1;a:2:{i:0;s:61:"http://www.orkut.com.br/Main#Profile?uid=15939730725879078384";i:1;s:5:"Orkut";}i:2;i:405;}i:29;a:3:{i:0;s:5:"cdata";i:1;a:1:{i:0;s:1:" ";}i:2;i:476;}i:30;a:3:{i:0;s:9:"linebreak";i:1;a:0:{}i:2;i:477;}i:31;a:3:{i:0;s:5:"cdata";i:1;a:1:{i:0;s:1:"
";}i:2;i:479;}i:32;a:3:{i:0;s:12:"externallink";i:1;a:2:{i:0;s:59:"http://www.topcoder.com/tc?module=MemberProfile&cr=22843857";i:1;s:8:"TopCoder";}i:2;i:480;}i:33;a:3:{i:0;s:5:"cdata";i:1;a:1:{i:0;s:1:" ";}i:2;i:552;}i:34;a:3:{i:0;s:9:"linebreak";i:1;a:0:{}i:2;i:553;}i:35;a:3:{i:0;s:5:"cdata";i:1;a:1:{i:0;s:1:"
";}i:2;i:555;}i:36;a:3:{i:0;s:12:"externallink";i:1;a:2:{i:0;s:63:"http://www.hacker.org/forum/profile.php?mode=viewprofile&u=6969";i:1;s:10:"Hacker.org";}i:2;i:556;}i:37;a:3:{i:0;s:5:"cdata";i:1;a:1:{i:0;s:1:" ";}i:2;i:634;}i:38;a:3:{i:0;s:9:"linebreak";i:1;a:0:{}i:2;i:635;}i:39;a:3:{i:0;s:5:"cdata";i:1;a:1:{i:0;s:1:"
";}i:2;i:637;}i:40;a:3:{i:0;s:12:"externallink";i:1;a:2:{i:0;s:33:"http://www.twitter.com/kssilveira";i:1;s:7:"Twitter";}i:2;i:638;}i:41;a:3:{i:0;s:5:"cdata";i:1;a:1:{i:0;s:1:" ";}i:2;i:683;}i:42;a:3:{i:0;s:9:"linebreak";i:1;a:0:{}i:2;i:684;}i:43;a:3:{i:0;s:5:"cdata";i:1;a:1:{i:0;s:1:"
";}i:2;i:686;}i:44;a:3:{i:0;s:13:"internalmedia";i:1;a:7:{i:0;s:9:"email.png";i:1;s:68:"Please feel free to contact me if you have any question or comments!";i:2;N;i:3;s:3:"162";i:4;N;i:5;s:5:"cache";i:6;s:7:"details";}i:2;i:687;}i:45;a:3:{i:0;s:5:"cdata";i:1;a:1:{i:0;s:1:"
";}i:2;i:780;}i:46;a:3:{i:0;s:7:"p_close";i:1;a:0:{}i:2;i:781;}i:47;a:3:{i:0;s:2:"hr";i:1;a:0:{}i:2;i:781;}i:48;a:3:{i:0;s:6:"plugin";i:1;a:4:{i:0;s:5:"cloud";i:1;a:2:{i:0;s:4:"word";i:1;i:50;}i:2;i:5;i:3;s:9:"~~CLOUD~~";}i:2;i:788;}i:49;a:3:{i:0;s:6:"p_open";i:1;a:0:{}i:2;i:788;}i:50;a:3:{i:0;s:5:"cdata";i:1;a:1:{i:0;s:1:"
";}i:2;i:797;}i:51;a:3:{i:0;s:6:"plugin";i:1;a:4:{i:0;s:11:"htmlcomment";i:1;a:2:{i:0;i:5;i:1;s:14:" ~~TAGCLOUD~~ ";}i:2;i:5;i:3;s:21:"<!-- ~~TAGCLOUD~~ -->";}i:2;i:798;}i:52;a:3:{i:0;s:7:"p_close";i:1;a:0:{}i:2;i:819;}i:53;a:2:{i:0;s:6:"plugin";i:1;a:4:{i:0;s:7:"uparrow";i:1;a:1:{i:0;s:42:"lib/plugins/uparrow/images/tango-small.png";}i:2;i:1;i:3;s:6:"~~UP~~";}}i:54;a:3:{i:0;s:13:"section_close";i:1;a:0:{}i:2;i:821;}i:55;a:3:{i:0;s:12:"section_edit";i:1;a:4:{i:0;i:1;i:1;i:820;i:2;i:1;i:3;s:14:"Kauê Silveira";}i:2;i:821;}i:56;a:3:{i:0;s:6:"header";i:1;a:3:{i:0;s:12:"Last Changes";i:1;i:1;i:2;i:821;}i:2;i:821;}i:57;a:3:{i:0;s:12:"section_open";i:1;a:1:{i:0;i:1;}i:2;i:821;}i:58;a:3:{i:0;s:6:"p_open";i:1;a:0:{}i:2;i:847;}i:59;a:3:{i:0;s:6:"plugin";i:1;a:4:{i:0;s:7:"changes";i:1;a:5:{s:2:"ns";a:0:{}s:5:"count";i:5;s:4:"type";a:0:{}s:6:"render";s:4:"list";s:12:"render-flags";a:2:{i:0;s:9:"signature";i:1;s:7:"summary";}}i:2;i:5;i:3;s:47:"{{changes>render = list(signature, summary)&5}}";}i:2;i:848;}i:60;a:3:{i:0;s:7:"p_close";i:1;a:0:{}i:2;i:895;}i:61;a:2:{i:0;s:6:"plugin";i:1;a:4:{i:0;s:7:"uparrow";i:1;a:1:{i:0;s:42:"lib/plugins/uparrow/images/tango-small.png";}i:2;i:1;i:3;s:6:"~~UP~~";}}i:62;a:3:{i:0;s:13:"section_close";i:1;a:0:{}i:2;i:897;}i:63;a:3:{i:0;s:12:"section_edit";i:1;a:4:{i:0;i:821;i:1;i:896;i:2;i:1;i:3;s:12:"Last Changes";}i:2;i:897;}i:64;a:3:{i:0;s:6:"header";i:1;a:3:{i:0;s:9:"Quotation";i:1;i:1;i:2;i:897;}i:2;i:897;}i:65;a:3:{i:0;s:12:"section_open";i:1;a:1:{i:0;i:1;}i:2;i:897;}i:66;a:3:{i:0;s:6:"plugin";i:1;a:4:{i:0;s:8:"xfortune";i:1;a:2:{s:6:"cookie";s:11:"cookies.pdf";s:4:"time";s:4:"3600";}i:2;i:5;i:3;s:29:"{{xfortune>cookies.pdf?3600}}";}i:2;i:922;}i:67;a:2:{i:0;s:6:"plugin";i:1;a:4:{i:0;s:7:"uparrow";i:1;a:1:{i:0;s:42:"lib/plugins/uparrow/images/tango-small.png";}i:2;i:1;i:3;s:6:"~~UP~~";}}i:68;a:3:{i:0;s:13:"section_close";i:1;a:0:{}i:2;i:953;}i:69;a:3:{i:0;s:12:"section_edit";i:1;a:4:{i:0;i:897;i:1;i:952;i:2;i:1;i:3;s:9:"Quotation";}i:2;i:953;}i:70;a:3:{i:0;s:6:"header";i:1;a:3:{i:0;s:7:"Friends";i:1;i:1;i:2;i:953;}i:2;i:953;}i:71;a:3:{i:0;s:12:"section_open";i:1;a:1:{i:0;i:1;}i:2;i:953;}i:72;a:3:{i:0;s:6:"p_open";i:1;a:0:{}i:2;i:974;}i:73;a:3:{i:0;s:5:"cdata";i:1;a:1:{i:0;s:1:"
";}i:2;i:975;}i:74;a:3:{i:0;s:12:"externallink";i:1;a:2:{i:0;s:28:"http://umblag.wordpress.com/";i:1;s:4:"Blag";}i:2;i:976;}i:75;a:3:{i:0;s:5:"cdata";i:1;a:1:{i:0;s:1:" ";}i:2;i:1013;}i:76;a:3:{i:0;s:9:"linebreak";i:1;a:0:{}i:2;i:1014;}i:77;a:3:{i:0;s:5:"cdata";i:1;a:1:{i:0;s:1:"
";}i:2;i:1016;}i:78;a:3:{i:0;s:12:"externallink";i:1;a:2:{i:0;s:36:"http://www.inf.ufrgs.br/~bjurkovski/";i:1;s:15:"Bruno Jurkovski";}i:2;i:1017;}i:79;a:3:{i:0;s:5:"cdata";i:1;a:1:{i:0;s:1:" ";}i:2;i:1073;}i:80;a:3:{i:0;s:9:"linebreak";i:1;a:0:{}i:2;i:1074;}i:81;a:3:{i:0;s:5:"cdata";i:1;a:1:{i:0;s:1:"
";}i:2;i:1076;}i:82;a:3:{i:0;s:12:"externallink";i:1;a:2:{i:0;s:33:"http://www.inf.ufrgs.br/~fachies/";i:1;s:20:"Felipe Augusto Chies";}i:2;i:1077;}i:83;a:3:{i:0;s:5:"cdata";i:1;a:1:{i:0;s:1:" ";}i:2;i:1135;}i:84;a:3:{i:0;s:9:"linebreak";i:1;a:0:{}i:2;i:1136;}i:85;a:3:{i:0;s:5:"cdata";i:1;a:1:{i:0;s:1:"
";}i:2;i:1138;}i:86;a:3:{i:0;s:12:"externallink";i:1;a:2:{i:0;s:35:"http://www.inf.ufrgs.br/~lfzawacki/";i:1;s:20:"Lucas Fialho Zawacki";}i:2;i:1139;}i:87;a:3:{i:0;s:5:"cdata";i:1;a:1:{i:0;s:1:" ";}i:2;i:1199;}i:88;a:3:{i:0;s:9:"linebreak";i:1;a:0:{}i:2;i:1200;}i:89;a:3:{i:0;s:5:"cdata";i:1;a:1:{i:0;s:1:"
";}i:2;i:1202;}i:90;a:3:{i:0;s:12:"externallink";i:1;a:2:{i:0;s:32:"http://linesocode.wordpress.com/";i:1;s:13:"Lines of Code";}i:2;i:1203;}i:91;a:3:{i:0;s:5:"cdata";i:1;a:1:{i:0;s:1:" ";}i:2;i:1253;}i:92;a:3:{i:0;s:9:"linebreak";i:1;a:0:{}i:2;i:1254;}i:93;a:3:{i:0;s:7:"p_close";i:1;a:0:{}i:2;i:1256;}i:94;a:2:{i:0;s:6:"plugin";i:1;a:4:{i:0;s:7:"uparrow";i:1;a:1:{i:0;s:42:"lib/plugins/uparrow/images/tango-small.png";}i:2;i:1;i:3;s:6:"~~UP~~";}}i:95;a:3:{i:0;s:13:"section_close";i:1;a:0:{}i:2;i:1257;}i:96;a:3:{i:0;s:12:"section_edit";i:1;a:4:{i:0;i:953;i:1;i:0;i:2;i:1;i:3;s:7:"Friends";}i:2;i:1257;}i:97;a:3:{i:0;s:12:"document_end";i:1;a:0:{}i:2;i:1257;}}