a:228:{i:0;a:3:{i:0;s:14:"document_start";i:1;a:0:{}i:2;i:0;}i:1;a:3:{i:0;s:6:"p_open";i:1;a:0:{}i:2;i:0;}i:2;a:3:{i:0;s:7:"p_close";i:1;a:0:{}i:2;i:1;}i:3;a:3:{i:0;s:12:"section_edit";i:1;a:4:{i:0;i:-1;i:1;i:0;i:2;i:1;i:3;s:0:"";}i:2;i:1;}i:4;a:3:{i:0;s:6:"header";i:1;a:3:{i:0;s:6:"Comics";i:1;i:1;i:2;i:1;}i:2;i:1;}i:5;a:3:{i:0;s:12:"section_open";i:1;a:1:{i:0;i:1;}i:2;i:1;}i:6;a:2:{i:0;s:6:"plugin";i:1;a:4:{i:0;s:7:"uparrow";i:1;a:1:{i:0;s:42:"lib/plugins/uparrow/images/tango-small.png";}i:2;i:1;i:3;s:6:"~~UP~~";}}i:7;a:3:{i:0;s:13:"section_close";i:1;a:0:{}i:2;i:23;}i:8;a:3:{i:0;s:12:"section_edit";i:1;a:4:{i:0;i:1;i:1;i:22;i:2;i:1;i:3;s:6:"Comics";}i:2;i:23;}i:9;a:3:{i:0;s:6:"header";i:1;a:3:{i:0;s:4:"xkcd";i:1;i:2;i:2;i:23;}i:2;i:23;}i:10;a:3:{i:0;s:12:"section_open";i:1;a:1:{i:0;i:2;}i:2;i:23;}i:11;a:3:{i:0;s:6:"p_open";i:1;a:0:{}i:2;i:39;}i:12;a:3:{i:0;s:5:"cdata";i:1;a:1:{i:0;s:1:"
";}i:2;i:40;}i:13;a:3:{i:0;s:12:"externallink";i:1;a:2:{i:0;s:19:"http://xkcd.com/26/";i:1;s:7:"Fourier";}i:2;i:41;}i:14;a:3:{i:0;s:5:"cdata";i:1;a:1:{i:0;s:1:" ";}i:2;i:72;}i:15;a:3:{i:0;s:9:"linebreak";i:1;a:0:{}i:2;i:73;}i:16;a:3:{i:0;s:5:"cdata";i:1;a:1:{i:0;s:1:"
";}i:2;i:75;}i:17;a:3:{i:0;s:12:"externallink";i:1;a:2:{i:0;s:19:"http://xkcd.com/45/";i:1;s:12:"Schrödinger";}i:2;i:76;}i:18;a:3:{i:0;s:5:"cdata";i:1;a:1:{i:0;s:1:" ";}i:2;i:112;}i:19;a:3:{i:0;s:9:"linebreak";i:1;a:0:{}i:2;i:113;}i:20;a:3:{i:0;s:5:"cdata";i:1;a:1:{i:0;s:1:"
";}i:2;i:115;}i:21;a:3:{i:0;s:12:"externallink";i:1;a:2:{i:0;s:19:"http://xkcd.com/69/";i:1;s:11:"Pillow Talk";}i:2;i:116;}i:22;a:3:{i:0;s:5:"cdata";i:1;a:1:{i:0;s:1:" ";}i:2;i:151;}i:23;a:3:{i:0;s:9:"linebreak";i:1;a:0:{}i:2;i:152;}i:24;a:3:{i:0;s:5:"cdata";i:1;a:1:{i:0;s:1:"
";}i:2;i:154;}i:25;a:3:{i:0;s:12:"externallink";i:1;a:2:{i:0;s:19:"http://xkcd.com/85/";i:1;s:4:"Path";}i:2;i:155;}i:26;a:3:{i:0;s:5:"cdata";i:1;a:1:{i:0;s:1:" ";}i:2;i:183;}i:27;a:3:{i:0;s:9:"linebreak";i:1;a:0:{}i:2;i:184;}i:28;a:3:{i:0;s:5:"cdata";i:1;a:1:{i:0;s:1:"
";}i:2;i:186;}i:29;a:3:{i:0;s:12:"externallink";i:1;a:2:{i:0;s:20:"http://xkcd.com/125/";i:1;s:19:"Marketing Interview";}i:2;i:187;}i:30;a:3:{i:0;s:5:"cdata";i:1;a:1:{i:0;s:1:" ";}i:2;i:231;}i:31;a:3:{i:0;s:9:"linebreak";i:1;a:0:{}i:2;i:232;}i:32;a:3:{i:0;s:5:"cdata";i:1;a:1:{i:0;s:1:"
";}i:2;i:234;}i:33;a:3:{i:0;s:12:"externallink";i:1;a:2:{i:0;s:20:"http://xkcd.com/138/";i:1;s:8:"Pointers";}i:2;i:235;}i:34;a:3:{i:0;s:5:"cdata";i:1;a:1:{i:0;s:1:" ";}i:2;i:268;}i:35;a:3:{i:0;s:9:"linebreak";i:1;a:0:{}i:2;i:269;}i:36;a:3:{i:0;s:5:"cdata";i:1;a:1:{i:0;s:1:"
";}i:2;i:271;}i:37;a:3:{i:0;s:12:"externallink";i:1;a:2:{i:0;s:20:"http://xkcd.com/149/";i:1;s:8:"Sandwich";}i:2;i:272;}i:38;a:3:{i:0;s:5:"cdata";i:1;a:1:{i:0;s:1:" ";}i:2;i:305;}i:39;a:3:{i:0;s:9:"linebreak";i:1;a:0:{}i:2;i:306;}i:40;a:3:{i:0;s:5:"cdata";i:1;a:1:{i:0;s:1:"
";}i:2;i:308;}i:41;a:3:{i:0;s:12:"externallink";i:1;a:2:{i:0;s:20:"http://xkcd.com/156/";i:1;s:9:"Commented";}i:2;i:309;}i:42;a:3:{i:0;s:5:"cdata";i:1;a:1:{i:0;s:1:" ";}i:2;i:343;}i:43;a:3:{i:0;s:9:"linebreak";i:1;a:0:{}i:2;i:344;}i:44;a:3:{i:0;s:5:"cdata";i:1;a:1:{i:0;s:1:"
";}i:2;i:346;}i:45;a:3:{i:0;s:12:"externallink";i:1;a:2:{i:0;s:20:"http://xkcd.com/163/";i:1;s:12:"Donald Knuth";}i:2;i:347;}i:46;a:3:{i:0;s:5:"cdata";i:1;a:1:{i:0;s:1:" ";}i:2;i:384;}i:47;a:3:{i:0;s:9:"linebreak";i:1;a:0:{}i:2;i:385;}i:48;a:3:{i:0;s:5:"cdata";i:1;a:1:{i:0;s:1:"
";}i:2;i:387;}i:49;a:3:{i:0;s:12:"externallink";i:1;a:2:{i:0;s:20:"http://xkcd.com/179/";i:1;s:19:"e to the pi times i";}i:2;i:388;}i:50;a:3:{i:0;s:5:"cdata";i:1;a:1:{i:0;s:1:" ";}i:2;i:432;}i:51;a:3:{i:0;s:9:"linebreak";i:1;a:0:{}i:2;i:433;}i:52;a:3:{i:0;s:5:"cdata";i:1;a:1:{i:0;s:1:"
";}i:2;i:435;}i:53;a:3:{i:0;s:12:"externallink";i:1;a:2:{i:0;s:20:"http://xkcd.com/182/";i:1;s:4:"Nash";}i:2;i:436;}i:54;a:3:{i:0;s:5:"cdata";i:1;a:1:{i:0;s:1:" ";}i:2;i:465;}i:55;a:3:{i:0;s:9:"linebreak";i:1;a:0:{}i:2;i:466;}i:56;a:3:{i:0;s:5:"cdata";i:1;a:1:{i:0;s:1:"
";}i:2;i:468;}i:57;a:3:{i:0;s:12:"externallink";i:1;a:2:{i:0;s:20:"http://xkcd.com/184/";i:1;s:16:"Matrix Transform";}i:2;i:469;}i:58;a:3:{i:0;s:5:"cdata";i:1;a:1:{i:0;s:1:" ";}i:2;i:510;}i:59;a:3:{i:0;s:9:"linebreak";i:1;a:0:{}i:2;i:511;}i:60;a:3:{i:0;s:5:"cdata";i:1;a:1:{i:0;s:1:"
";}i:2;i:513;}i:61;a:3:{i:0;s:12:"externallink";i:1;a:2:{i:0;s:20:"http://xkcd.com/189/";i:1;s:8:"Exercise";}i:2;i:514;}i:62;a:3:{i:0;s:5:"cdata";i:1;a:1:{i:0;s:1:" ";}i:2;i:547;}i:63;a:3:{i:0;s:6:"plugin";i:1;a:4:{i:0;s:5:"skill";i:1;a:2:{i:0;s:1:"4";i:1;s:1:"5";}i:2;i:5;i:3;s:13:"{{skill>4/5}}";}i:2;i:548;}i:64;a:3:{i:0;s:5:"cdata";i:1;a:1:{i:0;s:1:" ";}i:2;i:561;}i:65;a:3:{i:0;s:9:"linebreak";i:1;a:0:{}i:2;i:562;}i:66;a:3:{i:0;s:5:"cdata";i:1;a:1:{i:0;s:1:"
";}i:2;i:564;}i:67;a:3:{i:0;s:12:"externallink";i:1;a:2:{i:0;s:20:"http://xkcd.com/192/";i:1;s:18:"Working for Google";}i:2;i:565;}i:68;a:3:{i:0;s:5:"cdata";i:1;a:1:{i:0;s:1:" ";}i:2;i:608;}i:69;a:3:{i:0;s:9:"linebreak";i:1;a:0:{}i:2;i:609;}i:70;a:3:{i:0;s:5:"cdata";i:1;a:1:{i:0;s:1:"
";}i:2;i:611;}i:71;a:3:{i:0;s:12:"externallink";i:1;a:2:{i:0;s:20:"http://xkcd.com/199/";i:1;s:15:"Right-Hand Rule";}i:2;i:612;}i:72;a:3:{i:0;s:5:"cdata";i:1;a:1:{i:0;s:1:" ";}i:2;i:652;}i:73;a:3:{i:0;s:9:"linebreak";i:1;a:0:{}i:2;i:653;}i:74;a:3:{i:0;s:5:"cdata";i:1;a:1:{i:0;s:1:"
";}i:2;i:655;}i:75;a:3:{i:0;s:12:"externallink";i:1;a:2:{i:0;s:20:"http://xkcd.com/208/";i:1;s:19:"Regular Expressions";}i:2;i:656;}i:76;a:3:{i:0;s:5:"cdata";i:1;a:1:{i:0;s:1:" ";}i:2;i:700;}i:77;a:3:{i:0;s:9:"linebreak";i:1;a:0:{}i:2;i:701;}i:78;a:3:{i:0;s:6:"plugin";i:1;a:4:{i:0;s:11:"htmlcomment";i:1;a:2:{i:0;i:5;i:1;s:13:" parei nesta ";}i:2;i:5;i:3;s:20:"<!-- parei nesta -->";}i:2;i:704;}i:79;a:3:{i:0;s:5:"cdata";i:1;a:1:{i:0;s:1:"
";}i:2;i:724;}i:80;a:3:{i:0;s:12:"externallink";i:1;a:2:{i:0;s:20:"http://xkcd.com/230/";i:1;s:11:"Hamiltonian";}i:2;i:725;}i:81;a:3:{i:0;s:5:"cdata";i:1;a:1:{i:0;s:1:" ";}i:2;i:761;}i:82;a:3:{i:0;s:6:"plugin";i:1;a:4:{i:0;s:5:"skill";i:1;a:2:{i:0;s:1:"4";i:1;s:1:"5";}i:2;i:5;i:3;s:13:"{{skill>4/5}}";}i:2;i:762;}i:83;a:3:{i:0;s:5:"cdata";i:1;a:1:{i:0;s:1:" ";}i:2;i:775;}i:84;a:3:{i:0;s:9:"linebreak";i:1;a:0:{}i:2;i:776;}i:85;a:3:{i:0;s:5:"cdata";i:1;a:1:{i:0;s:1:"
";}i:2;i:778;}i:86;a:3:{i:0;s:12:"externallink";i:1;a:2:{i:0;s:20:"http://xkcd.com/287/";i:1;s:11:"NP-Complete";}i:2;i:779;}i:87;a:3:{i:0;s:5:"cdata";i:1;a:1:{i:0;s:1:" ";}i:2;i:815;}i:88;a:3:{i:0;s:6:"plugin";i:1;a:4:{i:0;s:5:"skill";i:1;a:2:{i:0;s:1:"3";i:1;s:1:"5";}i:2;i:5;i:3;s:13:"{{skill>3/5}}";}i:2;i:816;}i:89;a:3:{i:0;s:5:"cdata";i:1;a:1:{i:0;s:1:" ";}i:2;i:829;}i:90;a:3:{i:0;s:9:"linebreak";i:1;a:0:{}i:2;i:830;}i:91;a:3:{i:0;s:5:"cdata";i:1;a:1:{i:0;s:1:"
";}i:2;i:832;}i:92;a:3:{i:0;s:12:"externallink";i:1;a:2:{i:0;s:20:"http://xkcd.com/303/";i:1;s:9:"Compiling";}i:2;i:833;}i:93;a:3:{i:0;s:5:"cdata";i:1;a:1:{i:0;s:1:" ";}i:2;i:867;}i:94;a:3:{i:0;s:9:"linebreak";i:1;a:0:{}i:2;i:868;}i:95;a:3:{i:0;s:5:"cdata";i:1;a:1:{i:0;s:1:"
";}i:2;i:870;}i:96;a:3:{i:0;s:12:"externallink";i:1;a:2:{i:0;s:20:"http://xkcd.com/309/";i:1;s:14:"Shopping Teams";}i:2;i:871;}i:97;a:3:{i:0;s:5:"cdata";i:1;a:1:{i:0;s:1:" ";}i:2;i:910;}i:98;a:3:{i:0;s:9:"linebreak";i:1;a:0:{}i:2;i:911;}i:99;a:3:{i:0;s:5:"cdata";i:1;a:1:{i:0;s:1:"
";}i:2;i:913;}i:100;a:3:{i:0;s:12:"externallink";i:1;a:2:{i:0;s:20:"http://xkcd.com/320/";i:1;s:11:"28-Hour Day";}i:2;i:914;}i:101;a:3:{i:0;s:5:"cdata";i:1;a:1:{i:0;s:1:" ";}i:2;i:950;}i:102;a:3:{i:0;s:9:"linebreak";i:1;a:0:{}i:2;i:951;}i:103;a:3:{i:0;s:5:"cdata";i:1;a:1:{i:0;s:1:"
";}i:2;i:953;}i:104;a:3:{i:0;s:12:"externallink";i:1;a:2:{i:0;s:20:"http://xkcd.com/399/";i:1;s:26:"Traveling Salesman Problem";}i:2;i:954;}i:105;a:3:{i:0;s:5:"cdata";i:1;a:1:{i:0;s:1:" ";}i:2;i:1005;}i:106;a:3:{i:0;s:6:"plugin";i:1;a:4:{i:0;s:5:"skill";i:1;a:2:{i:0;s:1:"5";i:1;s:1:"5";}i:2;i:5;i:3;s:13:"{{skill>5/5}}";}i:2;i:1006;}i:107;a:3:{i:0;s:5:"cdata";i:1;a:1:{i:0;s:1:" ";}i:2;i:1019;}i:108;a:3:{i:0;s:9:"linebreak";i:1;a:0:{}i:2;i:1020;}i:109;a:3:{i:0;s:5:"cdata";i:1;a:1:{i:0;s:1:"
";}i:2;i:1022;}i:110;a:3:{i:0;s:12:"externallink";i:1;a:2:{i:0;s:20:"http://xkcd.com/435/";i:1;s:25:"Fields Arranged By Purity";}i:2;i:1023;}i:111;a:3:{i:0;s:5:"cdata";i:1;a:1:{i:0;s:1:" ";}i:2;i:1073;}i:112;a:3:{i:0;s:6:"plugin";i:1;a:4:{i:0;s:5:"skill";i:1;a:2:{i:0;s:1:"3";i:1;s:1:"5";}i:2;i:5;i:3;s:13:"{{skill>3/5}}";}i:2;i:1074;}i:113;a:3:{i:0;s:5:"cdata";i:1;a:1:{i:0;s:1:" ";}i:2;i:1087;}i:114;a:3:{i:0;s:9:"linebreak";i:1;a:0:{}i:2;i:1088;}i:115;a:3:{i:0;s:5:"cdata";i:1;a:1:{i:0;s:1:"
";}i:2;i:1090;}i:116;a:3:{i:0;s:12:"externallink";i:1;a:2:{i:0;s:20:"http://xkcd.com/557/";i:1;s:14:"Students Dream";}i:2;i:1091;}i:117;a:3:{i:0;s:5:"cdata";i:1;a:1:{i:0;s:1:" ";}i:2;i:1130;}i:118;a:3:{i:0;s:6:"plugin";i:1;a:4:{i:0;s:5:"skill";i:1;a:2:{i:0;s:1:"3";i:1;s:1:"5";}i:2;i:5;i:3;s:13:"{{skill>3/5}}";}i:2;i:1131;}i:119;a:3:{i:0;s:5:"cdata";i:1;a:1:{i:0;s:1:" ";}i:2;i:1144;}i:120;a:3:{i:0;s:9:"linebreak";i:1;a:0:{}i:2;i:1145;}i:121;a:3:{i:0;s:5:"cdata";i:1;a:1:{i:0;s:1:"
";}i:2;i:1147;}i:122;a:3:{i:0;s:12:"externallink";i:1;a:2:{i:0;s:20:"http://xkcd.com/565/";i:1;s:17:"Security Question";}i:2;i:1148;}i:123;a:3:{i:0;s:5:"cdata";i:1;a:1:{i:0;s:1:" ";}i:2;i:1190;}i:124;a:3:{i:0;s:6:"plugin";i:1;a:4:{i:0;s:5:"skill";i:1;a:2:{i:0;s:1:"2";i:1;s:1:"5";}i:2;i:5;i:3;s:13:"{{skill>2/5}}";}i:2;i:1191;}i:125;a:3:{i:0;s:5:"cdata";i:1;a:1:{i:0;s:1:" ";}i:2;i:1204;}i:126;a:3:{i:0;s:9:"linebreak";i:1;a:0:{}i:2;i:1205;}i:127;a:3:{i:0;s:5:"cdata";i:1;a:1:{i:0;s:1:"
";}i:2;i:1207;}i:128;a:3:{i:0;s:12:"externallink";i:1;a:2:{i:0;s:20:"http://xkcd.com/571/";i:1;s:11:"Can't Sleep";}i:2;i:1208;}i:129;a:3:{i:0;s:5:"cdata";i:1;a:1:{i:0;s:1:" ";}i:2;i:1244;}i:130;a:3:{i:0;s:6:"plugin";i:1;a:4:{i:0;s:5:"skill";i:1;a:2:{i:0;s:1:"2";i:1;s:1:"5";}i:2;i:5;i:3;s:13:"{{skill>2/5}}";}i:2;i:1245;}i:131;a:3:{i:0;s:5:"cdata";i:1;a:1:{i:0;s:1:" ";}i:2;i:1258;}i:132;a:3:{i:0;s:9:"linebreak";i:1;a:0:{}i:2;i:1259;}i:133;a:3:{i:0;s:5:"cdata";i:1;a:1:{i:0;s:1:"
";}i:2;i:1261;}i:134;a:3:{i:0;s:12:"externallink";i:1;a:2:{i:0;s:20:"http://xkcd.com/583/";i:1;s:3:"CNR";}i:2;i:1262;}i:135;a:3:{i:0;s:5:"cdata";i:1;a:1:{i:0;s:1:" ";}i:2;i:1290;}i:136;a:3:{i:0;s:6:"plugin";i:1;a:4:{i:0;s:5:"skill";i:1;a:2:{i:0;s:1:"1";i:1;s:1:"5";}i:2;i:5;i:3;s:13:"{{skill>1/5}}";}i:2;i:1291;}i:137;a:3:{i:0;s:5:"cdata";i:1;a:1:{i:0;s:1:" ";}i:2;i:1304;}i:138;a:3:{i:0;s:9:"linebreak";i:1;a:0:{}i:2;i:1305;}i:139;a:3:{i:0;s:5:"cdata";i:1;a:1:{i:0;s:1:"
";}i:2;i:1307;}i:140;a:3:{i:0;s:12:"externallink";i:1;a:2:{i:0;s:20:"http://xkcd.com/599/";i:1;s:10:"Apocalypse";}i:2;i:1308;}i:141;a:3:{i:0;s:5:"cdata";i:1;a:1:{i:0;s:1:" ";}i:2;i:1343;}i:142;a:3:{i:0;s:6:"plugin";i:1;a:4:{i:0;s:5:"skill";i:1;a:2:{i:0;s:1:"2";i:1;s:1:"5";}i:2;i:5;i:3;s:13:"{{skill>2/5}}";}i:2;i:1344;}i:143;a:3:{i:0;s:5:"cdata";i:1;a:1:{i:0;s:1:" ";}i:2;i:1357;}i:144;a:3:{i:0;s:13:"interwikilink";i:1;a:4:{i:0;s:16:"wp>Erdős_number";i:1;N;i:2;s:2:"wp";i:3;s:13:"Erdős_number";}i:2;i:1358;}i:145;a:3:{i:0;s:5:"cdata";i:1;a:1:{i:0;s:1:" ";}i:2;i:1378;}i:146;a:3:{i:0;s:9:"linebreak";i:1;a:0:{}i:2;i:1379;}i:147;a:3:{i:0;s:5:"cdata";i:1;a:1:{i:0;s:1:"
";}i:2;i:1381;}i:148;a:3:{i:0;s:12:"externallink";i:1;a:2:{i:0;s:20:"http://xkcd.com/612/";i:1;s:10:"Estimation";}i:2;i:1382;}i:149;a:3:{i:0;s:5:"cdata";i:1;a:1:{i:0;s:1:" ";}i:2;i:1417;}i:150;a:3:{i:0;s:6:"plugin";i:1;a:4:{i:0;s:5:"skill";i:1;a:2:{i:0;s:1:"3";i:1;s:1:"5";}i:2;i:5;i:3;s:13:"{{skill>3/5}}";}i:2;i:1418;}i:151;a:3:{i:0;s:5:"cdata";i:1;a:1:{i:0;s:1:" ";}i:2;i:1431;}i:152;a:3:{i:0;s:9:"linebreak";i:1;a:0:{}i:2;i:1432;}i:153;a:3:{i:0;s:5:"cdata";i:1;a:1:{i:0;s:1:"
";}i:2;i:1434;}i:154;a:3:{i:0;s:12:"externallink";i:1;a:2:{i:0;s:20:"http://xkcd.com/627/";i:1;s:24:"Tech Support Cheat Sheet";}i:2;i:1435;}i:155;a:3:{i:0;s:5:"cdata";i:1;a:1:{i:0;s:1:" ";}i:2;i:1484;}i:156;a:3:{i:0;s:6:"plugin";i:1;a:4:{i:0;s:5:"skill";i:1;a:2:{i:0;s:1:"4";i:1;s:1:"5";}i:2;i:5;i:3;s:13:"{{skill>4/5}}";}i:2;i:1485;}i:157;a:3:{i:0;s:5:"cdata";i:1;a:1:{i:0;s:1:" ";}i:2;i:1498;}i:158;a:3:{i:0;s:9:"linebreak";i:1;a:0:{}i:2;i:1499;}i:159;a:3:{i:0;s:5:"cdata";i:1;a:1:{i:0;s:1:"
";}i:2;i:1501;}i:160;a:3:{i:0;s:12:"externallink";i:1;a:2:{i:0;s:20:"http://xkcd.com/628/";i:1;s:7:"Psychic";}i:2;i:1502;}i:161;a:3:{i:0;s:5:"cdata";i:1;a:1:{i:0;s:1:" ";}i:2;i:1534;}i:162;a:3:{i:0;s:6:"plugin";i:1;a:4:{i:0;s:5:"skill";i:1;a:2:{i:0;s:1:"2";i:1;s:1:"5";}i:2;i:5;i:3;s:13:"{{skill>2/5}}";}i:2;i:1535;}i:163;a:3:{i:0;s:5:"cdata";i:1;a:1:{i:0;s:1:" ";}i:2;i:1548;}i:164;a:3:{i:0;s:9:"linebreak";i:1;a:0:{}i:2;i:1549;}i:165;a:3:{i:0;s:5:"cdata";i:1;a:1:{i:0;s:1:"
";}i:2;i:1551;}i:166;a:3:{i:0;s:12:"externallink";i:1;a:2:{i:0;s:20:"http://xkcd.com/632/";i:1;s:9:"Suspicion";}i:2;i:1552;}i:167;a:3:{i:0;s:5:"cdata";i:1;a:1:{i:0;s:1:" ";}i:2;i:1586;}i:168;a:3:{i:0;s:6:"plugin";i:1;a:4:{i:0;s:5:"skill";i:1;a:2:{i:0;s:1:"2";i:1;s:1:"5";}i:2;i:5;i:3;s:13:"{{skill>2/5}}";}i:2;i:1587;}i:169;a:3:{i:0;s:5:"cdata";i:1;a:1:{i:0;s:1:" ";}i:2;i:1600;}i:170;a:3:{i:0;s:9:"linebreak";i:1;a:0:{}i:2;i:1601;}i:171;a:3:{i:0;s:5:"cdata";i:1;a:1:{i:0;s:1:"
";}i:2;i:1603;}i:172;a:3:{i:0;s:12:"externallink";i:1;a:2:{i:0;s:20:"http://xkcd.com/645/";i:1;s:3:"RPS";}i:2;i:1604;}i:173;a:3:{i:0;s:5:"cdata";i:1;a:1:{i:0;s:1:" ";}i:2;i:1632;}i:174;a:3:{i:0;s:6:"plugin";i:1;a:4:{i:0;s:5:"skill";i:1;a:2:{i:0;s:1:"4";i:1;s:1:"5";}i:2;i:5;i:3;s:13:"{{skill>4/5}}";}i:2;i:1633;}i:175;a:3:{i:0;s:5:"cdata";i:1;a:1:{i:0;s:1:" ";}i:2;i:1646;}i:176;a:3:{i:0;s:9:"linebreak";i:1;a:0:{}i:2;i:1647;}i:177;a:3:{i:0;s:5:"cdata";i:1;a:1:{i:0;s:1:"
";}i:2;i:1649;}i:178;a:3:{i:0;s:12:"externallink";i:1;a:2:{i:0;s:20:"http://xkcd.com/664/";i:1;s:21:"Academia vs. Business";}i:2;i:1650;}i:179;a:3:{i:0;s:5:"cdata";i:1;a:1:{i:0;s:1:" ";}i:2;i:1696;}i:180;a:3:{i:0;s:6:"plugin";i:1;a:4:{i:0;s:5:"skill";i:1;a:2:{i:0;s:1:"2";i:1;s:1:"5";}i:2;i:5;i:3;s:13:"{{skill>2/5}}";}i:2;i:1697;}i:181;a:3:{i:0;s:5:"cdata";i:1;a:1:{i:0;s:1:" ";}i:2;i:1710;}i:182;a:3:{i:0;s:9:"linebreak";i:1;a:0:{}i:2;i:1711;}i:183;a:3:{i:0;s:5:"cdata";i:1;a:1:{i:0;s:1:"
";}i:2;i:1713;}i:184;a:3:{i:0;s:12:"externallink";i:1;a:2:{i:0;s:20:"http://xkcd.com/703/";i:1;s:15:"Honor Societies";}i:2;i:1714;}i:185;a:3:{i:0;s:5:"cdata";i:1;a:1:{i:0;s:1:" ";}i:2;i:1754;}i:186;a:3:{i:0;s:6:"plugin";i:1;a:4:{i:0;s:5:"skill";i:1;a:2:{i:0;s:1:"2";i:1;s:1:"5";}i:2;i:5;i:3;s:13:"{{skill>2/5}}";}i:2;i:1755;}i:187;a:3:{i:0;s:5:"cdata";i:1;a:1:{i:0;s:1:" ";}i:2;i:1768;}i:188;a:3:{i:0;s:9:"linebreak";i:1;a:0:{}i:2;i:1769;}i:189;a:3:{i:0;s:5:"cdata";i:1;a:1:{i:0;s:1:"
";}i:2;i:1771;}i:190;a:3:{i:0;s:12:"externallink";i:1;a:2:{i:0;s:20:"http://xkcd.com/710/";i:1;s:18:"Collatz Conjecture";}i:2;i:1772;}i:191;a:3:{i:0;s:5:"cdata";i:1;a:1:{i:0;s:1:" ";}i:2;i:1815;}i:192;a:3:{i:0;s:6:"plugin";i:1;a:4:{i:0;s:5:"skill";i:1;a:2:{i:0;s:1:"2";i:1;s:1:"5";}i:2;i:5;i:3;s:13:"{{skill>2/5}}";}i:2;i:1816;}i:193;a:3:{i:0;s:5:"cdata";i:1;a:1:{i:0;s:1:" ";}i:2;i:1829;}i:194;a:3:{i:0;s:9:"linebreak";i:1;a:0:{}i:2;i:1830;}i:195;a:3:{i:0;s:5:"cdata";i:1;a:1:{i:0;s:1:"
";}i:2;i:1832;}i:196;a:3:{i:0;s:12:"externallink";i:1;a:2:{i:0;s:20:"http://xkcd.com/720/";i:1;s:7:"Recipes";}i:2;i:1833;}i:197;a:3:{i:0;s:5:"cdata";i:1;a:1:{i:0;s:1:" ";}i:2;i:1865;}i:198;a:3:{i:0;s:6:"plugin";i:1;a:4:{i:0;s:5:"skill";i:1;a:2:{i:0;s:1:"2";i:1;s:1:"5";}i:2;i:5;i:3;s:13:"{{skill>2/5}}";}i:2;i:1866;}i:199;a:3:{i:0;s:5:"cdata";i:1;a:1:{i:0;s:1:" ";}i:2;i:1879;}i:200;a:3:{i:0;s:9:"linebreak";i:1;a:0:{}i:2;i:1880;}i:201;a:3:{i:0;s:5:"cdata";i:1;a:1:{i:0;s:1:"
";}i:2;i:1882;}i:202;a:3:{i:0;s:12:"externallink";i:1;a:2:{i:0;s:20:"http://xkcd.com/723/";i:1;s:13:"Seismic Waves";}i:2;i:1883;}i:203;a:3:{i:0;s:5:"cdata";i:1;a:1:{i:0;s:1:" ";}i:2;i:1921;}i:204;a:3:{i:0;s:6:"plugin";i:1;a:4:{i:0;s:5:"skill";i:1;a:2:{i:0;s:1:"2";i:1;s:1:"5";}i:2;i:5;i:3;s:13:"{{skill>2/5}}";}i:2;i:1922;}i:205;a:3:{i:0;s:5:"cdata";i:1;a:1:{i:0;s:1:" ";}i:2;i:1935;}i:206;a:3:{i:0;s:9:"linebreak";i:1;a:0:{}i:2;i:1936;}i:207;a:3:{i:0;s:7:"p_close";i:1;a:0:{}i:2;i:1938;}i:208;a:2:{i:0;s:6:"plugin";i:1;a:4:{i:0;s:7:"uparrow";i:1;a:1:{i:0;s:42:"lib/plugins/uparrow/images/tango-small.png";}i:2;i:1;i:3;s:6:"~~UP~~";}}i:209;a:3:{i:0;s:13:"section_close";i:1;a:0:{}i:2;i:1940;}i:210;a:3:{i:0;s:12:"section_edit";i:1;a:4:{i:0;i:23;i:1;i:1939;i:2;i:2;i:3;s:4:"xkcd";}i:2;i:1940;}i:211;a:3:{i:0;s:6:"header";i:1;a:3:{i:0;s:6:"Others";i:1;i:2;i:2;i:1940;}i:2;i:1940;}i:212;a:3:{i:0;s:12:"section_open";i:1;a:1:{i:0;i:2;}i:2;i:1940;}i:213;a:3:{i:0;s:6:"p_open";i:1;a:0:{}i:2;i:1958;}i:214;a:3:{i:0;s:5:"cdata";i:1;a:1:{i:0;s:1:"
";}i:2;i:1959;}i:215;a:3:{i:0;s:12:"externallink";i:1;a:2:{i:0;s:54:"http://www.phdcomics.com/comics/archive/phd112009s.gif";i:1;s:30:"PhD: Changes wrote on my draft";}i:2;i:1960;}i:216;a:3:{i:0;s:5:"cdata";i:1;a:1:{i:0;s:1:" ";}i:2;i:2049;}i:217;a:3:{i:0;s:9:"linebreak";i:1;a:0:{}i:2;i:2050;}i:218;a:3:{i:0;s:5:"cdata";i:1;a:1:{i:0;s:1:"
";}i:2;i:2052;}i:219;a:3:{i:0;s:12:"externallink";i:1;a:2:{i:0;s:28:"http://abstrusegoose.com/249";i:1;s:49:"Abstruse Goose: How to teach yourself programming";}i:2;i:2053;}i:220;a:3:{i:0;s:5:"cdata";i:1;a:1:{i:0;s:1:" ";}i:2;i:2135;}i:221;a:3:{i:0;s:9:"linebreak";i:1;a:0:{}i:2;i:2136;}i:222;a:3:{i:0;s:7:"p_close";i:1;a:0:{}i:2;i:2138;}i:223;a:3:{i:0;s:6:"plugin";i:1;a:4:{i:0;s:7:"tag_tag";i:1;a:1:{i:0;s:5:"links";}i:2;i:5;i:3;s:13:"{{tag>links}}";}i:2;i:2140;}i:224;a:2:{i:0;s:6:"plugin";i:1;a:4:{i:0;s:7:"uparrow";i:1;a:1:{i:0;s:42:"lib/plugins/uparrow/images/tango-small.png";}i:2;i:1;i:3;s:6:"~~UP~~";}}i:225;a:3:{i:0;s:13:"section_close";i:1;a:0:{}i:2;i:2153;}i:226;a:3:{i:0;s:12:"section_edit";i:1;a:4:{i:0;i:1940;i:1;i:0;i:2;i:2;i:3;s:6:"Others";}i:2;i:2153;}i:227;a:3:{i:0;s:12:"document_end";i:1;a:0:{}i:2;i:2153;}}