a:28:{i:0;a:3:{i:0;s:14:"document_start";i:1;a:0:{}i:2;i:0;}i:1;a:3:{i:0;s:6:"p_open";i:1;a:0:{}i:2;i:0;}i:2;a:3:{i:0;s:7:"p_close";i:1;a:0:{}i:2;i:1;}i:3;a:3:{i:0;s:12:"section_edit";i:1;a:4:{i:0;i:-1;i:1;i:0;i:2;i:1;i:3;s:0:"";}i:2;i:1;}i:4;a:3:{i:0;s:6:"header";i:1;a:3:{i:0;s:10:"Hacker.org";i:1;i:1;i:2;i:1;}i:2;i:1;}i:5;a:3:{i:0;s:12:"section_open";i:1;a:1:{i:0;i:1;}i:2;i:1;}i:6;a:3:{i:0;s:6:"p_open";i:1;a:0:{}i:2;i:25;}i:7;a:3:{i:0;s:5:"cdata";i:1;a:1:{i:0;s:1:"
";}i:2;i:26;}i:8;a:3:{i:0;s:12:"externallink";i:1;a:2:{i:0;s:22:"http://www.hacker.org/";i:1;s:10:"Hacker.org";}i:2;i:27;}i:9;a:3:{i:0;s:5:"cdata";i:1;a:1:{i:0;s:1:" ";}i:2;i:64;}i:10;a:3:{i:0;s:9:"linebreak";i:1;a:0:{}i:2;i:65;}i:11;a:3:{i:0;s:7:"p_close";i:1;a:0:{}i:2;i:67;}i:12;a:2:{i:0;s:6:"plugin";i:1;a:4:{i:0;s:7:"uparrow";i:1;a:1:{i:0;s:42:"lib/plugins/uparrow/images/tango-small.png";}i:2;i:1;i:3;s:6:"~~UP~~";}}i:13;a:3:{i:0;s:13:"section_close";i:1;a:0:{}i:2;i:69;}i:14;a:3:{i:0;s:12:"section_edit";i:1;a:4:{i:0;i:1;i:1;i:68;i:2;i:1;i:3;s:10:"Hacker.org";}i:2;i:69;}i:15;a:3:{i:0;s:6:"header";i:1;a:3:{i:0;s:15:"My Performances";i:1;i:2;i:2;i:69;}i:2;i:69;}i:16;a:3:{i:0;s:12:"section_open";i:1;a:1:{i:0;i:2;}i:2;i:69;}i:17;a:3:{i:0;s:6:"p_open";i:1;a:0:{}i:2;i:96;}i:18;a:3:{i:0;s:5:"cdata";i:1;a:1:{i:0;s:1:"
";}i:2;i:97;}i:19;a:3:{i:0;s:12:"externallink";i:1;a:2:{i:0;s:63:"http://www.hacker.org/forum/profile.php?mode=viewprofile&u=6969";i:1;s:8:"kauesilv";}i:2;i:98;}i:20;a:3:{i:0;s:5:"cdata";i:1;a:1:{i:0;s:1:" ";}i:2;i:174;}i:21;a:3:{i:0;s:9:"linebreak";i:1;a:0:{}i:2;i:175;}i:22;a:3:{i:0;s:5:"cdata";i:1;a:1:{i:0;s:1:"
";}i:2;i:177;}i:23;a:3:{i:0;s:7:"p_close";i:1;a:0:{}i:2;i:177;}i:24;a:2:{i:0;s:6:"plugin";i:1;a:4:{i:0;s:7:"uparrow";i:1;a:1:{i:0;s:42:"lib/plugins/uparrow/images/tango-small.png";}i:2;i:1;i:3;s:6:"~~UP~~";}}i:25;a:3:{i:0;s:13:"section_close";i:1;a:0:{}i:2;i:177;}i:26;a:3:{i:0;s:12:"section_edit";i:1;a:4:{i:0;i:69;i:1;i:0;i:2;i:2;i:3;s:15:"My Performances";}i:2;i:177;}i:27;a:3:{i:0;s:12:"document_end";i:1;a:0:{}i:2;i:177;}}