a:89:{i:0;a:3:{i:0;s:14:"document_start";i:1;a:0:{}i:2;i:0;}i:1;a:3:{i:0;s:6:"p_open";i:1;a:0:{}i:2;i:0;}i:2;a:3:{i:0;s:7:"p_close";i:1;a:0:{}i:2;i:1;}i:3;a:3:{i:0;s:12:"section_edit";i:1;a:4:{i:0;i:-1;i:1;i:0;i:2;i:1;i:3;s:0:"";}i:2;i:1;}i:4;a:3:{i:0;s:6:"header";i:1;a:3:{i:0;s:3:"Git";i:1;i:1;i:2;i:1;}i:2;i:1;}i:5;a:3:{i:0;s:12:"section_open";i:1;a:1:{i:0;i:1;}i:2;i:1;}i:6;a:3:{i:0;s:6:"p_open";i:1;a:0:{}i:2;i:18;}i:7;a:3:{i:0;s:5:"cdata";i:1;a:1:{i:0;s:1:"
";}i:2;i:19;}i:8;a:3:{i:0;s:12:"externallink";i:1;a:2:{i:0;s:19:"http://git-scm.com/";i:1;s:3:"Git";}i:2;i:20;}i:9;a:3:{i:0;s:5:"cdata";i:1;a:1:{i:0;s:2:": ";}i:2;i:47;}i:10;a:3:{i:0;s:13:"interwikilink";i:1;a:4:{i:0;s:17:"wp>Git_(software)";i:1;s:3:"Git";i:2;s:2:"wp";i:3;s:14:"Git_(software)";}i:2;i:49;}i:11;a:3:{i:0;s:5:"cdata";i:1;a:1:{i:0;s:1:" ";}i:2;i:74;}i:12;a:3:{i:0;s:9:"linebreak";i:1;a:0:{}i:2;i:75;}i:13;a:3:{i:0;s:5:"cdata";i:1;a:1:{i:0;s:7:"
Using ";}i:2;i:77;}i:14;a:3:{i:0;s:12:"externallink";i:1;a:2:{i:0;s:19:"https://github.com/";i:1;s:6:"GitHub";}i:2;i:84;}i:15;a:3:{i:0;s:7:"p_close";i:1;a:0:{}i:2;i:114;}i:16;a:2:{i:0;s:6:"plugin";i:1;a:4:{i:0;s:7:"uparrow";i:1;a:1:{i:0;s:42:"lib/plugins/uparrow/images/tango-small.png";}i:2;i:1;i:3;s:6:"~~UP~~";}}i:17;a:3:{i:0;s:13:"section_close";i:1;a:0:{}i:2;i:116;}i:18;a:3:{i:0;s:12:"section_edit";i:1;a:4:{i:0;i:1;i:1;i:115;i:2;i:1;i:3;s:3:"Git";}i:2;i:116;}i:19;a:3:{i:0;s:6:"header";i:1;a:3:{i:0;s:18:"How to install Git";i:1;i:2;i:2;i:116;}i:2;i:116;}i:20;a:3:{i:0;s:12:"section_open";i:1;a:1:{i:0;i:2;}i:2;i:116;}i:21;a:3:{i:0;s:4:"code";i:1;a:3:{i:0;s:135:"
$ sudo apt-get install git-core
$ git config --global user.name user_name
$ git config --global user.email you@yourdomain.example.com
";i:1;s:4:"bash";i:2;N;}i:2;i:152;}i:22;a:2:{i:0;s:6:"plugin";i:1;a:4:{i:0;s:7:"uparrow";i:1;a:1:{i:0;s:42:"lib/plugins/uparrow/images/tango-small.png";}i:2;i:1;i:3;s:6:"~~UP~~";}}i:23;a:3:{i:0;s:13:"section_close";i:1;a:0:{}i:2;i:302;}i:24;a:3:{i:0;s:12:"section_edit";i:1;a:4:{i:0;i:116;i:1;i:301;i:2;i:2;i:3;s:18:"How to install Git";}i:2;i:302;}i:25;a:3:{i:0;s:6:"header";i:1;a:3:{i:0;s:23:"How to create a SSH key";i:1;i:2;i:2;i:302;}i:2;i:302;}i:26;a:3:{i:0;s:12:"section_open";i:1;a:1:{i:0;i:2;}i:2;i:302;}i:27;a:3:{i:0;s:4:"code";i:1;a:3:{i:0;s:14:"
$ ssh-keygen
";i:1;s:4:"bash";i:2;N;}i:2;i:344;}i:28;a:2:{i:0;s:6:"plugin";i:1;a:4:{i:0;s:7:"uparrow";i:1;a:1:{i:0;s:42:"lib/plugins/uparrow/images/tango-small.png";}i:2;i:1;i:3;s:6:"~~UP~~";}}i:29;a:3:{i:0;s:13:"section_close";i:1;a:0:{}i:2;i:374;}i:30;a:3:{i:0;s:12:"section_edit";i:1;a:4:{i:0;i:302;i:1;i:373;i:2;i:2;i:3;s:23:"How to create a SSH key";}i:2;i:374;}i:31;a:3:{i:0;s:6:"header";i:1;a:3:{i:0;s:23:"How to create a project";i:1;i:2;i:2;i:374;}i:2;i:374;}i:32;a:3:{i:0;s:12:"section_open";i:1;a:1:{i:0;i:2;}i:2;i:374;}i:33;a:3:{i:0;s:4:"code";i:1;a:3:{i:0;s:205:"
$ mkdir project_name
$ cd project_name
$ git init
$ touch README
$ git add README
$ git commit -m 'first commit'
$ git remote add origin git@github.com:user_name/project_name.git
$ git push origin master
";i:1;s:4:"bash";i:2;N;}i:2;i:416;}i:34;a:2:{i:0;s:6:"plugin";i:1;a:4:{i:0;s:7:"uparrow";i:1;a:1:{i:0;s:42:"lib/plugins/uparrow/images/tango-small.png";}i:2;i:1;i:3;s:6:"~~UP~~";}}i:35;a:3:{i:0;s:13:"section_close";i:1;a:0:{}i:2;i:636;}i:36;a:3:{i:0;s:12:"section_edit";i:1;a:4:{i:0;i:374;i:1;i:635;i:2;i:2;i:3;s:23:"How to create a project";}i:2;i:636;}i:37;a:3:{i:0;s:6:"header";i:1;a:3:{i:0;s:25:"How to download a project";i:1;i:2;i:2;i:636;}i:2;i:636;}i:38;a:3:{i:0;s:12:"section_open";i:1;a:1:{i:0;i:2;}i:2;i:636;}i:39;a:3:{i:0;s:4:"code";i:1;a:3:{i:0;s:76:"
$ git clone http://github.com/user_name/project_name.git
$ cd project_name
";i:1;s:4:"bash";i:2;N;}i:2;i:680;}i:40;a:2:{i:0;s:6:"plugin";i:1;a:4:{i:0;s:7:"uparrow";i:1;a:1:{i:0;s:42:"lib/plugins/uparrow/images/tango-small.png";}i:2;i:1;i:3;s:6:"~~UP~~";}}i:41;a:3:{i:0;s:13:"section_close";i:1;a:0:{}i:2;i:771;}i:42;a:3:{i:0;s:12:"section_edit";i:1;a:4:{i:0;i:636;i:1;i:770;i:2;i:2;i:3;s:25:"How to download a project";}i:2;i:771;}i:43;a:3:{i:0;s:6:"header";i:1;a:3:{i:0;s:23:"How to upload a project";i:1;i:2;i:2;i:771;}i:2;i:771;}i:44;a:3:{i:0;s:12:"section_open";i:1;a:1:{i:0;i:2;}i:2;i:771;}i:45;a:3:{i:0;s:6:"p_open";i:1;a:0:{}i:2;i:806;}i:46;a:3:{i:0;s:5:"cdata";i:1;a:1:{i:0;s:21:"
Just the first time:";}i:2;i:807;}i:47;a:3:{i:0;s:7:"p_close";i:1;a:0:{}i:2;i:828;}i:48;a:3:{i:0;s:4:"code";i:1;a:3:{i:0;s:90:"
$ git remote rm origin
$ git remote add origin git@github.com:user_name/project_name.git
";i:1;s:4:"bash";i:2;N;}i:2;i:835;}i:49;a:3:{i:0;s:6:"p_open";i:1;a:0:{}i:2;i:938;}i:50;a:3:{i:0;s:5:"cdata";i:1;a:1:{i:0;s:8:"Always:
";}i:2;i:940;}i:51;a:3:{i:0;s:7:"p_close";i:1;a:0:{}i:2;i:953;}i:52;a:3:{i:0;s:4:"code";i:1;a:3:{i:0;s:90:"
$ git add .
$ git commit -a -m"description of the modifications"
$ git push --all origin
";i:1;s:4:"bash";i:2;N;}i:2;i:953;}i:53;a:2:{i:0;s:6:"plugin";i:1;a:4:{i:0;s:7:"uparrow";i:1;a:1:{i:0;s:42:"lib/plugins/uparrow/images/tango-small.png";}i:2;i:1;i:3;s:6:"~~UP~~";}}i:54;a:3:{i:0;s:13:"section_close";i:1;a:0:{}i:2;i:1058;}i:55;a:3:{i:0;s:12:"section_edit";i:1;a:4:{i:0;i:771;i:1;i:1057;i:2;i:2;i:3;s:23:"How to upload a project";}i:2;i:1058;}i:56;a:3:{i:0;s:6:"header";i:1;a:3:{i:0;s:39:"How to update your version of a project";i:1;i:2;i:2;i:1058;}i:2;i:1058;}i:57;a:3:{i:0;s:12:"section_open";i:1;a:1:{i:0;i:2;}i:2;i:1058;}i:58;a:3:{i:0;s:4:"code";i:1;a:3:{i:0;s:26:"
$ git pull origin master
";i:1;s:4:"bash";i:2;N;}i:2;i:1116;}i:59;a:2:{i:0;s:6:"plugin";i:1;a:4:{i:0;s:7:"uparrow";i:1;a:1:{i:0;s:42:"lib/plugins/uparrow/images/tango-small.png";}i:2;i:1;i:3;s:6:"~~UP~~";}}i:60;a:3:{i:0;s:13:"section_close";i:1;a:0:{}i:2;i:1159;}i:61;a:3:{i:0;s:12:"section_edit";i:1;a:4:{i:0;i:1058;i:1;i:1158;i:2;i:2;i:3;s:39:"How to update your version of a project";}i:2;i:1159;}i:62;a:3:{i:0;s:6:"header";i:1;a:3:{i:0;s:19:"How to create a tag";i:1;i:2;i:2;i:1159;}i:2;i:1159;}i:63;a:3:{i:0;s:12:"section_open";i:1;a:1:{i:0;i:2;}i:2;i:1159;}i:64;a:3:{i:0;s:4:"code";i:1;a:3:{i:0;s:20:"
$ git tag tag_name
";i:1;s:4:"bash";i:2;N;}i:2;i:1197;}i:65;a:2:{i:0;s:6:"plugin";i:1;a:4:{i:0;s:7:"uparrow";i:1;a:1:{i:0;s:42:"lib/plugins/uparrow/images/tango-small.png";}i:2;i:1;i:3;s:6:"~~UP~~";}}i:66;a:3:{i:0;s:13:"section_close";i:1;a:0:{}i:2;i:1232;}i:67;a:3:{i:0;s:12:"section_edit";i:1;a:4:{i:0;i:1159;i:1;i:1231;i:2;i:2;i:3;s:19:"How to create a tag";}i:2;i:1232;}i:68;a:3:{i:0;s:6:"header";i:1;a:3:{i:0;s:19:"How to upload a tag";i:1;i:2;i:2;i:1232;}i:2;i:1232;}i:69;a:3:{i:0;s:12:"section_open";i:1;a:1:{i:0;i:2;}i:2;i:1232;}i:70;a:3:{i:0;s:4:"code";i:1;a:3:{i:0;s:28:"
$ git push origin tag_name
";i:1;s:4:"bash";i:2;N;}i:2;i:1270;}i:71;a:3:{i:0;s:6:"p_open";i:1;a:0:{}i:2;i:1311;}i:72;a:3:{i:0;s:5:"cdata";i:1;a:1:{i:0;s:2:"or";}i:2;i:1313;}i:73;a:3:{i:0;s:7:"p_close";i:1;a:0:{}i:2;i:1315;}i:74;a:3:{i:0;s:4:"code";i:1;a:3:{i:0;s:26:"
$ git push --tags origin
";i:1;s:4:"bash";i:2;N;}i:2;i:1322;}i:75;a:2:{i:0;s:6:"plugin";i:1;a:4:{i:0;s:7:"uparrow";i:1;a:1:{i:0;s:42:"lib/plugins/uparrow/images/tango-small.png";}i:2;i:1;i:3;s:6:"~~UP~~";}}i:76;a:3:{i:0;s:13:"section_close";i:1;a:0:{}i:2;i:1363;}i:77;a:3:{i:0;s:12:"section_edit";i:1;a:4:{i:0;i:1232;i:1;i:1362;i:2;i:2;i:3;s:19:"How to upload a tag";}i:2;i:1363;}i:78;a:3:{i:0;s:6:"header";i:1;a:3:{i:0;s:15:"Git Cheat Sheet";i:1;i:2;i:2;i:1363;}i:2;i:1363;}i:79;a:3:{i:0;s:12:"section_open";i:1;a:1:{i:0;i:2;}i:2;i:1363;}i:80;a:3:{i:0;s:6:"p_open";i:1;a:0:{}i:2;i:1390;}i:81;a:3:{i:0;s:5:"cdata";i:1;a:1:{i:0;s:1:"
";}i:2;i:1391;}i:82;a:3:{i:0;s:12:"externallink";i:1;a:2:{i:0;s:95:"http://cheat.errtheblog.com/s/git?utm_source=twitter&utm_medium=micro-blog&utm_campaign=twitter";i:1;s:9:"Cheat Git";}i:2;i:1392;}i:83;a:3:{i:0;s:7:"p_close";i:1;a:0:{}i:2;i:1501;}i:84;a:3:{i:0;s:6:"plugin";i:1;a:4:{i:0;s:7:"tag_tag";i:1;a:1:{i:0;s:11:"programming";}i:2;i:5;i:3;s:19:"{{tag>programming}}";}i:2;i:1503;}i:85;a:2:{i:0;s:6:"plugin";i:1;a:4:{i:0;s:7:"uparrow";i:1;a:1:{i:0;s:42:"lib/plugins/uparrow/images/tango-small.png";}i:2;i:1;i:3;s:6:"~~UP~~";}}i:86;a:3:{i:0;s:13:"section_close";i:1;a:0:{}i:2;i:1522;}i:87;a:3:{i:0;s:12:"section_edit";i:1;a:4:{i:0;i:1363;i:1;i:0;i:2;i:2;i:3;s:15:"Git Cheat Sheet";}i:2;i:1522;}i:88;a:3:{i:0;s:12:"document_end";i:1;a:0:{}i:2;i:1522;}}