a:64:{i:0;a:3:{i:0;s:14:"document_start";i:1;a:0:{}i:2;i:0;}i:1;a:3:{i:0;s:6:"p_open";i:1;a:0:{}i:2;i:0;}i:2;a:3:{i:0;s:7:"p_close";i:1;a:0:{}i:2;i:1;}i:3;a:3:{i:0;s:12:"section_edit";i:1;a:4:{i:0;i:-1;i:1;i:0;i:2;i:1;i:3;s:0:"";}i:2;i:1;}i:4;a:3:{i:0;s:6:"header";i:1;a:3:{i:0;s:4:"Make";i:1;i:1;i:2;i:1;}i:2;i:1;}i:5;a:3:{i:0;s:12:"section_open";i:1;a:1:{i:0;i:1;}i:2;i:1;}i:6;a:3:{i:0;s:6:"p_open";i:1;a:0:{}i:2;i:19;}i:7;a:3:{i:0;s:5:"cdata";i:1;a:1:{i:0;s:1:"
";}i:2;i:20;}i:8;a:3:{i:0;s:12:"externallink";i:1;a:2:{i:0;s:33:"http://www.gnu.org/software/make/";i:1;s:4:"Make";}i:2;i:21;}i:9;a:3:{i:0;s:5:"cdata";i:1;a:1:{i:0;s:2:": ";}i:2;i:63;}i:10;a:3:{i:0;s:13:"interwikilink";i:1;a:4:{i:0;s:18:"wp>Make_(software)";i:1;s:4:"Make";i:2;s:2:"wp";i:3;s:15:"Make_(software)";}i:2;i:65;}i:11;a:3:{i:0;s:7:"p_close";i:1;a:0:{}i:2;i:92;}i:12;a:2:{i:0;s:6:"plugin";i:1;a:4:{i:0;s:7:"uparrow";i:1;a:1:{i:0;s:42:"lib/plugins/uparrow/images/tango-small.png";}i:2;i:1;i:3;s:6:"~~UP~~";}}i:13;a:3:{i:0;s:13:"section_close";i:1;a:0:{}i:2;i:94;}i:14;a:3:{i:0;s:12:"section_edit";i:1;a:4:{i:0;i:1;i:1;i:93;i:2;i:1;i:3;s:4:"Make";}i:2;i:94;}i:15;a:3:{i:0;s:6:"header";i:1;a:3:{i:0;s:14:"Smart Makefile";i:1;i:2;i:2;i:94;}i:2;i:94;}i:16;a:3:{i:0;s:12:"section_open";i:1;a:1:{i:0;i:2;}i:2;i:94;}i:17;a:3:{i:0;s:6:"p_open";i:1;a:0:{}i:2;i:120;}i:18;a:3:{i:0;s:5:"cdata";i:1;a:1:{i:0;s:1:"
";}i:2;i:121;}i:19;a:3:{i:0;s:12:"externallink";i:1;a:2:{i:0;s:58:"http://www-etud.iro.umontreal.ca/~petitg/cpp/makefile.html";i:1;s:4:"Here";}i:2;i:122;}i:20;a:3:{i:0;s:5:"cdata";i:1;a:1:{i:0;s:1:".";}i:2;i:189;}i:21;a:3:{i:0;s:7:"p_close";i:1;a:0:{}i:2;i:190;}i:22;a:2:{i:0;s:6:"plugin";i:1;a:4:{i:0;s:7:"uparrow";i:1;a:1:{i:0;s:42:"lib/plugins/uparrow/images/tango-small.png";}i:2;i:1;i:3;s:6:"~~UP~~";}}i:23;a:3:{i:0;s:13:"section_close";i:1;a:0:{}i:2;i:192;}i:24;a:3:{i:0;s:12:"section_edit";i:1;a:4:{i:0;i:94;i:1;i:191;i:2;i:2;i:3;s:14:"Smart Makefile";}i:2;i:192;}i:25;a:3:{i:0;s:6:"header";i:1;a:3:{i:0;s:15:"Simple Makefile";i:1;i:2;i:2;i:192;}i:2;i:192;}i:26;a:3:{i:0;s:12:"section_open";i:1;a:1:{i:0;i:2;}i:2;i:192;}i:27;a:3:{i:0;s:6:"p_open";i:1;a:0:{}i:2;i:219;}i:28;a:3:{i:0;s:5:"cdata";i:1;a:1:{i:0;s:40:"
This assumes a program.cpp source file.";}i:2;i:220;}i:29;a:3:{i:0;s:7:"p_close";i:1;a:0:{}i:2;i:260;}i:30;a:3:{i:0;s:4:"file";i:1;a:3:{i:0;s:47:"
all: program
	./$<
	touch $<
CXXFLAGS = -Wall
";i:1;s:4:"make";i:2;s:8:"makefile";}i:2;i:267;}i:31;a:3:{i:0;s:6:"p_open";i:1;a:0:{}i:2;i:336;}i:32;a:3:{i:0;s:5:"cdata";i:1;a:1:{i:0;s:6:"Usage:";}i:2;i:338;}i:33;a:3:{i:0;s:7:"p_close";i:1;a:0:{}i:2;i:344;}i:34;a:3:{i:0;s:4:"code";i:1;a:3:{i:0;s:156:"
$ ls
program.cpp makefile
$ make
g++ -Wall -o program program.cpp
./program
touch program
$ ls
program program.cpp makefile
$ make
./program
touch program
";i:1;s:4:"bash";i:2;N;}i:2;i:351;}i:35;a:2:{i:0;s:6:"plugin";i:1;a:4:{i:0;s:7:"uparrow";i:1;a:1:{i:0;s:42:"lib/plugins/uparrow/images/tango-small.png";}i:2;i:1;i:3;s:6:"~~UP~~";}}i:36;a:3:{i:0;s:13:"section_close";i:1;a:0:{}i:2;i:522;}i:37;a:3:{i:0;s:12:"section_edit";i:1;a:4:{i:0;i:192;i:1;i:521;i:2;i:2;i:3;s:15:"Simple Makefile";}i:2;i:522;}i:38;a:3:{i:0;s:6:"header";i:1;a:3:{i:0;s:44:"How to do a Programming Competition Makefile";i:1;i:2;i:2;i:522;}i:2;i:522;}i:39;a:3:{i:0;s:12:"section_open";i:1;a:1:{i:0;i:2;}i:2;i:522;}i:40;a:3:{i:0;s:4:"file";i:1;a:3:{i:0;s:219:"
PROG = a

all: $(PROG) $(PROG).in
	./$(PROG) < $(PROG).in
	@touch $(PROG)

$(PROG): $(PROG).cpp
	g++ -o $(PROG) $(PROG).cpp -Wall

$(PROG).cpp:
	@touch $(PROG).cpp

$(PROG).in:
	@touch $(PROG).in

clean:
	rm -f *.o *~
";i:1;s:4:"make";i:2;s:8:"makefile";}i:2;i:585;}i:41;a:2:{i:0;s:6:"plugin";i:1;a:4:{i:0;s:7:"uparrow";i:1;a:1:{i:0;s:42:"lib/plugins/uparrow/images/tango-small.png";}i:2;i:1;i:3;s:6:"~~UP~~";}}i:42;a:3:{i:0;s:13:"section_close";i:1;a:0:{}i:2;i:828;}i:43;a:3:{i:0;s:12:"section_edit";i:1;a:4:{i:0;i:522;i:1;i:827;i:2;i:2;i:3;s:44:"How to do a Programming Competition Makefile";}i:2;i:828;}i:44;a:3:{i:0;s:6:"header";i:1;a:3:{i:0;s:24:"How to install colormake";i:1;i:2;i:2;i:828;}i:2;i:828;}i:45;a:3:{i:0;s:12:"section_open";i:1;a:1:{i:0;i:2;}i:2;i:828;}i:46;a:3:{i:0;s:4:"code";i:1;a:3:{i:0;s:91:"
$ sudo apt-get install colormake
$ cd /usr/local/bin
$ sudo ln -s /usr/bin/colormake make
";i:1;s:4:"bash";i:2;N;}i:2;i:871;}i:47;a:2:{i:0;s:6:"plugin";i:1;a:4:{i:0;s:7:"uparrow";i:1;a:1:{i:0;s:42:"lib/plugins/uparrow/images/tango-small.png";}i:2;i:1;i:3;s:6:"~~UP~~";}}i:48;a:3:{i:0;s:13:"section_close";i:1;a:0:{}i:2;i:977;}i:49;a:3:{i:0;s:12:"section_edit";i:1;a:4:{i:0;i:828;i:1;i:976;i:2;i:2;i:3;s:24:"How to install colormake";}i:2;i:977;}i:50;a:3:{i:0;s:6:"header";i:1;a:3:{i:0;s:32:"How to access an index of a list";i:1;i:2;i:2;i:977;}i:2;i:977;}i:51;a:3:{i:0;s:12:"section_open";i:1;a:1:{i:0;i:2;}i:2;i:977;}i:52;a:3:{i:0;s:4:"code";i:1;a:3:{i:0;s:43:"
all: prog1 prog2
  ./$<
  ./$(word 2, $^)
";i:1;s:4:"make";i:2;N;}i:2;i:1028;}i:53;a:2:{i:0;s:6:"plugin";i:1;a:4:{i:0;s:7:"uparrow";i:1;a:1:{i:0;s:42:"lib/plugins/uparrow/images/tango-small.png";}i:2;i:1;i:3;s:6:"~~UP~~";}}i:54;a:3:{i:0;s:13:"section_close";i:1;a:0:{}i:2;i:1086;}i:55;a:3:{i:0;s:12:"section_edit";i:1;a:4:{i:0;i:977;i:1;i:1085;i:2;i:2;i:3;s:32:"How to access an index of a list";}i:2;i:1086;}i:56;a:3:{i:0;s:6:"header";i:1;a:3:{i:0;s:29:"How to make latex with bibtex";i:1;i:2;i:2;i:1086;}i:2;i:1086;}i:57;a:3:{i:0;s:12:"section_open";i:1;a:1:{i:0;i:2;}i:2;i:1086;}i:58;a:3:{i:0;s:4:"code";i:1;a:3:{i:0;s:193:"
DOC = document_name
all:
	pdflatex $(DOC).tex
	bibtex $(DOC)
	pdflatex $(DOC).tex
	pdflatex $(DOC).tex

clean:
	rm -rf *.aux *.nav *.out *.log *.snm *.toc *.vrb *~ *.o *.bbl *.blg *.lof *.lot
";i:1;s:4:"make";i:2;N;}i:2;i:1134;}i:59;a:3:{i:0;s:6:"plugin";i:1;a:4:{i:0;s:7:"tag_tag";i:1;a:1:{i:0;s:11:"programming";}i:2;i:5;i:3;s:19:"{{tag>programming}}";}i:2;i:1342;}i:60;a:2:{i:0;s:6:"plugin";i:1;a:4:{i:0;s:7:"uparrow";i:1;a:1:{i:0;s:42:"lib/plugins/uparrow/images/tango-small.png";}i:2;i:1;i:3;s:6:"~~UP~~";}}i:61;a:3:{i:0;s:13:"section_close";i:1;a:0:{}i:2;i:1362;}i:62;a:3:{i:0;s:12:"section_edit";i:1;a:4:{i:0;i:1086;i:1;i:0;i:2;i:2;i:3;s:29:"How to make latex with bibtex";}i:2;i:1362;}i:63;a:3:{i:0;s:12:"document_end";i:1;a:0:{}i:2;i:1362;}}