a:33:{i:0;a:3:{i:0;s:14:"document_start";i:1;a:0:{}i:2;i:0;}i:1;a:3:{i:0;s:6:"p_open";i:1;a:0:{}i:2;i:0;}i:2;a:3:{i:0;s:7:"p_close";i:1;a:0:{}i:2;i:1;}i:3;a:3:{i:0;s:12:"section_edit";i:1;a:4:{i:0;i:-1;i:1;i:0;i:2;i:1;i:3;s:0:"";}i:2;i:1;}i:4;a:3:{i:0;s:6:"header";i:1;a:3:{i:0;s:4:"ICPC";i:1;i:1;i:2;i:1;}i:2;i:1;}i:5;a:3:{i:0;s:12:"section_open";i:1;a:1:{i:0;i:1;}i:2;i:1;}i:6;a:3:{i:0;s:6:"p_open";i:1;a:0:{}i:2;i:19;}i:7;a:3:{i:0;s:5:"cdata";i:1;a:1:{i:0;s:1:"
";}i:2;i:20;}i:8;a:3:{i:0;s:12:"externallink";i:1;a:2:{i:0;s:33:"http://cm.baylor.edu/welcome.icpc";i:1;s:48:"ACM Internacional Collegiate Programming Contest";}i:2;i:21;}i:9;a:3:{i:0;s:5:"cdata";i:1;a:1:{i:0;s:2:": ";}i:2;i:107;}i:10;a:3:{i:0;s:13:"interwikilink";i:1;a:4:{i:0;s:51:"wp>ACM_International_Collegiate_Programming_Contest";i:1;s:48:"ACM Internacional Collegiate Programming Contest";i:2;s:2:"wp";i:3;s:48:"ACM_International_Collegiate_Programming_Contest";}i:2;i:109;}i:11;a:3:{i:0;s:5:"cdata";i:1;a:1:{i:0;s:1:" ";}i:2;i:213;}i:12;a:3:{i:0;s:9:"linebreak";i:1;a:0:{}i:2;i:214;}i:13;a:3:{i:0;s:7:"p_close";i:1;a:0:{}i:2;i:216;}i:14;a:2:{i:0;s:6:"plugin";i:1;a:4:{i:0;s:7:"uparrow";i:1;a:1:{i:0;s:42:"lib/plugins/uparrow/images/tango-small.png";}i:2;i:1;i:3;s:6:"~~UP~~";}}i:15;a:3:{i:0;s:13:"section_close";i:1;a:0:{}i:2;i:218;}i:16;a:3:{i:0;s:12:"section_edit";i:1;a:4:{i:0;i:1;i:1;i:217;i:2;i:1;i:3;s:4:"ICPC";}i:2;i:218;}i:17;a:3:{i:0;s:6:"header";i:1;a:3:{i:0;s:15:"My Performances";i:1;i:2;i:2;i:218;}i:2;i:218;}i:18;a:3:{i:0;s:12:"section_open";i:1;a:1:{i:0;i:2;}i:2;i:218;}i:19;a:3:{i:0;s:6:"p_open";i:1;a:0:{}i:2;i:245;}i:20;a:3:{i:0;s:5:"cdata";i:1;a:1:{i:0;s:1:"
";}i:2;i:246;}i:21;a:3:{i:0;s:12:"externallink";i:1;a:2:{i:0;s:93:"http://maratona.ime.usp.br/hist/2009/primeira-fase/primeirafase09/portoalegre/resultados.html";i:1;s:37:"2009 - Brazilian Regional Stage (1st)";}i:2;i:247;}i:22;a:3:{i:0;s:5:"cdata";i:1;a:1:{i:0;s:1:" ";}i:2;i:382;}i:23;a:3:{i:0;s:9:"linebreak";i:1;a:0:{}i:2;i:383;}i:24;a:3:{i:0;s:5:"cdata";i:1;a:1:{i:0;s:1:"
";}i:2;i:385;}i:25;a:3:{i:0;s:12:"externallink";i:1;a:2:{i:0;s:47:"http://maratona.ime.usp.br/hist/2009/placar.pdf";i:1;s:38:"2009 - Brazilian National Stage (16th)";}i:2;i:386;}i:26;a:3:{i:0;s:5:"cdata";i:1;a:1:{i:0;s:1:" ";}i:2;i:476;}i:27;a:3:{i:0;s:9:"linebreak";i:1;a:0:{}i:2;i:477;}i:28;a:3:{i:0;s:7:"p_close";i:1;a:0:{}i:2;i:479;}i:29;a:2:{i:0;s:6:"plugin";i:1;a:4:{i:0;s:7:"uparrow";i:1;a:1:{i:0;s:42:"lib/plugins/uparrow/images/tango-small.png";}i:2;i:1;i:3;s:6:"~~UP~~";}}i:30;a:3:{i:0;s:13:"section_close";i:1;a:0:{}i:2;i:481;}i:31;a:3:{i:0;s:12:"section_edit";i:1;a:4:{i:0;i:218;i:1;i:0;i:2;i:2;i:3;s:15:"My Performances";}i:2;i:481;}i:32;a:3:{i:0;s:12:"document_end";i:1;a:0:{}i:2;i:481;}}