a:221:{i:0;a:3:{i:0;s:14:"document_start";i:1;a:0:{}i:2;i:0;}i:1;a:3:{i:0;s:6:"p_open";i:1;a:0:{}i:2;i:0;}i:2;a:3:{i:0;s:7:"p_close";i:1;a:0:{}i:2;i:1;}i:3;a:3:{i:0;s:12:"section_edit";i:1;a:4:{i:0;i:-1;i:1;i:0;i:2;i:1;i:3;s:0:"";}i:2;i:1;}i:4;a:3:{i:0;s:6:"header";i:1;a:3:{i:0;s:8:"DokuWiki";i:1;i:1;i:2;i:1;}i:2;i:1;}i:5;a:3:{i:0;s:12:"section_open";i:1;a:1:{i:0;i:1;}i:2;i:1;}i:6;a:3:{i:0;s:6:"p_open";i:1;a:0:{}i:2;i:23;}i:7;a:3:{i:0;s:5:"cdata";i:1;a:1:{i:0;s:1:"
";}i:2;i:24;}i:8;a:3:{i:0;s:12:"externallink";i:1;a:2:{i:0;s:24:"http://www.dokuwiki.org/";i:1;s:8:"MainPage";}i:2;i:25;}i:9;a:3:{i:0;s:5:"cdata";i:1;a:1:{i:0;s:1:" ";}i:2;i:62;}i:10;a:3:{i:0;s:9:"linebreak";i:1;a:0:{}i:2;i:63;}i:11;a:3:{i:0;s:5:"cdata";i:1;a:1:{i:0;s:1:"
";}i:2;i:65;}i:12;a:3:{i:0;s:12:"externallink";i:1;a:2:{i:0;s:31:"http://www.dokuwiki.org/install";i:1;s:12:"Installation";}i:2;i:66;}i:13;a:3:{i:0;s:5:"cdata";i:1;a:1:{i:0;s:1:" ";}i:2;i:114;}i:14;a:3:{i:0;s:9:"linebreak";i:1;a:0:{}i:2;i:115;}i:15;a:3:{i:0;s:7:"p_close";i:1;a:0:{}i:2;i:117;}i:16;a:3:{i:0;s:10:"listu_open";i:1;a:0:{}i:2;i:117;}i:17;a:3:{i:0;s:13:"listitem_open";i:1;a:1:{i:0;i:1;}i:2;i:117;}i:18;a:3:{i:0;s:16:"listcontent_open";i:1;a:0:{}i:2;i:117;}i:19;a:3:{i:0;s:5:"cdata";i:1;a:1:{i:0;s:71:" Hint: in order to copy the doku to your server you can use scp or sftp";}i:2;i:121;}i:20;a:3:{i:0;s:17:"listcontent_close";i:1;a:0:{}i:2;i:192;}i:21;a:3:{i:0;s:14:"listitem_close";i:1;a:0:{}i:2;i:192;}i:22;a:3:{i:0;s:11:"listu_close";i:1;a:0:{}i:2;i:192;}i:23;a:3:{i:0;s:6:"p_open";i:1;a:0:{}i:2;i:192;}i:24;a:3:{i:0;s:12:"externallink";i:1;a:2:{i:0;s:32:"http://www.dokuwiki.org/security";i:1;s:8:"Security";}i:2;i:193;}i:25;a:3:{i:0;s:5:"cdata";i:1;a:1:{i:0;s:1:" ";}i:2;i:238;}i:26;a:3:{i:0;s:9:"linebreak";i:1;a:0:{}i:2;i:239;}i:27;a:3:{i:0;s:7:"p_close";i:1;a:0:{}i:2;i:241;}i:28;a:3:{i:0;s:10:"listu_open";i:1;a:0:{}i:2;i:241;}i:29;a:3:{i:0;s:13:"listitem_open";i:1;a:1:{i:0;i:1;}i:2;i:241;}i:30;a:3:{i:0;s:16:"listcontent_open";i:1;a:0:{}i:2;i:241;}i:31;a:3:{i:0;s:5:"cdata";i:1;a:1:{i:0;s:66:" Hint: you can use sftp to recursively change the file permissions";}i:2;i:245;}i:32;a:3:{i:0;s:17:"listcontent_close";i:1;a:0:{}i:2;i:311;}i:33;a:3:{i:0;s:14:"listitem_close";i:1;a:0:{}i:2;i:311;}i:34;a:3:{i:0;s:11:"listu_close";i:1;a:0:{}i:2;i:311;}i:35;a:3:{i:0;s:6:"p_open";i:1;a:0:{}i:2;i:311;}i:36;a:3:{i:0;s:12:"externallink";i:1;a:2:{i:0;s:31:"http://www.dokuwiki.org/plugins";i:1;s:7:"Plugins";}i:2;i:312;}i:37;a:3:{i:0;s:5:"cdata";i:1;a:1:{i:0;s:1:" ";}i:2;i:355;}i:38;a:3:{i:0;s:9:"linebreak";i:1;a:0:{}i:2;i:356;}i:39;a:3:{i:0;s:5:"cdata";i:1;a:1:{i:0;s:1:"
";}i:2;i:358;}i:40;a:3:{i:0;s:12:"externallink";i:1;a:2:{i:0;s:32:"http://www.dokuwiki.org/template";i:1;s:9:"Templates";}i:2;i:359;}i:41;a:3:{i:0;s:5:"cdata";i:1;a:1:{i:0;s:1:" ";}i:2;i:405;}i:42;a:3:{i:0;s:9:"linebreak";i:1;a:0:{}i:2;i:406;}i:43;a:3:{i:0;s:5:"cdata";i:1;a:1:{i:0;s:1:"
";}i:2;i:408;}i:44;a:3:{i:0;s:6:"plugin";i:1;a:4:{i:0;s:11:"htmlcomment";i:1;a:2:{i:0;i:5;i:1;s:7:" [[|]] ";}i:2;i:5;i:3;s:14:"<!-- [[|]] -->";}i:2;i:409;}i:45;a:3:{i:0;s:7:"p_close";i:1;a:0:{}i:2;i:423;}i:46;a:2:{i:0;s:6:"plugin";i:1;a:4:{i:0;s:7:"uparrow";i:1;a:1:{i:0;s:42:"lib/plugins/uparrow/images/tango-small.png";}i:2;i:1;i:3;s:6:"~~UP~~";}}i:47;a:3:{i:0;s:13:"section_close";i:1;a:0:{}i:2;i:425;}i:48;a:3:{i:0;s:12:"section_edit";i:1;a:4:{i:0;i:1;i:1;i:424;i:2;i:1;i:3;s:8:"DokuWiki";}i:2;i:425;}i:49;a:3:{i:0;s:6:"header";i:1;a:3:{i:0;s:12:"Nice Plugins";i:1;i:2;i:2;i:425;}i:2;i:425;}i:50;a:3:{i:0;s:12:"section_open";i:1;a:1:{i:0;i:2;}i:2;i:425;}i:51;a:3:{i:0;s:6:"plugin";i:1;a:4:{i:0;s:7:"columns";i:1;a:2:{i:0;i:1;i:1;a:6:{s:11:"table-width";s:4:"100%";s:12:"column-width";s:3:"50%";s:7:"columns";i:2;s:5:"class";s:5:"first";s:8:"block-id";i:1;s:9:"column-id";i:1;}}i:2;i:5;i:3;s:69:"<columns 100% first column attributes 50% second column attributes ->";}i:2;i:451;}i:52;a:3:{i:0;s:6:"p_open";i:1;a:0:{}i:2;i:520;}i:53;a:3:{i:0;s:12:"externallink";i:1;a:2:{i:0;s:38:"http://www.dokuwiki.org/plugin:changes";i:1;s:7:"Changes";}i:2;i:522;}i:54;a:3:{i:0;s:5:"cdata";i:1;a:1:{i:0;s:44:" - List the most recent changes of the wiki ";}i:2;i:572;}i:55;a:3:{i:0;s:9:"linebreak";i:1;a:0:{}i:2;i:616;}i:56;a:3:{i:0;s:5:"cdata";i:1;a:1:{i:0;s:1:"
";}i:2;i:618;}i:57;a:3:{i:0;s:12:"externallink";i:1;a:2:{i:0;s:36:"http://www.dokuwiki.org/plugin:clock";i:1;s:5:"Clock";}i:2;i:619;}i:58;a:3:{i:0;s:5:"cdata";i:1;a:1:{i:0;s:19:" - Display a clock ";}i:2;i:665;}i:59;a:3:{i:0;s:9:"linebreak";i:1;a:0:{}i:2;i:684;}i:60;a:3:{i:0;s:5:"cdata";i:1;a:1:{i:0;s:1:"
";}i:2;i:686;}i:61;a:3:{i:0;s:12:"externallink";i:1;a:2:{i:0;s:36:"http://www.dokuwiki.org/plugin:cloud";i:1;s:5:"Cloud";}i:2;i:687;}i:62;a:3:{i:0;s:5:"cdata";i:1;a:1:{i:0;s:50:" - Show a cloud of the most frequently used words ";}i:2;i:733;}i:63;a:3:{i:0;s:9:"linebreak";i:1;a:0:{}i:2;i:783;}i:64;a:3:{i:0;s:5:"cdata";i:1;a:1:{i:0;s:1:"
";}i:2;i:785;}i:65;a:3:{i:0;s:12:"externallink";i:1;a:2:{i:0;s:38:"http://www.dokuwiki.org/plugin:columns";i:1;s:7:"Columns";}i:2;i:786;}i:66;a:3:{i:0;s:5:"cdata";i:1;a:1:{i:0;s:43:" - Arrange information in multiple columns ";}i:2;i:836;}i:67;a:3:{i:0;s:9:"linebreak";i:1;a:0:{}i:2;i:879;}i:68;a:3:{i:0;s:5:"cdata";i:1;a:1:{i:0;s:1:"
";}i:2;i:881;}i:69;a:3:{i:0;s:12:"externallink";i:1;a:2:{i:0;s:40:"http://www.dokuwiki.org/plugin:countdown";i:1;s:9:"Countdown";}i:2;i:882;}i:70;a:3:{i:0;s:5:"cdata";i:1;a:1:{i:0;s:32:" - Countdown to a specific date ";}i:2;i:936;}i:71;a:3:{i:0;s:9:"linebreak";i:1;a:0:{}i:2;i:968;}i:72;a:3:{i:0;s:5:"cdata";i:1;a:1:{i:0;s:1:"
";}i:2;i:970;}i:73;a:3:{i:0;s:12:"externallink";i:1;a:2:{i:0;s:35:"http://www.dokuwiki.org/plugin:ebnf";i:1;s:4:"EBNF";}i:2;i:971;}i:74;a:3:{i:0;s:5:"cdata";i:1;a:1:{i:0;s:34:" - Render syntax diagrams in EBNF ";}i:2;i:1015;}i:75;a:3:{i:0;s:9:"linebreak";i:1;a:0:{}i:2;i:1049;}i:76;a:3:{i:0;s:5:"cdata";i:1;a:1:{i:0;s:1:"
";}i:2;i:1051;}i:77;a:3:{i:0;s:12:"externallink";i:1;a:2:{i:0;s:46:"http://www.dokuwiki.org/plugin:googleanalytics";i:1;s:16:"Google Analytics";}i:2;i:1052;}i:78;a:3:{i:0;s:5:"cdata";i:1;a:1:{i:0;s:68:" - Set a code for use with Google Analytics and track your visitors ";}i:2;i:1119;}i:79;a:3:{i:0;s:9:"linebreak";i:1;a:0:{}i:2;i:1187;}i:80;a:3:{i:0;s:5:"cdata";i:1;a:1:{i:0;s:1:"
";}i:2;i:1189;}i:81;a:3:{i:0;s:12:"externallink";i:1;a:2:{i:0;s:42:"http://www.dokuwiki.org/plugin:htmlcomment";i:1;s:12:"Html Comment";}i:2;i:1190;}i:82;a:3:{i:0;s:5:"cdata";i:1;a:1:{i:0;s:10:" - Enable ";}i:2;i:1249;}i:83;a:3:{i:0;s:7:"acronym";i:1;a:1:{i:0;s:4:"HTML";}i:2;i:1259;}i:84;a:3:{i:0;s:5:"cdata";i:1;a:1:{i:0;s:10:" comments ";}i:2;i:1263;}i:85;a:3:{i:0;s:9:"linebreak";i:1;a:0:{}i:2;i:1273;}i:86;a:3:{i:0;s:5:"cdata";i:1;a:1:{i:0;s:1:"
";}i:2;i:1275;}i:87;a:3:{i:0;s:12:"externallink";i:1;a:2:{i:0;s:40:"http://www.dokuwiki.org/plugin:indexmenu";i:1;s:10:"Index Menu";}i:2;i:1276;}i:88;a:3:{i:0;s:5:"cdata";i:1;a:1:{i:0;s:58:" - Show a customizable and sortable index for a namespace ";}i:2;i:1331;}i:89;a:3:{i:0;s:9:"linebreak";i:1;a:0:{}i:2;i:1389;}i:90;a:3:{i:0;s:5:"cdata";i:1;a:1:{i:0;s:1:"
";}i:2;i:1391;}i:91;a:3:{i:0;s:12:"externallink";i:1;a:2:{i:0;s:39:"http://www.dokuwiki.org/plugin:keywords";i:1;s:8:"Keywords";}i:2;i:1392;}i:92;a:3:{i:0;s:5:"cdata";i:1;a:1:{i:0;s:41:" - Add keywords to the page meta header. ";}i:2;i:1444;}i:93;a:3:{i:0;s:9:"linebreak";i:1;a:0:{}i:2;i:1485;}i:94;a:3:{i:0;s:5:"cdata";i:1;a:1:{i:0;s:1:"
";}i:2;i:1487;}i:95;a:3:{i:0;s:12:"externallink";i:1;a:2:{i:0;s:35:"http://www.dokuwiki.org/plugin:menu";i:1;s:4:"Menu";}i:2;i:1488;}i:96;a:3:{i:0;s:5:"cdata";i:1;a:1:{i:0;s:44:" - Display links as nice looking menu cards ";}i:2;i:1532;}i:97;a:3:{i:0;s:9:"linebreak";i:1;a:0:{}i:2;i:1576;}i:98;a:3:{i:0;s:5:"cdata";i:1;a:1:{i:0;s:1:"
";}i:2;i:1578;}i:99;a:3:{i:0;s:12:"externallink";i:1;a:2:{i:0;s:40:"http://www.dokuwiki.org/plugin:menupopup";i:1;s:11:"Menu Pop Up";}i:2;i:1579;}i:100;a:3:{i:0;s:5:"cdata";i:1;a:1:{i:0;s:73:" - Define a link or text to show an included DokuWiki page while hovered ";}i:2;i:1635;}i:101;a:3:{i:0;s:9:"linebreak";i:1;a:0:{}i:2;i:1708;}i:102;a:3:{i:0;s:5:"cdata";i:1;a:1:{i:0;s:1:"
";}i:2;i:1710;}i:103;a:3:{i:0;s:12:"externallink";i:1;a:2:{i:0;s:35:"http://www.dokuwiki.org/plugin:note";i:1;s:4:"Note";}i:2;i:1711;}i:104;a:3:{i:0;s:5:"cdata";i:1;a:1:{i:0;s:21:" - Create nice notes ";}i:2;i:1755;}i:105;a:3:{i:0;s:9:"linebreak";i:1;a:0:{}i:2;i:1776;}i:106;a:3:{i:0;s:5:"cdata";i:1;a:1:{i:0;s:1:"
";}i:2;i:1778;}i:107;a:3:{i:0;s:12:"externallink";i:1;a:2:{i:0;s:38:"http://www.dokuwiki.org/plugin:offline";i:1;s:7:"Offline";}i:2;i:1779;}i:108;a:3:{i:0;s:5:"cdata";i:1;a:1:{i:0;s:76:" - Generates a static version of your wiki that will be browseable offline. ";}i:2;i:1829;}i:109;a:3:{i:0;s:9:"linebreak";i:1;a:0:{}i:2;i:1905;}i:110;a:3:{i:0;s:5:"cdata";i:1;a:1:{i:0;s:1:"
";}i:2;i:1907;}i:111;a:3:{i:0;s:12:"externallink";i:1;a:2:{i:0;s:39:"http://www.dokuwiki.org/plugin:pagelist";i:1;s:8:"Pagelist";}i:2;i:1908;}i:112;a:3:{i:0;s:5:"cdata";i:1;a:1:{i:0;s:57:" - Lists pages in a nice looking table or unordered list ";}i:2;i:1960;}i:113;a:3:{i:0;s:9:"linebreak";i:1;a:0:{}i:2;i:2017;}i:114;a:3:{i:0;s:7:"p_close";i:1;a:0:{}i:2;i:2019;}i:115;a:3:{i:0;s:6:"plugin";i:1;a:4:{i:0;s:7:"columns";i:1;a:2:{i:0;i:2;i:1;a:3:{s:5:"class";s:4:"last";s:8:"block-id";i:1;s:9:"column-id";i:2;}}i:2;i:5;i:3;s:11:"<newcolumn>";}i:2;i:2021;}i:116;a:3:{i:0;s:6:"p_open";i:1;a:0:{}i:2;i:2032;}i:117;a:3:{i:0;s:12:"externallink";i:1;a:2:{i:0;s:40:"http://www.dokuwiki.org/plugin:progrecss";i:1;s:11:"Progresscss";}i:2;i:2034;}i:118;a:3:{i:0;s:5:"cdata";i:1;a:1:{i:0;s:10:" - Create ";}i:2;i:2090;}i:119;a:3:{i:0;s:7:"acronym";i:1;a:1:{i:0;s:3:"CSS";}i:2;i:2100;}i:120;a:3:{i:0;s:5:"cdata";i:1;a:1:{i:0;s:21:"-based progress bars ";}i:2;i:2103;}i:121;a:3:{i:0;s:9:"linebreak";i:1;a:0:{}i:2;i:2124;}i:122;a:3:{i:0;s:5:"cdata";i:1;a:1:{i:0;s:1:"
";}i:2;i:2126;}i:123;a:3:{i:0;s:12:"externallink";i:1;a:2:{i:0;s:35:"http://www.dokuwiki.org/plugin:repo";i:1;s:4:"Repo";}i:2;i:2127;}i:124;a:3:{i:0;s:5:"cdata";i:1;a:1:{i:0;s:65:" - Include syntax highlighted source code from code repositories ";}i:2;i:2171;}i:125;a:3:{i:0;s:9:"linebreak";i:1;a:0:{}i:2;i:2236;}i:126;a:3:{i:0;s:5:"cdata";i:1;a:1:{i:0;s:1:"
";}i:2;i:2238;}i:127;a:3:{i:0;s:12:"externallink";i:1;a:2:{i:0;s:33:"http://www.dokuwiki.org/plugin:s5";i:1;s:2:"S5";}i:2;i:2239;}i:128;a:3:{i:0;s:5:"cdata";i:1;a:1:{i:0;s:46:" - Create slideshow presentations from a page ";}i:2;i:2279;}i:129;a:3:{i:0;s:9:"linebreak";i:1;a:0:{}i:2;i:2325;}i:130;a:3:{i:0;s:5:"cdata";i:1;a:1:{i:0;s:1:"
";}i:2;i:2327;}i:131;a:3:{i:0;s:12:"externallink";i:1;a:2:{i:0;s:36:"http://www.dokuwiki.org/plugin:scrum";i:1;s:5:"Scrum";}i:2;i:2328;}i:132;a:3:{i:0;s:5:"cdata";i:1;a:1:{i:0;s:48:" - Create a task list based on the scrum method ";}i:2;i:2374;}i:133;a:3:{i:0;s:9:"linebreak";i:1;a:0:{}i:2;i:2422;}i:134;a:3:{i:0;s:5:"cdata";i:1;a:1:{i:0;s:1:"
";}i:2;i:2424;}i:135;a:3:{i:0;s:12:"externallink";i:1;a:2:{i:0;s:36:"http://www.dokuwiki.org/plugin:skill";i:1;s:5:"Skill";}i:2;i:2425;}i:136;a:3:{i:0;s:5:"cdata";i:1;a:1:{i:0;s:31:" - Show skill level for a page ";}i:2;i:2471;}i:137;a:3:{i:0;s:9:"linebreak";i:1;a:0:{}i:2;i:2502;}i:138;a:3:{i:0;s:5:"cdata";i:1;a:1:{i:0;s:1:"
";}i:2;i:2504;}i:139;a:3:{i:0;s:12:"externallink";i:1;a:2:{i:0;s:36:"http://www.dokuwiki.org/plugin:stats";i:1;s:14:"WikiStatistics";}i:2;i:2505;}i:140;a:3:{i:0;s:5:"cdata";i:1;a:1:{i:0;s:27:" - Display some wiki stats ";}i:2;i:2560;}i:141;a:3:{i:0;s:9:"linebreak";i:1;a:0:{}i:2;i:2587;}i:142;a:3:{i:0;s:5:"cdata";i:1;a:1:{i:0;s:1:"
";}i:2;i:2589;}i:143;a:3:{i:0;s:12:"externallink";i:1;a:2:{i:0;s:40:"http://www.dokuwiki.org/plugin:tablecalc";i:1;s:9:"Tablecalc";}i:2;i:2590;}i:144;a:3:{i:0;s:5:"cdata";i:1;a:1:{i:0;s:53:" - Add ability to use Excel-style formulas in tables ";}i:2;i:2644;}i:145;a:3:{i:0;s:9:"linebreak";i:1;a:0:{}i:2;i:2697;}i:146;a:3:{i:0;s:5:"cdata";i:1;a:1:{i:0;s:1:"
";}i:2;i:2699;}i:147;a:3:{i:0;s:12:"externallink";i:1;a:2:{i:0;s:34:"http://www.dokuwiki.org/plugin:tag";i:1;s:3:"Tag";}i:2;i:2700;}i:148;a:3:{i:0;s:5:"cdata";i:1;a:1:{i:0;s:33:" - Assign category tags to pages ";}i:2;i:2742;}i:149;a:3:{i:0;s:9:"linebreak";i:1;a:0:{}i:2;i:2775;}i:150;a:3:{i:0;s:5:"cdata";i:1;a:1:{i:0;s:1:"
";}i:2;i:2777;}i:151;a:3:{i:0;s:12:"externallink";i:1;a:2:{i:0;s:35:"http://www.dokuwiki.org/plugin:task";i:1;s:4:"Task";}i:2;i:2778;}i:152;a:3:{i:0;s:5:"cdata";i:1;a:1:{i:0;s:43:" - Integrate a simple task management tool ";}i:2;i:2822;}i:153;a:3:{i:0;s:9:"linebreak";i:1;a:0:{}i:2;i:2865;}i:154;a:3:{i:0;s:5:"cdata";i:1;a:1:{i:0;s:1:"
";}i:2;i:2867;}i:155;a:3:{i:0;s:12:"externallink";i:1;a:2:{i:0;s:34:"http://www.dokuwiki.org/plugin:tbt";i:1;s:3:"Tbt";}i:2;i:2868;}i:156;a:3:{i:0;s:5:"cdata";i:1;a:1:{i:0;s:26:" - Render time based text ";}i:2;i:2910;}i:157;a:3:{i:0;s:9:"linebreak";i:1;a:0:{}i:2;i:2936;}i:158;a:3:{i:0;s:5:"cdata";i:1;a:1:{i:0;s:1:"
";}i:2;i:2938;}i:159;a:3:{i:0;s:12:"externallink";i:1;a:2:{i:0;s:35:"http://www.dokuwiki.org/plugin:todo";i:1;s:4:"Todo";}i:2;i:2939;}i:160;a:3:{i:0;s:5:"cdata";i:1;a:1:{i:0;s:45:" - Create a simple, Checkbox based Todo List ";}i:2;i:2983;}i:161;a:3:{i:0;s:9:"linebreak";i:1;a:0:{}i:2;i:3028;}i:162;a:3:{i:0;s:5:"cdata";i:1;a:1:{i:0;s:1:"
";}i:2;i:3030;}i:163;a:3:{i:0;s:12:"externallink";i:1;a:2:{i:0;s:38:"http://www.dokuwiki.org/plugin:tooltip";i:1;s:7:"Tooltip";}i:2;i:3031;}i:164;a:3:{i:0;s:5:"cdata";i:1;a:1:{i:0;s:33:" - Mark some text with a tooltip ";}i:2;i:3081;}i:165;a:3:{i:0;s:9:"linebreak";i:1;a:0:{}i:2;i:3114;}i:166;a:3:{i:0;s:5:"cdata";i:1;a:1:{i:0;s:1:"
";}i:2;i:3116;}i:167;a:3:{i:0;s:12:"externallink";i:1;a:2:{i:0;s:38:"http://www.dokuwiki.org/plugin:uparrow";i:1;s:7:"Uparrow";}i:2;i:3117;}i:168;a:3:{i:0;s:5:"cdata";i:1;a:1:{i:0;s:66:" - Show an arrow-image which links to the top of the current page ";}i:2;i:3167;}i:169;a:3:{i:0;s:9:"linebreak";i:1;a:0:{}i:2;i:3233;}i:170;a:3:{i:0;s:5:"cdata";i:1;a:1:{i:0;s:1:"
";}i:2;i:3235;}i:171;a:3:{i:0;s:12:"externallink";i:1;a:2:{i:0;s:47:"http://www.dokuwiki.org/plugin:wikipediasnippet";i:1;s:17:"Wikipedia Snippet";}i:2;i:3236;}i:172;a:3:{i:0;s:5:"cdata";i:1;a:1:{i:0;s:46:" - Include a snippet from a Wikipedia article ";}i:2;i:3305;}i:173;a:3:{i:0;s:9:"linebreak";i:1;a:0:{}i:2;i:3351;}i:174;a:3:{i:0;s:5:"cdata";i:1;a:1:{i:0;s:1:"
";}i:2;i:3353;}i:175;a:3:{i:0;s:12:"externallink";i:1;a:2:{i:0;s:39:"http://www.dokuwiki.org/plugin:xfortune";i:1;s:8:"Xfortune";}i:2;i:3354;}i:176;a:3:{i:0;s:5:"cdata";i:1;a:1:{i:0;s:73:" - Display a random quote and update it every few seconds with a new one ";}i:2;i:3406;}i:177;a:3:{i:0;s:9:"linebreak";i:1;a:0:{}i:2;i:3479;}i:178;a:3:{i:0;s:5:"cdata";i:1;a:1:{i:0;s:1:"
";}i:2;i:3481;}i:179;a:3:{i:0;s:12:"externallink";i:1;a:2:{i:0;s:35:"http://www.dokuwiki.org/plugin:xkcd";i:1;s:4:"xkcd";}i:2;i:3482;}i:180;a:3:{i:0;s:5:"cdata";i:1;a:1:{i:0;s:48:" - Will show a new xkcd comic every MON-WED-FRI ";}i:2;i:3526;}i:181;a:3:{i:0;s:9:"linebreak";i:1;a:0:{}i:2;i:3574;}i:182;a:3:{i:0;s:7:"p_close";i:1;a:0:{}i:2;i:3576;}i:183;a:3:{i:0;s:6:"plugin";i:1;a:4:{i:0;s:7:"columns";i:1;a:1:{i:0;i:4;}i:2;i:5;i:3;s:10:"</columns>";}i:2;i:3578;}i:184;a:3:{i:0;s:6:"p_open";i:1;a:0:{}i:2;i:3588;}i:185;a:3:{i:0;s:5:"cdata";i:1;a:1:{i:0;s:1:"
";}i:2;i:3590;}i:186;a:3:{i:0;s:6:"plugin";i:1;a:4:{i:0;s:11:"htmlcomment";i:1;a:2:{i:0;i:5;i:1;s:7:" [[|]] ";}i:2;i:5;i:3;s:14:"<!-- [[|]] -->";}i:2;i:3591;}i:187;a:3:{i:0;s:7:"p_close";i:1;a:0:{}i:2;i:3605;}i:188;a:2:{i:0;s:6:"plugin";i:1;a:4:{i:0;s:7:"uparrow";i:1;a:1:{i:0;s:42:"lib/plugins/uparrow/images/tango-small.png";}i:2;i:1;i:3;s:6:"~~UP~~";}}i:189;a:3:{i:0;s:13:"section_close";i:1;a:0:{}i:2;i:3607;}i:190;a:3:{i:0;s:12:"section_edit";i:1;a:4:{i:0;i:425;i:1;i:3606;i:2;i:2;i:3;s:12:"Nice Plugins";}i:2;i:3607;}i:191;a:3:{i:0;s:6:"header";i:1;a:3:{i:0;s:14:"Nice Templates";i:1;i:2;i:2;i:3607;}i:2;i:3607;}i:192;a:3:{i:0;s:12:"section_open";i:1;a:1:{i:0;i:2;}i:2;i:3607;}i:193;a:3:{i:0;s:6:"p_open";i:1;a:0:{}i:2;i:3633;}i:194;a:3:{i:0;s:5:"cdata";i:1;a:1:{i:0;s:1:"
";}i:2;i:3634;}i:195;a:3:{i:0;s:12:"externallink";i:1;a:2:{i:0;s:40:"http://www.dokuwiki.org/template:sidebar";i:1;s:7:"Sidebar";}i:2;i:3635;}i:196;a:3:{i:0;s:5:"cdata";i:1;a:1:{i:0;s:1:" ";}i:2;i:3687;}i:197;a:3:{i:0;s:9:"linebreak";i:1;a:0:{}i:2;i:3688;}i:198;a:3:{i:0;s:5:"cdata";i:1;a:1:{i:0;s:1:"
";}i:2;i:3690;}i:199;a:3:{i:0;s:12:"externallink";i:1;a:2:{i:0;s:42:"http://www.dokuwiki.org/template:freechred";i:1;s:9:"Freechred";}i:2;i:3691;}i:200;a:3:{i:0;s:5:"cdata";i:1;a:1:{i:0;s:1:" ";}i:2;i:3747;}i:201;a:3:{i:0;s:9:"linebreak";i:1;a:0:{}i:2;i:3748;}i:202;a:3:{i:0;s:5:"cdata";i:1;a:1:{i:0;s:1:"
";}i:2;i:3750;}i:203;a:3:{i:0;s:6:"plugin";i:1;a:4:{i:0;s:11:"htmlcomment";i:1;a:2:{i:0;i:5;i:1;s:7:" [[|]] ";}i:2;i:5;i:3;s:14:"<!-- [[|]] -->";}i:2;i:3751;}i:204;a:3:{i:0;s:7:"p_close";i:1;a:0:{}i:2;i:3765;}i:205;a:2:{i:0;s:6:"plugin";i:1;a:4:{i:0;s:7:"uparrow";i:1;a:1:{i:0;s:42:"lib/plugins/uparrow/images/tango-small.png";}i:2;i:1;i:3;s:6:"~~UP~~";}}i:206;a:3:{i:0;s:13:"section_close";i:1;a:0:{}i:2;i:3767;}i:207;a:3:{i:0;s:12:"section_edit";i:1;a:4:{i:0;i:3607;i:1;i:3766;i:2;i:2;i:3;s:14:"Nice Templates";}i:2;i:3767;}i:208;a:3:{i:0;s:6:"header";i:1;a:3:{i:0;s:19:"Nice Configurations";i:1;i:2;i:2;i:3767;}i:2;i:3767;}i:209;a:3:{i:0;s:12:"section_open";i:1;a:1:{i:0;i:2;}i:2;i:3767;}i:210;a:3:{i:0;s:6:"p_open";i:1;a:0:{}i:2;i:3798;}i:211;a:3:{i:0;s:5:"cdata";i:1;a:1:{i:0;s:1:"
";}i:2;i:3799;}i:212;a:3:{i:0;s:12:"externallink";i:1;a:2:{i:0;s:31:"http://www.dokuwiki.org/sitemap";i:1;s:7:"Sitemap";}i:2;i:3800;}i:213;a:3:{i:0;s:5:"cdata";i:1;a:1:{i:0;s:27:" - Automatically create an ";}i:2;i:3843;}i:214;a:3:{i:0;s:7:"acronym";i:1;a:1:{i:0;s:3:"XML";}i:2;i:3870;}i:215;a:3:{i:0;s:5:"cdata";i:1;a:1:{i:0;s:9:" Sitemap
";}i:2;i:3873;}i:216;a:3:{i:0;s:7:"p_close";i:1;a:0:{}i:2;i:3881;}i:217;a:2:{i:0;s:6:"plugin";i:1;a:4:{i:0;s:7:"uparrow";i:1;a:1:{i:0;s:42:"lib/plugins/uparrow/images/tango-small.png";}i:2;i:1;i:3;s:6:"~~UP~~";}}i:218;a:3:{i:0;s:13:"section_close";i:1;a:0:{}i:2;i:3881;}i:219;a:3:{i:0;s:12:"section_edit";i:1;a:4:{i:0;i:3767;i:1;i:0;i:2;i:2;i:3;s:19:"Nice Configurations";}i:2;i:3881;}i:220;a:3:{i:0;s:12:"document_end";i:1;a:0:{}i:2;i:3881;}}