a:24:{i:0;a:3:{i:0;s:14:"document_start";i:1;a:0:{}i:2;i:0;}i:1;a:3:{i:0;s:6:"p_open";i:1;a:0:{}i:2;i:0;}i:2;a:3:{i:0;s:7:"p_close";i:1;a:0:{}i:2;i:1;}i:3;a:3:{i:0;s:12:"section_edit";i:1;a:4:{i:0;i:-1;i:1;i:0;i:2;i:1;i:3;s:0:"";}i:2;i:1;}i:4;a:3:{i:0;s:6:"header";i:1;a:3:{i:0;s:10:"App Engine";i:1;i:1;i:2;i:1;}i:2;i:1;}i:5;a:3:{i:0;s:12:"section_open";i:1;a:1:{i:0;i:1;}i:2;i:1;}i:6;a:3:{i:0;s:6:"p_open";i:1;a:0:{}i:2;i:25;}i:7;a:3:{i:0;s:5:"cdata";i:1;a:1:{i:0;s:1:"
";}i:2;i:26;}i:8;a:3:{i:0;s:12:"externallink";i:1;a:2:{i:0;s:33:"http://code.google.com/appengine/";i:1;s:17:"Google App Engine";}i:2;i:27;}i:9;a:3:{i:0;s:5:"cdata";i:1;a:1:{i:0;s:2:": ";}i:2;i:82;}i:10;a:3:{i:0;s:13:"interwikilink";i:1;a:4:{i:0;s:20:"wp>Google_App_Engine";i:1;s:17:"Google App Engine";i:2;s:2:"wp";i:3;s:17:"Google_App_Engine";}i:2;i:84;}i:11;a:3:{i:0;s:5:"cdata";i:1;a:1:{i:0;s:1:" ";}i:2;i:126;}i:12;a:3:{i:0;s:9:"linebreak";i:1;a:0:{}i:2;i:127;}i:13;a:3:{i:0;s:7:"p_close";i:1;a:0:{}i:2;i:129;}i:14;a:2:{i:0;s:6:"plugin";i:1;a:4:{i:0;s:7:"uparrow";i:1;a:1:{i:0;s:42:"lib/plugins/uparrow/images/tango-small.png";}i:2;i:1;i:3;s:6:"~~UP~~";}}i:15;a:3:{i:0;s:13:"section_close";i:1;a:0:{}i:2;i:131;}i:16;a:3:{i:0;s:12:"section_edit";i:1;a:4:{i:0;i:1;i:1;i:130;i:2;i:1;i:3;s:10:"App Engine";}i:2;i:131;}i:17;a:3:{i:0;s:6:"header";i:1;a:3:{i:0;s:7:"Example";i:1;i:2;i:2;i:131;}i:2;i:131;}i:18;a:3:{i:0;s:12:"section_open";i:1;a:1:{i:0;i:2;}i:2;i:131;}i:19;a:3:{i:0;s:4:"code";i:1;a:3:{i:0;s:4160:"
from google.appengine.ext import webapp
from google.appengine.ext.webapp.util import run_wsgi_app
from google.appengine.ext import db
import urllib
from HTMLParser import HTMLParser
import re

class MyHTMLParser(HTMLParser):
	def __init__(self):
		HTMLParser.__init__(self)
		self.s = ''

	def handle_starttag(self, tag, attrs):
		if tag == 'embed':
			for attr in attrs:
				if attr[0] == 'flashvars':
					self.s = attr[1]

	def feed(self, data):
		HTMLParser.feed(self, data)
		return self

	def get_s(self):
		return self.s

class Level(db.Model):
	content = db.TextProperty()

class Current(db.Model):
	x = db.IntegerProperty()
	y = db.IntegerProperty()
	d = db.IntegerProperty()
	n = db.IntegerProperty()
	m = db.IntegerProperty()
	l = db.IntegerProperty()

class Wrong(db.Model):
	x = db.IntegerProperty()
	y = db.IntegerProperty()
	d = db.IntegerProperty()
	l = db.IntegerProperty()

class CrossPage(webapp.RequestHandler):
	def get(self):
		url = 'http://www.hacker.org/cross/index.php?name=kauesilv&password=a1b2c3d4'
		regex = r'boardinit = "([^"]*)"'
		debug = self.request.get('debug')
		s = self.request.get('s')
		path = self.request.get('path')
		self.response.headers['Content-Type'] = 'text/plain'
		if s == '1':
			urllib.urlopen(url + '&sol=' + path).read()
		s = urllib.urlopen(url).read()
		#self.response.out.write(s + '\n')
		board = re.compile(regex).search(s).groups()[0].split(',')
		self.response.out.write(str(len(board)) + '\n' + str(len(board[0])) + '\n')
		for line in board:
			self.response.out.write(str(line) + '\n')
	
class MainPage(webapp.RequestHandler):
	def get(self):
		delete = self.request.get('delete')
		if delete == '1':
			db.delete(Wrong.all().fetch(100))
			if Wrong.all().count(1) == 1:
				return

		url = 'http://www.hacker.org/coil/index.php?name=kauesilv&password=a1b2c3d4'
		regex = r'x=(\d*)&y=(\d*)&board=(.*)'
		regexLevel = r'Level: (\d*)'
		self.response.headers['Content-Type'] = 'text/plain'
		debug = self.request.get('debug')
		s = self.request.get('s')
		r = self.request.get('r')
		x = self.request.get('x')
		y = self.request.get('y')
		d = self.request.get('d')
		w = self.request.get('w')
		path = self.request.get('path')
		
		levels = Level.all()
		currents = Current.all()

		if s == '1':
			urllib.urlopen(url + '&x=' + x + '&y=' + y + '&path=' + path).read()

		if w == '1':
			wrong = Wrong()
			wrong.x = int(x)
			wrong.y = int(y)
			wrong.d = int(d)
			wrong.l = currents.fetch(1)[0].l
			wrong.put()

		if s == '1' or r == '1':
			s = urllib.urlopen(url).read()
			x, y, board = re.compile(regex).search(MyHTMLParser().feed(s).get_s()).groups()
			lvl, = re.compile(regexLevel).search(s).groups()
			db.delete(Level.all().fetch(1000000))
			db.delete(Current.all().fetch(1000000))

			level = Level()
			level.content = x + '\n' + y + '\n' + board + '\n'
			level.put()

			current = Current()
			current.x = current.y = current.d = 0
			current.n = int(x)
			current.m = int(y)
			current.l = int(lvl)
			current.put()

		cur = currents.fetch(1)[0]
		while(True):
			cur.d = cur.d + 1
			if(cur.d == 4):
				cur.d = 0
				cur.y = cur.y + 1
				if(cur.y == cur.m):
					cur.y = 0
					cur.x = cur.x + 1
					if(cur.x == cur.n):
						cur.x = 0
			cur.put()
			wrong = Wrong().gql("WHERE x = :1 AND y = :2 AND d = :3 AND l = :4", cur.x, cur.y, cur.d, cur.l)
			if(wrong.count(1) == 0):
				break
			
		self.response.out.write(str(cur.x) + '\n' + str(cur.y) + '\n' + str(cur.d) + '\n' + str(cur.l) + '\n')
		self.response.out.write(levels.fetch(1)[0].content)

		if debug == '1':
			self.response.out.write('\n\n----DEBUG----\n\nwrongs\n')
			wrongs = Wrong.gql("WHERE l = :1", cur.l)
			for wrong in wrongs:
				self.response.out.write(str(wrong.x) + ' ' + str(wrong.y) + ' ' + str(wrong.d) + ' ' + str(wrong.l) + '\n')

			self.response.out.write('\ncurrents\n')
			for current in currents:
				self.response.out.write(str(current.x) + ' ' + str(current.y) + ' ' + str(current.d) + ' ' + str(current.l) + '\n')

application = webapp.WSGIApplication([('/', MainPage), ('/cross', CrossPage)], debug=True)

def main():
	run_wsgi_app(application)

if __name__ == "__main__":
	main()
";i:1;s:6:"python";i:2;N;}i:2;i:157;}i:20;a:2:{i:0;s:6:"plugin";i:1;a:4:{i:0;s:7:"uparrow";i:1;a:1:{i:0;s:42:"lib/plugins/uparrow/images/tango-small.png";}i:2;i:1;i:3;s:6:"~~UP~~";}}i:21;a:3:{i:0;s:13:"section_close";i:1;a:0:{}i:2;i:4334;}i:22;a:3:{i:0;s:12:"section_edit";i:1;a:4:{i:0;i:131;i:1;i:0;i:2;i:2;i:3;s:7:"Example";}i:2;i:4334;}i:23;a:3:{i:0;s:12:"document_end";i:1;a:0:{}i:2;i:4334;}}