a:76:{i:0;a:3:{i:0;s:14:"document_start";i:1;a:0:{}i:2;i:0;}i:1;a:3:{i:0;s:6:"p_open";i:1;a:0:{}i:2;i:0;}i:2;a:3:{i:0;s:7:"p_close";i:1;a:0:{}i:2;i:1;}i:3;a:3:{i:0;s:12:"section_edit";i:1;a:4:{i:0;i:-1;i:1;i:0;i:2;i:1;i:3;s:0:"";}i:2;i:1;}i:4;a:3:{i:0;s:6:"header";i:1;a:3:{i:0;s:7:"Haskell";i:1;i:1;i:2;i:1;}i:2;i:1;}i:5;a:3:{i:0;s:12:"section_open";i:1;a:1:{i:0;i:1;}i:2;i:1;}i:6;a:3:{i:0;s:6:"p_open";i:1;a:0:{}i:2;i:22;}i:7;a:3:{i:0;s:5:"cdata";i:1;a:1:{i:0;s:1:"
";}i:2;i:23;}i:8;a:3:{i:0;s:12:"externallink";i:1;a:2:{i:0;s:23:"http://www.haskell.org/";i:1;s:7:"Haskell";}i:2;i:24;}i:9;a:3:{i:0;s:5:"cdata";i:1;a:1:{i:0;s:2:": ";}i:2;i:59;}i:10;a:3:{i:0;s:13:"interwikilink";i:1;a:4:{i:0;s:33:"wp>Haskell_(programming_language)";i:1;s:7:"Haskell";i:2;s:2:"wp";i:3;s:30:"Haskell_(programming_language)";}i:2;i:61;}i:11;a:3:{i:0;s:7:"p_close";i:1;a:0:{}i:2;i:106;}i:12;a:2:{i:0;s:6:"plugin";i:1;a:4:{i:0;s:7:"uparrow";i:1;a:1:{i:0;s:42:"lib/plugins/uparrow/images/tango-small.png";}i:2;i:1;i:3;s:6:"~~UP~~";}}i:13;a:3:{i:0;s:13:"section_close";i:1;a:0:{}i:2;i:108;}i:14;a:3:{i:0;s:12:"section_edit";i:1;a:4:{i:0;i:1;i:1;i:107;i:2;i:1;i:3;s:7:"Haskell";}i:2;i:108;}i:15;a:3:{i:0;s:6:"header";i:1;a:3:{i:0;s:19:"Haskell Instalation";i:1;i:2;i:2;i:108;}i:2;i:108;}i:16;a:3:{i:0;s:12:"section_open";i:1;a:1:{i:0;i:2;}i:2;i:108;}i:17;a:3:{i:0;s:4:"code";i:1;a:3:{i:0;s:69:"
$ sudo apt-get install ghc6 libghc6-mtl-dev
$ sudo port install ghc
";i:1;s:4:"bash";i:2;N;}i:2;i:146;}i:18;a:2:{i:0;s:6:"plugin";i:1;a:4:{i:0;s:7:"uparrow";i:1;a:1:{i:0;s:42:"lib/plugins/uparrow/images/tango-small.png";}i:2;i:1;i:3;s:6:"~~UP~~";}}i:19;a:3:{i:0;s:13:"section_close";i:1;a:0:{}i:2;i:230;}i:20;a:3:{i:0;s:12:"section_edit";i:1;a:4:{i:0;i:108;i:1;i:229;i:2;i:2;i:3;s:19:"Haskell Instalation";}i:2;i:230;}i:21;a:3:{i:0;s:6:"header";i:1;a:3:{i:0;s:17:"Haskell Libraries";i:1;i:2;i:2;i:230;}i:2;i:230;}i:22;a:3:{i:0;s:12:"section_open";i:1;a:1:{i:0;i:2;}i:2;i:230;}i:23;a:3:{i:0;s:6:"p_open";i:1;a:0:{}i:2;i:259;}i:24;a:3:{i:0;s:5:"cdata";i:1;a:1:{i:0;s:1:"
";}i:2;i:260;}i:25;a:3:{i:0;s:12:"externallink";i:1;a:2:{i:0;s:54:"http://www.haskell.org/ghc/docs/6.12.2/html/libraries/";i:1;s:30:"Haskell Hierarchical Libraries";}i:2;i:261;}i:26;a:3:{i:0;s:7:"p_close";i:1;a:0:{}i:2;i:350;}i:27;a:2:{i:0;s:6:"plugin";i:1;a:4:{i:0;s:7:"uparrow";i:1;a:1:{i:0;s:42:"lib/plugins/uparrow/images/tango-small.png";}i:2;i:1;i:3;s:6:"~~UP~~";}}i:28;a:3:{i:0;s:13:"section_close";i:1;a:0:{}i:2;i:352;}i:29;a:3:{i:0;s:12:"section_edit";i:1;a:4:{i:0;i:230;i:1;i:351;i:2;i:2;i:3;s:17:"Haskell Libraries";}i:2;i:352;}i:30;a:3:{i:0;s:6:"header";i:1;a:3:{i:0;s:17:"Haskell Tutorials";i:1;i:2;i:2;i:352;}i:2;i:352;}i:31;a:3:{i:0;s:12:"section_open";i:1;a:1:{i:0;i:2;}i:2;i:352;}i:32;a:3:{i:0;s:6:"p_open";i:1;a:0:{}i:2;i:381;}i:33;a:3:{i:0;s:5:"cdata";i:1;a:1:{i:0;s:1:"
";}i:2;i:382;}i:34;a:3:{i:0;s:12:"externallink";i:1;a:2:{i:0;s:28:"http://learnyouahaskell.com/";i:1;s:34:"Learn You a Haskell for Great Good";}i:2;i:383;}i:35;a:3:{i:0;s:5:"cdata";i:1;a:1:{i:0;s:1:" ";}i:2;i:450;}i:36;a:3:{i:0;s:9:"linebreak";i:1;a:0:{}i:2;i:451;}i:37;a:3:{i:0;s:5:"cdata";i:1;a:1:{i:0;s:1:"
";}i:2;i:453;}i:38;a:3:{i:0;s:12:"externallink";i:1;a:2:{i:0;s:38:"http://book.realworldhaskell.org/read/";i:1;s:18:"Real World Haskell";}i:2;i:454;}i:39;a:3:{i:0;s:5:"cdata";i:1;a:1:{i:0;s:1:" ";}i:2;i:515;}i:40;a:3:{i:0;s:9:"linebreak";i:1;a:0:{}i:2;i:516;}i:41;a:3:{i:0;s:7:"p_close";i:1;a:0:{}i:2;i:518;}i:42;a:2:{i:0;s:6:"plugin";i:1;a:4:{i:0;s:7:"uparrow";i:1;a:1:{i:0;s:42:"lib/plugins/uparrow/images/tango-small.png";}i:2;i:1;i:3;s:6:"~~UP~~";}}i:43;a:3:{i:0;s:13:"section_close";i:1;a:0:{}i:2;i:520;}i:44;a:3:{i:0;s:12:"section_edit";i:1;a:4:{i:0;i:352;i:1;i:519;i:2;i:2;i:3;s:17:"Haskell Tutorials";}i:2;i:520;}i:45;a:3:{i:0;s:6:"header";i:1;a:3:{i:0;s:36:"How to Search for a Haskell Function";i:1;i:2;i:2;i:520;}i:2;i:520;}i:46;a:3:{i:0;s:12:"section_open";i:1;a:1:{i:0;i:2;}i:2;i:520;}i:47;a:3:{i:0;s:6:"p_open";i:1;a:0:{}i:2;i:568;}i:48;a:3:{i:0;s:5:"cdata";i:1;a:1:{i:0;s:1:"
";}i:2;i:569;}i:49;a:3:{i:0;s:12:"externallink";i:1;a:2:{i:0;s:26:"http://haskell.org/hoogle/";i:1;s:6:"Hoogle";}i:2;i:570;}i:50;a:3:{i:0;s:5:"cdata";i:1;a:1:{i:0;s:11:" - Haskell ";}i:2;i:607;}i:51;a:3:{i:0;s:7:"acronym";i:1;a:1:{i:0;s:3:"API";}i:2;i:618;}i:52;a:3:{i:0;s:5:"cdata";i:1;a:1:{i:0;s:14:" search engine";}i:2;i:621;}i:53;a:3:{i:0;s:7:"p_close";i:1;a:0:{}i:2;i:635;}i:54;a:2:{i:0;s:6:"plugin";i:1;a:4:{i:0;s:7:"uparrow";i:1;a:1:{i:0;s:42:"lib/plugins/uparrow/images/tango-small.png";}i:2;i:1;i:3;s:6:"~~UP~~";}}i:55;a:3:{i:0;s:13:"section_close";i:1;a:0:{}i:2;i:637;}i:56;a:3:{i:0;s:12:"section_edit";i:1;a:4:{i:0;i:520;i:1;i:636;i:2;i:2;i:3;s:36:"How to Search for a Haskell Function";}i:2;i:637;}i:57;a:3:{i:0;s:6:"header";i:1;a:3:{i:0;s:19:"Haskell Cheat Sheet";i:1;i:2;i:2;i:637;}i:2;i:637;}i:58;a:3:{i:0;s:12:"section_open";i:1;a:1:{i:0;i:2;}i:2;i:637;}i:59;a:3:{i:0;s:6:"p_open";i:1;a:0:{}i:2;i:668;}i:60;a:3:{i:0;s:5:"cdata";i:1;a:1:{i:0;s:44:"
Inspired on the first tutorial in the list.";}i:2;i:669;}i:61;a:3:{i:0;s:7:"p_close";i:1;a:0:{}i:2;i:713;}i:62;a:3:{i:0;s:4:"code";i:1;a:3:{i:0;s:32:"
# start the interpreter
$ ghci
";i:1;s:4:"bash";i:2;N;}i:2;i:720;}i:63;a:3:{i:0;s:4:"code";i:1;a:3:{i:0;s:8766:"
:l myfunctions --load the functions in the file myfunctions.hs
:r             --reload

1 /= 0         --not equal
succ 0 == 1    --successor
min 1 2 == 1   --minimum
max 1 2 == 2   --maximum
div 2 1 == 2 `div` 1 --infix notation
mysucc x = x + 1     --function definition

[1, 2] == 1:2:[]     --list definition
"ab" == ['a', 'b']   --string is [Char]
[1, 2] ++ [3, 4] == [1, 2, 3, 4] --list concatenation
['a', 'b'] !! 1 == 'b'           --list indexing

head [1, 2, 3] == 1
tail [1, 2, 3] == [2, 3]
init [1, 2, 3] == [1, 2]
last [1, 2, 3] == 3
l == (head l):(tail l) == (init l) ++ (last l)

lenght ['a', 'b'] == 2
null [] == True                  --list is empty?
reverse [1, 2, 3] == [3, 2, 1]
take 2 ['a', 'b', 'c'] == ['a', 'b'] --first n elements of list
drop 2 ['a', 'b', 'c'] == ['c']      --drops n elements of list
l == (take n l) ++ (drop n l)

maximum [1, 2, 3] == 3
minimum [1, 2, 3] == 1
sum [1, 2, 3, 4] == 10
product [1, 2, 3, 4] == 24
2 `elem` [1, 2, 3] == True       --element of the list?

[1..3] == [1, 2, 3]
[1, 3..10] == [1, 3, 5, 7, 9]
[1, 3..] == [1, 3, 5..]          --infinite list
factorial n = product [1..n]

take 24 [13, 26..]               --the first 24 multiples of 13
take 7 (cycle [1, 2, 3]) == [1, 2, 3, 1, 2, 3, 1] --cycle creates an infinite list
take 3 (repeat 'a') == ['a', 'a', 'a']            --repeat creates an infinite list
take n (repeat x) == replicate n x

[x * 2 | x <- [1 .. 10], 3 * x < 7] == [2, 4]
[ x*y | x <- [2,5,10], y <- [8,10,11], x*y > 50] == [55,80,100,110]

length' xs = sum [1 | _ <- xs]
removeNonUppercase st = [ c | c <- st, c `elem` ['A'..'Z']]

fst (1, 'a') == 1
snd (1, 'a') == 'a'
(fst x, snd x) == x

zip [1, 2] ['a', 'b'] == [(1, 'a'), (2, 'b')]
:t "HI" == "HI" :: [Char]                         --type
removeNonUppercase :: [Char] -> [Char]            --function type declaration
:t head == head :: [a] -> a                       --type variable "a"
:t elem == elem :: (Eq a) => a -> [a] -> Bool     --type class "Eq"

5 `compare` 3 == GT

show 5.334 == "5.334"                             --to string
read "[1, 2, 3]" == [1, 2, 3]                     --from string
read "5" :: Float                                 --type anotation

minBound :: Int == -2147483648
maxBound :: Int == 2147483647
fromIntegral (length [1,2,3,4]) + 3.2 == 7.2      --integral to float

head' :: [a] -> a  
head' [] = error "Can't call head on an empty list, dummy!"  --run-time error
head' (x:_) = x  

capital :: String -> String  
capital "" = "Empty string, whoops!"  
capital all@(x:xs) = "The first letter of " ++ all ++ " is " ++ [x] --as pattern

max' :: (Ord a) => a -> a -> a  
max' a b   
  | a > b     = a  --guard
  | otherwise = b  --otherwise = True

bmiTell :: (RealFloat a) => a -> a -> String  
bmiTell weight height  
  | bmi <= skinny = "You're underweight, you emo, you!"  
  | bmi <= normal = "You're supposedly normal. Pffft, I bet you're ugly!"  
  | bmi <= fat    = "You're fat! Lose some weight, fatty!"  
  | otherwise     = "You're a whale, congratulations!"
  where bmi = weight / height ^ 2  
        (skinny, normal, fat) = (18.5, 25.0, 30.0)  
        
cylinderSurfaceArea :: (RealFloat a) => a -> a -> a  
cylinderSurfaceArea r h = 
  let sideArea = 2 * pi * r * h  
      topArea = pi * r ^ 2  
  in  sideArea + 2 * topArea   

head' :: [a] -> a
head' xs = case xs of [] -> error "No head for empty lists!"
                      (x:_) -> x

quicksort :: (Ord a) => [a] -> [a]  
quicksort [] = []  
quicksort (x:xs) =   
  let smallerSorted = quicksort [a | a <- xs, a <= x]  
      biggerSorted = quicksort [a | a <- xs, a > x]  
  in  smallerSorted ++ [x] ++ biggerSorted

divideByTen :: (Floating a) => a -> a  
divideByTen = (/10)                    --section, infix function partial application

zipWith' :: (a -> b -> c) -> [a] -> [b] -> [c]  
zipWith' _ [] _ = []  
zipWith' _ _ [] = []  
zipWith' f (x:xs) (y:ys) = f x y : zipWith' f xs ys

map :: (a -> b) -> [a] -> [b]  
map _ [] = []  
map f (x:xs) = f x : map f xs

filter :: (a -> Bool) -> [a] -> [a]  
filter _ [] = []  
filter p (x:xs)   
  | p x       = x : filter p xs  
  | otherwise = filter p xs
filter p l == [x | x <- l, p x]
  
quicksort :: (Ord a) => [a] -> [a]    
quicksort [] = []    
quicksort (x:xs) =     
  let smallerSorted = quicksort (filter (<=x) xs)  
      biggerSorted = quicksort (filter (>x) xs)   
  in  smallerSorted ++ [x] ++ biggerSorted

sum (takeWhile (<10000) (filter odd (map (^2) [1..]))) --sum of all odd squares that are smaller than 10,000

zipWith (+) l r == zipWith (\a b -> a + b) l r  --lamba function

sum' :: (Num a) => [a] -> a  
sum' xs = foldl (\acc x -> acc + x) 0 xs
sum == foldl (+) 0

elem' y ys = foldl (\acc x -> acc || x == y) False ys

map' :: (a -> b) -> [a] -> [b]
map' f xs = foldr (\x acc -> f x : acc) [] xs

filter' :: (a -> Bool) -> [a] -> [a]  
filter' p = foldr (\x acc -> if p x then x : acc else acc) []

scanl (+) 0 [3,5,2,1] == [0,3,8,10,11]  --fold that keeps partial results

($) :: (a -> b) -> a -> b  
f $ x = f x                             --function application function
map ($ 3) [(4+), (10*), (^2)] == [7, 30, 9] --mapping function application

(.) :: (b -> c) -> (a -> b) -> a -> c  
f . g = \x -> f (g x)                       --function composition function

import Data.List                            --import Data.List module
:m + Data.List Data.Map Data.Set            --import several modules
import Data.List (nub, sort)                --import just nub and sort
import Data.List hiding (nub)               --import all except nub
import qualified Data.Map                   --force qualification
import qualified Data.Map as M              --force and rename qualification

{-
  this is a
  multiline comment
-}

intersperse 0 [1, 2, 3] == [1, 0, 2, 0, 3]
intercalate " - " ["hey","there","guys"] == "hey - there - guys"
transpose [[1,2,3],[4,5,6],[7,8,9]] == [[1,4,7],[2,5,8],[3,6,9]]
concat [1, 2] [3, 4, 5] == [1, 2, 3, 4, 5]
concatMap' f = concat . map f

and $ map (>4) [5,6,7,8] == True
or $ map (>4) [1,2,3] == False
any (==4) [2,3,5,6,1,4] == True
all (==4) [2,3,5,6,1,4] == False

take 4 $ iterate (*2) 1 == [1, 2, 4, 8]
splitAt 3 "abcd" == ("abc","d")

dropWhile (<3) [1, 2, 3, 4] == [3, 4]
(takeWhile p l) ++ (dropWhile p l) == l
span p l == (takeWhile p l, dropWhile p l)
break p == span $ not . p

sort [2, 1, 3] == [1, 2, 3]
group [1, 1, 2, 3, 3, 3, 2, 2] == [[1, 1], [2], [3, 3, 3], [2, 2]] --group adjacent equals
map (\l@(x:xs) -> (x,length l)) . group . sort $ [1, 2, 1, 1, 3] == [(1, 3), (2, 1), (3, 1)]  --occurrences of each element

inits "w00t" == ["","w","w0","w00","w00t"]
tails "w00t" == ["w00t","00t","0t","t",""]
concat . nub $ map (\(x, y) -> x ++ y) $ zip (inits w) (tails w) == w

and $ map (`isPrefixOf` w) (inits w) == True
and $ map (`isSuffixOf` w) (tails w) == True
[2, 3] `isInfixOf` [1, 2, 3, 4] == True

notElem x = not . elem x

partition p w == (filter p w, filter (not . p) w)
qsort (x:xs) = (qsort $ fst p) ++ [x] ++ (qsort $ snd p)
  where p = partition (<=x) xs

find (>2) [1, 2, 3, 4] == Just 3
find (>4) [1, 2, 3, 4] == Nothing
'b' `elemIndex` "abc" == Just 1
'a' `elemIndices` "abac" == [0, 2]
findIndex (>2) [1, 2, 3, 4] == Just 2
findIndices (>2) [1, 2, 3, 4] == [2, 3]

zipWith3 (\x y z -> x + y + z) [1,2,3] [4,5,2,2] [2,2,3] == [7,9,8]  
zip4 [2,3,3] [2,2,2] [5,5,3] [2,2,2] == [(2,2,5,2),(3,2,5,2),(3,2,3,2)]

lines "first line\nsecond line\nthird line" == ["first line","second line","third line"]
unlines ["first line", "second line", "third line"] == "first line\nsecond line\nthird line\n"
words "hey\nthere           mate" == ["hey","there","mate"]
unwords ["hey","there","mate"] == "hey there mate"

nub [1,2,3,4,3,2,1,2,3,4,3,2,1] == [1,2,3,4] --erase duplicates
delete 'b' "abcbc" == "acbc"                 --erase first occurence

(l \\ r) == (filter (`notElem` r) l)
union [1, 2, 2] [1, 2, 3] == [1, 2, 2, 3]
intersect [0, 1, 2, 2] [1, 2, 3] == [1, 2, 2]
insert 2 [1, 3, 1, 2] == [1, 2, 3, 1, 2]

genericLength, genericTake, genericDrop, genericSplitAt, genericIndex and genericReplicate
average xs = sum xs / genericLength xs

nubBy, deleteBy, unionBy, intersectBy and groupBy
group = groupBy (==)

on :: (b -> b -> c) -> (a -> b) -> a -> a -> c  
f `on` g = \x y -> f (g x) (g y)

sortBy, insertBy, maximumBy and minimumBy
sort = sortBy compare
sortBy (compare `on` length) [[1, 2], [], [3]]  == [[], [3], [1, 2]]

isControl, isSpace, isLower, isUpper, isAlpha, isAlphaNum,
isPrint, isDigit, isOctDigit, isHexDigit, isLetter, isMark,
isNumber, isPunctuation, isSymbol, isSeparator, isAscii,
isLatin1, isAsciiUpper, isAsciiLower

filter (not . any isSpace) . groupBy ((==) `on` isSpace) $ w == words w

toUpper, toLower, toTitle, digitToInt, intToDigit, ord, chr
";i:1;s:7:"haskell";i:2;N;}i:2;i:772;}i:64;a:3:{i:0;s:4:"code";i:1;a:3:{i:0;s:350:"
module Shapes   
( Shape(..)  
, surface
) where

data Shape = Circle Float Float Float | Rectangle Float Float Float Float
data Shape = Circle Float Float Float | Rectangle Float Float Float Float deriving (Show)

surface :: Shape -> Float  
surface (Circle _ _ r) = pi * r ^ 2  
surface (Rectangle x1 y1 x2 y2) = (abs $ x2 - x1) * (abs $ y2 - y1)
";i:1;s:7:"haskell";i:2;N;}i:2;i:9561;}i:65;a:3:{i:0;s:4:"code";i:1;a:3:{i:0;s:583:"
data Person = Person { firstName :: String  
                     , lastName :: String  
                     , age :: Int  
                     , height :: Float  
                     , phoneNumber :: String  
                     , flavor :: String  
                     } deriving (Show)

data Maybe a = Nothing | Just a
data Either a b = Left a | Right b deriving (Eq, Ord, Read, Show)
data List a = Empty | Cons a (List a) deriving (Show, Read, Eq, Ord)  
infixr 5 :-:
data List a = Empty | a :-: (List a) deriving (Show, Read, Eq, Ord)

type String = [Char] --type synonym
";i:1;s:7:"haskell";i:2;N;}i:2;i:9934;}i:66;a:3:{i:0;s:4:"code";i:1;a:3:{i:0;s:107:"
import Control.Monad   
  
main = do  
  c <- getChar  
  when (c /= ' ') $ do  
    putChar c  
    main
";i:1;s:7:"haskell";i:2;N;}i:2;i:10540;}i:67;a:3:{i:0;s:4:"code";i:1;a:3:{i:0;s:243:"
main = interact shortLinesOnly  

shortLinesOnly :: String -> String  
shortLinesOnly input =   
  let allLines = lines input  
      shortLines = filter (\line -> length line < 10) allLines  
      result = unlines shortLines  
  in  result
";i:1;s:7:"haskell";i:2;N;}i:2;i:10670;}i:68;a:3:{i:0;s:4:"code";i:1;a:3:{i:0;s:155:"
import System.IO     

main = do     
  withFile "girlfriend.txt" ReadMode (\handle -> do  
    contents <- hGetContents handle     
    putStr contents)
";i:1;s:7:"haskell";i:2;N;}i:2;i:10936;}i:69;a:3:{i:0;s:4:"code";i:1;a:3:{i:0;s:93:"
import System.IO  

main = do  
  contents <- readFile "girlfriend.txt"  
  putStr contents
";i:1;s:7:"haskell";i:2;N;}i:2;i:11114;}i:70;a:3:{i:0;s:4:"code";i:1;a:3:{i:0;s:223:"
import System.Environment   
import Data.List  

main = do  
  args <- getArgs  
  progName <- getProgName  
  putStrLn "The arguments are:"  
  mapM putStrLn args  
  putStrLn "The program name is:"  
  putStrLn progName
";i:1;s:7:"haskell";i:2;N;}i:2;i:11230;}i:71;a:3:{i:0;s:4:"code";i:1;a:3:{i:0;s:295:"
import Control.Monad  

main = do   
  colors <- forM [1,2,3,4] (\a -> do  
    putStrLn $ "Which color do you associate with the number " ++ show a ++ "?"  
    color <- getLine  
    return color)  
  putStrLn "The colors that you associate with 1, 2, 3 and 4 are: "  
  mapM putStrLn colors
";i:1;s:7:"haskell";i:2;N;}i:2;i:11476;}i:72;a:2:{i:0;s:6:"plugin";i:1;a:4:{i:0;s:7:"uparrow";i:1;a:1:{i:0;s:42:"lib/plugins/uparrow/images/tango-small.png";}i:2;i:1;i:3;s:6:"~~UP~~";}}i:73;a:3:{i:0;s:13:"section_close";i:1;a:0:{}i:2;i:11788;}i:74;a:3:{i:0;s:12:"section_edit";i:1;a:4:{i:0;i:637;i:1;i:0;i:2;i:2;i:3;s:19:"Haskell Cheat Sheet";}i:2;i:11788;}i:75;a:3:{i:0;s:12:"document_end";i:1;a:0:{}i:2;i:11788;}}