a:31:{i:0;a:3:{i:0;s:14:"document_start";i:1;a:0:{}i:2;i:0;}i:1;a:3:{i:0;s:6:"p_open";i:1;a:0:{}i:2;i:0;}i:2;a:3:{i:0;s:7:"p_close";i:1;a:0:{}i:2;i:1;}i:3;a:3:{i:0;s:12:"section_edit";i:1;a:4:{i:0;i:-1;i:1;i:0;i:2;i:1;i:3;s:0:"";}i:2;i:1;}i:4;a:3:{i:0;s:6:"header";i:1;a:3:{i:0;s:12:"Shell Script";i:1;i:1;i:2;i:1;}i:2;i:1;}i:5;a:3:{i:0;s:12:"section_open";i:1;a:1:{i:0;i:1;}i:2;i:1;}i:6;a:3:{i:0;s:6:"p_open";i:1;a:0:{}i:2;i:27;}i:7;a:3:{i:0;s:5:"cdata";i:1;a:1:{i:0;s:1:"
";}i:2;i:28;}i:8;a:3:{i:0;s:13:"interwikilink";i:1;a:4:{i:0;s:15:"wp>Shell_script";i:1;s:12:"Shell Script";i:2;s:2:"wp";i:3;s:12:"Shell_script";}i:2;i:29;}i:9;a:3:{i:0;s:7:"p_close";i:1;a:0:{}i:2;i:61;}i:10;a:2:{i:0;s:6:"plugin";i:1;a:4:{i:0;s:7:"uparrow";i:1;a:1:{i:0;s:42:"lib/plugins/uparrow/images/tango-small.png";}i:2;i:1;i:3;s:6:"~~UP~~";}}i:11;a:3:{i:0;s:13:"section_close";i:1;a:0:{}i:2;i:63;}i:12;a:3:{i:0;s:12:"section_edit";i:1;a:4:{i:0;i:1;i:1;i:62;i:2;i:1;i:3;s:12:"Shell Script";}i:2;i:63;}i:13;a:3:{i:0;s:6:"header";i:1;a:3:{i:0;s:8:"Examples";i:1;i:2;i:2;i:63;}i:2;i:63;}i:14;a:3:{i:0;s:12:"section_open";i:1;a:1:{i:0;i:2;}i:2;i:63;}i:15;a:3:{i:0;s:4:"file";i:1;a:3:{i:0;s:518:"
#!/bin/bash
dir_names=("tcp/null" "tcp/sort" "udp/null")
for d in {0..2}
do
	dir_name=${dir_names[$d]}
	echo "$dir_name"
	mv "$dir_name/out.txt" "$dir_name/out.bak.txt"
	for j in {0..3}
	do
		#echo "$j"
		for i in {0..9}
		do
			#echo "$i"
			if [ "$d" = "8" ] || [ "$d" = "9" ]
			then
				cd "$dir_name"
				java Client 143.54.12.150:808"$d" >> "out.txt"
				cd "../../"
			else
				./"$dir_name/client" 143.54.12.150 808"$d" >> "$dir_name/out.txt"
			fi
		done
		sleep 60
	done
	./calc.rb "$dir_name/out.txt"
done
";i:1;s:4:"bash";i:2;s:6:"run.sh";}i:2;i:90;}i:16;a:3:{i:0;s:4:"file";i:1;a:3:{i:0;s:105:"
#!/bin/bash
for prog in *.pico
do
	echo "$prog"
	prog_name=${prog%\.*}
	./run_test.sh "$prog_name"
done
";i:1;s:4:"bash";i:2;s:12:"run_tests.sh";}i:2;i:635;}i:17;a:3:{i:0;s:4:"file";i:1;a:3:{i:0;s:162:"
#!/bin/bash
if test $# -ne 1
then
	echo "usage: $0 program_name"
	echo "given: $*"
else
	prog_name=$1
	./../../src/pico -o "$prog_name.tac" "$prog_name.pico"
fi
";i:1;s:4:"bash";i:2;s:11:"run_test.sh";}i:2;i:773;}i:18;a:2:{i:0;s:6:"plugin";i:1;a:4:{i:0;s:7:"uparrow";i:1;a:1:{i:0;s:42:"lib/plugins/uparrow/images/tango-small.png";}i:2;i:1;i:3;s:6:"~~UP~~";}}i:19;a:3:{i:0;s:13:"section_close";i:1;a:0:{}i:2;i:962;}i:20;a:3:{i:0;s:12:"section_edit";i:1;a:4:{i:0;i:63;i:1;i:961;i:2;i:2;i:3;s:8:"Examples";}i:2;i:962;}i:21;a:3:{i:0;s:6:"header";i:1;a:3:{i:0;s:5:"Books";i:1;i:2;i:2;i:962;}i:2;i:962;}i:22;a:3:{i:0;s:12:"section_open";i:1;a:1:{i:0;i:2;}i:2;i:962;}i:23;a:3:{i:0;s:6:"p_open";i:1;a:0:{}i:2;i:979;}i:24;a:3:{i:0;s:13:"internalmedia";i:1;a:7:{i:0;s:18:"canivete-shell.pdf";i:1;s:14:"Canivete Shell";i:2;N;i:3;N;i:4;N;i:5;s:5:"cache";i:6;s:7:"details";}i:2;i:980;}i:25;a:3:{i:0;s:5:"cdata";i:1;a:1:{i:0;s:1:"
";}i:2;i:1017;}i:26;a:3:{i:0;s:7:"p_close";i:1;a:0:{}i:2;i:1017;}i:27;a:2:{i:0;s:6:"plugin";i:1;a:4:{i:0;s:7:"uparrow";i:1;a:1:{i:0;s:42:"lib/plugins/uparrow/images/tango-small.png";}i:2;i:1;i:3;s:6:"~~UP~~";}}i:28;a:3:{i:0;s:13:"section_close";i:1;a:0:{}i:2;i:1017;}i:29;a:3:{i:0;s:12:"section_edit";i:1;a:4:{i:0;i:962;i:1;i:0;i:2;i:2;i:3;s:5:"Books";}i:2;i:1017;}i:30;a:3:{i:0;s:12:"document_end";i:1;a:0:{}i:2;i:1017;}}