a:24:{i:0;a:3:{i:0;s:14:"document_start";i:1;a:0:{}i:2;i:0;}i:1;a:3:{i:0;s:6:"p_open";i:1;a:0:{}i:2;i:0;}i:2;a:3:{i:0;s:7:"p_close";i:1;a:0:{}i:2;i:1;}i:3;a:3:{i:0;s:12:"section_edit";i:1;a:4:{i:0;i:-1;i:1;i:0;i:2;i:1;i:3;s:0:"";}i:2;i:1;}i:4;a:3:{i:0;s:6:"header";i:1;a:3:{i:0;s:3:"GTK";i:1;i:1;i:2;i:1;}i:2;i:1;}i:5;a:3:{i:0;s:12:"section_open";i:1;a:1:{i:0;i:1;}i:2;i:1;}i:6;a:3:{i:0;s:6:"p_open";i:1;a:0:{}i:2;i:18;}i:7;a:3:{i:0;s:5:"cdata";i:1;a:1:{i:0;s:1:"
";}i:2;i:19;}i:8;a:3:{i:0;s:12:"externallink";i:1;a:2:{i:0;s:19:"http://www.gtk.org/";i:1;s:4:"GTK+";}i:2;i:20;}i:9;a:3:{i:0;s:5:"cdata";i:1;a:1:{i:0;s:2:": ";}i:2;i:48;}i:10;a:3:{i:0;s:13:"interwikilink";i:1;a:4:{i:0;s:6:"wp>Gtk";i:1;s:4:"GTK+";i:2;s:2:"wp";i:3;s:3:"Gtk";}i:2;i:50;}i:11;a:3:{i:0;s:5:"cdata";i:1;a:1:{i:0;s:50:" - Toolkit for creating graphical user interfaces ";}i:2;i:65;}i:12;a:3:{i:0;s:9:"linebreak";i:1;a:0:{}i:2;i:115;}i:13;a:3:{i:0;s:5:"cdata";i:1;a:1:{i:0;s:1:"
";}i:2;i:117;}i:14;a:3:{i:0;s:12:"externallink";i:1;a:2:{i:0;s:21:"http://www.gtkmm.org/";i:1;s:5:"Gtkmm";}i:2;i:118;}i:15;a:3:{i:0;s:5:"cdata";i:1;a:1:{i:0;s:2:": ";}i:2;i:149;}i:16;a:3:{i:0;s:13:"interwikilink";i:1;a:4:{i:0;s:8:"wp>Gtkmm";i:1;s:5:"gtkmm";i:2;s:2:"wp";i:3;s:5:"Gtkmm";}i:2;i:151;}i:17;a:3:{i:0;s:5:"cdata";i:1;a:1:{i:0;s:29:" - The C++ Interface for GTK ";}i:2;i:169;}i:18;a:3:{i:0;s:9:"linebreak";i:1;a:0:{}i:2;i:198;}i:19;a:3:{i:0;s:5:"cdata";i:1;a:1:{i:0;s:1:"
";}i:2;i:200;}i:20;a:3:{i:0;s:7:"p_close";i:1;a:0:{}i:2;i:200;}i:21;a:2:{i:0;s:6:"plugin";i:1;a:4:{i:0;s:7:"uparrow";i:1;a:1:{i:0;s:42:"lib/plugins/uparrow/images/tango-small.png";}i:2;i:1;i:3;s:6:"~~UP~~";}}i:22;a:3:{i:0;s:13:"section_close";i:1;a:0:{}i:2;i:200;}i:23;a:3:{i:0;s:12:"document_end";i:1;a:0:{}i:2;i:200;}}