a:276:{i:0;a:3:{i:0;s:14:"document_start";i:1;a:0:{}i:2;i:0;}i:1;a:3:{i:0;s:6:"p_open";i:1;a:0:{}i:2;i:0;}i:2;a:3:{i:0;s:7:"p_close";i:1;a:0:{}i:2;i:1;}i:3;a:3:{i:0;s:12:"section_edit";i:1;a:4:{i:0;i:-1;i:1;i:0;i:2;i:1;i:3;s:0:"";}i:2;i:1;}i:4;a:3:{i:0;s:6:"header";i:1;a:3:{i:0;s:6:"Videos";i:1;i:1;i:2;i:1;}i:2;i:1;}i:5;a:3:{i:0;s:12:"section_open";i:1;a:1:{i:0;i:1;}i:2;i:1;}i:6;a:2:{i:0;s:6:"plugin";i:1;a:4:{i:0;s:7:"uparrow";i:1;a:1:{i:0;s:42:"lib/plugins/uparrow/images/tango-small.png";}i:2;i:1;i:3;s:6:"~~UP~~";}}i:7;a:3:{i:0;s:13:"section_close";i:1;a:0:{}i:2;i:23;}i:8;a:3:{i:0;s:12:"section_edit";i:1;a:4:{i:0;i:1;i:1;i:22;i:2;i:1;i:3;s:6:"Videos";}i:2;i:23;}i:9;a:3:{i:0;s:6:"header";i:1;a:3:{i:0;s:4:"Talk";i:1;i:2;i:2;i:23;}i:2;i:23;}i:10;a:3:{i:0;s:12:"section_open";i:1;a:1:{i:0;i:2;}i:2;i:23;}i:11;a:3:{i:0;s:6:"p_open";i:1;a:0:{}i:2;i:39;}i:12;a:3:{i:0;s:5:"cdata";i:1;a:1:{i:0;s:1:"
";}i:2;i:40;}i:13;a:3:{i:0;s:12:"externallink";i:1;a:2:{i:0;s:42:"http://www.youtube.com/watch?v=yplX3pYWlPo";i:1;s:31:"Steve Jobs at Stanford (part 1)";}i:2;i:41;}i:14;a:3:{i:0;s:5:"cdata";i:1;a:1:{i:0;s:1:" ";}i:2;i:119;}i:15;a:3:{i:0;s:9:"linebreak";i:1;a:0:{}i:2;i:120;}i:16;a:3:{i:0;s:5:"cdata";i:1;a:1:{i:0;s:1:"
";}i:2;i:122;}i:17;a:3:{i:0;s:12:"externallink";i:1;a:2:{i:0;s:42:"http://www.youtube.com/watch?v=ksoo-G_YB2o";i:1;s:31:"Steve Jobs at Stanford (part 2)";}i:2;i:123;}i:18;a:3:{i:0;s:5:"cdata";i:1;a:1:{i:0;s:1:" ";}i:2;i:201;}i:19;a:3:{i:0;s:9:"linebreak";i:1;a:0:{}i:2;i:202;}i:20;a:3:{i:0;s:5:"cdata";i:1;a:1:{i:0;s:1:"
";}i:2;i:204;}i:21;a:3:{i:0;s:12:"externallink";i:1;a:2:{i:0;s:59:"http://www.groklaw.net/staticpages/index.php?page=GatesDepo";i:1;s:31:"Groklaw: Gates Deposition Video";}i:2;i:205;}i:22;a:3:{i:0;s:5:"cdata";i:1;a:1:{i:0;s:1:" ";}i:2;i:300;}i:23;a:3:{i:0;s:9:"linebreak";i:1;a:0:{}i:2;i:301;}i:24;a:3:{i:0;s:5:"cdata";i:1;a:1:{i:0;s:1:"
";}i:2;i:303;}i:25;a:3:{i:0;s:12:"externallink";i:1;a:2:{i:0;s:24:"http://vimeo.com/7441291";i:1;s:128:"Jürgen Schmidhuber at Singularity Summit 2009 - Compression Progress: The Algorithmic Principle Behind Curiosity and Creativity";}i:2;i:304;}i:26;a:3:{i:0;s:5:"cdata";i:1;a:1:{i:0;s:1:" ";}i:2;i:461;}i:27;a:3:{i:0;s:6:"plugin";i:1;a:4:{i:0;s:5:"skill";i:1;a:2:{i:0;s:1:"4";i:1;s:1:"5";}i:2;i:5;i:3;s:13:"{{skill>4/5}}";}i:2;i:462;}i:28;a:3:{i:0;s:5:"cdata";i:1;a:1:{i:0;s:1:" ";}i:2;i:475;}i:29;a:3:{i:0;s:9:"linebreak";i:1;a:0:{}i:2;i:476;}i:30;a:3:{i:0;s:5:"cdata";i:1;a:1:{i:0;s:1:"
";}i:2;i:478;}i:31;a:3:{i:0;s:12:"externallink";i:1;a:2:{i:0;s:42:"http://www.youtube.com/watch?v=u6XAPnuFjJc";i:1;s:65:"RSA Animate - Drive: The surprising truth about what motivates us";}i:2;i:479;}i:32;a:3:{i:0;s:5:"cdata";i:1;a:1:{i:0;s:1:" ";}i:2;i:591;}i:33;a:3:{i:0;s:6:"plugin";i:1;a:4:{i:0;s:5:"skill";i:1;a:2:{i:0;s:1:"3";i:1;s:1:"5";}i:2;i:5;i:3;s:13:"{{skill>3/5}}";}i:2;i:592;}i:34;a:3:{i:0;s:5:"cdata";i:1;a:1:{i:0;s:1:" ";}i:2;i:605;}i:35;a:3:{i:0;s:9:"linebreak";i:1;a:0:{}i:2;i:606;}i:36;a:3:{i:0;s:7:"p_close";i:1;a:0:{}i:2;i:608;}i:37;a:2:{i:0;s:6:"plugin";i:1;a:4:{i:0;s:7:"uparrow";i:1;a:1:{i:0;s:42:"lib/plugins/uparrow/images/tango-small.png";}i:2;i:1;i:3;s:6:"~~UP~~";}}i:38;a:3:{i:0;s:13:"section_close";i:1;a:0:{}i:2;i:610;}i:39;a:3:{i:0;s:12:"section_edit";i:1;a:4:{i:0;i:23;i:1;i:609;i:2;i:2;i:3;s:4:"Talk";}i:2;i:610;}i:40;a:3:{i:0;s:6:"header";i:1;a:3:{i:0;s:8:"Software";i:1;i:2;i:2;i:610;}i:2;i:610;}i:41;a:3:{i:0;s:12:"section_open";i:1;a:1:{i:0;i:2;}i:2;i:610;}i:42;a:3:{i:0;s:6:"p_open";i:1;a:0:{}i:2;i:630;}i:43;a:3:{i:0;s:5:"cdata";i:1;a:1:{i:0;s:1:"
";}i:2;i:631;}i:44;a:3:{i:0;s:12:"externallink";i:1;a:2:{i:0;s:84:"http://brightcove.newscientist.com/services/player/bcpid1873822884?bctid=77464563001";i:1;s:53:"Hand-held projector images respond to the real world ";}i:2;i:632;}i:45;a:3:{i:0;s:5:"cdata";i:1;a:1:{i:0;s:1:" ";}i:2;i:774;}i:46;a:3:{i:0;s:6:"plugin";i:1;a:4:{i:0;s:5:"skill";i:1;a:2:{i:0;s:1:"3";i:1;s:1:"5";}i:2;i:5;i:3;s:13:"{{skill>3/5}}";}i:2;i:775;}i:47;a:3:{i:0;s:5:"cdata";i:1;a:1:{i:0;s:1:" ";}i:2;i:788;}i:48;a:3:{i:0;s:9:"linebreak";i:1;a:0:{}i:2;i:789;}i:49;a:3:{i:0;s:5:"cdata";i:1;a:1:{i:0;s:1:"
";}i:2;i:791;}i:50;a:3:{i:0;s:12:"externallink";i:1;a:2:{i:0;s:42:"http://www.youtube.com/watch?v=PsPX0nElJ0k";i:1;s:91:"Code Bubbles: Rethinking the User Interface Paradigm of Integrated Development Environments";}i:2;i:792;}i:51;a:3:{i:0;s:5:"cdata";i:1;a:1:{i:0;s:1:" ";}i:2;i:930;}i:52;a:3:{i:0;s:6:"plugin";i:1;a:4:{i:0;s:5:"skill";i:1;a:2:{i:0;s:1:"5";i:1;s:1:"5";}i:2;i:5;i:3;s:13:"{{skill>5/5}}";}i:2;i:931;}i:53;a:3:{i:0;s:5:"cdata";i:1;a:1:{i:0;s:1:" ";}i:2;i:944;}i:54;a:3:{i:0;s:9:"linebreak";i:1;a:0:{}i:2;i:945;}i:55;a:3:{i:0;s:5:"cdata";i:1;a:1:{i:0;s:1:"
";}i:2;i:947;}i:56;a:3:{i:0;s:12:"externallink";i:1;a:2:{i:0;s:42:"http://www.youtube.com/watch?v=Q5k7a9YEoUI";i:1;s:25:"SCRUM in Under 10 Minutes";}i:2;i:948;}i:57;a:3:{i:0;s:5:"cdata";i:1;a:1:{i:0;s:1:" ";}i:2;i:1020;}i:58;a:3:{i:0;s:6:"plugin";i:1;a:4:{i:0;s:5:"skill";i:1;a:2:{i:0;s:1:"3";i:1;s:1:"5";}i:2;i:5;i:3;s:13:"{{skill>3/5}}";}i:2;i:1021;}i:59;a:3:{i:0;s:5:"cdata";i:1;a:1:{i:0;s:1:" ";}i:2;i:1034;}i:60;a:3:{i:0;s:9:"linebreak";i:1;a:0:{}i:2;i:1035;}i:61;a:3:{i:0;s:5:"cdata";i:1;a:1:{i:0;s:1:"
";}i:2;i:1037;}i:62;a:3:{i:0;s:12:"externallink";i:1;a:2:{i:0;s:23:"http://10gui.com/video/";i:1;s:37:"10/GUI Multi-touch Operational System";}i:2;i:1038;}i:63;a:3:{i:0;s:5:"cdata";i:1;a:1:{i:0;s:1:" ";}i:2;i:1103;}i:64;a:3:{i:0;s:6:"plugin";i:1;a:4:{i:0;s:5:"skill";i:1;a:2:{i:0;s:1:"5";i:1;s:1:"5";}i:2;i:5;i:3;s:13:"{{skill>5/5}}";}i:2;i:1104;}i:65;a:3:{i:0;s:5:"cdata";i:1;a:1:{i:0;s:1:" ";}i:2;i:1117;}i:66;a:3:{i:0;s:9:"linebreak";i:1;a:0:{}i:2;i:1118;}i:67;a:3:{i:0;s:5:"cdata";i:1;a:1:{i:0;s:1:"
";}i:2;i:1120;}i:68;a:3:{i:0;s:12:"externallink";i:1;a:2:{i:0;s:156:"http://admin.brightcove.com/viewer/us1.23.01.01b/BrightcoveBootloader.swf?isVid=1&videoId=89303155001&playerID=2227271001&domain=embed&dynamicStreaming=true";i:1;s:52:"Impossible figures brought to life in virtual worlds";}i:2;i:1121;}i:69;a:3:{i:0;s:5:"cdata";i:1;a:1:{i:0;s:1:" ";}i:2;i:1334;}i:70;a:3:{i:0;s:6:"plugin";i:1;a:4:{i:0;s:5:"skill";i:1;a:2:{i:0;s:1:"1";i:1;s:1:"5";}i:2;i:5;i:3;s:13:"{{skill>1/5}}";}i:2;i:1335;}i:71;a:3:{i:0;s:5:"cdata";i:1;a:1:{i:0;s:1:" ";}i:2;i:1348;}i:72;a:3:{i:0;s:9:"linebreak";i:1;a:0:{}i:2;i:1349;}i:73;a:3:{i:0;s:5:"cdata";i:1;a:1:{i:0;s:1:"
";}i:2;i:1351;}i:74;a:3:{i:0;s:12:"externallink";i:1;a:2:{i:0;s:42:"http://www.youtube.com/watch?v=FxDOlhysFcM";i:1;s:57:"Sikuli Script Demo (Automatically setting IP on Mac OS X)";}i:2;i:1352;}i:75;a:3:{i:0;s:5:"cdata";i:1;a:1:{i:0;s:1:" ";}i:2;i:1456;}i:76;a:3:{i:0;s:6:"plugin";i:1;a:4:{i:0;s:5:"skill";i:1;a:2:{i:0;s:1:"3";i:1;s:1:"5";}i:2;i:5;i:3;s:13:"{{skill>3/5}}";}i:2;i:1457;}i:77;a:3:{i:0;s:5:"cdata";i:1;a:1:{i:0;s:1:" ";}i:2;i:1470;}i:78;a:3:{i:0;s:9:"linebreak";i:1;a:0:{}i:2;i:1471;}i:79;a:3:{i:0;s:5:"cdata";i:1;a:1:{i:0;s:1:"
";}i:2;i:1473;}i:80;a:3:{i:0;s:12:"externallink";i:1;a:2:{i:0;s:90:"http://video.nytimes.com/video/2010/06/15/magazine/1247468055784/how-does-watson-work.html";i:1;s:21:"How Does Watson Work?";}i:2;i:1474;}i:81;a:3:{i:0;s:5:"cdata";i:1;a:1:{i:0;s:1:" ";}i:2;i:1590;}i:82;a:3:{i:0;s:6:"plugin";i:1;a:4:{i:0;s:5:"skill";i:1;a:2:{i:0;s:1:"2";i:1;s:1:"5";}i:2;i:5;i:3;s:13:"{{skill>2/5}}";}i:2;i:1591;}i:83;a:3:{i:0;s:5:"cdata";i:1;a:1:{i:0;s:1:" ";}i:2;i:1604;}i:84;a:3:{i:0;s:9:"linebreak";i:1;a:0:{}i:2;i:1605;}i:85;a:3:{i:0;s:7:"p_close";i:1;a:0:{}i:2;i:1607;}i:86;a:2:{i:0;s:6:"plugin";i:1;a:4:{i:0;s:7:"uparrow";i:1;a:1:{i:0;s:42:"lib/plugins/uparrow/images/tango-small.png";}i:2;i:1;i:3;s:6:"~~UP~~";}}i:87;a:3:{i:0;s:13:"section_close";i:1;a:0:{}i:2;i:1609;}i:88;a:3:{i:0;s:12:"section_edit";i:1;a:4:{i:0;i:610;i:1;i:1608;i:2;i:2;i:3;s:8:"Software";}i:2;i:1609;}i:89;a:3:{i:0;s:6:"header";i:1;a:3:{i:0;s:26:"Human Computer Interaction";i:1;i:2;i:2;i:1609;}i:2;i:1609;}i:90;a:3:{i:0;s:12:"section_open";i:1;a:1:{i:0;i:2;}i:2;i:1609;}i:91;a:3:{i:0;s:6:"p_open";i:1;a:0:{}i:2;i:1647;}i:92;a:3:{i:0;s:5:"cdata";i:1;a:1:{i:0;s:1:"
";}i:2;i:1648;}i:93;a:3:{i:0;s:12:"externallink";i:1;a:2:{i:0;s:24:"http://vimeo.com/8398577";i:1;s:35:"Multi-touch graphing and flowcharts";}i:2;i:1649;}i:94;a:3:{i:0;s:5:"cdata";i:1;a:1:{i:0;s:1:" ";}i:2;i:1713;}i:95;a:3:{i:0;s:6:"plugin";i:1;a:4:{i:0;s:5:"skill";i:1;a:2:{i:0;s:1:"3";i:1;s:1:"5";}i:2;i:5;i:3;s:13:"{{skill>3/5}}";}i:2;i:1714;}i:96;a:3:{i:0;s:5:"cdata";i:1;a:1:{i:0;s:1:" ";}i:2;i:1727;}i:97;a:3:{i:0;s:9:"linebreak";i:1;a:0:{}i:2;i:1728;}i:98;a:3:{i:0;s:5:"cdata";i:1;a:1:{i:0;s:1:"
";}i:2;i:1730;}i:99;a:3:{i:0;s:12:"externallink";i:1;a:2:{i:0;s:42:"http://www.youtube.com/watch?v=IzXVBlQ6wFY";i:1;s:48:"CHI: Multitoe project offers new touch interface";}i:2;i:1731;}i:100;a:3:{i:0;s:5:"cdata";i:1;a:1:{i:0;s:1:" ";}i:2;i:1826;}i:101;a:3:{i:0;s:6:"plugin";i:1;a:4:{i:0;s:5:"skill";i:1;a:2:{i:0;s:1:"1";i:1;s:1:"5";}i:2;i:5;i:3;s:13:"{{skill>1/5}}";}i:2;i:1827;}i:102;a:3:{i:0;s:5:"cdata";i:1;a:1:{i:0;s:1:" ";}i:2;i:1840;}i:103;a:3:{i:0;s:9:"linebreak";i:1;a:0:{}i:2;i:1841;}i:104;a:3:{i:0;s:5:"cdata";i:1;a:1:{i:0;s:1:"
";}i:2;i:1843;}i:105;a:3:{i:0;s:12:"externallink";i:1;a:2:{i:0;s:77:"http://link.brightcove.com/services/player/bcpid36804639001?bctid=86656499001";i:1;s:36:"Gesture-based computing on the cheap";}i:2;i:1844;}i:106;a:3:{i:0;s:5:"cdata";i:1;a:1:{i:0;s:1:" ";}i:2;i:1962;}i:107;a:3:{i:0;s:6:"plugin";i:1;a:4:{i:0;s:5:"skill";i:1;a:2:{i:0;s:1:"5";i:1;s:1:"5";}i:2;i:5;i:3;s:13:"{{skill>5/5}}";}i:2;i:1963;}i:108;a:3:{i:0;s:5:"cdata";i:1;a:1:{i:0;s:1:" ";}i:2;i:1976;}i:109;a:3:{i:0;s:9:"linebreak";i:1;a:0:{}i:2;i:1977;}i:110;a:3:{i:0;s:5:"cdata";i:1;a:1:{i:0;s:1:"
";}i:2;i:1979;}i:111;a:3:{i:0;s:12:"externallink";i:1;a:2:{i:0;s:42:"http://www.youtube.com/watch?v=g3XPUdW9Ryg";i:1;s:62:"Skinput: Appropriating the Body as an Input Surface (CHI 2010)";}i:2;i:1980;}i:112;a:3:{i:0;s:5:"cdata";i:1;a:1:{i:0;s:1:" ";}i:2;i:2089;}i:113;a:3:{i:0;s:6:"plugin";i:1;a:4:{i:0;s:5:"skill";i:1;a:2:{i:0;s:1:"4";i:1;s:1:"5";}i:2;i:5;i:3;s:13:"{{skill>4/5}}";}i:2;i:2090;}i:114;a:3:{i:0;s:5:"cdata";i:1;a:1:{i:0;s:1:" ";}i:2;i:2103;}i:115;a:3:{i:0;s:9:"linebreak";i:1;a:0:{}i:2;i:2104;}i:116;a:3:{i:0;s:5:"cdata";i:1;a:1:{i:0;s:1:"
";}i:2;i:2106;}i:117;a:3:{i:0;s:12:"externallink";i:1;a:2:{i:0;s:92:"http://www.ted.com/talks/pranav_mistry_the_thrilling_potential_of_sixthsense_technology.html";i:1;s:63:"Pranav Mistry: The thrilling potential of SixthSense technology";}i:2;i:2107;}i:118;a:3:{i:0;s:5:"cdata";i:1;a:1:{i:0;s:1:" ";}i:2;i:2267;}i:119;a:3:{i:0;s:6:"plugin";i:1;a:4:{i:0;s:5:"skill";i:1;a:2:{i:0;s:1:"5";i:1;s:1:"5";}i:2;i:5;i:3;s:13:"{{skill>5/5}}";}i:2;i:2268;}i:120;a:3:{i:0;s:5:"cdata";i:1;a:1:{i:0;s:1:" ";}i:2;i:2281;}i:121;a:3:{i:0;s:9:"linebreak";i:1;a:0:{}i:2;i:2282;}i:122;a:3:{i:0;s:7:"p_close";i:1;a:0:{}i:2;i:2284;}i:123;a:2:{i:0;s:6:"plugin";i:1;a:4:{i:0;s:7:"uparrow";i:1;a:1:{i:0;s:42:"lib/plugins/uparrow/images/tango-small.png";}i:2;i:1;i:3;s:6:"~~UP~~";}}i:124;a:3:{i:0;s:13:"section_close";i:1;a:0:{}i:2;i:2286;}i:125;a:3:{i:0;s:12:"section_edit";i:1;a:4:{i:0;i:1609;i:1;i:2285;i:2;i:2;i:3;s:26:"Human Computer Interaction";}i:2;i:2286;}i:126;a:3:{i:0;s:6:"header";i:1;a:3:{i:0;s:8:"Robotics";i:1;i:2;i:2;i:2286;}i:2;i:2286;}i:127;a:3:{i:0;s:12:"section_open";i:1;a:1:{i:0;i:2;}i:2;i:2286;}i:128;a:3:{i:0;s:6:"p_open";i:1;a:0:{}i:2;i:2306;}i:129;a:3:{i:0;s:5:"cdata";i:1;a:1:{i:0;s:1:"
";}i:2;i:2307;}i:130;a:3:{i:0;s:12:"externallink";i:1;a:2:{i:0;s:42:"http://www.youtube.com/watch?v=dYDR-yC3wK0";i:1;s:51:"Miniature Glider with Head-first Perching from EPFL";}i:2;i:2308;}i:131;a:3:{i:0;s:5:"cdata";i:1;a:1:{i:0;s:1:" ";}i:2;i:2406;}i:132;a:3:{i:0;s:6:"plugin";i:1;a:4:{i:0;s:5:"skill";i:1;a:2:{i:0;s:1:"1";i:1;s:1:"5";}i:2;i:5;i:3;s:13:"{{skill>1/5}}";}i:2;i:2407;}i:133;a:3:{i:0;s:5:"cdata";i:1;a:1:{i:0;s:1:" ";}i:2;i:2420;}i:134;a:3:{i:0;s:9:"linebreak";i:1;a:0:{}i:2;i:2421;}i:135;a:3:{i:0;s:5:"cdata";i:1;a:1:{i:0;s:1:"
";}i:2;i:2423;}i:136;a:3:{i:0;s:12:"externallink";i:1;a:2:{i:0;s:42:"http://www.youtube.com/watch?v=oN1lQcJHpO8";i:1;s:29:"Anybots QB Telepresence Robot";}i:2;i:2424;}i:137;a:3:{i:0;s:5:"cdata";i:1;a:1:{i:0;s:1:" ";}i:2;i:2500;}i:138;a:3:{i:0;s:6:"plugin";i:1;a:4:{i:0;s:5:"skill";i:1;a:2:{i:0;s:1:"2";i:1;s:1:"5";}i:2;i:5;i:3;s:13:"{{skill>2/5}}";}i:2;i:2501;}i:139;a:3:{i:0;s:5:"cdata";i:1;a:1:{i:0;s:1:" ";}i:2;i:2514;}i:140;a:3:{i:0;s:9:"linebreak";i:1;a:0:{}i:2;i:2515;}i:141;a:3:{i:0;s:5:"cdata";i:1;a:1:{i:0;s:1:"
";}i:2;i:2517;}i:142;a:3:{i:0;s:12:"externallink";i:1;a:2:{i:0;s:42:"http://www.youtube.com/watch?v=UtW8PDP7P1s";i:1;s:44:"The Conference Room That Re-Arranges Itself ";}i:2;i:2518;}i:143;a:3:{i:0;s:5:"cdata";i:1;a:1:{i:0;s:1:" ";}i:2;i:2609;}i:144;a:3:{i:0;s:6:"plugin";i:1;a:4:{i:0;s:5:"skill";i:1;a:2:{i:0;s:1:"3";i:1;s:1:"5";}i:2;i:5;i:3;s:13:"{{skill>3/5}}";}i:2;i:2610;}i:145;a:3:{i:0;s:5:"cdata";i:1;a:1:{i:0;s:1:" ";}i:2;i:2623;}i:146;a:3:{i:0;s:9:"linebreak";i:1;a:0:{}i:2;i:2624;}i:147;a:3:{i:0;s:5:"cdata";i:1;a:1:{i:0;s:1:"
";}i:2;i:2626;}i:148;a:3:{i:0;s:12:"externallink";i:1;a:2:{i:0;s:42:"http://www.youtube.com/watch?v=nUQsRPJ1dYw";i:1;s:41:"The latest version of the LittleDog Robot";}i:2;i:2627;}i:149;a:3:{i:0;s:5:"cdata";i:1;a:1:{i:0;s:1:" ";}i:2;i:2715;}i:150;a:3:{i:0;s:6:"plugin";i:1;a:4:{i:0;s:5:"skill";i:1;a:2:{i:0;s:1:"2";i:1;s:1:"5";}i:2;i:5;i:3;s:13:"{{skill>2/5}}";}i:2;i:2716;}i:151;a:3:{i:0;s:5:"cdata";i:1;a:1:{i:0;s:1:" ";}i:2;i:2729;}i:152;a:3:{i:0;s:9:"linebreak";i:1;a:0:{}i:2;i:2730;}i:153;a:3:{i:0;s:5:"cdata";i:1;a:1:{i:0;s:1:"
";}i:2;i:2732;}i:154;a:3:{i:0;s:12:"externallink";i:1;a:2:{i:0;s:42:"http://www.youtube.com/watch?v=LlF0YllW7Gg";i:1;s:21:"Coffee Table Computer";}i:2;i:2733;}i:155;a:3:{i:0;s:5:"cdata";i:1;a:1:{i:0;s:1:" ";}i:2;i:2801;}i:156;a:3:{i:0;s:6:"plugin";i:1;a:4:{i:0;s:5:"skill";i:1;a:2:{i:0;s:1:"4";i:1;s:1:"5";}i:2;i:5;i:3;s:13:"{{skill>4/5}}";}i:2;i:2802;}i:157;a:3:{i:0;s:5:"cdata";i:1;a:1:{i:0;s:1:" ";}i:2;i:2815;}i:158;a:3:{i:0;s:9:"linebreak";i:1;a:0:{}i:2;i:2816;}i:159;a:3:{i:0;s:5:"cdata";i:1;a:1:{i:0;s:1:"
";}i:2;i:2818;}i:160;a:3:{i:0;s:12:"externallink";i:1;a:2:{i:0;s:42:"http://www.youtube.com/watch?v=7iHZKMDvdNI";i:1;s:46:"ETH Zurich IDSC - The Distributed Flight Array";}i:2;i:2819;}i:161;a:3:{i:0;s:5:"cdata";i:1;a:1:{i:0;s:1:" ";}i:2;i:2912;}i:162;a:3:{i:0;s:6:"plugin";i:1;a:4:{i:0;s:5:"skill";i:1;a:2:{i:0;s:1:"1";i:1;s:1:"5";}i:2;i:5;i:3;s:13:"{{skill>1/5}}";}i:2;i:2913;}i:163;a:3:{i:0;s:5:"cdata";i:1;a:1:{i:0;s:1:" ";}i:2;i:2926;}i:164;a:3:{i:0;s:9:"linebreak";i:1;a:0:{}i:2;i:2927;}i:165;a:3:{i:0;s:5:"cdata";i:1;a:1:{i:0;s:1:"
";}i:2;i:2929;}i:166;a:3:{i:0;s:12:"externallink";i:1;a:2:{i:0;s:42:"http://www.youtube.com/watch?v=HMx1xW2E4Gg";i:1;s:20:"PR2 Robot Plays Pool";}i:2;i:2930;}i:167;a:3:{i:0;s:5:"cdata";i:1;a:1:{i:0;s:1:" ";}i:2;i:2997;}i:168;a:3:{i:0;s:6:"plugin";i:1;a:4:{i:0;s:5:"skill";i:1;a:2:{i:0;s:1:"3";i:1;s:1:"5";}i:2;i:5;i:3;s:13:"{{skill>3/5}}";}i:2;i:2998;}i:169;a:3:{i:0;s:5:"cdata";i:1;a:1:{i:0;s:1:" ";}i:2;i:3011;}i:170;a:3:{i:0;s:9:"linebreak";i:1;a:0:{}i:2;i:3012;}i:171;a:3:{i:0;s:7:"p_close";i:1;a:0:{}i:2;i:3014;}i:172;a:3:{i:0;s:6:"p_open";i:1;a:0:{}i:2;i:3014;}i:173;a:3:{i:0;s:6:"plugin";i:1;a:4:{i:0;s:11:"htmlcomment";i:1;a:2:{i:0;i:5;i:1;s:7:" [[|]] ";}i:2;i:5;i:3;s:14:"<!-- [[|]] -->";}i:2;i:3016;}i:174;a:3:{i:0;s:7:"p_close";i:1;a:0:{}i:2;i:3030;}i:175;a:2:{i:0;s:6:"plugin";i:1;a:4:{i:0;s:7:"uparrow";i:1;a:1:{i:0;s:42:"lib/plugins/uparrow/images/tango-small.png";}i:2;i:1;i:3;s:6:"~~UP~~";}}i:176;a:3:{i:0;s:13:"section_close";i:1;a:0:{}i:2;i:3032;}i:177;a:3:{i:0;s:12:"section_edit";i:1;a:4:{i:0;i:2286;i:1;i:3031;i:2;i:2;i:3;s:8:"Robotics";}i:2;i:3032;}i:178;a:3:{i:0;s:6:"header";i:1;a:3:{i:0;s:16:"Google Tech Talk";i:1;i:2;i:2;i:3032;}i:2;i:3032;}i:179;a:3:{i:0;s:12:"section_open";i:1;a:1:{i:0;i:2;}i:2;i:3032;}i:180;a:3:{i:0;s:6:"p_open";i:1;a:0:{}i:2;i:3060;}i:181;a:3:{i:0;s:5:"cdata";i:1;a:1:{i:0;s:1:"
";}i:2;i:3061;}i:182;a:3:{i:0;s:12:"externallink";i:1;a:2:{i:0;s:42:"http://www.youtube.com/watch?v=4XpnKHJAok8";i:1;s:19:"Linus Torvalds: Git";}i:2;i:3062;}i:183;a:3:{i:0;s:5:"cdata";i:1;a:1:{i:0;s:1:" ";}i:2;i:3128;}i:184;a:3:{i:0;s:9:"linebreak";i:1;a:0:{}i:2;i:3129;}i:185;a:3:{i:0;s:5:"cdata";i:1;a:1:{i:0;s:1:"
";}i:2;i:3131;}i:186;a:3:{i:0;s:12:"externallink";i:1;a:2:{i:0;s:42:"http://www.youtube.com/watch?v=rKnDgT73v8s";i:1;s:37:"Rob Pike: The Go Programming Language";}i:2;i:3132;}i:187;a:3:{i:0;s:5:"cdata";i:1;a:1:{i:0;s:1:" ";}i:2;i:3216;}i:188;a:3:{i:0;s:9:"linebreak";i:1;a:0:{}i:2;i:3217;}i:189;a:3:{i:0;s:5:"cdata";i:1;a:1:{i:0;s:1:"
";}i:2;i:3219;}i:190;a:3:{i:0;s:12:"externallink";i:1;a:2:{i:0;s:58:"http://video.google.com/videoplay?docid=810232012617965344";i:1;s:96:"Rob Pike: Advanced Topics in Programming Languages: Concurrency and Message Passing In Newsqueak";}i:2;i:3220;}i:191;a:3:{i:0;s:5:"cdata";i:1;a:1:{i:0;s:1:" ";}i:2;i:3379;}i:192;a:3:{i:0;s:9:"linebreak";i:1;a:0:{}i:2;i:3380;}i:193;a:3:{i:0;s:5:"cdata";i:1;a:1:{i:0;s:1:"
";}i:2;i:3382;}i:194;a:3:{i:0;s:6:"plugin";i:1;a:4:{i:0;s:11:"htmlcomment";i:1;a:2:{i:0;i:5;i:1;s:7:" [[|]] ";}i:2;i:5;i:3;s:14:"<!-- [[|]] -->";}i:2;i:3383;}i:195;a:3:{i:0;s:7:"p_close";i:1;a:0:{}i:2;i:3397;}i:196;a:2:{i:0;s:6:"plugin";i:1;a:4:{i:0;s:7:"uparrow";i:1;a:1:{i:0;s:42:"lib/plugins/uparrow/images/tango-small.png";}i:2;i:1;i:3;s:6:"~~UP~~";}}i:197;a:3:{i:0;s:13:"section_close";i:1;a:0:{}i:2;i:3399;}i:198;a:3:{i:0;s:12:"section_edit";i:1;a:4:{i:0;i:3032;i:1;i:3398;i:2;i:2;i:3;s:16:"Google Tech Talk";}i:2;i:3399;}i:199;a:3:{i:0;s:6:"header";i:1;a:3:{i:0;s:14:"Authors@Google";i:1;i:2;i:2;i:3399;}i:2;i:3399;}i:200;a:3:{i:0;s:12:"section_open";i:1;a:1:{i:0;i:2;}i:2;i:3399;}i:201;a:3:{i:0;s:6:"p_open";i:1;a:0:{}i:2;i:3425;}i:202;a:3:{i:0;s:5:"cdata";i:1;a:1:{i:0;s:1:"
";}i:2;i:3426;}i:203;a:3:{i:0;s:12:"externallink";i:1;a:2:{i:0;s:42:"http://www.youtube.com/watch?v=DZ2vtQCESpk";i:1;s:13:"Garr Reynolds";}i:2;i:3427;}i:204;a:3:{i:0;s:5:"cdata";i:1;a:1:{i:0;s:1:" ";}i:2;i:3487;}i:205;a:3:{i:0;s:9:"linebreak";i:1;a:0:{}i:2;i:3488;}i:206;a:3:{i:0;s:5:"cdata";i:1;a:1:{i:0;s:1:"
";}i:2;i:3490;}i:207;a:3:{i:0;s:6:"plugin";i:1;a:4:{i:0;s:11:"htmlcomment";i:1;a:2:{i:0;i:5;i:1;s:7:" [[|]] ";}i:2;i:5;i:3;s:14:"<!-- [[|]] -->";}i:2;i:3491;}i:208;a:3:{i:0;s:7:"p_close";i:1;a:0:{}i:2;i:3505;}i:209;a:2:{i:0;s:6:"plugin";i:1;a:4:{i:0;s:7:"uparrow";i:1;a:1:{i:0;s:42:"lib/plugins/uparrow/images/tango-small.png";}i:2;i:1;i:3;s:6:"~~UP~~";}}i:210;a:3:{i:0;s:13:"section_close";i:1;a:0:{}i:2;i:3507;}i:211;a:3:{i:0;s:12:"section_edit";i:1;a:4:{i:0;i:3399;i:1;i:3506;i:2;i:2;i:3;s:14:"Authors@Google";}i:2;i:3507;}i:212;a:3:{i:0;s:6:"header";i:1;a:3:{i:0;s:21:"Google Speaker Series";i:1;i:2;i:2;i:3507;}i:2;i:3507;}i:213;a:3:{i:0;s:12:"section_open";i:1;a:1:{i:0;i:2;}i:2;i:3507;}i:214;a:3:{i:0;s:6:"p_open";i:1;a:0:{}i:2;i:3540;}i:215;a:3:{i:0;s:5:"cdata";i:1;a:1:{i:0;s:1:"
";}i:2;i:3541;}i:216;a:3:{i:0;s:12:"externallink";i:1;a:2:{i:0;s:60:"http://video.google.com/videoplay?docid=-3478907067117491758";i:1;s:37:"Bjarne Stroustrup, C++0x: An Overview";}i:2;i:3542;}i:217;a:3:{i:0;s:5:"cdata";i:1;a:1:{i:0;s:1:" ";}i:2;i:3644;}i:218;a:3:{i:0;s:9:"linebreak";i:1;a:0:{}i:2;i:3645;}i:219;a:3:{i:0;s:7:"p_close";i:1;a:0:{}i:2;i:3647;}i:220;a:2:{i:0;s:6:"plugin";i:1;a:4:{i:0;s:7:"uparrow";i:1;a:1:{i:0;s:42:"lib/plugins/uparrow/images/tango-small.png";}i:2;i:1;i:3;s:6:"~~UP~~";}}i:221;a:3:{i:0;s:13:"section_close";i:1;a:0:{}i:2;i:3649;}i:222;a:3:{i:0;s:12:"section_edit";i:1;a:4:{i:0;i:3507;i:1;i:3648;i:2;i:2;i:3;s:21:"Google Speaker Series";}i:2;i:3649;}i:223;a:3:{i:0;s:6:"header";i:1;a:3:{i:0;s:26:"TED: Ideas Worth Spreading";i:1;i:2;i:2;i:3649;}i:2;i:3649;}i:224;a:3:{i:0;s:12:"section_open";i:1;a:1:{i:0;i:2;}i:2;i:3649;}i:225;a:3:{i:0;s:6:"p_open";i:1;a:0:{}i:2;i:3687;}i:226;a:3:{i:0;s:5:"cdata";i:1;a:1:{i:0;s:1:"
";}i:2;i:3688;}i:227;a:3:{i:0;s:12:"externallink";i:1;a:2:{i:0;s:59:"http://www.ted.com/talks/mark_roth_suspended_animation.html";i:1;s:50:"Mark Roth: Suspended animation is within our grasp";}i:2;i:3689;}i:228;a:3:{i:0;s:5:"cdata";i:1;a:1:{i:0;s:1:" ";}i:2;i:3803;}i:229;a:3:{i:0;s:9:"linebreak";i:1;a:0:{}i:2;i:3804;}i:230;a:3:{i:0;s:5:"cdata";i:1;a:1:{i:0;s:1:"
";}i:2;i:3806;}i:231;a:3:{i:0;s:12:"externallink";i:1;a:2:{i:0;s:72:"http://www.ted.com/talks/bobby_mcferrin_hacks_your_brain_with_music.html";i:1;s:42:"Bobby McFerrin hacks your brain with music";}i:2;i:3807;}i:232;a:3:{i:0;s:5:"cdata";i:1;a:1:{i:0;s:1:" ";}i:2;i:3926;}i:233;a:3:{i:0;s:9:"linebreak";i:1;a:0:{}i:2;i:3927;}i:234;a:3:{i:0;s:5:"cdata";i:1;a:1:{i:0;s:1:"
";}i:2;i:3929;}i:235;a:3:{i:0;s:6:"plugin";i:1;a:4:{i:0;s:11:"htmlcomment";i:1;a:2:{i:0;i:5;i:1;s:7:" [[|]] ";}i:2;i:5;i:3;s:14:"<!-- [[|]] -->";}i:2;i:3930;}i:236;a:3:{i:0;s:7:"p_close";i:1;a:0:{}i:2;i:3944;}i:237;a:2:{i:0;s:6:"plugin";i:1;a:4:{i:0;s:7:"uparrow";i:1;a:1:{i:0;s:42:"lib/plugins/uparrow/images/tango-small.png";}i:2;i:1;i:3;s:6:"~~UP~~";}}i:238;a:3:{i:0;s:13:"section_close";i:1;a:0:{}i:2;i:3947;}i:239;a:3:{i:0;s:12:"section_edit";i:1;a:4:{i:0;i:3649;i:1;i:3946;i:2;i:2;i:3;s:26:"TED: Ideas Worth Spreading";}i:2;i:3947;}i:240;a:3:{i:0;s:6:"header";i:1;a:3:{i:0;s:5:"Music";i:1;i:2;i:2;i:3947;}i:2;i:3947;}i:241;a:3:{i:0;s:12:"section_open";i:1;a:1:{i:0;i:2;}i:2;i:3947;}i:242;a:3:{i:0;s:6:"p_open";i:1;a:0:{}i:2;i:3964;}i:243;a:3:{i:0;s:5:"cdata";i:1;a:1:{i:0;s:1:"
";}i:2;i:3965;}i:244;a:3:{i:0;s:12:"externallink";i:1;a:2:{i:0;s:53:"http://www.gearwire.com/korg-kaossilatorpro-demo.html";i:1;s:20:"Korg Kaossilator Pro";}i:2;i:3966;}i:245;a:3:{i:0;s:5:"cdata";i:1;a:1:{i:0;s:1:" ";}i:2;i:4044;}i:246;a:3:{i:0;s:9:"linebreak";i:1;a:0:{}i:2;i:4045;}i:247;a:3:{i:0;s:5:"cdata";i:1;a:1:{i:0;s:1:"
";}i:2;i:4047;}i:248;a:3:{i:0;s:12:"externallink";i:1;a:2:{i:0;s:42:"http://www.youtube.com/watch?v=98ew0VtHmik";i:1;s:36:"Super Mario Castle Theme Death Metal";}i:2;i:4048;}i:249;a:3:{i:0;s:5:"cdata";i:1;a:1:{i:0;s:1:" ";}i:2;i:4131;}i:250;a:3:{i:0;s:9:"linebreak";i:1;a:0:{}i:2;i:4132;}i:251;a:3:{i:0;s:5:"cdata";i:1;a:1:{i:0;s:1:"
";}i:2;i:4134;}i:252;a:3:{i:0;s:12:"externallink";i:1;a:2:{i:0;s:42:"http://www.youtube.com/watch?v=9UagxOZ-DDQ";i:1;s:55:"Learning How To Play Guitar Well Enough To Get You Laid";}i:2;i:4135;}i:253;a:3:{i:0;s:5:"cdata";i:1;a:1:{i:0;s:1:" ";}i:2;i:4237;}i:254;a:3:{i:0;s:9:"linebreak";i:1;a:0:{}i:2;i:4238;}i:255;a:3:{i:0;s:5:"cdata";i:1;a:1:{i:0;s:1:"
";}i:2;i:4240;}i:256;a:3:{i:0;s:6:"plugin";i:1;a:4:{i:0;s:11:"htmlcomment";i:1;a:2:{i:0;i:5;i:1;s:7:" [[|]] ";}i:2;i:5;i:3;s:14:"<!-- [[|]] -->";}i:2;i:4241;}i:257;a:3:{i:0;s:7:"p_close";i:1;a:0:{}i:2;i:4255;}i:258;a:2:{i:0;s:6:"plugin";i:1;a:4:{i:0;s:7:"uparrow";i:1;a:1:{i:0;s:42:"lib/plugins/uparrow/images/tango-small.png";}i:2;i:1;i:3;s:6:"~~UP~~";}}i:259;a:3:{i:0;s:13:"section_close";i:1;a:0:{}i:2;i:4257;}i:260;a:3:{i:0;s:12:"section_edit";i:1;a:4:{i:0;i:3947;i:1;i:4256;i:2;i:2;i:3;s:5:"Music";}i:2;i:4257;}i:261;a:3:{i:0;s:6:"header";i:1;a:3:{i:0;s:5:"Funny";i:1;i:2;i:2;i:4257;}i:2;i:4257;}i:262;a:3:{i:0;s:12:"section_open";i:1;a:1:{i:0;i:2;}i:2;i:4257;}i:263;a:3:{i:0;s:6:"p_open";i:1;a:0:{}i:2;i:4274;}i:264;a:3:{i:0;s:5:"cdata";i:1;a:1:{i:0;s:1:"
";}i:2;i:4275;}i:265;a:3:{i:0;s:12:"externallink";i:1;a:2:{i:0;s:42:"http://www.youtube.com/watch?v=Ghgg_fukbvU";i:1;s:12:"Kung Fu Bear";}i:2;i:4276;}i:266;a:3:{i:0;s:5:"cdata";i:1;a:1:{i:0;s:1:" ";}i:2;i:4335;}i:267;a:3:{i:0;s:6:"plugin";i:1;a:4:{i:0;s:5:"skill";i:1;a:2:{i:0;s:1:"3";i:1;s:1:"5";}i:2;i:5;i:3;s:13:"{{skill>3/5}}";}i:2;i:4336;}i:268;a:3:{i:0;s:5:"cdata";i:1;a:1:{i:0;s:1:" ";}i:2;i:4349;}i:269;a:3:{i:0;s:9:"linebreak";i:1;a:0:{}i:2;i:4350;}i:270;a:3:{i:0;s:7:"p_close";i:1;a:0:{}i:2;i:4352;}i:271;a:3:{i:0;s:6:"plugin";i:1;a:4:{i:0;s:7:"tag_tag";i:1;a:1:{i:0;s:5:"links";}i:2;i:5;i:3;s:13:"{{tag>links}}";}i:2;i:4354;}i:272;a:2:{i:0;s:6:"plugin";i:1;a:4:{i:0;s:7:"uparrow";i:1;a:1:{i:0;s:42:"lib/plugins/uparrow/images/tango-small.png";}i:2;i:1;i:3;s:6:"~~UP~~";}}i:273;a:3:{i:0;s:13:"section_close";i:1;a:0:{}i:2;i:4367;}i:274;a:3:{i:0;s:12:"section_edit";i:1;a:4:{i:0;i:4257;i:1;i:0;i:2;i:2;i:3;s:5:"Funny";}i:2;i:4367;}i:275;a:3:{i:0;s:12:"document_end";i:1;a:0:{}i:2;i:4367;}}