a:179:{i:0;a:3:{i:0;s:14:"document_start";i:1;a:0:{}i:2;i:0;}i:1;a:3:{i:0;s:6:"p_open";i:1;a:0:{}i:2;i:0;}i:2;a:3:{i:0;s:7:"p_close";i:1;a:0:{}i:2;i:1;}i:3;a:3:{i:0;s:12:"section_edit";i:1;a:4:{i:0;i:-1;i:1;i:0;i:2;i:1;i:3;s:0:"";}i:2;i:1;}i:4;a:3:{i:0;s:6:"header";i:1;a:3:{i:0;s:3:"Vim";i:1;i:1;i:2;i:1;}i:2;i:1;}i:5;a:3:{i:0;s:12:"section_open";i:1;a:1:{i:0;i:1;}i:2;i:1;}i:6;a:3:{i:0;s:6:"p_open";i:1;a:0:{}i:2;i:18;}i:7;a:3:{i:0;s:5:"cdata";i:1;a:1:{i:0;s:1:"
";}i:2;i:19;}i:8;a:3:{i:0;s:13:"interwikilink";i:1;a:4:{i:0;s:6:"wp>Vim";i:1;N;i:2;s:2:"wp";i:3;s:3:"Vim";}i:2;i:20;}i:9;a:3:{i:0;s:5:"cdata";i:1;a:1:{i:0;s:128:" is an wonderful editor. You have to spent some time to get used to this, but since then you will gain much more in produtivity.";}i:2;i:30;}i:10;a:3:{i:0;s:7:"p_close";i:1;a:0:{}i:2;i:158;}i:11;a:3:{i:0;s:6:"p_open";i:1;a:0:{}i:2;i:158;}i:12;a:3:{i:0;s:5:"cdata";i:1;a:1:{i:0;s:9:"See also ";}i:2;i:160;}i:13;a:3:{i:0;s:12:"externallink";i:1;a:2:{i:0;s:60:"http://www.inf.ufrgs.br/~kssilveira/vim_quick_reference.html";i:1;s:19:"Vim Quick Reference";}i:2;i:169;}i:14;a:3:{i:0;s:5:"cdata";i:1;a:1:{i:0;s:1:" ";}i:2;i:253;}i:15;a:3:{i:0;s:9:"linebreak";i:1;a:0:{}i:2;i:254;}i:16;a:3:{i:0;s:7:"p_close";i:1;a:0:{}i:2;i:256;}i:17;a:2:{i:0;s:6:"plugin";i:1;a:4:{i:0;s:7:"uparrow";i:1;a:1:{i:0;s:42:"lib/plugins/uparrow/images/tango-small.png";}i:2;i:1;i:3;s:6:"~~UP~~";}}i:18;a:3:{i:0;s:13:"section_close";i:1;a:0:{}i:2;i:259;}i:19;a:3:{i:0;s:12:"section_edit";i:1;a:4:{i:0;i:1;i:1;i:258;i:2;i:1;i:3;s:3:"Vim";}i:2;i:259;}i:20;a:3:{i:0;s:6:"header";i:1;a:3:{i:0;s:31:"How to change vim configuration";i:1;i:2;i:2;i:259;}i:2;i:259;}i:21;a:3:{i:0;s:12:"section_open";i:1;a:1:{i:0;i:2;}i:2;i:259;}i:22;a:3:{i:0;s:6:"p_open";i:1;a:0:{}i:2;i:302;}i:23;a:3:{i:0;s:5:"cdata";i:1;a:1:{i:0;s:226:"
The file ~/.vimrc is read and executed every time you open vim. So if you want that a configuration change (like set number) to be true the next time you open vim, you must append it to the ~/.vimrc. Here is an example code: ";}i:2;i:303;}i:24;a:3:{i:0;s:7:"p_close";i:1;a:0:{}i:2;i:529;}i:25;a:3:{i:0;s:4:"code";i:1;a:3:{i:0;s:54:"
# append to ~/.vimrc
$ echo 'set number' >> ~/.vimrc
";i:1;s:4:"bash";i:2;N;}i:2;i:536;}i:26;a:2:{i:0;s:6:"plugin";i:1;a:4:{i:0;s:7:"uparrow";i:1;a:1:{i:0;s:42:"lib/plugins/uparrow/images/tango-small.png";}i:2;i:1;i:3;s:6:"~~UP~~";}}i:27;a:3:{i:0;s:13:"section_close";i:1;a:0:{}i:2;i:605;}i:28;a:3:{i:0;s:12:"section_edit";i:1;a:4:{i:0;i:259;i:1;i:604;i:2;i:2;i:3;s:31:"How to change vim configuration";}i:2;i:605;}i:29;a:3:{i:0;s:6:"header";i:1;a:3:{i:0;s:25:"Useful Vim Configurations";i:1;i:2;i:2;i:605;}i:2;i:605;}i:30;a:3:{i:0;s:12:"section_open";i:1;a:1:{i:0;i:2;}i:2;i:605;}i:31;a:3:{i:0;s:6:"p_open";i:1;a:0:{}i:2;i:642;}i:32;a:3:{i:0;s:5:"cdata";i:1;a:1:{i:0;s:13:"
Download my ";}i:2;i:643;}i:33;a:3:{i:0;s:12:"externallink";i:1;a:2:{i:0;s:42:"http://www.inf.ufrgs.br/~kssilveira/.vimrc";i:1;s:6:".vimrc";}i:2;i:656;}i:34;a:3:{i:0;s:5:"cdata";i:1;a:1:{i:0;s:27:" file and do the following:";}i:2;i:709;}i:35;a:3:{i:0;s:7:"p_close";i:1;a:0:{}i:2;i:736;}i:36;a:3:{i:0;s:4:"code";i:1;a:3:{i:0;s:84:"
# append to ~/.vimrc
$ echo ':source path/to/my/vimrc/file/on/your/pc' >> ~/.vimrc
";i:1;s:4:"bash";i:2;N;}i:2;i:743;}i:37;a:3:{i:0;s:6:"p_open";i:1;a:0:{}i:2;i:840;}i:38;a:3:{i:0;s:5:"cdata";i:1;a:1:{i:0;s:49:"This loads my .vimrc file everytime you open Vim.";}i:2;i:842;}i:39;a:3:{i:0;s:7:"p_close";i:1;a:0:{}i:2;i:891;}i:40;a:3:{i:0;s:6:"p_open";i:1;a:0:{}i:2;i:891;}i:41;a:3:{i:0;s:5:"cdata";i:1;a:1:{i:0;s:41:"These are the extra configurations I use:";}i:2;i:893;}i:42;a:3:{i:0;s:7:"p_close";i:1;a:0:{}i:2;i:934;}i:43;a:3:{i:0;s:4:"file";i:1;a:3:{i:0;s:698:"
" show line numbers
set number 
" incremental search
set incsearch
" auto indentation
set autoindent
" tab size
set tabstop=2
" indentation size (used on auto indentation)
set shiftwidth=2
" smart indentation (indent beginning of blocks (e.g. '{') and unnindent ending of blocks (e.g. '}'))
set smartindent
" save with Ctrl+S
	map! <C-s> <Esc>:w<CR>
	map  <C-s> <Esc>:w<CR>
" call make with F9
	map! <F9> <Esc>:make<CR><CR>
	map  <F9> <Esc>:make<CR><CR>
" auto save files
set autowrite
set autowriteall
" abreviations
	iab #i #include
	iab #d #define
" reload file automatically when it changes
set autoread
" call make -B with F8
	map! <F8> <Esc>:make -B<CR><CR>
	map  <F8> <Esc>:make -B<CR><CR>
";i:1;s:3:"vim";i:2;s:6:".vimrc";}i:2;i:941;}i:44;a:3:{i:0;s:6:"p_open";i:1;a:0:{}i:2;i:1658;}i:45;a:3:{i:0;s:5:"cdata";i:1;a:1:{i:0;s:93:"If the save with Ctrl+S isn't working, maybe you have to change your bash configuration (see ";}i:2;i:1660;}i:46;a:3:{i:0;s:12:"internallink";i:1;a:2:{i:0;s:9:"Main:Bash";i:1;N;}i:2;i:1753;}i:47;a:3:{i:0;s:5:"cdata";i:1;a:1:{i:0;s:2:").";}i:2;i:1766;}i:48;a:3:{i:0;s:7:"p_close";i:1;a:0:{}i:2;i:1768;}i:49;a:2:{i:0;s:6:"plugin";i:1;a:4:{i:0;s:7:"uparrow";i:1;a:1:{i:0;s:42:"lib/plugins/uparrow/images/tango-small.png";}i:2;i:1;i:3;s:6:"~~UP~~";}}i:50;a:3:{i:0;s:13:"section_close";i:1;a:0:{}i:2;i:1770;}i:51;a:3:{i:0;s:12:"section_edit";i:1;a:4:{i:0;i:605;i:1;i:1769;i:2;i:2;i:3;s:25:"Useful Vim Configurations";}i:2;i:1770;}i:52;a:3:{i:0;s:6:"header";i:1;a:3:{i:0;s:8:"Commands";i:1;i:2;i:2;i:1770;}i:2;i:1770;}i:53;a:3:{i:0;s:12:"section_open";i:1;a:1:{i:0;i:2;}i:2;i:1770;}i:54;a:3:{i:0;s:6:"p_open";i:1;a:0:{}i:2;i:1790;}i:55;a:3:{i:0;s:5:"cdata";i:1;a:1:{i:0;s:1:"
";}i:2;i:1791;}i:56;a:3:{i:0;s:12:"internallink";i:1;a:2:{i:0;s:13:"vim::commands";i:1;s:12:"Vim Commands";}i:2;i:1792;}i:57;a:3:{i:0;s:7:"p_close";i:1;a:0:{}i:2;i:1822;}i:58;a:2:{i:0;s:6:"plugin";i:1;a:4:{i:0;s:7:"uparrow";i:1;a:1:{i:0;s:42:"lib/plugins/uparrow/images/tango-small.png";}i:2;i:1;i:3;s:6:"~~UP~~";}}i:59;a:3:{i:0;s:13:"section_close";i:1;a:0:{}i:2;i:1824;}i:60;a:3:{i:0;s:12:"section_edit";i:1;a:4:{i:0;i:1770;i:1;i:1823;i:2;i:2;i:3;s:8:"Commands";}i:2;i:1824;}i:61;a:3:{i:0;s:6:"header";i:1;a:3:{i:0;s:26:"Edit-Compile-Execute Cycle";i:1;i:2;i:2;i:1824;}i:2;i:1824;}i:62;a:3:{i:0;s:12:"section_open";i:1;a:1:{i:0;i:2;}i:2;i:1824;}i:63;a:3:{i:0;s:10:"table_open";i:1;a:2:{i:0;i:2;i:1;i:14;}i:2;i:1862;}i:64;a:3:{i:0;s:13:"tablerow_open";i:1;a:0:{}i:2;i:1862;}i:65;a:3:{i:0;s:16:"tableheader_open";i:1;a:3:{i:0;i:2;i:1;s:4:"left";i:2;i:1;}i:2;i:1862;}i:66;a:3:{i:0;s:5:"cdata";i:1;a:1:{i:0;s:10:" Session  ";}i:2;i:1864;}i:67;a:3:{i:0;s:17:"tableheader_close";i:1;a:0:{}i:2;i:1874;}i:68;a:3:{i:0;s:14:"tablerow_close";i:1;a:0:{}i:2;i:1876;}i:69;a:3:{i:0;s:13:"tablerow_open";i:1;a:0:{}i:2;i:1876;}i:70;a:3:{i:0;s:14:"tablecell_open";i:1;a:3:{i:0;i:1;i:1;N;i:2;i:1;}i:2;i:1876;}i:71;a:3:{i:0;s:5:"cdata";i:1;a:1:{i:0;s:14:" :mks(ession) ";}i:2;i:1878;}i:72;a:3:{i:0;s:15:"tablecell_close";i:1;a:0:{}i:2;i:1892;}i:73;a:3:{i:0;s:14:"tablecell_open";i:1;a:3:{i:0;i:1;i:1;N;i:2;i:1;}i:2;i:1892;}i:74;a:3:{i:0;s:5:"cdata";i:1;a:1:{i:0;s:23:" create a session file ";}i:2;i:1893;}i:75;a:3:{i:0;s:15:"tablecell_close";i:1;a:0:{}i:2;i:1916;}i:76;a:3:{i:0;s:14:"tablerow_close";i:1;a:0:{}i:2;i:1917;}i:77;a:3:{i:0;s:13:"tablerow_open";i:1;a:0:{}i:2;i:1917;}i:78;a:3:{i:0;s:14:"tablecell_open";i:1;a:3:{i:0;i:1;i:1;N;i:2;i:1;}i:2;i:1917;}i:79;a:3:{i:0;s:5:"cdata";i:1;a:1:{i:0;s:8:" vim -S ";}i:2;i:1919;}i:80;a:3:{i:0;s:15:"tablecell_close";i:1;a:0:{}i:2;i:1927;}i:81;a:3:{i:0;s:14:"tablecell_open";i:1;a:3:{i:0;i:1;i:1;N;i:2;i:1;}i:2;i:1927;}i:82;a:3:{i:0;s:5:"cdata";i:1;a:1:{i:0;s:21:" load a session file ";}i:2;i:1928;}i:83;a:3:{i:0;s:15:"tablecell_close";i:1;a:0:{}i:2;i:1949;}i:84;a:3:{i:0;s:14:"tablerow_close";i:1;a:0:{}i:2;i:1950;}i:85;a:3:{i:0;s:13:"tablerow_open";i:1;a:0:{}i:2;i:1950;}i:86;a:3:{i:0;s:16:"tableheader_open";i:1;a:3:{i:0;i:2;i:1;s:4:"left";i:2;i:1;}i:2;i:1950;}i:87;a:3:{i:0;s:5:"cdata";i:1;a:1:{i:0;s:7:" Make  ";}i:2;i:1952;}i:88;a:3:{i:0;s:17:"tableheader_close";i:1;a:0:{}i:2;i:1959;}i:89;a:3:{i:0;s:14:"tablerow_close";i:1;a:0:{}i:2;i:1961;}i:90;a:3:{i:0;s:13:"tablerow_open";i:1;a:0:{}i:2;i:1961;}i:91;a:3:{i:0;s:14:"tablecell_open";i:1;a:3:{i:0;i:1;i:1;N;i:2;i:1;}i:2;i:1961;}i:92;a:3:{i:0;s:5:"cdata";i:1;a:1:{i:0;s:9:" :mak(e) ";}i:2;i:1963;}i:93;a:3:{i:0;s:15:"tablecell_close";i:1;a:0:{}i:2;i:1972;}i:94;a:3:{i:0;s:14:"tablecell_open";i:1;a:3:{i:0;i:1;i:1;N;i:2;i:1;}i:2;i:1972;}i:95;a:3:{i:0;s:5:"cdata";i:1;a:1:{i:0;s:10:" run make ";}i:2;i:1973;}i:96;a:3:{i:0;s:15:"tablecell_close";i:1;a:0:{}i:2;i:1983;}i:97;a:3:{i:0;s:14:"tablerow_close";i:1;a:0:{}i:2;i:1984;}i:98;a:3:{i:0;s:13:"tablerow_open";i:1;a:0:{}i:2;i:1984;}i:99;a:3:{i:0;s:14:"tablecell_open";i:1;a:3:{i:0;i:1;i:1;N;i:2;i:1;}i:2;i:1984;}i:100;a:3:{i:0;s:5:"cdata";i:1;a:1:{i:0;s:10:" :cl(ist) ";}i:2;i:1986;}i:101;a:3:{i:0;s:15:"tablecell_close";i:1;a:0:{}i:2;i:1996;}i:102;a:3:{i:0;s:14:"tablecell_open";i:1;a:3:{i:0;i:1;i:1;N;i:2;i:1;}i:2;i:1996;}i:103;a:3:{i:0;s:5:"cdata";i:1;a:1:{i:0;s:18:" show make output ";}i:2;i:1997;}i:104;a:3:{i:0;s:15:"tablecell_close";i:1;a:0:{}i:2;i:2015;}i:105;a:3:{i:0;s:14:"tablerow_close";i:1;a:0:{}i:2;i:2016;}i:106;a:3:{i:0;s:13:"tablerow_open";i:1;a:0:{}i:2;i:2016;}i:107;a:3:{i:0;s:14:"tablecell_open";i:1;a:3:{i:0;i:1;i:1;N;i:2;i:1;}i:2;i:2016;}i:108;a:3:{i:0;s:5:"cdata";i:1;a:1:{i:0;s:10:" :cope(n) ";}i:2;i:2018;}i:109;a:3:{i:0;s:15:"tablecell_close";i:1;a:0:{}i:2;i:2028;}i:110;a:3:{i:0;s:14:"tablecell_open";i:1;a:3:{i:0;i:1;i:1;N;i:2;i:1;}i:2;i:2028;}i:111;a:3:{i:0;s:5:"cdata";i:1;a:1:{i:0;s:32:" open a window with make output ";}i:2;i:2029;}i:112;a:3:{i:0;s:15:"tablecell_close";i:1;a:0:{}i:2;i:2061;}i:113;a:3:{i:0;s:14:"tablerow_close";i:1;a:0:{}i:2;i:2062;}i:114;a:3:{i:0;s:13:"tablerow_open";i:1;a:0:{}i:2;i:2062;}i:115;a:3:{i:0;s:14:"tablecell_open";i:1;a:3:{i:0;i:1;i:1;N;i:2;i:1;}i:2;i:2062;}i:116;a:3:{i:0;s:5:"cdata";i:1;a:1:{i:0;s:10:" :cn(ext) ";}i:2;i:2064;}i:117;a:3:{i:0;s:15:"tablecell_close";i:1;a:0:{}i:2;i:2074;}i:118;a:3:{i:0;s:14:"tablecell_open";i:1;a:3:{i:0;i:1;i:1;N;i:2;i:1;}i:2;i:2074;}i:119;a:3:{i:0;s:5:"cdata";i:1;a:1:{i:0;s:18:" go to next error ";}i:2;i:2075;}i:120;a:3:{i:0;s:15:"tablecell_close";i:1;a:0:{}i:2;i:2093;}i:121;a:3:{i:0;s:14:"tablerow_close";i:1;a:0:{}i:2;i:2094;}i:122;a:3:{i:0;s:13:"tablerow_open";i:1;a:0:{}i:2;i:2094;}i:123;a:3:{i:0;s:14:"tablecell_open";i:1;a:3:{i:0;i:1;i:1;N;i:2;i:1;}i:2;i:2094;}i:124;a:3:{i:0;s:5:"cdata";i:1;a:1:{i:0;s:14:" :cp(revious) ";}i:2;i:2096;}i:125;a:3:{i:0;s:15:"tablecell_close";i:1;a:0:{}i:2;i:2110;}i:126;a:3:{i:0;s:14:"tablecell_open";i:1;a:3:{i:0;i:1;i:1;N;i:2;i:1;}i:2;i:2110;}i:127;a:3:{i:0;s:5:"cdata";i:1;a:1:{i:0;s:22:" go to previous error ";}i:2;i:2111;}i:128;a:3:{i:0;s:15:"tablecell_close";i:1;a:0:{}i:2;i:2133;}i:129;a:3:{i:0;s:14:"tablerow_close";i:1;a:0:{}i:2;i:2134;}i:130;a:3:{i:0;s:13:"tablerow_open";i:1;a:0:{}i:2;i:2134;}i:131;a:3:{i:0;s:14:"tablecell_open";i:1;a:3:{i:0;i:1;i:1;N;i:2;i:1;}i:2;i:2134;}i:132;a:3:{i:0;s:5:"cdata";i:1;a:1:{i:0;s:5:" :cc ";}i:2;i:2136;}i:133;a:3:{i:0;s:15:"tablecell_close";i:1;a:0:{}i:2;i:2141;}i:134;a:3:{i:0;s:14:"tablecell_open";i:1;a:3:{i:0;i:1;i:1;N;i:2;i:1;}i:2;i:2141;}i:135;a:3:{i:0;s:5:"cdata";i:1;a:1:{i:0;s:21:" go to current error ";}i:2;i:2142;}i:136;a:3:{i:0;s:15:"tablecell_close";i:1;a:0:{}i:2;i:2163;}i:137;a:3:{i:0;s:14:"tablerow_close";i:1;a:0:{}i:2;i:2164;}i:138;a:3:{i:0;s:13:"tablerow_open";i:1;a:0:{}i:2;i:2164;}i:139;a:3:{i:0;s:14:"tablecell_open";i:1;a:3:{i:0;i:1;i:1;N;i:2;i:1;}i:2;i:2164;}i:140;a:3:{i:0;s:5:"cdata";i:1;a:1:{i:0;s:11:" :ccl(ose) ";}i:2;i:2166;}i:141;a:3:{i:0;s:15:"tablecell_close";i:1;a:0:{}i:2;i:2177;}i:142;a:3:{i:0;s:14:"tablecell_open";i:1;a:3:{i:0;i:1;i:1;N;i:2;i:1;}i:2;i:2177;}i:143;a:3:{i:0;s:5:"cdata";i:1;a:1:{i:0;s:35:" close the window with make output ";}i:2;i:2178;}i:144;a:3:{i:0;s:15:"tablecell_close";i:1;a:0:{}i:2;i:2213;}i:145;a:3:{i:0;s:14:"tablerow_close";i:1;a:0:{}i:2;i:2214;}i:146;a:3:{i:0;s:13:"tablerow_open";i:1;a:0:{}i:2;i:2214;}i:147;a:3:{i:0;s:16:"tableheader_open";i:1;a:3:{i:0;i:2;i:1;s:4:"left";i:2;i:1;}i:2;i:2214;}i:148;a:3:{i:0;s:5:"cdata";i:1;a:1:{i:0;s:9:" Motion  ";}i:2;i:2216;}i:149;a:3:{i:0;s:17:"tableheader_close";i:1;a:0:{}i:2;i:2225;}i:150;a:3:{i:0;s:14:"tablerow_close";i:1;a:0:{}i:2;i:2227;}i:151;a:3:{i:0;s:13:"tablerow_open";i:1;a:0:{}i:2;i:2227;}i:152;a:3:{i:0;s:14:"tablecell_open";i:1;a:3:{i:0;i:1;i:1;N;i:2;i:1;}i:2;i:2227;}i:153;a:3:{i:0;s:5:"cdata";i:1;a:1:{i:0;s:8:" Ctrl+O ";}i:2;i:2229;}i:154;a:3:{i:0;s:15:"tablecell_close";i:1;a:0:{}i:2;i:2237;}i:155;a:3:{i:0;s:14:"tablecell_open";i:1;a:3:{i:0;i:1;i:1;N;i:2;i:1;}i:2;i:2237;}i:156;a:3:{i:0;s:5:"cdata";i:1;a:1:{i:0;s:24:" go to previous edition ";}i:2;i:2238;}i:157;a:3:{i:0;s:15:"tablecell_close";i:1;a:0:{}i:2;i:2262;}i:158;a:3:{i:0;s:14:"tablerow_close";i:1;a:0:{}i:2;i:2263;}i:159;a:3:{i:0;s:13:"tablerow_open";i:1;a:0:{}i:2;i:2263;}i:160;a:3:{i:0;s:14:"tablecell_open";i:1;a:3:{i:0;i:1;i:1;N;i:2;i:1;}i:2;i:2263;}i:161;a:3:{i:0;s:5:"cdata";i:1;a:1:{i:0;s:8:" Ctrl+I ";}i:2;i:2265;}i:162;a:3:{i:0;s:15:"tablecell_close";i:1;a:0:{}i:2;i:2273;}i:163;a:3:{i:0;s:14:"tablecell_open";i:1;a:3:{i:0;i:1;i:1;N;i:2;i:1;}i:2;i:2273;}i:164;a:3:{i:0;s:5:"cdata";i:1;a:1:{i:0;s:20:" go to next edition ";}i:2;i:2274;}i:165;a:3:{i:0;s:15:"tablecell_close";i:1;a:0:{}i:2;i:2294;}i:166;a:3:{i:0;s:14:"tablerow_close";i:1;a:0:{}i:2;i:2295;}i:167;a:3:{i:0;s:11:"table_close";i:1;a:0:{}i:2;i:2295;}i:168;a:2:{i:0;s:6:"plugin";i:1;a:4:{i:0;s:7:"uparrow";i:1;a:1:{i:0;s:42:"lib/plugins/uparrow/images/tango-small.png";}i:2;i:1;i:3;s:6:"~~UP~~";}}i:169;a:3:{i:0;s:13:"section_close";i:1;a:0:{}i:2;i:2297;}i:170;a:3:{i:0;s:12:"section_edit";i:1;a:4:{i:0;i:1824;i:1;i:2296;i:2;i:2;i:3;s:26:"Edit-Compile-Execute Cycle";}i:2;i:2297;}i:171;a:3:{i:0;s:6:"header";i:1;a:3:{i:0;s:41:"How to use visual bell instead of beeping";i:1;i:2;i:2;i:2297;}i:2;i:2297;}i:172;a:3:{i:0;s:12:"section_open";i:1;a:1:{i:0;i:2;}i:2;i:2297;}i:173;a:3:{i:0;s:4:"code";i:1;a:3:{i:0;s:17:"
:set visualbell
";i:1;s:3:"vim";i:2;N;}i:2;i:2357;}i:174;a:3:{i:0;s:6:"plugin";i:1;a:4:{i:0;s:7:"tag_tag";i:1;a:1:{i:0;s:11:"programming";}i:2;i:5;i:3;s:19:"{{tag>programming}}";}i:2;i:2388;}i:175;a:2:{i:0;s:6:"plugin";i:1;a:4:{i:0;s:7:"uparrow";i:1;a:1:{i:0;s:42:"lib/plugins/uparrow/images/tango-small.png";}i:2;i:1;i:3;s:6:"~~UP~~";}}i:176;a:3:{i:0;s:13:"section_close";i:1;a:0:{}i:2;i:2407;}i:177;a:3:{i:0;s:12:"section_edit";i:1;a:4:{i:0;i:2297;i:1;i:0;i:2;i:2;i:3;s:41:"How to use visual bell instead of beeping";}i:2;i:2407;}i:178;a:3:{i:0;s:12:"document_end";i:1;a:0:{}i:2;i:2407;}}