a:1045:{i:0;a:3:{i:0;s:14:"document_start";i:1;a:0:{}i:2;i:0;}i:1;a:3:{i:0;s:6:"p_open";i:1;a:0:{}i:2;i:0;}i:2;a:3:{i:0;s:6:"plugin";i:1;a:4:{i:0;s:2:"s5";i:1;a:0:{}i:2;i:5;i:3;s:13:"~~SLIDESHOW~~";}i:2;i:1;}i:3;a:3:{i:0;s:7:"p_close";i:1;a:0:{}i:2;i:14;}i:4;a:3:{i:0;s:6:"p_open";i:1;a:0:{}i:2;i:14;}i:5;a:3:{i:0;s:7:"p_close";i:1;a:0:{}i:2;i:16;}i:6;a:3:{i:0;s:12:"section_edit";i:1;a:4:{i:0;i:-1;i:1;i:15;i:2;i:1;i:3;s:0:"";}i:2;i:16;}i:7;a:3:{i:0;s:6:"header";i:1;a:3:{i:0;s:5:"Latex";i:1;i:1;i:2;i:16;}i:2;i:16;}i:8;a:3:{i:0;s:12:"section_open";i:1;a:1:{i:0;i:1;}i:2;i:16;}i:9;a:3:{i:0;s:6:"p_open";i:1;a:0:{}i:2;i:35;}i:10;a:3:{i:0;s:5:"cdata";i:1;a:1:{i:0;s:1:"
";}i:2;i:36;}i:11;a:3:{i:0;s:12:"externallink";i:1;a:2:{i:0;s:35:"http://www.inf.ufrgs.br/~kssilveira";i:1;s:24:"Kauê Soares da Silveira";}i:2;i:37;}i:12;a:3:{i:0;s:5:"cdata";i:1;a:1:{i:0;s:1:" ";}i:2;i:101;}i:13;a:3:{i:0;s:9:"linebreak";i:1;a:0:{}i:2;i:102;}i:14;a:3:{i:0;s:5:"cdata";i:1;a:1:{i:0;s:1:"
";}i:2;i:104;}i:15;a:3:{i:0;s:12:"externallink";i:1;a:2:{i:0;s:34:"http://www.inf.ufrgs.br/~ffbeltrao";i:1;s:27:"Fábio da Fontoura Beltrão";}i:2;i:105;}i:16;a:3:{i:0;s:5:"cdata";i:1;a:1:{i:0;s:1:" ";}i:2;i:171;}i:17;a:3:{i:0;s:9:"linebreak";i:1;a:0:{}i:2;i:172;}i:18;a:3:{i:0;s:7:"p_close";i:1;a:0:{}i:2;i:174;}i:19;a:3:{i:0;s:6:"p_open";i:1;a:0:{}i:2;i:174;}i:20;a:3:{i:0;s:5:"cdata";i:1;a:1:{i:0;s:40:"Universidade Federal Rio Grande do Sul  ";}i:2;i:176;}i:21;a:3:{i:0;s:9:"linebreak";i:1;a:0:{}i:2;i:216;}i:22;a:3:{i:0;s:5:"cdata";i:1;a:1:{i:0;s:28:"
Instituto de Informática  ";}i:2;i:218;}i:23;a:3:{i:0;s:9:"linebreak";i:1;a:0:{}i:2;i:246;}i:24;a:3:{i:0;s:5:"cdata";i:1;a:1:{i:0;s:25:"
Grupo PET Computação  ";}i:2;i:248;}i:25;a:3:{i:0;s:9:"linebreak";i:1;a:0:{}i:2;i:273;}i:26;a:3:{i:0;s:7:"p_close";i:1;a:0:{}i:2;i:275;}i:27;a:3:{i:0;s:6:"p_open";i:1;a:0:{}i:2;i:275;}i:28;a:3:{i:0;s:5:"cdata";i:1;a:1:{i:0;s:18:"25 de Maio de 2010";}i:2;i:277;}i:29;a:3:{i:0;s:7:"p_close";i:1;a:0:{}i:2;i:295;}i:30;a:3:{i:0;s:6:"p_open";i:1;a:0:{}i:2;i:295;}i:31;a:3:{i:0;s:6:"plugin";i:1;a:4:{i:0;s:11:"htmlcomment";i:1;a:2:{i:0;i:5;i:1;s:34:" testar tudo que está nos slides ";}i:2;i:5;i:3;s:41:"<!-- testar tudo que está nos slides -->";}i:2;i:297;}i:32;a:3:{i:0;s:5:"cdata";i:1;a:1:{i:0;s:1:"
";}i:2;i:338;}i:33;a:3:{i:0;s:6:"plugin";i:1;a:4:{i:0;s:11:"htmlcomment";i:1;a:2:{i:0;i:5;i:1;s:35:" mudar a data do exemplo para 2010 ";}i:2;i:5;i:3;s:42:"<!-- mudar a data do exemplo para 2010 -->";}i:2;i:339;}i:34;a:3:{i:0;s:7:"p_close";i:1;a:0:{}i:2;i:381;}i:35;a:2:{i:0;s:6:"plugin";i:1;a:4:{i:0;s:7:"uparrow";i:1;a:1:{i:0;s:42:"lib/plugins/uparrow/images/tango-small.png";}i:2;i:1;i:3;s:6:"~~UP~~";}}i:36;a:3:{i:0;s:13:"section_close";i:1;a:0:{}i:2;i:383;}i:37;a:3:{i:0;s:12:"section_edit";i:1;a:4:{i:0;i:16;i:1;i:382;i:2;i:1;i:3;s:5:"Latex";}i:2;i:383;}i:38;a:3:{i:0;s:6:"header";i:1;a:3:{i:0;s:3:"TeX";i:1;i:2;i:2;i:383;}i:2;i:383;}i:39;a:3:{i:0;s:12:"section_open";i:1;a:1:{i:0;i:2;}i:2;i:383;}i:40;a:3:{i:0;s:10:"listu_open";i:1;a:0:{}i:2;i:399;}i:41;a:3:{i:0;s:13:"listitem_open";i:1;a:1:{i:0;i:1;}i:2;i:399;}i:42;a:3:{i:0;s:16:"listcontent_open";i:1;a:0:{}i:2;i:399;}i:43;a:3:{i:0;s:5:"cdata";i:1;a:1:{i:0;s:32:" Criado por Donald Knuth em 1982";}i:2;i:403;}i:44;a:3:{i:0;s:17:"listcontent_close";i:1;a:0:{}i:2;i:435;}i:45;a:3:{i:0;s:14:"listitem_close";i:1;a:0:{}i:2;i:435;}i:46;a:3:{i:0;s:13:"listitem_open";i:1;a:1:{i:0;i:1;}i:2;i:435;}i:47;a:3:{i:0;s:16:"listcontent_open";i:1;a:0:{}i:2;i:435;}i:48;a:3:{i:0;s:5:"cdata";i:1;a:1:{i:0;s:106:" Voltado ao desenvolvimento de textos com alta qualidade tipográfica, e à escrita de textos matemáticos";}i:2;i:439;}i:49;a:3:{i:0;s:17:"listcontent_close";i:1;a:0:{}i:2;i:545;}i:50;a:3:{i:0;s:14:"listitem_close";i:1;a:0:{}i:2;i:545;}i:51;a:3:{i:0;s:13:"listitem_open";i:1;a:1:{i:0;i:1;}i:2;i:545;}i:52;a:3:{i:0;s:16:"listcontent_open";i:1;a:0:{}i:2;i:545;}i:53;a:3:{i:0;s:5:"cdata";i:1;a:1:{i:0;s:45:" A versão tende a pi. Atualmente é 3.141592";}i:2;i:549;}i:54;a:3:{i:0;s:17:"listcontent_close";i:1;a:0:{}i:2;i:594;}i:55;a:3:{i:0;s:14:"listitem_close";i:1;a:0:{}i:2;i:594;}i:56;a:3:{i:0;s:13:"listitem_open";i:1;a:1:{i:0;i:1;}i:2;i:594;}i:57;a:3:{i:0;s:16:"listcontent_open";i:1;a:0:{}i:2;i:594;}i:58;a:3:{i:0;s:5:"cdata";i:1;a:1:{i:0;s:18:" TeX se pronuncia ";}i:2;i:598;}i:59;a:3:{i:0;s:18:"doublequoteopening";i:1;a:0:{}i:2;i:616;}i:60;a:3:{i:0;s:5:"cdata";i:1;a:1:{i:0;s:4:"Tech";}i:2;i:617;}i:61;a:3:{i:0;s:18:"doublequoteclosing";i:1;a:0:{}i:2;i:621;}i:62;a:3:{i:0;s:17:"listcontent_close";i:1;a:0:{}i:2;i:622;}i:63;a:3:{i:0;s:14:"listitem_close";i:1;a:0:{}i:2;i:622;}i:64;a:3:{i:0;s:13:"listitem_open";i:1;a:1:{i:0;i:1;}i:2;i:622;}i:65;a:3:{i:0;s:16:"listcontent_open";i:1;a:0:{}i:2;i:622;}i:66;a:3:{i:0;s:5:"cdata";i:1;a:1:{i:0;s:61:" Requer controle da formatação, tornando o trabalho oneroso";}i:2;i:626;}i:67;a:3:{i:0;s:17:"listcontent_close";i:1;a:0:{}i:2;i:687;}i:68;a:3:{i:0;s:14:"listitem_close";i:1;a:0:{}i:2;i:687;}i:69;a:3:{i:0;s:11:"listu_close";i:1;a:0:{}i:2;i:687;}i:70;a:2:{i:0;s:6:"plugin";i:1;a:4:{i:0;s:7:"uparrow";i:1;a:1:{i:0;s:42:"lib/plugins/uparrow/images/tango-small.png";}i:2;i:1;i:3;s:6:"~~UP~~";}}i:71;a:3:{i:0;s:13:"section_close";i:1;a:0:{}i:2;i:689;}i:72;a:3:{i:0;s:12:"section_edit";i:1;a:4:{i:0;i:383;i:1;i:688;i:2;i:2;i:3;s:3:"TeX";}i:2;i:689;}i:73;a:3:{i:0;s:6:"header";i:1;a:3:{i:0;s:5:"LaTeX";i:1;i:2;i:2;i:689;}i:2;i:689;}i:74;a:3:{i:0;s:12:"section_open";i:1;a:1:{i:0;i:2;}i:2;i:689;}i:75;a:3:{i:0;s:10:"listu_open";i:1;a:0:{}i:2;i:707;}i:76;a:3:{i:0;s:13:"listitem_open";i:1;a:1:{i:0;i:1;}i:2;i:707;}i:77;a:3:{i:0;s:16:"listcontent_open";i:1;a:0:{}i:2;i:707;}i:78;a:3:{i:0;s:5:"cdata";i:1;a:1:{i:0;s:56:" Conjunto de macros para o TeX, automatizando o processo";}i:2;i:711;}i:79;a:3:{i:0;s:17:"listcontent_close";i:1;a:0:{}i:2;i:767;}i:80;a:3:{i:0;s:14:"listitem_close";i:1;a:0:{}i:2;i:767;}i:81;a:3:{i:0;s:13:"listitem_open";i:1;a:1:{i:0;i:1;}i:2;i:767;}i:82;a:3:{i:0;s:16:"listcontent_open";i:1;a:0:{}i:2;i:767;}i:83;a:3:{i:0;s:5:"cdata";i:1;a:1:{i:0;s:26:" Criado por Leslie Lamport";}i:2;i:771;}i:84;a:3:{i:0;s:17:"listcontent_close";i:1;a:0:{}i:2;i:797;}i:85;a:3:{i:0;s:14:"listitem_close";i:1;a:0:{}i:2;i:797;}i:86;a:3:{i:0;s:13:"listitem_open";i:1;a:1:{i:0;i:1;}i:2;i:797;}i:87;a:3:{i:0;s:16:"listcontent_open";i:1;a:0:{}i:2;i:797;}i:88;a:3:{i:0;s:5:"cdata";i:1;a:1:{i:0;s:70:" Contém um conjunto de layouts e classes para vários fins diferentes";}i:2;i:801;}i:89;a:3:{i:0;s:17:"listcontent_close";i:1;a:0:{}i:2;i:871;}i:90;a:3:{i:0;s:14:"listitem_close";i:1;a:0:{}i:2;i:871;}i:91;a:3:{i:0;s:13:"listitem_open";i:1;a:1:{i:0;i:1;}i:2;i:871;}i:92;a:3:{i:0;s:16:"listcontent_open";i:1;a:0:{}i:2;i:871;}i:93;a:3:{i:0;s:5:"cdata";i:1;a:1:{i:0;s:19:" Paradigma WYSIWYM ";}i:2;i:875;}i:94;a:3:{i:0;s:4:"nest";i:1;a:1:{i:0;a:3:{i:0;a:3:{i:0;s:13:"footnote_open";i:1;a:0:{}i:2;i:894;}i:1;a:3:{i:0;s:5:"cdata";i:1;a:1:{i:0;s:29:"What You See is What You Mean";}i:2;i:896;}i:2;a:3:{i:0;s:14:"footnote_close";i:1;a:0:{}i:2;i:925;}}}i:2;i:894;}i:95;a:3:{i:0;s:17:"listcontent_close";i:1;a:0:{}i:2;i:927;}i:96;a:3:{i:0;s:14:"listitem_close";i:1;a:0:{}i:2;i:927;}i:97;a:3:{i:0;s:13:"listitem_open";i:1;a:1:{i:0;i:1;}i:2;i:927;}i:98;a:3:{i:0;s:16:"listcontent_open";i:1;a:0:{}i:2;i:927;}i:99;a:3:{i:0;s:5:"cdata";i:1;a:1:{i:0;s:20:" LaTeX se pronuncia ";}i:2;i:931;}i:100;a:3:{i:0;s:18:"doublequoteopening";i:1;a:0:{}i:2;i:951;}i:101;a:3:{i:0;s:5:"cdata";i:1;a:1:{i:0;s:8:"Lay-Tech";}i:2;i:952;}i:102;a:3:{i:0;s:18:"doublequoteclosing";i:1;a:0:{}i:2;i:960;}i:103;a:3:{i:0;s:5:"cdata";i:1;a:1:{i:0;s:4:" ou ";}i:2;i:961;}i:104;a:3:{i:0;s:18:"doublequoteopening";i:1;a:0:{}i:2;i:965;}i:105;a:3:{i:0;s:5:"cdata";i:1;a:1:{i:0;s:8:"Lah-Tech";}i:2;i:966;}i:106;a:3:{i:0;s:18:"doublequoteclosing";i:1;a:0:{}i:2;i:974;}i:107;a:3:{i:0;s:17:"listcontent_close";i:1;a:0:{}i:2;i:975;}i:108;a:3:{i:0;s:14:"listitem_close";i:1;a:0:{}i:2;i:975;}i:109;a:3:{i:0;s:11:"listu_close";i:1;a:0:{}i:2;i:975;}i:110;a:2:{i:0;s:6:"plugin";i:1;a:4:{i:0;s:7:"uparrow";i:1;a:1:{i:0;s:42:"lib/plugins/uparrow/images/tango-small.png";}i:2;i:1;i:3;s:6:"~~UP~~";}}i:111;a:3:{i:0;s:13:"section_close";i:1;a:0:{}i:2;i:977;}i:112;a:3:{i:0;s:12:"section_edit";i:1;a:4:{i:0;i:689;i:1;i:976;i:2;i:2;i:3;s:5:"LaTeX";}i:2;i:977;}i:113;a:3:{i:0;s:6:"header";i:1;a:3:{i:0;s:9:"Vantagens";i:1;i:2;i:2;i:977;}i:2;i:977;}i:114;a:3:{i:0;s:12:"section_open";i:1;a:1:{i:0;i:2;}i:2;i:977;}i:115;a:3:{i:0;s:10:"listu_open";i:1;a:0:{}i:2;i:999;}i:116;a:3:{i:0;s:13:"listitem_open";i:1;a:1:{i:0;i:1;}i:2;i:999;}i:117;a:3:{i:0;s:16:"listcontent_open";i:1;a:0:{}i:2;i:999;}i:118;a:3:{i:0;s:5:"cdata";i:1;a:1:{i:0;s:37:" Produto final altamente profissional";}i:2;i:1003;}i:119;a:3:{i:0;s:17:"listcontent_close";i:1;a:0:{}i:2;i:1040;}i:120;a:3:{i:0;s:14:"listitem_close";i:1;a:0:{}i:2;i:1040;}i:121;a:3:{i:0;s:13:"listitem_open";i:1;a:1:{i:0;i:1;}i:2;i:1040;}i:122;a:3:{i:0;s:16:"listcontent_open";i:1;a:0:{}i:2;i:1040;}i:123;a:3:{i:0;s:5:"cdata";i:1;a:1:{i:0;s:81:" Menos preocupação com formatação e adequação às normas, foco no conteúdo";}i:2;i:1044;}i:124;a:3:{i:0;s:17:"listcontent_close";i:1;a:0:{}i:2;i:1125;}i:125;a:3:{i:0;s:14:"listitem_close";i:1;a:0:{}i:2;i:1125;}i:126;a:3:{i:0;s:13:"listitem_open";i:1;a:1:{i:0;i:1;}i:2;i:1125;}i:127;a:3:{i:0;s:16:"listcontent_open";i:1;a:0:{}i:2;i:1125;}i:128;a:3:{i:0;s:5:"cdata";i:1;a:1:{i:0;s:46:" Suporte avançado para fórmulas matemáticas";}i:2;i:1129;}i:129;a:3:{i:0;s:17:"listcontent_close";i:1;a:0:{}i:2;i:1175;}i:130;a:3:{i:0;s:14:"listitem_close";i:1;a:0:{}i:2;i:1175;}i:131;a:3:{i:0;s:13:"listitem_open";i:1;a:1:{i:0;i:1;}i:2;i:1175;}i:132;a:3:{i:0;s:16:"listcontent_open";i:1;a:0:{}i:2;i:1175;}i:133;a:3:{i:0;s:5:"cdata";i:1;a:1:{i:0;s:22:" Aprendizado intuitivo";}i:2;i:1179;}i:134;a:3:{i:0;s:17:"listcontent_close";i:1;a:0:{}i:2;i:1201;}i:135;a:3:{i:0;s:14:"listitem_close";i:1;a:0:{}i:2;i:1201;}i:136;a:3:{i:0;s:13:"listitem_open";i:1;a:1:{i:0;i:1;}i:2;i:1201;}i:137;a:3:{i:0;s:16:"listcontent_open";i:1;a:0:{}i:2;i:1201;}i:138;a:3:{i:0;s:5:"cdata";i:1;a:1:{i:0;s:86:" Pacotes para gerar vários tipos de documentos (artigos, relatórios, livros, slides)";}i:2;i:1205;}i:139;a:3:{i:0;s:17:"listcontent_close";i:1;a:0:{}i:2;i:1291;}i:140;a:3:{i:0;s:14:"listitem_close";i:1;a:0:{}i:2;i:1291;}i:141;a:3:{i:0;s:13:"listitem_open";i:1;a:1:{i:0;i:1;}i:2;i:1291;}i:142;a:3:{i:0;s:16:"listcontent_open";i:1;a:0:{}i:2;i:1291;}i:143;a:3:{i:0;s:5:"cdata";i:1;a:1:{i:0;s:83:" Sistema de desenvolvimento e formatos de exibição altamente portáveis e grátis";}i:2;i:1295;}i:144;a:3:{i:0;s:17:"listcontent_close";i:1;a:0:{}i:2;i:1378;}i:145;a:3:{i:0;s:14:"listitem_close";i:1;a:0:{}i:2;i:1378;}i:146;a:3:{i:0;s:11:"listu_close";i:1;a:0:{}i:2;i:1378;}i:147;a:2:{i:0;s:6:"plugin";i:1;a:4:{i:0;s:7:"uparrow";i:1;a:1:{i:0;s:42:"lib/plugins/uparrow/images/tango-small.png";}i:2;i:1;i:3;s:6:"~~UP~~";}}i:148;a:3:{i:0;s:13:"section_close";i:1;a:0:{}i:2;i:1380;}i:149;a:3:{i:0;s:12:"section_edit";i:1;a:4:{i:0;i:977;i:1;i:1379;i:2;i:2;i:3;s:9:"Vantagens";}i:2;i:1380;}i:150;a:3:{i:0;s:6:"header";i:1;a:3:{i:0;s:12:"Desvantagens";i:1;i:2;i:2;i:1380;}i:2;i:1380;}i:151;a:3:{i:0;s:12:"section_open";i:1;a:1:{i:0;i:2;}i:2;i:1380;}i:152;a:3:{i:0;s:10:"listu_open";i:1;a:0:{}i:2;i:1405;}i:153;a:3:{i:0;s:13:"listitem_open";i:1;a:1:{i:0;i:1;}i:2;i:1405;}i:154;a:3:{i:0;s:16:"listcontent_open";i:1;a:0:{}i:2;i:1405;}i:155;a:3:{i:0;s:5:"cdata";i:1;a:1:{i:0;s:63:" Você só vê o resultado final do documento após compilá-lo";}i:2;i:1409;}i:156;a:3:{i:0;s:17:"listcontent_close";i:1;a:0:{}i:2;i:1472;}i:157;a:3:{i:0;s:14:"listitem_close";i:1;a:0:{}i:2;i:1472;}i:158;a:3:{i:0;s:13:"listitem_open";i:1;a:1:{i:0;i:1;}i:2;i:1472;}i:159;a:3:{i:0;s:16:"listcontent_open";i:1;a:0:{}i:2;i:1472;}i:160;a:3:{i:0;s:5:"cdata";i:1;a:1:{i:0;s:81:" É extremamente díficil escrever documentos sem estrutura e ordem bem definidas";}i:2;i:1476;}i:161;a:3:{i:0;s:17:"listcontent_close";i:1;a:0:{}i:2;i:1557;}i:162;a:3:{i:0;s:14:"listitem_close";i:1;a:0:{}i:2;i:1557;}i:163;a:3:{i:0;s:13:"listitem_open";i:1;a:1:{i:0;i:1;}i:2;i:1557;}i:164;a:3:{i:0;s:16:"listcontent_open";i:1;a:0:{}i:2;i:1557;}i:165;a:3:{i:0;s:5:"cdata";i:1;a:1:{i:0;s:47:" A criação de novos layouts pode ser complexa";}i:2;i:1561;}i:166;a:3:{i:0;s:17:"listcontent_close";i:1;a:0:{}i:2;i:1608;}i:167;a:3:{i:0;s:14:"listitem_close";i:1;a:0:{}i:2;i:1608;}i:168;a:3:{i:0;s:11:"listu_close";i:1;a:0:{}i:2;i:1608;}i:169;a:2:{i:0;s:6:"plugin";i:1;a:4:{i:0;s:7:"uparrow";i:1;a:1:{i:0;s:42:"lib/plugins/uparrow/images/tango-small.png";}i:2;i:1;i:3;s:6:"~~UP~~";}}i:170;a:3:{i:0;s:13:"section_close";i:1;a:0:{}i:2;i:1610;}i:171;a:3:{i:0;s:12:"section_edit";i:1;a:4:{i:0;i:1380;i:1;i:1609;i:2;i:2;i:3;s:12:"Desvantagens";}i:2;i:1610;}i:172;a:3:{i:0;s:6:"header";i:1;a:3:{i:0;s:19:"Instalando no Linux";i:1;i:2;i:2;i:1610;}i:2;i:1610;}i:173;a:3:{i:0;s:12:"section_open";i:1;a:1:{i:0;i:2;}i:2;i:1610;}i:174;a:3:{i:0;s:4:"code";i:1;a:3:{i:0;s:76:"
$ sudo apt-get install kile
$ sudo apt-get install texlive-lang-portuguese
";i:1;s:4:"bash";i:2;N;}i:2;i:1648;}i:175;a:2:{i:0;s:6:"plugin";i:1;a:4:{i:0;s:7:"uparrow";i:1;a:1:{i:0;s:42:"lib/plugins/uparrow/images/tango-small.png";}i:2;i:1;i:3;s:6:"~~UP~~";}}i:176;a:3:{i:0;s:13:"section_close";i:1;a:0:{}i:2;i:1739;}i:177;a:3:{i:0;s:12:"section_edit";i:1;a:4:{i:0;i:1610;i:1;i:1738;i:2;i:2;i:3;s:19:"Instalando no Linux";}i:2;i:1739;}i:178;a:3:{i:0;s:6:"header";i:1;a:3:{i:0;s:21:"Instalando no Windows";i:1;i:2;i:2;i:1739;}i:2;i:1739;}i:179;a:3:{i:0;s:12:"section_open";i:1;a:1:{i:0;i:2;}i:2;i:1739;}i:180;a:3:{i:0;s:10:"listu_open";i:1;a:0:{}i:2;i:1773;}i:181;a:3:{i:0;s:13:"listitem_open";i:1;a:1:{i:0;i:1;}i:2;i:1773;}i:182;a:3:{i:0;s:16:"listcontent_open";i:1;a:0:{}i:2;i:1773;}i:183;a:3:{i:0;s:5:"cdata";i:1;a:1:{i:0;s:7:" MikTeX";}i:2;i:1777;}i:184;a:3:{i:0;s:17:"listcontent_close";i:1;a:0:{}i:2;i:1784;}i:185;a:3:{i:0;s:14:"listitem_close";i:1;a:0:{}i:2;i:1784;}i:186;a:3:{i:0;s:13:"listitem_open";i:1;a:1:{i:0;i:1;}i:2;i:1784;}i:187;a:3:{i:0;s:16:"listcontent_open";i:1;a:0:{}i:2;i:1784;}i:188;a:3:{i:0;s:5:"cdata";i:1;a:1:{i:0;s:4:" LEd";}i:2;i:1788;}i:189;a:3:{i:0;s:17:"listcontent_close";i:1;a:0:{}i:2;i:1792;}i:190;a:3:{i:0;s:14:"listitem_close";i:1;a:0:{}i:2;i:1792;}i:191;a:3:{i:0;s:11:"listu_close";i:1;a:0:{}i:2;i:1792;}i:192;a:2:{i:0;s:6:"plugin";i:1;a:4:{i:0;s:7:"uparrow";i:1;a:1:{i:0;s:42:"lib/plugins/uparrow/images/tango-small.png";}i:2;i:1;i:3;s:6:"~~UP~~";}}i:193;a:3:{i:0;s:13:"section_close";i:1;a:0:{}i:2;i:1794;}i:194;a:3:{i:0;s:12:"section_edit";i:1;a:4:{i:0;i:1739;i:1;i:1793;i:2;i:2;i:3;s:21:"Instalando no Windows";}i:2;i:1794;}i:195;a:3:{i:0;s:6:"header";i:1;a:3:{i:0;s:11:"Hello World";i:1;i:2;i:2;i:1794;}i:2;i:1794;}i:196;a:3:{i:0;s:12:"section_open";i:1;a:1:{i:0;i:2;}i:2;i:1794;}i:197;a:3:{i:0;s:4:"file";i:1;a:3:{i:0;s:244:"
\documentclass{article}
\usepackage[brazil]{babel}
\usepackage[T1]{fontenc}
\usepackage[utf8]{inputenc}
\usepackage{indentfirst}
\author{Leslie Lamport}
\title{Hello World Title}
\begin{document}
  \maketitle
  Hello World Body
\end{document}
";i:1;s:5:"latex";i:2;s:15:"hello_world.tex";}i:2;i:1824;}i:198;a:2:{i:0;s:6:"plugin";i:1;a:4:{i:0;s:7:"uparrow";i:1;a:1:{i:0;s:42:"lib/plugins/uparrow/images/tango-small.png";}i:2;i:1;i:3;s:6:"~~UP~~";}}i:199;a:3:{i:0;s:13:"section_close";i:1;a:0:{}i:2;i:2100;}i:200;a:3:{i:0;s:12:"section_edit";i:1;a:4:{i:0;i:1794;i:1;i:2099;i:2;i:2;i:3;s:11:"Hello World";}i:2;i:2100;}i:201;a:3:{i:0;s:6:"header";i:1;a:3:{i:0;s:11:"Hello World";i:1;i:2;i:2;i:2100;}i:2;i:2100;}i:202;a:3:{i:0;s:12:"section_open";i:1;a:1:{i:0;i:2;}i:2;i:2100;}i:203;a:3:{i:0;s:6:"p_open";i:1;a:0:{}i:2;i:2123;}i:204;a:3:{i:0;s:5:"cdata";i:1;a:1:{i:0;s:1:"
";}i:2;i:2124;}i:205;a:3:{i:0;s:13:"internalmedia";i:1;a:7:{i:0;s:31:"tutorials:latex:hello_world.png";i:1;N;i:2;N;i:3;s:3:"750";i:4;N;i:5;s:5:"cache";i:6;s:7:"details";}i:2;i:2125;}i:206;a:3:{i:0;s:7:"p_close";i:1;a:0:{}i:2;i:2164;}i:207;a:2:{i:0;s:6:"plugin";i:1;a:4:{i:0;s:7:"uparrow";i:1;a:1:{i:0;s:42:"lib/plugins/uparrow/images/tango-small.png";}i:2;i:1;i:3;s:6:"~~UP~~";}}i:208;a:3:{i:0;s:13:"section_close";i:1;a:0:{}i:2;i:2166;}i:209;a:3:{i:0;s:12:"section_edit";i:1;a:4:{i:0;i:2100;i:1;i:2165;i:2;i:2;i:3;s:11:"Hello World";}i:2;i:2166;}i:210;a:3:{i:0;s:6:"header";i:1;a:3:{i:0;s:24:"O que acabei de digitar?";i:1;i:2;i:2;i:2166;}i:2;i:2166;}i:211;a:3:{i:0;s:12:"section_open";i:1;a:1:{i:0;i:2;}i:2;i:2166;}i:212;a:3:{i:0;s:6:"p_open";i:1;a:0:{}i:2;i:2202;}i:213;a:3:{i:0;s:6:"plugin";i:1;a:4:{i:0;s:11:"htmlcomment";i:1;a:2:{i:0;i:5;i:1;s:19:" acentuar listings ";}i:2;i:5;i:3;s:26:"<!-- acentuar listings -->";}i:2;i:2203;}i:214;a:3:{i:0;s:7:"p_close";i:1;a:0:{}i:2;i:2229;}i:215;a:3:{i:0;s:4:"code";i:1;a:3:{i:0;s:338:"
% formata saída para um artigo
\documentclass{article}     

% traduz os parâmetros (data, etc.)
% para o formato brasileiro, e faz
% a hifenização correta
\usepackage[brazil]{babel}  

% formata a codificação de saída               
\usepackage[T1]{fontenc}    

% formata a codificação de entrada
\usepackage[utf8]{inputenc} 
";i:1;s:5:"latex";i:2;N;}i:2;i:2236;}i:216;a:2:{i:0;s:6:"plugin";i:1;a:4:{i:0;s:7:"uparrow";i:1;a:1:{i:0;s:42:"lib/plugins/uparrow/images/tango-small.png";}i:2;i:1;i:3;s:6:"~~UP~~";}}i:217;a:3:{i:0;s:13:"section_close";i:1;a:0:{}i:2;i:2590;}i:218;a:3:{i:0;s:12:"section_edit";i:1;a:4:{i:0;i:2166;i:1;i:2589;i:2;i:2;i:3;s:24:"O que acabei de digitar?";}i:2;i:2590;}i:219;a:3:{i:0;s:6:"header";i:1;a:3:{i:0;s:24:"O que acabei de digitar?";i:1;i:2;i:2;i:2590;}i:2;i:2590;}i:220;a:3:{i:0;s:12:"section_open";i:1;a:1:{i:0;i:2;}i:2;i:2590;}i:221;a:3:{i:0;s:6:"p_open";i:1;a:0:{}i:2;i:2626;}i:222;a:3:{i:0;s:6:"plugin";i:1;a:4:{i:0;s:11:"htmlcomment";i:1;a:2:{i:0;i:5;i:1;s:19:" acentuar listings ";}i:2;i:5;i:3;s:26:"<!-- acentuar listings -->";}i:2;i:2627;}i:223;a:3:{i:0;s:7:"p_close";i:1;a:0:{}i:2;i:2653;}i:224;a:3:{i:0;s:4:"code";i:1;a:3:{i:0;s:198:"
% indentação na primeira linha
% de todas as seções
\usepackage{indentfirst}    
         
% autor do artigo          
\author{Leslie Lamport} 

% título do artigo  
\title{Hello World Title}
";i:1;s:5:"latex";i:2;N;}i:2;i:2660;}i:225;a:2:{i:0;s:6:"plugin";i:1;a:4:{i:0;s:7:"uparrow";i:1;a:1:{i:0;s:42:"lib/plugins/uparrow/images/tango-small.png";}i:2;i:1;i:3;s:6:"~~UP~~";}}i:226;a:3:{i:0;s:13:"section_close";i:1;a:0:{}i:2;i:2874;}i:227;a:3:{i:0;s:12:"section_edit";i:1;a:4:{i:0;i:2590;i:1;i:2873;i:2;i:2;i:3;s:24:"O que acabei de digitar?";}i:2;i:2874;}i:228;a:3:{i:0;s:6:"header";i:1;a:3:{i:0;s:24:"O que acabei de digitar?";i:1;i:2;i:2;i:2874;}i:2;i:2874;}i:229;a:3:{i:0;s:12:"section_open";i:1;a:1:{i:0;i:2;}i:2;i:2874;}i:230;a:3:{i:0;s:4:"code";i:1;a:3:{i:0;s:231:"
% fim do preâmbulo
% começo do corpo
\begin{document}   

  % faz o cabeçalho
  % (página, slide) de título 
  \maketitle      
  
  % texto do corpo do documento  
  Hello World Body  
  
% fim do corpo
\end{document}      
";i:1;s:5:"latex";i:2;N;}i:2;i:2917;}i:231;a:2:{i:0;s:6:"plugin";i:1;a:4:{i:0;s:7:"uparrow";i:1;a:1:{i:0;s:42:"lib/plugins/uparrow/images/tango-small.png";}i:2;i:1;i:3;s:6:"~~UP~~";}}i:232;a:3:{i:0;s:13:"section_close";i:1;a:0:{}i:2;i:3164;}i:233;a:3:{i:0;s:12:"section_edit";i:1;a:4:{i:0;i:2874;i:1;i:3163;i:2;i:2;i:3;s:24:"O que acabei de digitar?";}i:2;i:3164;}i:234;a:3:{i:0;s:6:"header";i:1;a:3:{i:0;s:13:"Como compilo?";i:1;i:2;i:2;i:3164;}i:2;i:3164;}i:235;a:3:{i:0;s:12:"section_open";i:1;a:1:{i:0;i:2;}i:2;i:3164;}i:236;a:2:{i:0;s:6:"plugin";i:1;a:4:{i:0;s:7:"uparrow";i:1;a:1:{i:0;s:42:"lib/plugins/uparrow/images/tango-small.png";}i:2;i:1;i:3;s:6:"~~UP~~";}}i:237;a:3:{i:0;s:13:"section_close";i:1;a:0:{}i:2;i:3191;}i:238;a:3:{i:0;s:12:"section_edit";i:1;a:4:{i:0;i:3164;i:1;i:3190;i:2;i:2;i:3;s:13:"Como compilo?";}i:2;i:3191;}i:239;a:3:{i:0;s:6:"header";i:1;a:3:{i:0;s:7:"Console";i:1;i:3;i:2;i:3191;}i:2;i:3191;}i:240;a:3:{i:0;s:12:"section_open";i:1;a:1:{i:0;i:3;}i:2;i:3191;}i:241;a:3:{i:0;s:4:"code";i:1;a:3:{i:0;s:28:"
$ pdflatex hello_world.tex
";i:1;s:4:"bash";i:2;N;}i:2;i:3215;}i:242;a:2:{i:0;s:6:"plugin";i:1;a:4:{i:0;s:7:"uparrow";i:1;a:1:{i:0;s:42:"lib/plugins/uparrow/images/tango-small.png";}i:2;i:1;i:3;s:6:"~~UP~~";}}i:243;a:3:{i:0;s:13:"section_close";i:1;a:0:{}i:2;i:3258;}i:244;a:3:{i:0;s:12:"section_edit";i:1;a:4:{i:0;i:3191;i:1;i:3257;i:2;i:3;i:3;s:7:"Console";}i:2;i:3258;}i:245;a:3:{i:0;s:6:"header";i:1;a:3:{i:0;s:4:"Kile";i:1;i:3;i:2;i:3258;}i:2;i:3258;}i:246;a:3:{i:0;s:12:"section_open";i:1;a:1:{i:0;i:3;}i:2;i:3258;}i:247;a:3:{i:0;s:6:"p_open";i:1;a:0:{}i:2;i:3272;}i:248;a:3:{i:0;s:5:"cdata";i:1;a:1:{i:0;s:7:"
Build ";}i:2;i:3273;}i:249;a:3:{i:0;s:6:"entity";i:1;a:1:{i:0;s:2:"->";}i:2;i:3280;}i:250;a:3:{i:0;s:5:"cdata";i:1;a:1:{i:0;s:9:" Compile ";}i:2;i:3282;}i:251;a:3:{i:0;s:6:"entity";i:1;a:1:{i:0;s:2:"->";}i:2;i:3291;}i:252;a:3:{i:0;s:5:"cdata";i:1;a:1:{i:0;s:9:" Pdflatex";}i:2;i:3293;}i:253;a:3:{i:0;s:7:"p_close";i:1;a:0:{}i:2;i:3302;}i:254;a:2:{i:0;s:6:"plugin";i:1;a:4:{i:0;s:7:"uparrow";i:1;a:1:{i:0;s:42:"lib/plugins/uparrow/images/tango-small.png";}i:2;i:1;i:3;s:6:"~~UP~~";}}i:255;a:3:{i:0;s:13:"section_close";i:1;a:0:{}i:2;i:3304;}i:256;a:3:{i:0;s:12:"section_edit";i:1;a:4:{i:0;i:3258;i:1;i:3303;i:2;i:3;i:3;s:4:"Kile";}i:2;i:3304;}i:257;a:3:{i:0;s:6:"header";i:1;a:3:{i:0;s:31:"Organização dos arquivos .tex";i:1;i:2;i:2;i:3304;}i:2;i:3304;}i:258;a:3:{i:0;s:12:"section_open";i:1;a:1:{i:0;i:2;}i:2;i:3304;}i:259;a:3:{i:0;s:6:"p_open";i:1;a:0:{}i:2;i:3347;}i:260;a:3:{i:0;s:5:"cdata";i:1;a:1:{i:0;s:56:"
Um documento LaTeX costuma ter três partes principais:";}i:2;i:3348;}i:261;a:3:{i:0;s:7:"p_close";i:1;a:0:{}i:2;i:3404;}i:262;a:3:{i:0;s:10:"table_open";i:1;a:2:{i:0;i:2;i:1;i:3;}i:2;i:3404;}i:263;a:3:{i:0;s:13:"tablerow_open";i:1;a:0:{}i:2;i:3404;}i:264;a:3:{i:0;s:16:"tableheader_open";i:1;a:3:{i:0;i:1;i:1;s:4:"left";i:2;i:1;}i:2;i:3404;}i:265;a:3:{i:0;s:5:"cdata";i:1;a:1:{i:0;s:13:" Preâmbulo  ";}i:2;i:3406;}i:266;a:3:{i:0;s:17:"tableheader_close";i:1;a:0:{}i:2;i:3419;}i:267;a:3:{i:0;s:14:"tablecell_open";i:1;a:3:{i:0;i:1;i:1;N;i:2;i:1;}i:2;i:3419;}i:268;a:3:{i:0;s:5:"cdata";i:1;a:1:{i:0;s:1:" ";}i:2;i:3420;}i:269;a:3:{i:0;s:6:"entity";i:1;a:1:{i:0;s:2:"->";}i:2;i:3421;}i:270;a:3:{i:0;s:5:"cdata";i:1;a:1:{i:0;s:105:" Contém declarações, inclusão de pacotes e outras construções que indicam a estrutura do documento ";}i:2;i:3423;}i:271;a:3:{i:0;s:15:"tablecell_close";i:1;a:0:{}i:2;i:3528;}i:272;a:3:{i:0;s:14:"tablerow_close";i:1;a:0:{}i:2;i:3529;}i:273;a:3:{i:0;s:13:"tablerow_open";i:1;a:0:{}i:2;i:3529;}i:274;a:3:{i:0;s:16:"tableheader_open";i:1;a:3:{i:0;i:1;i:1;s:4:"left";i:2;i:1;}i:2;i:3529;}i:275;a:3:{i:0;s:5:"cdata";i:1;a:1:{i:0;s:8:" Corpo  ";}i:2;i:3531;}i:276;a:3:{i:0;s:17:"tableheader_close";i:1;a:0:{}i:2;i:3539;}i:277;a:3:{i:0;s:14:"tablecell_open";i:1;a:3:{i:0;i:1;i:1;N;i:2;i:1;}i:2;i:3539;}i:278;a:3:{i:0;s:5:"cdata";i:1;a:1:{i:0;s:1:" ";}i:2;i:3540;}i:279;a:3:{i:0;s:6:"entity";i:1;a:1:{i:0;s:2:"->";}i:2;i:3541;}i:280;a:3:{i:0;s:5:"cdata";i:1;a:1:{i:0;s:19:" O documento em si ";}i:2;i:3543;}i:281;a:3:{i:0;s:15:"tablecell_close";i:1;a:0:{}i:2;i:3562;}i:282;a:3:{i:0;s:14:"tablerow_close";i:1;a:0:{}i:2;i:3563;}i:283;a:3:{i:0;s:13:"tablerow_open";i:1;a:0:{}i:2;i:3563;}i:284;a:3:{i:0;s:16:"tableheader_open";i:1;a:3:{i:0;i:1;i:1;s:4:"left";i:2;i:1;}i:2;i:3563;}i:285;a:3:{i:0;s:5:"cdata";i:1;a:1:{i:0;s:15:" Bibliografia  ";}i:2;i:3565;}i:286;a:3:{i:0;s:17:"tableheader_close";i:1;a:0:{}i:2;i:3580;}i:287;a:3:{i:0;s:14:"tablecell_open";i:1;a:3:{i:0;i:1;i:1;N;i:2;i:1;}i:2;i:3580;}i:288;a:3:{i:0;s:5:"cdata";i:1;a:1:{i:0;s:1:" ";}i:2;i:3581;}i:289;a:3:{i:0;s:6:"entity";i:1;a:1:{i:0;s:2:"->";}i:2;i:3582;}i:290;a:3:{i:0;s:5:"cdata";i:1;a:1:{i:0;s:14:" Referências ";}i:2;i:3584;}i:291;a:3:{i:0;s:15:"tablecell_close";i:1;a:0:{}i:2;i:3598;}i:292;a:3:{i:0;s:14:"tablerow_close";i:1;a:0:{}i:2;i:3599;}i:293;a:3:{i:0;s:11:"table_close";i:1;a:0:{}i:2;i:3599;}i:294;a:2:{i:0;s:6:"plugin";i:1;a:4:{i:0;s:7:"uparrow";i:1;a:1:{i:0;s:42:"lib/plugins/uparrow/images/tango-small.png";}i:2;i:1;i:3;s:6:"~~UP~~";}}i:295;a:3:{i:0;s:13:"section_close";i:1;a:0:{}i:2;i:3601;}i:296;a:3:{i:0;s:12:"section_edit";i:1;a:4:{i:0;i:3304;i:1;i:3600;i:2;i:2;i:3;s:31:"Organização dos arquivos .tex";}i:2;i:3601;}i:297;a:3:{i:0;s:6:"header";i:1;a:3:{i:0;s:14:"Document Class";i:1;i:2;i:2;i:3601;}i:2;i:3601;}i:298;a:3:{i:0;s:12:"section_open";i:1;a:1:{i:0;i:2;}i:2;i:3601;}i:299;a:3:{i:0;s:4:"code";i:1;a:3:{i:0;s:64:"
% define a classe do documento
\documentclass[options]{class} 
";i:1;s:5:"latex";i:2;N;}i:2;i:3634;}i:300;a:3:{i:0;s:10:"table_open";i:1;a:2:{i:0;i:2;i:1;i:6;}i:2;i:3713;}i:301;a:3:{i:0;s:13:"tablerow_open";i:1;a:0:{}i:2;i:3713;}i:302;a:3:{i:0;s:16:"tableheader_open";i:1;a:3:{i:0;i:2;i:1;s:6:"center";i:2;i:1;}i:2;i:3713;}i:303;a:3:{i:0;s:5:"cdata";i:1;a:1:{i:0;s:11:"  Classes  ";}i:2;i:3715;}i:304;a:3:{i:0;s:17:"tableheader_close";i:1;a:0:{}i:2;i:3726;}i:305;a:3:{i:0;s:14:"tablerow_close";i:1;a:0:{}i:2;i:3728;}i:306;a:3:{i:0;s:13:"tablerow_open";i:1;a:0:{}i:2;i:3728;}i:307;a:3:{i:0;s:16:"tableheader_open";i:1;a:3:{i:0;i:1;i:1;s:4:"left";i:2;i:1;}i:2;i:3728;}i:308;a:3:{i:0;s:5:"cdata";i:1;a:1:{i:0;s:10:" article  ";}i:2;i:3730;}i:309;a:3:{i:0;s:17:"tableheader_close";i:1;a:0:{}i:2;i:3740;}i:310;a:3:{i:0;s:14:"tablecell_open";i:1;a:3:{i:0;i:1;i:1;N;i:2;i:1;}i:2;i:3740;}i:311;a:3:{i:0;s:5:"cdata";i:1;a:1:{i:0;s:1:" ";}i:2;i:3741;}i:312;a:3:{i:0;s:6:"entity";i:1;a:1:{i:0;s:2:"->";}i:2;i:3742;}i:313;a:3:{i:0;s:5:"cdata";i:1;a:1:{i:0;s:22:" Artigos científicos ";}i:2;i:3744;}i:314;a:3:{i:0;s:15:"tablecell_close";i:1;a:0:{}i:2;i:3766;}i:315;a:3:{i:0;s:14:"tablerow_close";i:1;a:0:{}i:2;i:3767;}i:316;a:3:{i:0;s:13:"tablerow_open";i:1;a:0:{}i:2;i:3767;}i:317;a:3:{i:0;s:16:"tableheader_open";i:1;a:3:{i:0;i:1;i:1;s:4:"left";i:2;i:1;}i:2;i:3767;}i:318;a:3:{i:0;s:5:"cdata";i:1;a:1:{i:0;s:9:" report  ";}i:2;i:3769;}i:319;a:3:{i:0;s:17:"tableheader_close";i:1;a:0:{}i:2;i:3778;}i:320;a:3:{i:0;s:14:"tablecell_open";i:1;a:3:{i:0;i:1;i:1;N;i:2;i:1;}i:2;i:3778;}i:321;a:3:{i:0;s:5:"cdata";i:1;a:1:{i:0;s:1:" ";}i:2;i:3779;}i:322;a:3:{i:0;s:6:"entity";i:1;a:1:{i:0;s:2:"->";}i:2;i:3780;}i:323;a:3:{i:0;s:5:"cdata";i:1;a:1:{i:0;s:27:" Relatórios e monografias ";}i:2;i:3782;}i:324;a:3:{i:0;s:15:"tablecell_close";i:1;a:0:{}i:2;i:3809;}i:325;a:3:{i:0;s:14:"tablerow_close";i:1;a:0:{}i:2;i:3810;}i:326;a:3:{i:0;s:13:"tablerow_open";i:1;a:0:{}i:2;i:3810;}i:327;a:3:{i:0;s:16:"tableheader_open";i:1;a:3:{i:0;i:1;i:1;s:4:"left";i:2;i:1;}i:2;i:3810;}i:328;a:3:{i:0;s:5:"cdata";i:1;a:1:{i:0;s:7:" book  ";}i:2;i:3812;}i:329;a:3:{i:0;s:17:"tableheader_close";i:1;a:0:{}i:2;i:3819;}i:330;a:3:{i:0;s:14:"tablecell_open";i:1;a:3:{i:0;i:1;i:1;N;i:2;i:1;}i:2;i:3819;}i:331;a:3:{i:0;s:5:"cdata";i:1;a:1:{i:0;s:1:" ";}i:2;i:3820;}i:332;a:3:{i:0;s:6:"entity";i:1;a:1:{i:0;s:2:"->";}i:2;i:3821;}i:333;a:3:{i:0;s:5:"cdata";i:1;a:1:{i:0;s:8:" Livros ";}i:2;i:3823;}i:334;a:3:{i:0;s:15:"tablecell_close";i:1;a:0:{}i:2;i:3831;}i:335;a:3:{i:0;s:14:"tablerow_close";i:1;a:0:{}i:2;i:3832;}i:336;a:3:{i:0;s:13:"tablerow_open";i:1;a:0:{}i:2;i:3832;}i:337;a:3:{i:0;s:16:"tableheader_open";i:1;a:3:{i:0;i:1;i:1;s:4:"left";i:2;i:1;}i:2;i:3832;}i:338;a:3:{i:0;s:5:"cdata";i:1;a:1:{i:0;s:9:" beamer  ";}i:2;i:3834;}i:339;a:3:{i:0;s:17:"tableheader_close";i:1;a:0:{}i:2;i:3843;}i:340;a:3:{i:0;s:14:"tablecell_open";i:1;a:3:{i:0;i:1;i:1;N;i:2;i:1;}i:2;i:3843;}i:341;a:3:{i:0;s:5:"cdata";i:1;a:1:{i:0;s:1:" ";}i:2;i:3844;}i:342;a:3:{i:0;s:6:"entity";i:1;a:1:{i:0;s:2:"->";}i:2;i:3845;}i:343;a:3:{i:0;s:5:"cdata";i:1;a:1:{i:0;s:8:" Slides ";}i:2;i:3847;}i:344;a:3:{i:0;s:15:"tablecell_close";i:1;a:0:{}i:2;i:3855;}i:345;a:3:{i:0;s:14:"tablerow_close";i:1;a:0:{}i:2;i:3856;}i:346;a:3:{i:0;s:13:"tablerow_open";i:1;a:0:{}i:2;i:3856;}i:347;a:3:{i:0;s:16:"tableheader_open";i:1;a:3:{i:0;i:1;i:1;s:4:"left";i:2;i:1;}i:2;i:3856;}i:348;a:3:{i:0;s:5:"cdata";i:1;a:1:{i:0;s:7:" abnt  ";}i:2;i:3858;}i:349;a:3:{i:0;s:17:"tableheader_close";i:1;a:0:{}i:2;i:3865;}i:350;a:3:{i:0;s:14:"tablecell_open";i:1;a:3:{i:0;i:1;i:1;N;i:2;i:1;}i:2;i:3865;}i:351;a:3:{i:0;s:5:"cdata";i:1;a:1:{i:0;s:1:" ";}i:2;i:3866;}i:352;a:3:{i:0;s:6:"entity";i:1;a:1:{i:0;s:2:"->";}i:2;i:3867;}i:353;a:3:{i:0;s:5:"cdata";i:1;a:1:{i:0;s:28:" Monografia no padrão ABNT ";}i:2;i:3869;}i:354;a:3:{i:0;s:15:"tablecell_close";i:1;a:0:{}i:2;i:3897;}i:355;a:3:{i:0;s:14:"tablerow_close";i:1;a:0:{}i:2;i:3898;}i:356;a:3:{i:0;s:11:"table_close";i:1;a:0:{}i:2;i:3898;}i:357;a:2:{i:0;s:6:"plugin";i:1;a:4:{i:0;s:7:"uparrow";i:1;a:1:{i:0;s:42:"lib/plugins/uparrow/images/tango-small.png";}i:2;i:1;i:3;s:6:"~~UP~~";}}i:358;a:3:{i:0;s:13:"section_close";i:1;a:0:{}i:2;i:3900;}i:359;a:3:{i:0;s:12:"section_edit";i:1;a:4:{i:0;i:3601;i:1;i:3899;i:2;i:2;i:3;s:14:"Document Class";}i:2;i:3900;}i:360;a:3:{i:0;s:6:"header";i:1;a:3:{i:0;s:14:"Document Class";i:1;i:2;i:2;i:3900;}i:2;i:3900;}i:361;a:3:{i:0;s:12:"section_open";i:1;a:1:{i:0;i:2;}i:2;i:3900;}i:362;a:3:{i:0;s:4:"code";i:1;a:3:{i:0;s:64:"
% define a classe do documento
\documentclass[options]{class} 
";i:1;s:5:"latex";i:2;N;}i:2;i:3933;}i:363;a:3:{i:0;s:10:"table_open";i:1;a:2:{i:0;i:2;i:1;i:5;}i:2;i:4012;}i:364;a:3:{i:0;s:13:"tablerow_open";i:1;a:0:{}i:2;i:4012;}i:365;a:3:{i:0;s:16:"tableheader_open";i:1;a:3:{i:0;i:2;i:1;s:6:"center";i:2;i:1;}i:2;i:4012;}i:366;a:3:{i:0;s:5:"cdata";i:1;a:1:{i:0;s:12:"  Opções  ";}i:2;i:4014;}i:367;a:3:{i:0;s:17:"tableheader_close";i:1;a:0:{}i:2;i:4026;}i:368;a:3:{i:0;s:14:"tablerow_close";i:1;a:0:{}i:2;i:4028;}i:369;a:3:{i:0;s:13:"tablerow_open";i:1;a:0:{}i:2;i:4028;}i:370;a:3:{i:0;s:16:"tableheader_open";i:1;a:3:{i:0;i:1;i:1;s:4:"left";i:2;i:1;}i:2;i:4028;}i:371;a:3:{i:0;s:5:"cdata";i:1;a:1:{i:0;s:19:" 10pt, 11pt, 12pt  ";}i:2;i:4030;}i:372;a:3:{i:0;s:17:"tableheader_close";i:1;a:0:{}i:2;i:4049;}i:373;a:3:{i:0;s:14:"tablecell_open";i:1;a:3:{i:0;i:1;i:1;N;i:2;i:1;}i:2;i:4049;}i:374;a:3:{i:0;s:5:"cdata";i:1;a:1:{i:0;s:1:" ";}i:2;i:4050;}i:375;a:3:{i:0;s:6:"entity";i:1;a:1:{i:0;s:2:"->";}i:2;i:4051;}i:376;a:3:{i:0;s:5:"cdata";i:1;a:1:{i:0;s:18:" Tamanho da fonte ";}i:2;i:4053;}i:377;a:3:{i:0;s:15:"tablecell_close";i:1;a:0:{}i:2;i:4071;}i:378;a:3:{i:0;s:14:"tablerow_close";i:1;a:0:{}i:2;i:4072;}i:379;a:3:{i:0;s:13:"tablerow_open";i:1;a:0:{}i:2;i:4072;}i:380;a:3:{i:0;s:16:"tableheader_open";i:1;a:3:{i:0;i:1;i:1;s:4:"left";i:2;i:1;}i:2;i:4072;}i:381;a:3:{i:0;s:5:"cdata";i:1;a:1:{i:0;s:23:" a4paper, letterpaper  ";}i:2;i:4074;}i:382;a:3:{i:0;s:17:"tableheader_close";i:1;a:0:{}i:2;i:4097;}i:383;a:3:{i:0;s:14:"tablecell_open";i:1;a:3:{i:0;i:1;i:1;N;i:2;i:1;}i:2;i:4097;}i:384;a:3:{i:0;s:5:"cdata";i:1;a:1:{i:0;s:1:" ";}i:2;i:4098;}i:385;a:3:{i:0;s:6:"entity";i:1;a:1:{i:0;s:2:"->";}i:2;i:4099;}i:386;a:3:{i:0;s:5:"cdata";i:1;a:1:{i:0;s:18:" Tamanho do papel ";}i:2;i:4101;}i:387;a:3:{i:0;s:15:"tablecell_close";i:1;a:0:{}i:2;i:4119;}i:388;a:3:{i:0;s:14:"tablerow_close";i:1;a:0:{}i:2;i:4120;}i:389;a:3:{i:0;s:13:"tablerow_open";i:1;a:0:{}i:2;i:4120;}i:390;a:3:{i:0;s:16:"tableheader_open";i:1;a:3:{i:0;i:1;i:1;s:4:"left";i:2;i:1;}i:2;i:4120;}i:391;a:3:{i:0;s:5:"cdata";i:1;a:1:{i:0;s:25:" titlepage, notitlepage  ";}i:2;i:4122;}i:392;a:3:{i:0;s:17:"tableheader_close";i:1;a:0:{}i:2;i:4147;}i:393;a:3:{i:0;s:14:"tablecell_open";i:1;a:3:{i:0;i:1;i:1;N;i:2;i:1;}i:2;i:4147;}i:394;a:3:{i:0;s:5:"cdata";i:1;a:1:{i:0;s:1:" ";}i:2;i:4148;}i:395;a:3:{i:0;s:6:"entity";i:1;a:1:{i:0;s:2:"->";}i:2;i:4149;}i:396;a:3:{i:0;s:5:"cdata";i:1;a:1:{i:0;s:37:" Página de título separada ou não ";}i:2;i:4151;}i:397;a:3:{i:0;s:15:"tablecell_close";i:1;a:0:{}i:2;i:4188;}i:398;a:3:{i:0;s:14:"tablerow_close";i:1;a:0:{}i:2;i:4189;}i:399;a:3:{i:0;s:13:"tablerow_open";i:1;a:0:{}i:2;i:4189;}i:400;a:3:{i:0;s:16:"tableheader_open";i:1;a:3:{i:0;i:1;i:1;s:4:"left";i:2;i:1;}i:2;i:4189;}i:401;a:3:{i:0;s:5:"cdata";i:1;a:1:{i:0;s:23:" onecolumn, twocolumn  ";}i:2;i:4191;}i:402;a:3:{i:0;s:17:"tableheader_close";i:1;a:0:{}i:2;i:4214;}i:403;a:3:{i:0;s:14:"tablecell_open";i:1;a:3:{i:0;i:1;i:1;N;i:2;i:1;}i:2;i:4214;}i:404;a:3:{i:0;s:5:"cdata";i:1;a:1:{i:0;s:1:" ";}i:2;i:4215;}i:405;a:3:{i:0;s:6:"entity";i:1;a:1:{i:0;s:2:"->";}i:2;i:4216;}i:406;a:3:{i:0;s:5:"cdata";i:1;a:1:{i:0;s:30:" Texto em uma ou duas colunas ";}i:2;i:4218;}i:407;a:3:{i:0;s:15:"tablecell_close";i:1;a:0:{}i:2;i:4248;}i:408;a:3:{i:0;s:14:"tablerow_close";i:1;a:0:{}i:2;i:4249;}i:409;a:3:{i:0;s:11:"table_close";i:1;a:0:{}i:2;i:4249;}i:410;a:2:{i:0;s:6:"plugin";i:1;a:4:{i:0;s:7:"uparrow";i:1;a:1:{i:0;s:42:"lib/plugins/uparrow/images/tango-small.png";}i:2;i:1;i:3;s:6:"~~UP~~";}}i:411;a:3:{i:0;s:13:"section_close";i:1;a:0:{}i:2;i:4251;}i:412;a:3:{i:0;s:12:"section_edit";i:1;a:4:{i:0;i:3900;i:1;i:4250;i:2;i:2;i:3;s:14:"Document Class";}i:2;i:4251;}i:413;a:3:{i:0;s:6:"header";i:1;a:3:{i:0;s:11:"Use Package";i:1;i:2;i:2;i:4251;}i:2;i:4251;}i:414;a:3:{i:0;s:12:"section_open";i:1;a:1:{i:0;i:2;}i:2;i:4251;}i:415;a:3:{i:0;s:4:"code";i:1;a:3:{i:0;s:55:"
% inclusão de pacotes
\usepackage[options]{package} 
";i:1;s:5:"latex";i:2;N;}i:2;i:4281;}i:416;a:3:{i:0;s:10:"table_open";i:1;a:2:{i:0;i:2;i:1;i:7;}i:2;i:4351;}i:417;a:3:{i:0;s:13:"tablerow_open";i:1;a:0:{}i:2;i:4351;}i:418;a:3:{i:0;s:16:"tableheader_open";i:1;a:3:{i:0;i:2;i:1;s:6:"center";i:2;i:1;}i:2;i:4351;}i:419;a:3:{i:0;s:5:"cdata";i:1;a:1:{i:0;s:11:"  Pacotes  ";}i:2;i:4353;}i:420;a:3:{i:0;s:17:"tableheader_close";i:1;a:0:{}i:2;i:4364;}i:421;a:3:{i:0;s:14:"tablerow_close";i:1;a:0:{}i:2;i:4366;}i:422;a:3:{i:0;s:13:"tablerow_open";i:1;a:0:{}i:2;i:4366;}i:423;a:3:{i:0;s:16:"tableheader_open";i:1;a:3:{i:0;i:1;i:1;s:4:"left";i:2;i:1;}i:2;i:4366;}i:424;a:3:{i:0;s:5:"cdata";i:1;a:1:{i:0;s:11:" inputenc  ";}i:2;i:4368;}i:425;a:3:{i:0;s:17:"tableheader_close";i:1;a:0:{}i:2;i:4379;}i:426;a:3:{i:0;s:14:"tablecell_open";i:1;a:3:{i:0;i:1;i:1;N;i:2;i:1;}i:2;i:4379;}i:427;a:3:{i:0;s:5:"cdata";i:1;a:1:{i:0;s:1:" ";}i:2;i:4380;}i:428;a:3:{i:0;s:6:"entity";i:1;a:1:{i:0;s:2:"->";}i:2;i:4381;}i:429;a:3:{i:0;s:5:"cdata";i:1;a:1:{i:0;s:46:" Codificação do arquivo .tex (utf8, latin1) ";}i:2;i:4383;}i:430;a:3:{i:0;s:15:"tablecell_close";i:1;a:0:{}i:2;i:4429;}i:431;a:3:{i:0;s:14:"tablerow_close";i:1;a:0:{}i:2;i:4430;}i:432;a:3:{i:0;s:13:"tablerow_open";i:1;a:0:{}i:2;i:4430;}i:433;a:3:{i:0;s:16:"tableheader_open";i:1;a:3:{i:0;i:1;i:1;s:4:"left";i:2;i:1;}i:2;i:4430;}i:434;a:3:{i:0;s:5:"cdata";i:1;a:1:{i:0;s:8:" babel  ";}i:2;i:4432;}i:435;a:3:{i:0;s:17:"tableheader_close";i:1;a:0:{}i:2;i:4440;}i:436;a:3:{i:0;s:14:"tablecell_open";i:1;a:3:{i:0;i:1;i:1;N;i:2;i:1;}i:2;i:4440;}i:437;a:3:{i:0;s:5:"cdata";i:1;a:1:{i:0;s:1:" ";}i:2;i:4441;}i:438;a:3:{i:0;s:6:"entity";i:1;a:1:{i:0;s:2:"->";}i:2;i:4442;}i:439;a:3:{i:0;s:5:"cdata";i:1;a:1:{i:0;s:52:" Traduz nomes e formas de data (brazil, portuguese) ";}i:2;i:4444;}i:440;a:3:{i:0;s:15:"tablecell_close";i:1;a:0:{}i:2;i:4496;}i:441;a:3:{i:0;s:14:"tablerow_close";i:1;a:0:{}i:2;i:4497;}i:442;a:3:{i:0;s:13:"tablerow_open";i:1;a:0:{}i:2;i:4497;}i:443;a:3:{i:0;s:16:"tableheader_open";i:1;a:3:{i:0;i:1;i:1;s:4:"left";i:2;i:1;}i:2;i:4497;}i:444;a:3:{i:0;s:5:"cdata";i:1;a:1:{i:0;s:10:" amsmath  ";}i:2;i:4499;}i:445;a:3:{i:0;s:17:"tableheader_close";i:1;a:0:{}i:2;i:4509;}i:446;a:3:{i:0;s:14:"tablecell_open";i:1;a:3:{i:0;i:1;i:1;N;i:2;i:1;}i:2;i:4509;}i:447;a:3:{i:0;s:5:"cdata";i:1;a:1:{i:0;s:1:" ";}i:2;i:4510;}i:448;a:3:{i:0;s:6:"entity";i:1;a:1:{i:0;s:2:"->";}i:2;i:4511;}i:449;a:3:{i:0;s:5:"cdata";i:1;a:1:{i:0;s:24:" Fórmulas matemáticas ";}i:2;i:4513;}i:450;a:3:{i:0;s:15:"tablecell_close";i:1;a:0:{}i:2;i:4537;}i:451;a:3:{i:0;s:14:"tablerow_close";i:1;a:0:{}i:2;i:4538;}i:452;a:3:{i:0;s:13:"tablerow_open";i:1;a:0:{}i:2;i:4538;}i:453;a:3:{i:0;s:16:"tableheader_open";i:1;a:3:{i:0;i:1;i:1;s:4:"left";i:2;i:1;}i:2;i:4538;}i:454;a:3:{i:0;s:5:"cdata";i:1;a:1:{i:0;s:11:" listings  ";}i:2;i:4540;}i:455;a:3:{i:0;s:17:"tableheader_close";i:1;a:0:{}i:2;i:4551;}i:456;a:3:{i:0;s:14:"tablecell_open";i:1;a:3:{i:0;i:1;i:1;N;i:2;i:1;}i:2;i:4551;}i:457;a:3:{i:0;s:5:"cdata";i:1;a:1:{i:0;s:1:" ";}i:2;i:4552;}i:458;a:3:{i:0;s:6:"entity";i:1;a:1:{i:0;s:2:"->";}i:2;i:4553;}i:459;a:3:{i:0;s:5:"cdata";i:1;a:1:{i:0;s:31:" Formatação de código fonte ";}i:2;i:4555;}i:460;a:3:{i:0;s:15:"tablecell_close";i:1;a:0:{}i:2;i:4586;}i:461;a:3:{i:0;s:14:"tablerow_close";i:1;a:0:{}i:2;i:4587;}i:462;a:3:{i:0;s:13:"tablerow_open";i:1;a:0:{}i:2;i:4587;}i:463;a:3:{i:0;s:16:"tableheader_open";i:1;a:3:{i:0;i:1;i:1;s:4:"left";i:2;i:1;}i:2;i:4587;}i:464;a:3:{i:0;s:5:"cdata";i:1;a:1:{i:0;s:14:" indentfirst  ";}i:2;i:4589;}i:465;a:3:{i:0;s:17:"tableheader_close";i:1;a:0:{}i:2;i:4603;}i:466;a:3:{i:0;s:14:"tablecell_open";i:1;a:3:{i:0;i:1;i:1;N;i:2;i:1;}i:2;i:4603;}i:467;a:3:{i:0;s:5:"cdata";i:1;a:1:{i:0;s:1:" ";}i:2;i:4604;}i:468;a:3:{i:0;s:6:"entity";i:1;a:1:{i:0;s:2:"->";}i:2;i:4605;}i:469;a:3:{i:0;s:5:"cdata";i:1;a:1:{i:0;s:45:" Indentação na primeira linha das seções ";}i:2;i:4607;}i:470;a:3:{i:0;s:15:"tablecell_close";i:1;a:0:{}i:2;i:4652;}i:471;a:3:{i:0;s:14:"tablerow_close";i:1;a:0:{}i:2;i:4653;}i:472;a:3:{i:0;s:13:"tablerow_open";i:1;a:0:{}i:2;i:4653;}i:473;a:3:{i:0;s:16:"tableheader_open";i:1;a:3:{i:0;i:1;i:1;s:4:"left";i:2;i:1;}i:2;i:4653;}i:474;a:3:{i:0;s:5:"cdata";i:1;a:1:{i:0;s:11:" verbatim  ";}i:2;i:4655;}i:475;a:3:{i:0;s:17:"tableheader_close";i:1;a:0:{}i:2;i:4666;}i:476;a:3:{i:0;s:14:"tablecell_open";i:1;a:3:{i:0;i:1;i:1;N;i:2;i:1;}i:2;i:4666;}i:477;a:3:{i:0;s:5:"cdata";i:1;a:1:{i:0;s:1:" ";}i:2;i:4667;}i:478;a:3:{i:0;s:6:"entity";i:1;a:1:{i:0;s:2:"->";}i:2;i:4668;}i:479;a:3:{i:0;s:5:"cdata";i:1;a:1:{i:0;s:18:" Ambiente comment ";}i:2;i:4670;}i:480;a:3:{i:0;s:15:"tablecell_close";i:1;a:0:{}i:2;i:4688;}i:481;a:3:{i:0;s:14:"tablerow_close";i:1;a:0:{}i:2;i:4689;}i:482;a:3:{i:0;s:11:"table_close";i:1;a:0:{}i:2;i:4689;}i:483;a:2:{i:0;s:6:"plugin";i:1;a:4:{i:0;s:7:"uparrow";i:1;a:1:{i:0;s:42:"lib/plugins/uparrow/images/tango-small.png";}i:2;i:1;i:3;s:6:"~~UP~~";}}i:484;a:3:{i:0;s:13:"section_close";i:1;a:0:{}i:2;i:4693;}i:485;a:3:{i:0;s:12:"section_edit";i:1;a:4:{i:0;i:4251;i:1;i:4692;i:2;i:2;i:3;s:11:"Use Package";}i:2;i:4693;}i:486;a:3:{i:0;s:6:"header";i:1;a:3:{i:0;s:15:"Considerações";i:1;i:2;i:2;i:4693;}i:2;i:4693;}i:487;a:3:{i:0;s:12:"section_open";i:1;a:1:{i:0;i:2;}i:2;i:4693;}i:488;a:3:{i:0;s:10:"listu_open";i:1;a:0:{}i:2;i:4721;}i:489;a:3:{i:0;s:13:"listitem_open";i:1;a:1:{i:0;i:1;}i:2;i:4721;}i:490;a:3:{i:0;s:16:"listcontent_open";i:1;a:0:{}i:2;i:4721;}i:491;a:3:{i:0;s:5:"cdata";i:1;a:1:{i:0;s:37:" Espaços a mais são desconsiderados";}i:2;i:4725;}i:492;a:3:{i:0;s:17:"listcontent_close";i:1;a:0:{}i:2;i:4762;}i:493;a:3:{i:0;s:14:"listitem_close";i:1;a:0:{}i:2;i:4762;}i:494;a:3:{i:0;s:13:"listitem_open";i:1;a:1:{i:0;i:1;}i:2;i:4762;}i:495;a:3:{i:0;s:16:"listcontent_open";i:1;a:0:{}i:2;i:4762;}i:496;a:3:{i:0;s:5:"cdata";i:1;a:1:{i:0;s:27:" Todo comando começa com \";}i:2;i:4766;}i:497;a:3:{i:0;s:17:"listcontent_close";i:1;a:0:{}i:2;i:4793;}i:498;a:3:{i:0;s:14:"listitem_close";i:1;a:0:{}i:2;i:4793;}i:499;a:3:{i:0;s:13:"listitem_open";i:1;a:1:{i:0;i:1;}i:2;i:4793;}i:500;a:3:{i:0;s:16:"listcontent_open";i:1;a:0:{}i:2;i:4793;}i:501;a:3:{i:0;s:5:"cdata";i:1;a:1:{i:0;s:41:" Comentários de uma linha começam com %";}i:2;i:4797;}i:502;a:3:{i:0;s:17:"listcontent_close";i:1;a:0:{}i:2;i:4838;}i:503;a:3:{i:0;s:14:"listitem_close";i:1;a:0:{}i:2;i:4838;}i:504;a:3:{i:0;s:13:"listitem_open";i:1;a:1:{i:0;i:1;}i:2;i:4838;}i:505;a:3:{i:0;s:16:"listcontent_open";i:1;a:0:{}i:2;i:4838;}i:506;a:3:{i:0;s:5:"cdata";i:1;a:1:{i:0;s:73:" Use \begin{comment} e \end{comment} para comentários com várias linhas";}i:2;i:4842;}i:507;a:3:{i:0;s:17:"listcontent_close";i:1;a:0:{}i:2;i:4915;}i:508;a:3:{i:0;s:14:"listitem_close";i:1;a:0:{}i:2;i:4915;}i:509;a:3:{i:0;s:13:"listitem_open";i:1;a:1:{i:0;i:1;}i:2;i:4915;}i:510;a:3:{i:0;s:16:"listcontent_open";i:1;a:0:{}i:2;i:4915;}i:511;a:3:{i:0;s:5:"cdata";i:1;a:1:{i:0;s:84:" Escape os caracteres $, ^, &, _, {, } e % com uma barra invertida (\$, por exemplo)";}i:2;i:4919;}i:512;a:3:{i:0;s:17:"listcontent_close";i:1;a:0:{}i:2;i:5003;}i:513;a:3:{i:0;s:14:"listitem_close";i:1;a:0:{}i:2;i:5003;}i:514;a:3:{i:0;s:13:"listitem_open";i:1;a:1:{i:0;i:1;}i:2;i:5003;}i:515;a:3:{i:0;s:16:"listcontent_open";i:1;a:0:{}i:2;i:5003;}i:516;a:3:{i:0;s:5:"cdata";i:1;a:1:{i:0;s:31:" Escape \ com \textbackslash{}.";}i:2;i:5007;}i:517;a:3:{i:0;s:17:"listcontent_close";i:1;a:0:{}i:2;i:5038;}i:518;a:3:{i:0;s:14:"listitem_close";i:1;a:0:{}i:2;i:5038;}i:519;a:3:{i:0;s:13:"listitem_open";i:1;a:1:{i:0;i:1;}i:2;i:5038;}i:520;a:3:{i:0;s:16:"listcontent_open";i:1;a:0:{}i:2;i:5038;}i:521;a:3:{i:0;s:5:"cdata";i:1;a:1:{i:0;s:39:" Quebras de linha são sinalizadas com ";}i:2;i:5042;}i:522;a:3:{i:0;s:11:"unformatted";i:1;a:1:{i:0;s:2:"\\";}i:2;i:5083;}i:523;a:3:{i:0;s:17:"listcontent_close";i:1;a:0:{}i:2;i:5087;}i:524;a:3:{i:0;s:14:"listitem_close";i:1;a:0:{}i:2;i:5087;}i:525;a:3:{i:0;s:13:"listitem_open";i:1;a:1:{i:0;i:1;}i:2;i:5087;}i:526;a:3:{i:0;s:16:"listcontent_open";i:1;a:0:{}i:2;i:5087;}i:527;a:3:{i:0;s:5:"cdata";i:1;a:1:{i:0;s:52:" Deixe uma linha em branco para quebrar o parágrafo";}i:2;i:5091;}i:528;a:3:{i:0;s:17:"listcontent_close";i:1;a:0:{}i:2;i:5143;}i:529;a:3:{i:0;s:14:"listitem_close";i:1;a:0:{}i:2;i:5143;}i:530;a:3:{i:0;s:11:"listu_close";i:1;a:0:{}i:2;i:5143;}i:531;a:2:{i:0;s:6:"plugin";i:1;a:4:{i:0;s:7:"uparrow";i:1;a:1:{i:0;s:42:"lib/plugins/uparrow/images/tango-small.png";}i:2;i:1;i:3;s:6:"~~UP~~";}}i:532;a:3:{i:0;s:13:"section_close";i:1;a:0:{}i:2;i:5145;}i:533;a:3:{i:0;s:12:"section_edit";i:1;a:4:{i:0;i:4693;i:1;i:5144;i:2;i:2;i:3;s:15:"Considerações";}i:2;i:5145;}i:534;a:3:{i:0;s:6:"header";i:1;a:3:{i:0;s:6:"Fontes";i:1;i:2;i:2;i:5145;}i:2;i:5145;}i:535;a:3:{i:0;s:12:"section_open";i:1;a:1:{i:0;i:2;}i:2;i:5145;}i:536;a:3:{i:0;s:6:"p_open";i:1;a:0:{}i:2;i:5163;}i:537;a:3:{i:0;s:5:"cdata";i:1;a:1:{i:0;s:43:"
Evite usar! Lembre-se: foco no conteúdo.
";}i:2;i:5164;}i:538;a:3:{i:0;s:7:"p_close";i:1;a:0:{}i:2;i:5207;}i:539;a:3:{i:0;s:10:"table_open";i:1;a:2:{i:0;i:2;i:1;i:4;}i:2;i:5207;}i:540;a:3:{i:0;s:13:"tablerow_open";i:1;a:0:{}i:2;i:5207;}i:541;a:3:{i:0;s:16:"tableheader_open";i:1;a:3:{i:0;i:2;i:1;s:6:"center";i:2;i:1;}i:2;i:5207;}i:542;a:3:{i:0;s:5:"cdata";i:1;a:1:{i:0;s:19:"  Tipos de Fontes  ";}i:2;i:5209;}i:543;a:3:{i:0;s:17:"tableheader_close";i:1;a:0:{}i:2;i:5228;}i:544;a:3:{i:0;s:14:"tablerow_close";i:1;a:0:{}i:2;i:5230;}i:545;a:3:{i:0;s:13:"tablerow_open";i:1;a:0:{}i:2;i:5230;}i:546;a:3:{i:0;s:16:"tableheader_open";i:1;a:3:{i:0;i:1;i:1;s:4:"left";i:2;i:1;}i:2;i:5230;}i:547;a:3:{i:0;s:5:"cdata";i:1;a:1:{i:0;s:10:" \textbf  ";}i:2;i:5232;}i:548;a:3:{i:0;s:17:"tableheader_close";i:1;a:0:{}i:2;i:5242;}i:549;a:3:{i:0;s:14:"tablecell_open";i:1;a:3:{i:0;i:1;i:1;s:4:"left";i:2;i:1;}i:2;i:5242;}i:550;a:3:{i:0;s:5:"cdata";i:1;a:1:{i:0;s:1:" ";}i:2;i:5243;}i:551;a:3:{i:0;s:6:"entity";i:1;a:1:{i:0;s:2:"->";}i:2;i:5244;}i:552;a:3:{i:0;s:5:"cdata";i:1;a:1:{i:0;s:10:" negrito  ";}i:2;i:5246;}i:553;a:3:{i:0;s:15:"tablecell_close";i:1;a:0:{}i:2;i:5256;}i:554;a:3:{i:0;s:14:"tablerow_close";i:1;a:0:{}i:2;i:5257;}i:555;a:3:{i:0;s:13:"tablerow_open";i:1;a:0:{}i:2;i:5257;}i:556;a:3:{i:0;s:16:"tableheader_open";i:1;a:3:{i:0;i:1;i:1;s:4:"left";i:2;i:1;}i:2;i:5257;}i:557;a:3:{i:0;s:5:"cdata";i:1;a:1:{i:0;s:10:" \textit  ";}i:2;i:5259;}i:558;a:3:{i:0;s:17:"tableheader_close";i:1;a:0:{}i:2;i:5269;}i:559;a:3:{i:0;s:14:"tablecell_open";i:1;a:3:{i:0;i:1;i:1;s:4:"left";i:2;i:1;}i:2;i:5269;}i:560;a:3:{i:0;s:5:"cdata";i:1;a:1:{i:0;s:1:" ";}i:2;i:5270;}i:561;a:3:{i:0;s:6:"entity";i:1;a:1:{i:0;s:2:"->";}i:2;i:5271;}i:562;a:3:{i:0;s:5:"cdata";i:1;a:1:{i:0;s:11:" itálico  ";}i:2;i:5273;}i:563;a:3:{i:0;s:15:"tablecell_close";i:1;a:0:{}i:2;i:5284;}i:564;a:3:{i:0;s:14:"tablerow_close";i:1;a:0:{}i:2;i:5285;}i:565;a:3:{i:0;s:13:"tablerow_open";i:1;a:0:{}i:2;i:5285;}i:566;a:3:{i:0;s:16:"tableheader_open";i:1;a:3:{i:0;i:1;i:1;s:4:"left";i:2;i:1;}i:2;i:5285;}i:567;a:3:{i:0;s:5:"cdata";i:1;a:1:{i:0;s:10:" \emph    ";}i:2;i:5287;}i:568;a:3:{i:0;s:17:"tableheader_close";i:1;a:0:{}i:2;i:5297;}i:569;a:3:{i:0;s:14:"tablecell_open";i:1;a:3:{i:0;i:1;i:1;s:4:"left";i:2;i:1;}i:2;i:5297;}i:570;a:3:{i:0;s:5:"cdata";i:1;a:1:{i:0;s:1:" ";}i:2;i:5298;}i:571;a:3:{i:0;s:6:"entity";i:1;a:1:{i:0;s:2:"->";}i:2;i:5299;}i:572;a:3:{i:0;s:5:"cdata";i:1;a:1:{i:0;s:11:" ênfase   ";}i:2;i:5301;}i:573;a:3:{i:0;s:15:"tablecell_close";i:1;a:0:{}i:2;i:5312;}i:574;a:3:{i:0;s:14:"tablerow_close";i:1;a:0:{}i:2;i:5313;}i:575;a:3:{i:0;s:11:"table_close";i:1;a:0:{}i:2;i:5313;}i:576;a:3:{i:0;s:4:"code";i:1;a:3:{i:0;s:82:"
Exemplo de palavras \textbf{em negrito},
\textit{itálico} e \emph{com ênfase}.
";i:1;s:5:"latex";i:2;N;}i:2;i:5320;}i:577;a:3:{i:0;s:6:"p_open";i:1;a:0:{}i:2;i:5416;}i:578;a:3:{i:0;s:13:"internalmedia";i:1;a:7:{i:0;s:25:"tutorials:latex:fonts.png";i:1;N;i:2;N;i:3;s:3:"750";i:4;N;i:5;s:5:"cache";i:6;s:7:"details";}i:2;i:5418;}i:579;a:3:{i:0;s:7:"p_close";i:1;a:0:{}i:2;i:5451;}i:580;a:2:{i:0;s:6:"plugin";i:1;a:4:{i:0;s:7:"uparrow";i:1;a:1:{i:0;s:42:"lib/plugins/uparrow/images/tango-small.png";}i:2;i:1;i:3;s:6:"~~UP~~";}}i:581;a:3:{i:0;s:13:"section_close";i:1;a:0:{}i:2;i:5453;}i:582;a:3:{i:0;s:12:"section_edit";i:1;a:4:{i:0;i:5145;i:1;i:5452;i:2;i:2;i:3;s:6:"Fontes";}i:2;i:5453;}i:583;a:3:{i:0;s:6:"header";i:1;a:3:{i:0;s:17:"Tamanho de Fontes";i:1;i:2;i:2;i:5453;}i:2;i:5453;}i:584;a:3:{i:0;s:12:"section_open";i:1;a:1:{i:0;i:2;}i:2;i:5453;}i:585;a:3:{i:0;s:6:"p_open";i:1;a:0:{}i:2;i:5482;}i:586;a:3:{i:0;s:5:"cdata";i:1;a:1:{i:0;s:43:"
Evite usar! Lembre-se: foco no conteúdo.
";}i:2;i:5483;}i:587;a:3:{i:0;s:7:"p_close";i:1;a:0:{}i:2;i:5526;}i:588;a:3:{i:0;s:10:"table_open";i:1;a:2:{i:0;i:2;i:1;i:4;}i:2;i:5526;}i:589;a:3:{i:0;s:13:"tablerow_open";i:1;a:0:{}i:2;i:5526;}i:590;a:3:{i:0;s:16:"tableheader_open";i:1;a:3:{i:0;i:2;i:1;s:6:"center";i:2;i:1;}i:2;i:5526;}i:591;a:3:{i:0;s:5:"cdata";i:1;a:1:{i:0;s:22:"  Tamanhos de Fontes  ";}i:2;i:5528;}i:592;a:3:{i:0;s:17:"tableheader_close";i:1;a:0:{}i:2;i:5550;}i:593;a:3:{i:0;s:14:"tablerow_close";i:1;a:0:{}i:2;i:5552;}i:594;a:3:{i:0;s:13:"tablerow_open";i:1;a:0:{}i:2;i:5552;}i:595;a:3:{i:0;s:16:"tableheader_open";i:1;a:3:{i:0;i:1;i:1;s:4:"left";i:2;i:1;}i:2;i:5552;}i:596;a:3:{i:0;s:5:"cdata";i:1;a:1:{i:0;s:8:" \tiny  ";}i:2;i:5554;}i:597;a:3:{i:0;s:17:"tableheader_close";i:1;a:0:{}i:2;i:5562;}i:598;a:3:{i:0;s:14:"tablecell_open";i:1;a:3:{i:0;i:1;i:1;s:4:"left";i:2;i:1;}i:2;i:5562;}i:599;a:3:{i:0;s:5:"cdata";i:1;a:1:{i:0;s:1:" ";}i:2;i:5563;}i:600;a:3:{i:0;s:6:"entity";i:1;a:1:{i:0;s:2:"->";}i:2;i:5564;}i:601;a:3:{i:0;s:5:"cdata";i:1;a:1:{i:0;s:7:" tiny  ";}i:2;i:5566;}i:602;a:3:{i:0;s:15:"tablecell_close";i:1;a:0:{}i:2;i:5573;}i:603;a:3:{i:0;s:14:"tablerow_close";i:1;a:0:{}i:2;i:5574;}i:604;a:3:{i:0;s:13:"tablerow_open";i:1;a:0:{}i:2;i:5574;}i:605;a:3:{i:0;s:16:"tableheader_open";i:1;a:3:{i:0;i:1;i:1;s:4:"left";i:2;i:1;}i:2;i:5574;}i:606;a:3:{i:0;s:5:"cdata";i:1;a:1:{i:0;s:14:" \normalsize  ";}i:2;i:5576;}i:607;a:3:{i:0;s:17:"tableheader_close";i:1;a:0:{}i:2;i:5590;}i:608;a:3:{i:0;s:14:"tablecell_open";i:1;a:3:{i:0;i:1;i:1;s:4:"left";i:2;i:1;}i:2;i:5590;}i:609;a:3:{i:0;s:5:"cdata";i:1;a:1:{i:0;s:1:" ";}i:2;i:5591;}i:610;a:3:{i:0;s:6:"entity";i:1;a:1:{i:0;s:2:"->";}i:2;i:5592;}i:611;a:3:{i:0;s:5:"cdata";i:1;a:1:{i:0;s:9:" normal  ";}i:2;i:5594;}i:612;a:3:{i:0;s:15:"tablecell_close";i:1;a:0:{}i:2;i:5603;}i:613;a:3:{i:0;s:14:"tablerow_close";i:1;a:0:{}i:2;i:5604;}i:614;a:3:{i:0;s:13:"tablerow_open";i:1;a:0:{}i:2;i:5604;}i:615;a:3:{i:0;s:16:"tableheader_open";i:1;a:3:{i:0;i:1;i:1;s:4:"left";i:2;i:1;}i:2;i:5604;}i:616;a:3:{i:0;s:5:"cdata";i:1;a:1:{i:0;s:8:" \Huge  ";}i:2;i:5606;}i:617;a:3:{i:0;s:17:"tableheader_close";i:1;a:0:{}i:2;i:5614;}i:618;a:3:{i:0;s:14:"tablecell_open";i:1;a:3:{i:0;i:1;i:1;s:4:"left";i:2;i:1;}i:2;i:5614;}i:619;a:3:{i:0;s:5:"cdata";i:1;a:1:{i:0;s:1:" ";}i:2;i:5615;}i:620;a:3:{i:0;s:6:"entity";i:1;a:1:{i:0;s:2:"->";}i:2;i:5616;}i:621;a:3:{i:0;s:5:"cdata";i:1;a:1:{i:0;s:10:" largest  ";}i:2;i:5618;}i:622;a:3:{i:0;s:15:"tablecell_close";i:1;a:0:{}i:2;i:5628;}i:623;a:3:{i:0;s:14:"tablerow_close";i:1;a:0:{}i:2;i:5629;}i:624;a:3:{i:0;s:11:"table_close";i:1;a:0:{}i:2;i:5629;}i:625;a:3:{i:0;s:4:"code";i:1;a:3:{i:0;s:100:"
Exemplo de palavras \tiny{muito pequenas},
\normalsize{com tamanho normal} e \Huge{muito grandes}.
";i:1;s:5:"latex";i:2;N;}i:2;i:5636;}i:626;a:3:{i:0;s:6:"p_open";i:1;a:0:{}i:2;i:5750;}i:627;a:3:{i:0;s:13:"internalmedia";i:1;a:7:{i:0;s:30:"tutorials:latex:font_sizes.png";i:1;N;i:2;N;i:3;s:3:"750";i:4;N;i:5;s:5:"cache";i:6;s:7:"details";}i:2;i:5752;}i:628;a:3:{i:0;s:7:"p_close";i:1;a:0:{}i:2;i:5790;}i:629;a:2:{i:0;s:6:"plugin";i:1;a:4:{i:0;s:7:"uparrow";i:1;a:1:{i:0;s:42:"lib/plugins/uparrow/images/tango-small.png";}i:2;i:1;i:3;s:6:"~~UP~~";}}i:630;a:3:{i:0;s:13:"section_close";i:1;a:0:{}i:2;i:5792;}i:631;a:3:{i:0;s:12:"section_edit";i:1;a:4:{i:0;i:5453;i:1;i:5791;i:2;i:2;i:3;s:17:"Tamanho de Fontes";}i:2;i:5792;}i:632;a:3:{i:0;s:6:"header";i:1;a:3:{i:0;s:14:"Estruturação";i:1;i:2;i:2;i:5792;}i:2;i:5792;}i:633;a:3:{i:0;s:12:"section_open";i:1;a:1:{i:0;i:2;}i:2;i:5792;}i:634;a:3:{i:0;s:10:"listu_open";i:1;a:0:{}i:2;i:5819;}i:635;a:3:{i:0;s:13:"listitem_open";i:1;a:1:{i:0;i:1;}i:2;i:5819;}i:636;a:3:{i:0;s:16:"listcontent_open";i:1;a:0:{}i:2;i:5819;}i:637;a:3:{i:0;s:5:"cdata";i:1;a:1:{i:0;s:51:" Documentos são estruturados através de ambientes";}i:2;i:5823;}i:638;a:3:{i:0;s:17:"listcontent_close";i:1;a:0:{}i:2;i:5874;}i:639;a:3:{i:0;s:14:"listitem_close";i:1;a:0:{}i:2;i:5874;}i:640;a:3:{i:0;s:13:"listitem_open";i:1;a:1:{i:0;i:1;}i:2;i:5874;}i:641;a:3:{i:0;s:16:"listcontent_open";i:1;a:0:{}i:2;i:5874;}i:642;a:3:{i:0;s:5:"cdata";i:1;a:1:{i:0;s:65:" Ambientes são delimitados por \begin{ambiente} e \end{ambiente}";}i:2;i:5878;}i:643;a:3:{i:0;s:17:"listcontent_close";i:1;a:0:{}i:2;i:5943;}i:644;a:3:{i:0;s:14:"listitem_close";i:1;a:0:{}i:2;i:5943;}i:645;a:3:{i:0;s:13:"listitem_open";i:1;a:1:{i:0;i:1;}i:2;i:5943;}i:646;a:3:{i:0;s:16:"listcontent_open";i:1;a:0:{}i:2;i:5943;}i:647;a:3:{i:0;s:5:"cdata";i:1;a:1:{i:0;s:59:" Tudo que aparece entre esses comandos pertence ao ambiente";}i:2;i:5947;}i:648;a:3:{i:0;s:17:"listcontent_close";i:1;a:0:{}i:2;i:6006;}i:649;a:3:{i:0;s:14:"listitem_close";i:1;a:0:{}i:2;i:6006;}i:650;a:3:{i:0;s:13:"listitem_open";i:1;a:1:{i:0;i:1;}i:2;i:6006;}i:651;a:3:{i:0;s:16:"listcontent_open";i:1;a:0:{}i:2;i:6006;}i:652;a:3:{i:0;s:5:"cdata";i:1;a:1:{i:0;s:30:" Ambientes podem ser aninhados";}i:2;i:6010;}i:653;a:3:{i:0;s:17:"listcontent_close";i:1;a:0:{}i:2;i:6040;}i:654;a:3:{i:0;s:14:"listitem_close";i:1;a:0:{}i:2;i:6040;}i:655;a:3:{i:0;s:11:"listu_close";i:1;a:0:{}i:2;i:6040;}i:656;a:2:{i:0;s:6:"plugin";i:1;a:4:{i:0;s:7:"uparrow";i:1;a:1:{i:0;s:42:"lib/plugins/uparrow/images/tango-small.png";}i:2;i:1;i:3;s:6:"~~UP~~";}}i:657;a:3:{i:0;s:13:"section_close";i:1;a:0:{}i:2;i:6042;}i:658;a:3:{i:0;s:12:"section_edit";i:1;a:4:{i:0;i:5792;i:1;i:6041;i:2;i:2;i:3;s:14:"Estruturação";}i:2;i:6042;}i:659;a:3:{i:0;s:6:"header";i:1;a:3:{i:0;s:15:"Mais Um Exemplo";i:1;i:2;i:2;i:6042;}i:2;i:6042;}i:660;a:3:{i:0;s:12:"section_open";i:1;a:1:{i:0;i:2;}i:2;i:6042;}i:661;a:3:{i:0;s:4:"code";i:1;a:3:{i:0;s:492:"
\begin{document}
  \maketitle       % título
  \begin{abstract}
% resumo aqui
  \end{abstract}
  \tableofcontents % sumário
  \section{Título da Primeira Seção}
% corpo da seção (1)
    \subsection{Título da Primeira Sub-seção}
% corpo da sub-seção (1.1)
      \subsubsection{Título da Sub-sub-seção}
% corpo da sub-sub-seção (1.1.1)
    \subsection{Outra sub-seção}
% corpo da outra sub-seção (1.2)
  \section{Outra Seção)
% corpo da outra seção (2)
\end{document}
";i:1;s:5:"latex";i:2;N;}i:2;i:6076;}i:662;a:2:{i:0;s:6:"plugin";i:1;a:4:{i:0;s:7:"uparrow";i:1;a:1:{i:0;s:42:"lib/plugins/uparrow/images/tango-small.png";}i:2;i:1;i:3;s:6:"~~UP~~";}}i:663;a:3:{i:0;s:13:"section_close";i:1;a:0:{}i:2;i:6584;}i:664;a:3:{i:0;s:12:"section_edit";i:1;a:4:{i:0;i:6042;i:1;i:6583;i:2;i:2;i:3;s:15:"Mais Um Exemplo";}i:2;i:6584;}i:665;a:3:{i:0;s:6:"header";i:1;a:3:{i:0;s:6:"Listas";i:1;i:2;i:2;i:6584;}i:2;i:6584;}i:666;a:3:{i:0;s:12:"section_open";i:1;a:1:{i:0;i:2;}i:2;i:6584;}i:667;a:3:{i:0;s:10:"table_open";i:1;a:2:{i:0;i:2;i:1;i:4;}i:2;i:6603;}i:668;a:3:{i:0;s:13:"tablerow_open";i:1;a:0:{}i:2;i:6603;}i:669;a:3:{i:0;s:16:"tableheader_open";i:1;a:3:{i:0;i:2;i:1;s:6:"center";i:2;i:1;}i:2;i:6603;}i:670;a:3:{i:0;s:5:"cdata";i:1;a:1:{i:0;s:19:"  Tipos de Listas  ";}i:2;i:6605;}i:671;a:3:{i:0;s:17:"tableheader_close";i:1;a:0:{}i:2;i:6624;}i:672;a:3:{i:0;s:14:"tablerow_close";i:1;a:0:{}i:2;i:6626;}i:673;a:3:{i:0;s:13:"tablerow_open";i:1;a:0:{}i:2;i:6626;}i:674;a:3:{i:0;s:16:"tableheader_open";i:1;a:3:{i:0;i:1;i:1;s:4:"left";i:2;i:1;}i:2;i:6626;}i:675;a:3:{i:0;s:5:"cdata";i:1;a:1:{i:0;s:10:" itemize  ";}i:2;i:6628;}i:676;a:3:{i:0;s:17:"tableheader_close";i:1;a:0:{}i:2;i:6638;}i:677;a:3:{i:0;s:14:"tablecell_open";i:1;a:3:{i:0;i:1;i:1;s:4:"left";i:2;i:1;}i:2;i:6638;}i:678;a:3:{i:0;s:5:"cdata";i:1;a:1:{i:0;s:1:" ";}i:2;i:6639;}i:679;a:3:{i:0;s:6:"entity";i:1;a:1:{i:0;s:2:"->";}i:2;i:6640;}i:680;a:3:{i:0;s:5:"cdata";i:1;a:1:{i:0;s:20:" lista desordenada  ";}i:2;i:6642;}i:681;a:3:{i:0;s:15:"tablecell_close";i:1;a:0:{}i:2;i:6662;}i:682;a:3:{i:0;s:14:"tablerow_close";i:1;a:0:{}i:2;i:6663;}i:683;a:3:{i:0;s:13:"tablerow_open";i:1;a:0:{}i:2;i:6663;}i:684;a:3:{i:0;s:16:"tableheader_open";i:1;a:3:{i:0;i:1;i:1;s:4:"left";i:2;i:1;}i:2;i:6663;}i:685;a:3:{i:0;s:5:"cdata";i:1;a:1:{i:0;s:12:" enumerate  ";}i:2;i:6665;}i:686;a:3:{i:0;s:17:"tableheader_close";i:1;a:0:{}i:2;i:6677;}i:687;a:3:{i:0;s:14:"tablecell_open";i:1;a:3:{i:0;i:1;i:1;s:4:"left";i:2;i:1;}i:2;i:6677;}i:688;a:3:{i:0;s:5:"cdata";i:1;a:1:{i:0;s:1:" ";}i:2;i:6678;}i:689;a:3:{i:0;s:6:"entity";i:1;a:1:{i:0;s:2:"->";}i:2;i:6679;}i:690;a:3:{i:0;s:5:"cdata";i:1;a:1:{i:0;s:17:" lista ordenada  ";}i:2;i:6681;}i:691;a:3:{i:0;s:15:"tablecell_close";i:1;a:0:{}i:2;i:6698;}i:692;a:3:{i:0;s:14:"tablerow_close";i:1;a:0:{}i:2;i:6699;}i:693;a:3:{i:0;s:13:"tablerow_open";i:1;a:0:{}i:2;i:6699;}i:694;a:3:{i:0;s:16:"tableheader_open";i:1;a:3:{i:0;i:1;i:1;s:4:"left";i:2;i:1;}i:2;i:6699;}i:695;a:3:{i:0;s:5:"cdata";i:1;a:1:{i:0;s:14:" description  ";}i:2;i:6701;}i:696;a:3:{i:0;s:17:"tableheader_close";i:1;a:0:{}i:2;i:6715;}i:697;a:3:{i:0;s:14:"tablecell_open";i:1;a:3:{i:0;i:1;i:1;s:4:"left";i:2;i:1;}i:2;i:6715;}i:698;a:3:{i:0;s:5:"cdata";i:1;a:1:{i:0;s:1:" ";}i:2;i:6716;}i:699;a:3:{i:0;s:6:"entity";i:1;a:1:{i:0;s:2:"->";}i:2;i:6717;}i:700;a:3:{i:0;s:5:"cdata";i:1;a:1:{i:0;s:19:" lista descritiva  ";}i:2;i:6719;}i:701;a:3:{i:0;s:15:"tablecell_close";i:1;a:0:{}i:2;i:6738;}i:702;a:3:{i:0;s:14:"tablerow_close";i:1;a:0:{}i:2;i:6739;}i:703;a:3:{i:0;s:11:"table_close";i:1;a:0:{}i:2;i:6739;}i:704;a:2:{i:0;s:6:"plugin";i:1;a:4:{i:0;s:7:"uparrow";i:1;a:1:{i:0;s:42:"lib/plugins/uparrow/images/tango-small.png";}i:2;i:1;i:3;s:6:"~~UP~~";}}i:705;a:3:{i:0;s:13:"section_close";i:1;a:0:{}i:2;i:6741;}i:706;a:3:{i:0;s:12:"section_edit";i:1;a:4:{i:0;i:6584;i:1;i:6740;i:2;i:2;i:3;s:6:"Listas";}i:2;i:6741;}i:707;a:3:{i:0;s:6:"header";i:1;a:3:{i:0;s:15:"Exemplo Itemize";i:1;i:2;i:2;i:6741;}i:2;i:6741;}i:708;a:3:{i:0;s:12:"section_open";i:1;a:1:{i:0;i:2;}i:2;i:6741;}i:709;a:3:{i:0;s:4:"code";i:1;a:3:{i:0;s:197:"
\begin{itemize}    % início da lista desordenada
  \item um item    % item da lista desordenada
  \item outro item % outro item da lista desordenada
\end{itemize}      % fim da lista desordenada
";i:1;s:5:"latex";i:2;N;}i:2;i:6775;}i:710;a:3:{i:0;s:6:"p_open";i:1;a:0:{}i:2;i:6986;}i:711;a:3:{i:0;s:13:"internalmedia";i:1;a:7:{i:0;s:27:"tutorials:latex:itemize.png";i:1;N;i:2;N;i:3;s:3:"125";i:4;N;i:5;s:5:"cache";i:6;s:7:"details";}i:2;i:6988;}i:712;a:3:{i:0;s:7:"p_close";i:1;a:0:{}i:2;i:7023;}i:713;a:2:{i:0;s:6:"plugin";i:1;a:4:{i:0;s:7:"uparrow";i:1;a:1:{i:0;s:42:"lib/plugins/uparrow/images/tango-small.png";}i:2;i:1;i:3;s:6:"~~UP~~";}}i:714;a:3:{i:0;s:13:"section_close";i:1;a:0:{}i:2;i:7025;}i:715;a:3:{i:0;s:12:"section_edit";i:1;a:4:{i:0;i:6741;i:1;i:7024;i:2;i:2;i:3;s:15:"Exemplo Itemize";}i:2;i:7025;}i:716;a:3:{i:0;s:6:"header";i:1;a:3:{i:0;s:17:"Exemplo Enumerate";i:1;i:2;i:2;i:7025;}i:2;i:7025;}i:717;a:3:{i:0;s:12:"section_open";i:1;a:1:{i:0;i:2;}i:2;i:7025;}i:718;a:3:{i:0;s:4:"code";i:1;a:3:{i:0;s:197:"
\begin{enumerate}     % início da lista ordenada
  \item primeiro item % item da lista ordenada
  \item segundo item  % outro item da lista ordenada
\end{enumerate}       % fim da lista ordenada
";i:1;s:5:"latex";i:2;N;}i:2;i:7061;}i:719;a:3:{i:0;s:6:"p_open";i:1;a:0:{}i:2;i:7272;}i:720;a:3:{i:0;s:13:"internalmedia";i:1;a:7:{i:0;s:29:"tutorials:latex:enumerate.png";i:1;N;i:2;N;i:3;s:3:"125";i:4;N;i:5;s:5:"cache";i:6;s:7:"details";}i:2;i:7274;}i:721;a:3:{i:0;s:7:"p_close";i:1;a:0:{}i:2;i:7311;}i:722;a:2:{i:0;s:6:"plugin";i:1;a:4:{i:0;s:7:"uparrow";i:1;a:1:{i:0;s:42:"lib/plugins/uparrow/images/tango-small.png";}i:2;i:1;i:3;s:6:"~~UP~~";}}i:723;a:3:{i:0;s:13:"section_close";i:1;a:0:{}i:2;i:7313;}i:724;a:3:{i:0;s:12:"section_edit";i:1;a:4:{i:0;i:7025;i:1;i:7312;i:2;i:2;i:3;s:17:"Exemplo Enumerate";}i:2;i:7313;}i:725;a:3:{i:0;s:6:"header";i:1;a:3:{i:0;s:19:"Exemplo Description";i:1;i:2;i:2;i:7313;}i:2;i:7313;}i:726;a:3:{i:0;s:12:"section_open";i:1;a:1:{i:0;i:2;}i:2;i:7313;}i:727;a:3:{i:0;s:4:"code";i:1;a:3:{i:0;s:214:"
\begin{description} % lista descritiva
  % item da lista descritiva
  \item[nome do item:] descrição do item
  \item[nome do outro item:]  descrição do outro item
\end{description}   % fim da lista descritiva
";i:1;s:5:"latex";i:2;N;}i:2;i:7351;}i:728;a:3:{i:0;s:6:"p_open";i:1;a:0:{}i:2;i:7579;}i:729;a:3:{i:0;s:13:"internalmedia";i:1;a:7:{i:0;s:31:"tutorials:latex:description.png";i:1;N;i:2;N;i:3;s:3:"500";i:4;N;i:5;s:5:"cache";i:6;s:7:"details";}i:2;i:7581;}i:730;a:3:{i:0;s:7:"p_close";i:1;a:0:{}i:2;i:7620;}i:731;a:2:{i:0;s:6:"plugin";i:1;a:4:{i:0;s:7:"uparrow";i:1;a:1:{i:0;s:42:"lib/plugins/uparrow/images/tango-small.png";}i:2;i:1;i:3;s:6:"~~UP~~";}}i:732;a:3:{i:0;s:13:"section_close";i:1;a:0:{}i:2;i:7622;}i:733;a:3:{i:0;s:12:"section_edit";i:1;a:4:{i:0;i:7313;i:1;i:7621;i:2;i:2;i:3;s:19:"Exemplo Description";}i:2;i:7622;}i:734;a:3:{i:0;s:6:"header";i:1;a:3:{i:0;s:12:"Referências";i:1;i:2;i:2;i:7622;}i:2;i:7622;}i:735;a:3:{i:0;s:12:"section_open";i:1;a:1:{i:0;i:2;}i:2;i:7622;}i:736;a:3:{i:0;s:10:"table_open";i:1;a:2:{i:0;i:2;i:1;i:6;}i:2;i:7647;}i:737;a:3:{i:0;s:13:"tablerow_open";i:1;a:0:{}i:2;i:7647;}i:738;a:3:{i:0;s:16:"tableheader_open";i:1;a:3:{i:0;i:2;i:1;s:6:"center";i:2;i:1;}i:2;i:7647;}i:739;a:3:{i:0;s:5:"cdata";i:1;a:1:{i:0;s:15:"  Definição  ";}i:2;i:7649;}i:740;a:3:{i:0;s:17:"tableheader_close";i:1;a:0:{}i:2;i:7664;}i:741;a:3:{i:0;s:14:"tablerow_close";i:1;a:0:{}i:2;i:7666;}i:742;a:3:{i:0;s:13:"tablerow_open";i:1;a:0:{}i:2;i:7666;}i:743;a:3:{i:0;s:16:"tableheader_open";i:1;a:3:{i:0;i:1;i:1;s:4:"left";i:2;i:1;}i:2;i:7666;}i:744;a:3:{i:0;s:5:"cdata";i:1;a:1:{i:0;s:15:" \label{nome}  ";}i:2;i:7668;}i:745;a:3:{i:0;s:17:"tableheader_close";i:1;a:0:{}i:2;i:7683;}i:746;a:3:{i:0;s:14:"tablecell_open";i:1;a:3:{i:0;i:1;i:1;s:4:"left";i:2;i:1;}i:2;i:7683;}i:747;a:3:{i:0;s:5:"cdata";i:1;a:1:{i:0;s:1:" ";}i:2;i:7684;}i:748;a:3:{i:0;s:6:"entity";i:1;a:1:{i:0;s:2:"->";}i:2;i:7685;}i:749;a:3:{i:0;s:5:"cdata";i:1;a:1:{i:0;s:43:" colocado no lugar que será referenciado  ";}i:2;i:7687;}i:750;a:3:{i:0;s:15:"tablecell_close";i:1;a:0:{}i:2;i:7730;}i:751;a:3:{i:0;s:14:"tablerow_close";i:1;a:0:{}i:2;i:7731;}i:752;a:3:{i:0;s:13:"tablerow_open";i:1;a:0:{}i:2;i:7731;}i:753;a:3:{i:0;s:16:"tableheader_open";i:1;a:3:{i:0;i:2;i:1;s:6:"center";i:2;i:1;}i:2;i:7731;}i:754;a:3:{i:0;s:5:"cdata";i:1;a:1:{i:0;s:16:"  Utilização  ";}i:2;i:7733;}i:755;a:3:{i:0;s:17:"tableheader_close";i:1;a:0:{}i:2;i:7749;}i:756;a:3:{i:0;s:14:"tablerow_close";i:1;a:0:{}i:2;i:7751;}i:757;a:3:{i:0;s:13:"tablerow_open";i:1;a:0:{}i:2;i:7751;}i:758;a:3:{i:0;s:16:"tableheader_open";i:1;a:3:{i:0;i:1;i:1;s:4:"left";i:2;i:1;}i:2;i:7751;}i:759;a:3:{i:0;s:5:"cdata";i:1;a:1:{i:0;s:13:" \ref{nome}  ";}i:2;i:7753;}i:760;a:3:{i:0;s:17:"tableheader_close";i:1;a:0:{}i:2;i:7766;}i:761;a:3:{i:0;s:14:"tablecell_open";i:1;a:3:{i:0;i:1;i:1;s:4:"left";i:2;i:1;}i:2;i:7766;}i:762;a:3:{i:0;s:5:"cdata";i:1;a:1:{i:0;s:1:" ";}i:2;i:7767;}i:763;a:3:{i:0;s:6:"entity";i:1;a:1:{i:0;s:2:"->";}i:2;i:7768;}i:764;a:3:{i:0;s:5:"cdata";i:1;a:1:{i:0;s:39:" referencia a seção, tabela, figura  ";}i:2;i:7770;}i:765;a:3:{i:0;s:15:"tablecell_close";i:1;a:0:{}i:2;i:7809;}i:766;a:3:{i:0;s:14:"tablerow_close";i:1;a:0:{}i:2;i:7810;}i:767;a:3:{i:0;s:13:"tablerow_open";i:1;a:0:{}i:2;i:7810;}i:768;a:3:{i:0;s:16:"tableheader_open";i:1;a:3:{i:0;i:1;i:1;s:4:"left";i:2;i:1;}i:2;i:7810;}i:769;a:3:{i:0;s:5:"cdata";i:1;a:1:{i:0;s:17:" \pageref{nome}  ";}i:2;i:7812;}i:770;a:3:{i:0;s:17:"tableheader_close";i:1;a:0:{}i:2;i:7829;}i:771;a:3:{i:0;s:14:"tablecell_open";i:1;a:3:{i:0;i:1;i:1;s:4:"left";i:2;i:1;}i:2;i:7829;}i:772;a:3:{i:0;s:5:"cdata";i:1;a:1:{i:0;s:1:" ";}i:2;i:7830;}i:773;a:3:{i:0;s:6:"entity";i:1;a:1:{i:0;s:2:"->";}i:2;i:7831;}i:774;a:3:{i:0;s:5:"cdata";i:1;a:1:{i:0;s:23:" referencia a página  ";}i:2;i:7833;}i:775;a:3:{i:0;s:15:"tablecell_close";i:1;a:0:{}i:2;i:7856;}i:776;a:3:{i:0;s:14:"tablerow_close";i:1;a:0:{}i:2;i:7857;}i:777;a:3:{i:0;s:13:"tablerow_open";i:1;a:0:{}i:2;i:7857;}i:778;a:3:{i:0;s:16:"tableheader_open";i:1;a:3:{i:0;i:1;i:1;s:4:"left";i:2;i:1;}i:2;i:7857;}i:779;a:3:{i:0;s:5:"cdata";i:1;a:1:{i:0;s:15:" \eqref{nome}  ";}i:2;i:7859;}i:780;a:3:{i:0;s:17:"tableheader_close";i:1;a:0:{}i:2;i:7874;}i:781;a:3:{i:0;s:14:"tablecell_open";i:1;a:3:{i:0;i:1;i:1;s:4:"left";i:2;i:1;}i:2;i:7874;}i:782;a:3:{i:0;s:5:"cdata";i:1;a:1:{i:0;s:1:" ";}i:2;i:7875;}i:783;a:3:{i:0;s:6:"entity";i:1;a:1:{i:0;s:2:"->";}i:2;i:7876;}i:784;a:3:{i:0;s:5:"cdata";i:1;a:1:{i:0;s:25:" referencia a equação  ";}i:2;i:7878;}i:785;a:3:{i:0;s:15:"tablecell_close";i:1;a:0:{}i:2;i:7903;}i:786;a:3:{i:0;s:14:"tablerow_close";i:1;a:0:{}i:2;i:7904;}i:787;a:3:{i:0;s:11:"table_close";i:1;a:0:{}i:2;i:7904;}i:788;a:2:{i:0;s:6:"plugin";i:1;a:4:{i:0;s:7:"uparrow";i:1;a:1:{i:0;s:42:"lib/plugins/uparrow/images/tango-small.png";}i:2;i:1;i:3;s:6:"~~UP~~";}}i:789;a:3:{i:0;s:13:"section_close";i:1;a:0:{}i:2;i:7906;}i:790;a:3:{i:0;s:12:"section_edit";i:1;a:4:{i:0;i:7622;i:1;i:7905;i:2;i:2;i:3;s:12:"Referências";}i:2;i:7906;}i:791;a:3:{i:0;s:6:"header";i:1;a:3:{i:0;s:23:"Exemplo de Referências";i:1;i:2;i:2;i:7906;}i:2;i:7906;}i:792;a:3:{i:0;s:12:"section_open";i:1;a:1:{i:0;i:2;}i:2;i:7906;}i:793;a:3:{i:0;s:4:"code";i:1;a:3:{i:0;s:198:"
  \section{Informática}
     Esta seção fala sobre informática. \label{inf}
  % ...
  \section{Conclusão}
     Como visto na seção \ref{inf} (pág. \pageref{inf}),
     a informática % ...
";i:1;s:5:"latex";i:2;N;}i:2;i:7948;}i:794;a:3:{i:0;s:6:"p_open";i:1;a:0:{}i:2;i:8160;}i:795;a:3:{i:0;s:13:"internalmedia";i:1;a:7:{i:0;s:30:"tutorials:latex:references.png";i:1;N;i:2;N;i:3;s:3:"300";i:4;N;i:5;s:5:"cache";i:6;s:7:"details";}i:2;i:8162;}i:796;a:3:{i:0;s:7:"p_close";i:1;a:0:{}i:2;i:8200;}i:797;a:2:{i:0;s:6:"plugin";i:1;a:4:{i:0;s:7:"uparrow";i:1;a:1:{i:0;s:42:"lib/plugins/uparrow/images/tango-small.png";}i:2;i:1;i:3;s:6:"~~UP~~";}}i:798;a:3:{i:0;s:13:"section_close";i:1;a:0:{}i:2;i:8202;}i:799;a:3:{i:0;s:12:"section_edit";i:1;a:4:{i:0;i:7906;i:1;i:8201;i:2;i:2;i:3;s:23:"Exemplo de Referências";}i:2;i:8202;}i:800;a:3:{i:0;s:6:"header";i:1;a:3:{i:0;s:16:"Notas de Rodapé";i:1;i:2;i:2;i:8202;}i:2;i:8202;}i:801;a:3:{i:0;s:12:"section_open";i:1;a:1:{i:0;i:2;}i:2;i:8202;}i:802;a:3:{i:0;s:4:"code";i:1;a:3:{i:0;s:59:"
  % ...
  \footnote{Esta é uma nota de rodapé.}
  % ...
";i:1;s:5:"latex";i:2;N;}i:2;i:8237;}i:803;a:3:{i:0;s:4:"code";i:1;a:3:{i:0;s:253:"
  \author{
    Kauê Soares da Silveira
      \footnote{UFRGS}
    \and Fábio da Fontoura Beltrão
      \footnotemark[\value{footnote}] % mesmo footnote anterior
    \and Matheus de Carvalho Proença
      \footnote{École Centrale de Marseille}
  }
";i:1;s:5:"latex";i:2;N;}i:2;i:8317;}i:804;a:2:{i:0;s:6:"plugin";i:1;a:4:{i:0;s:7:"uparrow";i:1;a:1:{i:0;s:42:"lib/plugins/uparrow/images/tango-small.png";}i:2;i:1;i:3;s:6:"~~UP~~";}}i:805;a:3:{i:0;s:13:"section_close";i:1;a:0:{}i:2;i:8586;}i:806;a:3:{i:0;s:12:"section_edit";i:1;a:4:{i:0;i:8202;i:1;i:8585;i:2;i:2;i:3;s:16:"Notas de Rodapé";}i:2;i:8586;}i:807;a:3:{i:0;s:6:"header";i:1;a:3:{i:0;s:22:"Fórmulas Matemáticas";i:1;i:2;i:2;i:8586;}i:2;i:8586;}i:808;a:3:{i:0;s:12:"section_open";i:1;a:1:{i:0;i:2;}i:2;i:8586;}i:809;a:3:{i:0;s:10:"table_open";i:1;a:2:{i:0;i:2;i:1;i:2;}i:2;i:8621;}i:810;a:3:{i:0;s:13:"tablerow_open";i:1;a:0:{}i:2;i:8621;}i:811;a:3:{i:0;s:16:"tableheader_open";i:1;a:3:{i:0;i:1;i:1;s:4:"left";i:2;i:1;}i:2;i:8621;}i:812;a:3:{i:0;s:5:"cdata";i:1;a:1:{i:0;s:4:" $  ";}i:2;i:8623;}i:813;a:3:{i:0;s:6:"entity";i:1;a:1:{i:0;s:3:"...";}i:2;i:8627;}i:814;a:3:{i:0;s:5:"cdata";i:1;a:1:{i:0;s:5:"  $  ";}i:2;i:8630;}i:815;a:3:{i:0;s:17:"tableheader_close";i:1;a:0:{}i:2;i:8635;}i:816;a:3:{i:0;s:14:"tablecell_open";i:1;a:3:{i:0;i:1;i:1;s:4:"left";i:2;i:1;}i:2;i:8635;}i:817;a:3:{i:0;s:5:"cdata";i:1;a:1:{i:0;s:1:" ";}i:2;i:8636;}i:818;a:3:{i:0;s:6:"entity";i:1;a:1:{i:0;s:2:"->";}i:2;i:8637;}i:819;a:3:{i:0;s:5:"cdata";i:1;a:1:{i:0;s:20:" Inserção inline  ";}i:2;i:8639;}i:820;a:3:{i:0;s:15:"tablecell_close";i:1;a:0:{}i:2;i:8659;}i:821;a:3:{i:0;s:14:"tablerow_close";i:1;a:0:{}i:2;i:8660;}i:822;a:3:{i:0;s:13:"tablerow_open";i:1;a:0:{}i:2;i:8660;}i:823;a:3:{i:0;s:16:"tableheader_open";i:1;a:3:{i:0;i:1;i:1;s:4:"left";i:2;i:1;}i:2;i:8660;}i:824;a:3:{i:0;s:5:"cdata";i:1;a:1:{i:0;s:4:" $$ ";}i:2;i:8662;}i:825;a:3:{i:0;s:6:"entity";i:1;a:1:{i:0;s:3:"...";}i:2;i:8666;}i:826;a:3:{i:0;s:5:"cdata";i:1;a:1:{i:0;s:5:" $$  ";}i:2;i:8669;}i:827;a:3:{i:0;s:17:"tableheader_close";i:1;a:0:{}i:2;i:8674;}i:828;a:3:{i:0;s:14:"tablecell_open";i:1;a:3:{i:0;i:1;i:1;s:4:"left";i:2;i:1;}i:2;i:8674;}i:829;a:3:{i:0;s:5:"cdata";i:1;a:1:{i:0;s:1:" ";}i:2;i:8675;}i:830;a:3:{i:0;s:6:"entity";i:1;a:1:{i:0;s:2:"->";}i:2;i:8676;}i:831;a:3:{i:0;s:5:"cdata";i:1;a:1:{i:0;s:27:" Inserção em nova linha  ";}i:2;i:8678;}i:832;a:3:{i:0;s:15:"tablecell_close";i:1;a:0:{}i:2;i:8705;}i:833;a:3:{i:0;s:14:"tablerow_close";i:1;a:0:{}i:2;i:8706;}i:834;a:3:{i:0;s:11:"table_close";i:1;a:0:{}i:2;i:8706;}i:835;a:3:{i:0;s:4:"code";i:1;a:3:{i:0;s:51:"
$$ \sum_{i = 1}^n a_i = \frac{n(a_1 + a_n)}{2} $$
";i:1;s:5:"latex";i:2;N;}i:2;i:8713;}i:836;a:3:{i:0;s:6:"p_open";i:1;a:0:{}i:2;i:8778;}i:837;a:3:{i:0;s:13:"internalmedia";i:1;a:7:{i:0;s:27:"tutorials:latex:soma_pa.jpg";i:1;N;i:2;N;i:3;s:3:"250";i:4;N;i:5;s:5:"cache";i:6;s:7:"details";}i:2;i:8780;}i:838;a:3:{i:0;s:7:"p_close";i:1;a:0:{}i:2;i:8815;}i:839;a:2:{i:0;s:6:"plugin";i:1;a:4:{i:0;s:7:"uparrow";i:1;a:1:{i:0;s:42:"lib/plugins/uparrow/images/tango-small.png";}i:2;i:1;i:3;s:6:"~~UP~~";}}i:840;a:3:{i:0;s:13:"section_close";i:1;a:0:{}i:2;i:8817;}i:841;a:3:{i:0;s:12:"section_edit";i:1;a:4:{i:0;i:8586;i:1;i:8816;i:2;i:2;i:3;s:22:"Fórmulas Matemáticas";}i:2;i:8817;}i:842;a:3:{i:0;s:6:"header";i:1;a:3:{i:0;s:18:"Equação Numerada";i:1;i:2;i:2;i:8817;}i:2;i:8817;}i:843;a:3:{i:0;s:12:"section_open";i:1;a:1:{i:0;i:2;}i:2;i:8817;}i:844;a:3:{i:0;s:4:"code";i:1;a:3:{i:0;s:144:"
\begin{equation}
a^x + y \neq a^{x + y}
\label{eq_errada} % para posterior referência
\end{equation}

Como mostrado em \eqref{eq_errada}, ...
";i:1;s:5:"latex";i:2;N;}i:2;i:8854;}i:845;a:3:{i:0;s:6:"p_open";i:1;a:0:{}i:2;i:9012;}i:846;a:3:{i:0;s:13:"internalmedia";i:1;a:7:{i:0;s:39:"tutorials:latex:equation_definition.png";i:1;N;i:2;N;i:3;s:3:"750";i:4;N;i:5;s:5:"cache";i:6;s:7:"details";}i:2;i:9014;}i:847;a:3:{i:0;s:5:"cdata";i:1;a:1:{i:0;s:1:" ";}i:2;i:9061;}i:848;a:3:{i:0;s:9:"linebreak";i:1;a:0:{}i:2;i:9062;}i:849;a:3:{i:0;s:5:"cdata";i:1;a:1:{i:0;s:1:"
";}i:2;i:9064;}i:850;a:3:{i:0;s:13:"internalmedia";i:1;a:7:{i:0;s:38:"tutorials:latex:equation_reference.png";i:1;N;i:2;N;i:3;s:3:"250";i:4;N;i:5;s:5:"cache";i:6;s:7:"details";}i:2;i:9065;}i:851;a:3:{i:0;s:7:"p_close";i:1;a:0:{}i:2;i:9111;}i:852;a:2:{i:0;s:6:"plugin";i:1;a:4:{i:0;s:7:"uparrow";i:1;a:1:{i:0;s:42:"lib/plugins/uparrow/images/tango-small.png";}i:2;i:1;i:3;s:6:"~~UP~~";}}i:853;a:3:{i:0;s:13:"section_close";i:1;a:0:{}i:2;i:9113;}i:854;a:3:{i:0;s:12:"section_edit";i:1;a:4:{i:0;i:8817;i:1;i:9112;i:2;i:2;i:3;s:18:"Equação Numerada";}i:2;i:9113;}i:855;a:3:{i:0;s:6:"header";i:1;a:3:{i:0;s:20:"Equações Alinhadas";i:1;i:2;i:2;i:9113;}i:2;i:9113;}i:856;a:3:{i:0;s:12:"section_open";i:1;a:1:{i:0;i:2;}i:2;i:9113;}i:857;a:3:{i:0;s:10:"table_open";i:1;a:2:{i:0;i:2;i:1;i:1;}i:2;i:9146;}i:858;a:3:{i:0;s:13:"tablerow_open";i:1;a:0:{}i:2;i:9146;}i:859;a:3:{i:0;s:16:"tableheader_open";i:1;a:3:{i:0;i:1;i:1;s:4:"left";i:2;i:1;}i:2;i:9146;}i:860;a:3:{i:0;s:5:"cdata";i:1;a:1:{i:0;s:4:" &  ";}i:2;i:9148;}i:861;a:3:{i:0;s:17:"tableheader_close";i:1;a:0:{}i:2;i:9152;}i:862;a:3:{i:0;s:14:"tablecell_open";i:1;a:3:{i:0;i:1;i:1;s:4:"left";i:2;i:1;}i:2;i:9152;}i:863;a:3:{i:0;s:5:"cdata";i:1;a:1:{i:0;s:1:" ";}i:2;i:9153;}i:864;a:3:{i:0;s:6:"entity";i:1;a:1:{i:0;s:2:"->";}i:2;i:9154;}i:865;a:3:{i:0;s:5:"cdata";i:1;a:1:{i:0;s:20:" Marca alinhamento  ";}i:2;i:9156;}i:866;a:3:{i:0;s:15:"tablecell_close";i:1;a:0:{}i:2;i:9176;}i:867;a:3:{i:0;s:14:"tablerow_close";i:1;a:0:{}i:2;i:9177;}i:868;a:3:{i:0;s:11:"table_close";i:1;a:0:{}i:2;i:9177;}i:869;a:3:{i:0;s:4:"code";i:1;a:3:{i:0;s:212:"
\begin{align*} % *: sem numerar
a = b &\iff a^2 = ab \\
      &\iff a^2 - b^2 = ab - b^2 \\
      &\iff (a + b)(a - b) = b(a - b) \\
      &\iff a + b = b \\
      &\iff 2b = b \\
      &\iff 2 = 1
\end{align*}
";i:1;s:5:"latex";i:2;N;}i:2;i:9184;}i:870;a:3:{i:0;s:6:"p_open";i:1;a:0:{}i:2;i:9410;}i:871;a:3:{i:0;s:13:"internalmedia";i:1;a:7:{i:0;s:25:"tutorials:latex:align.png";i:1;N;i:2;N;i:3;s:3:"250";i:4;N;i:5;s:5:"cache";i:6;s:7:"details";}i:2;i:9412;}i:872;a:3:{i:0;s:7:"p_close";i:1;a:0:{}i:2;i:9445;}i:873;a:2:{i:0;s:6:"plugin";i:1;a:4:{i:0;s:7:"uparrow";i:1;a:1:{i:0;s:42:"lib/plugins/uparrow/images/tango-small.png";}i:2;i:1;i:3;s:6:"~~UP~~";}}i:874;a:3:{i:0;s:13:"section_close";i:1;a:0:{}i:2;i:9447;}i:875;a:3:{i:0;s:12:"section_edit";i:1;a:4:{i:0;i:9113;i:1;i:9446;i:2;i:2;i:3;s:20:"Equações Alinhadas";}i:2;i:9447;}i:876;a:3:{i:0;s:6:"header";i:1;a:3:{i:0;s:8:"Matrizes";i:1;i:2;i:2;i:9447;}i:2;i:9447;}i:877;a:3:{i:0;s:12:"section_open";i:1;a:1:{i:0;i:2;}i:2;i:9447;}i:878;a:3:{i:0;s:4:"code";i:1;a:3:{i:0;s:191:"
$$
  \mathbf{A} = \left(
  \begin{array}{ccc} % 3 colunas centralizadas
    a_{11} & a_{12} & \cdots \\
    a_{21} & a_{22} & \cdots \\
    \vdots & \vdots & \ddots
  \end{array} \right)
$$
";i:1;s:5:"latex";i:2;N;}i:2;i:9474;}i:879;a:3:{i:0;s:6:"p_open";i:1;a:0:{}i:2;i:9679;}i:880;a:3:{i:0;s:13:"internalmedia";i:1;a:7:{i:0;s:25:"tutorials:latex:array.png";i:1;N;i:2;N;i:3;s:3:"250";i:4;N;i:5;s:5:"cache";i:6;s:7:"details";}i:2;i:9681;}i:881;a:3:{i:0;s:7:"p_close";i:1;a:0:{}i:2;i:9714;}i:882;a:2:{i:0;s:6:"plugin";i:1;a:4:{i:0;s:7:"uparrow";i:1;a:1:{i:0;s:42:"lib/plugins/uparrow/images/tango-small.png";}i:2;i:1;i:3;s:6:"~~UP~~";}}i:883;a:3:{i:0;s:13:"section_close";i:1;a:0:{}i:2;i:9716;}i:884;a:3:{i:0;s:12:"section_edit";i:1;a:4:{i:0;i:9447;i:1;i:9715;i:2;i:2;i:3;s:8:"Matrizes";}i:2;i:9716;}i:885;a:3:{i:0;s:6:"header";i:1;a:3:{i:0;s:9:"Fibonacci";i:1;i:2;i:2;i:9716;}i:2;i:9716;}i:886;a:3:{i:0;s:12:"section_open";i:1;a:1:{i:0;i:2;}i:2;i:9716;}i:887;a:3:{i:0;s:4:"code";i:1;a:3:{i:0;s:129:"
$$
  F_{n} = \left\{
  \begin{array}{ll}
    n & n \leq 1 \\
    F_{n - 1} + F_{n - 2} & n \geq 2 \\
  \end{array}
  \right.
$$
";i:1;s:5:"latex";i:2;N;}i:2;i:9744;}i:888;a:3:{i:0;s:6:"p_open";i:1;a:0:{}i:2;i:9887;}i:889;a:3:{i:0;s:13:"internalmedia";i:1;a:7:{i:0;s:29:"tutorials:latex:fibonacci.png";i:1;N;i:2;N;i:3;s:3:"500";i:4;N;i:5;s:5:"cache";i:6;s:7:"details";}i:2;i:9889;}i:890;a:3:{i:0;s:7:"p_close";i:1;a:0:{}i:2;i:9926;}i:891;a:2:{i:0;s:6:"plugin";i:1;a:4:{i:0;s:7:"uparrow";i:1;a:1:{i:0;s:42:"lib/plugins/uparrow/images/tango-small.png";}i:2;i:1;i:3;s:6:"~~UP~~";}}i:892;a:3:{i:0;s:13:"section_close";i:1;a:0:{}i:2;i:9928;}i:893;a:3:{i:0;s:12:"section_edit";i:1;a:4:{i:0;i:9716;i:1;i:9927;i:2;i:2;i:3;s:9:"Fibonacci";}i:2;i:9928;}i:894;a:3:{i:0;s:6:"header";i:1;a:3:{i:0;s:8:"Teoremas";i:1;i:2;i:2;i:9928;}i:2;i:9928;}i:895;a:3:{i:0;s:12:"section_open";i:1;a:1:{i:0;i:2;}i:2;i:9928;}i:896;a:3:{i:0;s:4:"code";i:1;a:3:{i:0;s:265:"
% no preâmbulo (antes do begin{document})
\newtheorem{mur}{Lei de Murphy}

% no corpo
\begin{mur}[enunciada por Edward A. Murphy]
If there are two or more ways to do
something, and one of those ways can
result in a catastrophe, then someone
will do it.
\end{mur}
";i:1;s:5:"latex";i:2;N;}i:2;i:9955;}i:897;a:3:{i:0;s:6:"p_open";i:1;a:0:{}i:2;i:10234;}i:898;a:3:{i:0;s:13:"internalmedia";i:1;a:7:{i:0;s:26:"tutorials:latex:murphy.png";i:1;N;i:2;N;i:3;s:3:"750";i:4;N;i:5;s:5:"cache";i:6;s:7:"details";}i:2;i:10236;}i:899;a:3:{i:0;s:7:"p_close";i:1;a:0:{}i:2;i:10270;}i:900;a:2:{i:0;s:6:"plugin";i:1;a:4:{i:0;s:7:"uparrow";i:1;a:1:{i:0;s:42:"lib/plugins/uparrow/images/tango-small.png";}i:2;i:1;i:3;s:6:"~~UP~~";}}i:901;a:3:{i:0;s:13:"section_close";i:1;a:0:{}i:2;i:10272;}i:902;a:3:{i:0;s:12:"section_edit";i:1;a:4:{i:0;i:9928;i:1;i:10271;i:2;i:2;i:3;s:8:"Teoremas";}i:2;i:10272;}i:903;a:3:{i:0;s:6:"header";i:1;a:3:{i:0;s:10:"Exercício";i:1;i:2;i:2;i:10272;}i:2;i:10272;}i:904;a:3:{i:0;s:12:"section_open";i:1;a:1:{i:0;i:2;}i:2;i:10272;}i:905;a:3:{i:0;s:6:"p_open";i:1;a:0:{}i:2;i:10294;}i:906;a:3:{i:0;s:5:"cdata";i:1;a:1:{i:0;s:54:"
Crie um artigo com o Teorema Fundamental do Cálculo:";}i:2;i:10295;}i:907;a:3:{i:0;s:7:"p_close";i:1;a:0:{}i:2;i:10349;}i:908;a:3:{i:0;s:6:"p_open";i:1;a:0:{}i:2;i:10349;}i:909;a:3:{i:0;s:13:"internalmedia";i:1;a:7:{i:0;s:35:"tutorials:latex:teorema_calculo.png";i:1;N;i:2;N;i:3;s:3:"750";i:4;N;i:5;s:5:"cache";i:6;s:7:"details";}i:2;i:10351;}i:910;a:3:{i:0;s:7:"p_close";i:1;a:0:{}i:2;i:10394;}i:911;a:2:{i:0;s:6:"plugin";i:1;a:4:{i:0;s:7:"uparrow";i:1;a:1:{i:0;s:42:"lib/plugins/uparrow/images/tango-small.png";}i:2;i:1;i:3;s:6:"~~UP~~";}}i:912;a:3:{i:0;s:13:"section_close";i:1;a:0:{}i:2;i:10396;}i:913;a:3:{i:0;s:12:"section_edit";i:1;a:4:{i:0;i:10272;i:1;i:10395;i:2;i:2;i:3;s:10:"Exercício";}i:2;i:10396;}i:914;a:3:{i:0;s:6:"header";i:1;a:3:{i:0;s:17:"Corpos Flutuantes";i:1;i:2;i:2;i:10396;}i:2;i:10396;}i:915;a:3:{i:0;s:12:"section_open";i:1;a:1:{i:0;i:2;}i:2;i:10396;}i:916;a:3:{i:0;s:10:"listu_open";i:1;a:0:{}i:2;i:10426;}i:917;a:3:{i:0;s:13:"listitem_open";i:1;a:1:{i:0;i:1;}i:2;i:10426;}i:918;a:3:{i:0;s:16:"listcontent_open";i:1;a:0:{}i:2;i:10426;}i:919;a:3:{i:0;s:5:"cdata";i:1;a:1:{i:0;s:19:" Tabelas ou figuras";}i:2;i:10430;}i:920;a:3:{i:0;s:17:"listcontent_close";i:1;a:0:{}i:2;i:10449;}i:921;a:3:{i:0;s:14:"listitem_close";i:1;a:0:{}i:2;i:10449;}i:922;a:3:{i:0;s:13:"listitem_open";i:1;a:1:{i:0;i:1;}i:2;i:10449;}i:923;a:3:{i:0;s:16:"listcontent_open";i:1;a:0:{}i:2;i:10449;}i:924;a:3:{i:0;s:5:"cdata";i:1;a:1:{i:0;s:18:" Podem ter legenda";}i:2;i:10453;}i:925;a:3:{i:0;s:17:"listcontent_close";i:1;a:0:{}i:2;i:10471;}i:926;a:3:{i:0;s:14:"listitem_close";i:1;a:0:{}i:2;i:10471;}i:927;a:3:{i:0;s:13:"listitem_open";i:1;a:1:{i:0;i:1;}i:2;i:10471;}i:928;a:3:{i:0;s:16:"listcontent_open";i:1;a:0:{}i:2;i:10471;}i:929;a:3:{i:0;s:5:"cdata";i:1;a:1:{i:0;s:24:" Podem ser referenciados";}i:2;i:10475;}i:930;a:3:{i:0;s:17:"listcontent_close";i:1;a:0:{}i:2;i:10499;}i:931;a:3:{i:0;s:14:"listitem_close";i:1;a:0:{}i:2;i:10499;}i:932;a:3:{i:0;s:13:"listitem_open";i:1;a:1:{i:0;i:1;}i:2;i:10499;}i:933;a:3:{i:0;s:16:"listcontent_open";i:1;a:0:{}i:2;i:10499;}i:934;a:3:{i:0;s:5:"cdata";i:1;a:1:{i:0;s:26:" Ambientes table ou figure";}i:2;i:10503;}i:935;a:3:{i:0;s:17:"listcontent_close";i:1;a:0:{}i:2;i:10529;}i:936;a:3:{i:0;s:14:"listitem_close";i:1;a:0:{}i:2;i:10529;}i:937;a:3:{i:0;s:11:"listu_close";i:1;a:0:{}i:2;i:10529;}i:938;a:2:{i:0;s:6:"plugin";i:1;a:4:{i:0;s:7:"uparrow";i:1;a:1:{i:0;s:42:"lib/plugins/uparrow/images/tango-small.png";}i:2;i:1;i:3;s:6:"~~UP~~";}}i:939;a:3:{i:0;s:13:"section_close";i:1;a:0:{}i:2;i:10531;}i:940;a:3:{i:0;s:12:"section_edit";i:1;a:4:{i:0;i:10396;i:1;i:10530;i:2;i:2;i:3;s:17:"Corpos Flutuantes";}i:2;i:10531;}i:941;a:3:{i:0;s:6:"header";i:1;a:3:{i:0;s:25:"Códigos de Modificação";i:1;i:2;i:2;i:10531;}i:2;i:10531;}i:942;a:3:{i:0;s:12:"section_open";i:1;a:1:{i:0;i:2;}i:2;i:10531;}i:943;a:3:{i:0;s:10:"table_open";i:1;a:2:{i:0;i:2;i:1;i:5;}i:2;i:10569;}i:944;a:3:{i:0;s:13:"tablerow_open";i:1;a:0:{}i:2;i:10569;}i:945;a:3:{i:0;s:16:"tableheader_open";i:1;a:3:{i:0;i:1;i:1;s:4:"left";i:2;i:1;}i:2;i:10569;}i:946;a:3:{i:0;s:5:"cdata";i:1;a:1:{i:0;s:4:" h  ";}i:2;i:10571;}i:947;a:3:{i:0;s:17:"tableheader_close";i:1;a:0:{}i:2;i:10575;}i:948;a:3:{i:0;s:14:"tablecell_open";i:1;a:3:{i:0;i:1;i:1;s:4:"left";i:2;i:1;}i:2;i:10575;}i:949;a:3:{i:0;s:5:"cdata";i:1;a:1:{i:0;s:1:" ";}i:2;i:10576;}i:950;a:3:{i:0;s:6:"entity";i:1;a:1:{i:0;s:2:"->";}i:2;i:10577;}i:951;a:3:{i:0;s:5:"cdata";i:1;a:1:{i:0;s:7:" Aqui  ";}i:2;i:10579;}i:952;a:3:{i:0;s:15:"tablecell_close";i:1;a:0:{}i:2;i:10586;}i:953;a:3:{i:0;s:14:"tablerow_close";i:1;a:0:{}i:2;i:10587;}i:954;a:3:{i:0;s:13:"tablerow_open";i:1;a:0:{}i:2;i:10587;}i:955;a:3:{i:0;s:16:"tableheader_open";i:1;a:3:{i:0;i:1;i:1;s:4:"left";i:2;i:1;}i:2;i:10587;}i:956;a:3:{i:0;s:5:"cdata";i:1;a:1:{i:0;s:4:" t  ";}i:2;i:10589;}i:957;a:3:{i:0;s:17:"tableheader_close";i:1;a:0:{}i:2;i:10593;}i:958;a:3:{i:0;s:14:"tablecell_open";i:1;a:3:{i:0;i:1;i:1;s:4:"left";i:2;i:1;}i:2;i:10593;}i:959;a:3:{i:0;s:5:"cdata";i:1;a:1:{i:0;s:1:" ";}i:2;i:10594;}i:960;a:3:{i:0;s:6:"entity";i:1;a:1:{i:0;s:2:"->";}i:2;i:10595;}i:961;a:3:{i:0;s:5:"cdata";i:1;a:1:{i:0;s:25:" No topo de uma página  ";}i:2;i:10597;}i:962;a:3:{i:0;s:15:"tablecell_close";i:1;a:0:{}i:2;i:10622;}i:963;a:3:{i:0;s:14:"tablerow_close";i:1;a:0:{}i:2;i:10623;}i:964;a:3:{i:0;s:13:"tablerow_open";i:1;a:0:{}i:2;i:10623;}i:965;a:3:{i:0;s:16:"tableheader_open";i:1;a:3:{i:0;i:1;i:1;s:4:"left";i:2;i:1;}i:2;i:10623;}i:966;a:3:{i:0;s:5:"cdata";i:1;a:1:{i:0;s:4:" b  ";}i:2;i:10625;}i:967;a:3:{i:0;s:17:"tableheader_close";i:1;a:0:{}i:2;i:10629;}i:968;a:3:{i:0;s:14:"tablecell_open";i:1;a:3:{i:0;i:1;i:1;s:4:"left";i:2;i:1;}i:2;i:10629;}i:969;a:3:{i:0;s:5:"cdata";i:1;a:1:{i:0;s:1:" ";}i:2;i:10630;}i:970;a:3:{i:0;s:6:"entity";i:1;a:1:{i:0;s:2:"->";}i:2;i:10631;}i:971;a:3:{i:0;s:5:"cdata";i:1;a:1:{i:0;s:25:" Na base de uma página  ";}i:2;i:10633;}i:972;a:3:{i:0;s:15:"tablecell_close";i:1;a:0:{}i:2;i:10658;}i:973;a:3:{i:0;s:14:"tablerow_close";i:1;a:0:{}i:2;i:10659;}i:974;a:3:{i:0;s:13:"tablerow_open";i:1;a:0:{}i:2;i:10659;}i:975;a:3:{i:0;s:16:"tableheader_open";i:1;a:3:{i:0;i:1;i:1;s:4:"left";i:2;i:1;}i:2;i:10659;}i:976;a:3:{i:0;s:5:"cdata";i:1;a:1:{i:0;s:4:" p  ";}i:2;i:10661;}i:977;a:3:{i:0;s:17:"tableheader_close";i:1;a:0:{}i:2;i:10665;}i:978;a:3:{i:0;s:14:"tablecell_open";i:1;a:3:{i:0;i:1;i:1;s:4:"left";i:2;i:1;}i:2;i:10665;}i:979;a:3:{i:0;s:5:"cdata";i:1;a:1:{i:0;s:1:" ";}i:2;i:10666;}i:980;a:3:{i:0;s:6:"entity";i:1;a:1:{i:0;s:2:"->";}i:2;i:10667;}i:981;a:3:{i:0;s:5:"cdata";i:1;a:1:{i:0;s:31:" Em uma página só para isso  ";}i:2;i:10669;}i:982;a:3:{i:0;s:15:"tablecell_close";i:1;a:0:{}i:2;i:10700;}i:983;a:3:{i:0;s:14:"tablerow_close";i:1;a:0:{}i:2;i:10701;}i:984;a:3:{i:0;s:13:"tablerow_open";i:1;a:0:{}i:2;i:10701;}i:985;a:3:{i:0;s:16:"tableheader_open";i:1;a:3:{i:0;i:1;i:1;s:4:"left";i:2;i:1;}i:2;i:10701;}i:986;a:3:{i:0;s:5:"cdata";i:1;a:1:{i:0;s:4:" !  ";}i:2;i:10703;}i:987;a:3:{i:0;s:17:"tableheader_close";i:1;a:0:{}i:2;i:10707;}i:988;a:3:{i:0;s:14:"tablecell_open";i:1;a:3:{i:0;i:1;i:1;s:4:"left";i:2;i:1;}i:2;i:10707;}i:989;a:3:{i:0;s:5:"cdata";i:1;a:1:{i:0;s:1:" ";}i:2;i:10708;}i:990;a:3:{i:0;s:6:"entity";i:1;a:1:{i:0;s:2:"->";}i:2;i:10709;}i:991;a:3:{i:0;s:5:"cdata";i:1;a:1:{i:0;s:20:" Força inserção  ";}i:2;i:10711;}i:992;a:3:{i:0;s:15:"tablecell_close";i:1;a:0:{}i:2;i:10731;}i:993;a:3:{i:0;s:14:"tablerow_close";i:1;a:0:{}i:2;i:10732;}i:994;a:3:{i:0;s:11:"table_close";i:1;a:0:{}i:2;i:10732;}i:995;a:3:{i:0;s:6:"p_open";i:1;a:0:{}i:2;i:10732;}i:996;a:3:{i:0;s:5:"cdata";i:1;a:1:{i:0;s:57:"
Especificam onde o corpo flutuante poderá ser inserido.";}i:2;i:10733;}i:997;a:3:{i:0;s:7:"p_close";i:1;a:0:{}i:2;i:10790;}i:998;a:2:{i:0;s:6:"plugin";i:1;a:4:{i:0;s:7:"uparrow";i:1;a:1:{i:0;s:42:"lib/plugins/uparrow/images/tango-small.png";}i:2;i:1;i:3;s:6:"~~UP~~";}}i:999;a:3:{i:0;s:13:"section_close";i:1;a:0:{}i:2;i:10792;}i:1000;a:3:{i:0;s:12:"section_edit";i:1;a:4:{i:0;i:10531;i:1;i:10791;i:2;i:2;i:3;s:25:"Códigos de Modificação";}i:2;i:10792;}i:1001;a:3:{i:0;s:6:"header";i:1;a:3:{i:0;s:21:"Comandos Relacionados";i:1;i:2;i:2;i:10792;}i:2;i:10792;}i:1002;a:3:{i:0;s:12:"section_open";i:1;a:1:{i:0;i:2;}i:2;i:10792;}i:1003;a:3:{i:0;s:10:"table_open";i:1;a:2:{i:0;i:2;i:1;i:3;}i:2;i:10826;}i:1004;a:3:{i:0;s:13:"tablerow_open";i:1;a:0:{}i:2;i:10826;}i:1005;a:3:{i:0;s:16:"tableheader_open";i:1;a:3:{i:0;i:1;i:1;s:4:"left";i:2;i:1;}i:2;i:10826;}i:1006;a:3:{i:0;s:5:"cdata";i:1;a:1:{i:0;s:13:" \caption{}  ";}i:2;i:10828;}i:1007;a:3:{i:0;s:17:"tableheader_close";i:1;a:0:{}i:2;i:10841;}i:1008;a:3:{i:0;s:14:"tablecell_open";i:1;a:3:{i:0;i:1;i:1;s:4:"left";i:2;i:1;}i:2;i:10841;}i:1009;a:3:{i:0;s:5:"cdata";i:1;a:1:{i:0;s:1:" ";}i:2;i:10842;}i:1010;a:3:{i:0;s:6:"entity";i:1;a:1:{i:0;s:2:"->";}i:2;i:10843;}i:1011;a:3:{i:0;s:5:"cdata";i:1;a:1:{i:0;s:10:" Legenda  ";}i:2;i:10845;}i:1012;a:3:{i:0;s:15:"tablecell_close";i:1;a:0:{}i:2;i:10855;}i:1013;a:3:{i:0;s:14:"tablerow_close";i:1;a:0:{}i:2;i:10856;}i:1014;a:3:{i:0;s:13:"tablerow_open";i:1;a:0:{}i:2;i:10856;}i:1015;a:3:{i:0;s:16:"tableheader_open";i:1;a:3:{i:0;i:1;i:1;s:4:"left";i:2;i:1;}i:2;i:10856;}i:1016;a:3:{i:0;s:5:"cdata";i:1;a:1:{i:0;s:11:" \label{}  ";}i:2;i:10858;}i:1017;a:3:{i:0;s:17:"tableheader_close";i:1;a:0:{}i:2;i:10869;}i:1018;a:3:{i:0;s:14:"tablecell_open";i:1;a:3:{i:0;i:1;i:1;s:4:"left";i:2;i:1;}i:2;i:10869;}i:1019;a:3:{i:0;s:5:"cdata";i:1;a:1:{i:0;s:1:" ";}i:2;i:10870;}i:1020;a:3:{i:0;s:6:"entity";i:1;a:1:{i:0;s:2:"->";}i:2;i:10871;}i:1021;a:3:{i:0;s:5:"cdata";i:1;a:1:{i:0;s:10:" Rótulo  ";}i:2;i:10873;}i:1022;a:3:{i:0;s:15:"tablecell_close";i:1;a:0:{}i:2;i:10883;}i:1023;a:3:{i:0;s:14:"tablerow_close";i:1;a:0:{}i:2;i:10884;}i:1024;a:3:{i:0;s:13:"tablerow_open";i:1;a:0:{}i:2;i:10884;}i:1025;a:3:{i:0;s:16:"tableheader_open";i:1;a:3:{i:0;i:1;i:1;s:4:"left";i:2;i:1;}i:2;i:10884;}i:1026;a:3:{i:0;s:5:"cdata";i:1;a:1:{i:0;s:16:" \listoftables  ";}i:2;i:10886;}i:1027;a:3:{i:0;s:17:"tableheader_close";i:1;a:0:{}i:2;i:10902;}i:1028;a:3:{i:0;s:14:"tablecell_open";i:1;a:3:{i:0;i:1;i:1;s:4:"left";i:2;i:1;}i:2;i:10902;}i:1029;a:3:{i:0;s:5:"cdata";i:1;a:1:{i:0;s:1:" ";}i:2;i:10903;}i:1030;a:3:{i:0;s:6:"entity";i:1;a:1:{i:0;s:2:"->";}i:2;i:10904;}i:1031;a:3:{i:0;s:5:"cdata";i:1;a:1:{i:0;s:19:" Lista de Tabelas  ";}i:2;i:10906;}i:1032;a:3:{i:0;s:15:"tablecell_close";i:1;a:0:{}i:2;i:10925;}i:1033;a:3:{i:0;s:14:"tablerow_close";i:1;a:0:{}i:2;i:10926;}i:1034;a:3:{i:0;s:11:"table_close";i:1;a:0:{}i:2;i:10926;}i:1035;a:3:{i:0;s:4:"code";i:1;a:3:{i:0;s:135:"
\begin{table}[htbp]
% ... como fazer tabelas em seguida
\caption{Uma tabela em branco por enquanto}
\label{tab_em_branco}
\end{table}
";i:1;s:5:"latex";i:2;N;}i:2;i:10933;}i:1036;a:3:{i:0;s:6:"p_open";i:1;a:0:{}i:2;i:11082;}i:1037;a:3:{i:0;s:5:"cdata";i:1;a:1:{i:0;s:16:"To be continued ";}i:2;i:11084;}i:1038;a:3:{i:0;s:6:"entity";i:1;a:1:{i:0;s:3:"...";}i:2;i:11100;}i:1039;a:3:{i:0;s:5:"cdata";i:1;a:1:{i:0;s:1:"
";}i:2;i:11103;}i:1040;a:3:{i:0;s:7:"p_close";i:1;a:0:{}i:2;i:11103;}i:1041;a:2:{i:0;s:6:"plugin";i:1;a:4:{i:0;s:7:"uparrow";i:1;a:1:{i:0;s:42:"lib/plugins/uparrow/images/tango-small.png";}i:2;i:1;i:3;s:6:"~~UP~~";}}i:1042;a:3:{i:0;s:13:"section_close";i:1;a:0:{}i:2;i:11103;}i:1043;a:3:{i:0;s:12:"section_edit";i:1;a:4:{i:0;i:10792;i:1;i:0;i:2;i:2;i:3;s:21:"Comandos Relacionados";}i:2;i:11103;}i:1044;a:3:{i:0;s:12:"document_end";i:1;a:0:{}i:2;i:11103;}}