a:119:{i:0;a:3:{i:0;s:14:"document_start";i:1;a:0:{}i:2;i:0;}i:1;a:3:{i:0;s:6:"p_open";i:1;a:0:{}i:2;i:0;}i:2;a:3:{i:0;s:7:"p_close";i:1;a:0:{}i:2;i:1;}i:3;a:3:{i:0;s:12:"section_edit";i:1;a:4:{i:0;i:-1;i:1;i:0;i:2;i:1;i:3;s:0:"";}i:2;i:1;}i:4;a:3:{i:0;s:6:"header";i:1;a:3:{i:0;s:6:"Videos";i:1;i:1;i:2;i:1;}i:2;i:1;}i:5;a:3:{i:0;s:12:"section_open";i:1;a:1:{i:0;i:1;}i:2;i:1;}i:6;a:3:{i:0;s:6:"p_open";i:1;a:0:{}i:2;i:21;}i:7;a:3:{i:0;s:5:"cdata";i:1;a:1:{i:0;s:1:"
";}i:2;i:22;}i:8;a:3:{i:0;s:12:"externallink";i:1;a:2:{i:0;s:84:"http://brightcove.newscientist.com/services/player/bcpid1873822884?bctid=77464563001";i:1;s:53:"Hand-held projector images respond to the real world ";}i:2;i:23;}i:9;a:3:{i:0;s:5:"cdata";i:1;a:1:{i:0;s:1:" ";}i:2;i:165;}i:10;a:3:{i:0;s:9:"linebreak";i:1;a:0:{}i:2;i:166;}i:11;a:3:{i:0;s:5:"cdata";i:1;a:1:{i:0;s:1:"
";}i:2;i:168;}i:12;a:3:{i:0;s:12:"externallink";i:1;a:2:{i:0;s:42:"http://www.youtube.com/watch?v=yplX3pYWlPo";i:1;s:31:"Steve Jobs at Stanford (part 1)";}i:2;i:169;}i:13;a:3:{i:0;s:5:"cdata";i:1;a:1:{i:0;s:1:" ";}i:2;i:247;}i:14;a:3:{i:0;s:9:"linebreak";i:1;a:0:{}i:2;i:248;}i:15;a:3:{i:0;s:5:"cdata";i:1;a:1:{i:0;s:1:"
";}i:2;i:250;}i:16;a:3:{i:0;s:12:"externallink";i:1;a:2:{i:0;s:42:"http://www.youtube.com/watch?v=ksoo-G_YB2o";i:1;s:31:"Steve Jobs at Stanford (part 2)";}i:2;i:251;}i:17;a:3:{i:0;s:5:"cdata";i:1;a:1:{i:0;s:1:" ";}i:2;i:329;}i:18;a:3:{i:0;s:9:"linebreak";i:1;a:0:{}i:2;i:330;}i:19;a:3:{i:0;s:5:"cdata";i:1;a:1:{i:0;s:1:"
";}i:2;i:332;}i:20;a:3:{i:0;s:12:"externallink";i:1;a:2:{i:0;s:59:"http://www.groklaw.net/staticpages/index.php?page=GatesDepo";i:1;s:31:"Groklaw: Gates Deposition Video";}i:2;i:333;}i:21;a:3:{i:0;s:5:"cdata";i:1;a:1:{i:0;s:1:" ";}i:2;i:428;}i:22;a:3:{i:0;s:9:"linebreak";i:1;a:0:{}i:2;i:429;}i:23;a:3:{i:0;s:5:"cdata";i:1;a:1:{i:0;s:1:"
";}i:2;i:431;}i:24;a:3:{i:0;s:12:"externallink";i:1;a:2:{i:0;s:42:"http://www.youtube.com/watch?v=PsPX0nElJ0k";i:1;s:91:"Code Bubbles: Rethinking the User Interface Paradigm of Integrated Development Environments";}i:2;i:432;}i:25;a:3:{i:0;s:5:"cdata";i:1;a:1:{i:0;s:1:" ";}i:2;i:570;}i:26;a:3:{i:0;s:9:"linebreak";i:1;a:0:{}i:2;i:571;}i:27;a:3:{i:0;s:5:"cdata";i:1;a:1:{i:0;s:1:"
";}i:2;i:573;}i:28;a:3:{i:0;s:12:"externallink";i:1;a:2:{i:0;s:42:"http://www.youtube.com/watch?v=Q5k7a9YEoUI";i:1;s:25:"SCRUM in Under 10 Minutes";}i:2;i:574;}i:29;a:3:{i:0;s:5:"cdata";i:1;a:1:{i:0;s:1:" ";}i:2;i:646;}i:30;a:3:{i:0;s:9:"linebreak";i:1;a:0:{}i:2;i:647;}i:31;a:3:{i:0;s:5:"cdata";i:1;a:1:{i:0;s:1:"
";}i:2;i:649;}i:32;a:3:{i:0;s:12:"externallink";i:1;a:2:{i:0;s:23:"http://10gui.com/video/";i:1;s:37:"10/GUI Multi-touch Operational System";}i:2;i:650;}i:33;a:3:{i:0;s:5:"cdata";i:1;a:1:{i:0;s:1:" ";}i:2;i:715;}i:34;a:3:{i:0;s:9:"linebreak";i:1;a:0:{}i:2;i:716;}i:35;a:3:{i:0;s:5:"cdata";i:1;a:1:{i:0;s:1:"
";}i:2;i:718;}i:36;a:3:{i:0;s:12:"externallink";i:1;a:2:{i:0;s:42:"http://www.youtube.com/watch?v=IzXVBlQ6wFY";i:1;s:48:"CHI: Multitoe project offers new touch interface";}i:2;i:719;}i:37;a:3:{i:0;s:5:"cdata";i:1;a:1:{i:0;s:1:" ";}i:2;i:814;}i:38;a:3:{i:0;s:9:"linebreak";i:1;a:0:{}i:2;i:815;}i:39;a:3:{i:0;s:5:"cdata";i:1;a:1:{i:0;s:1:"
";}i:2;i:817;}i:40;a:3:{i:0;s:6:"plugin";i:1;a:4:{i:0;s:11:"htmlcomment";i:1;a:2:{i:0;i:5;i:1;s:7:" [[|]] ";}i:2;i:5;i:3;s:14:"<!-- [[|]] -->";}i:2;i:818;}i:41;a:3:{i:0;s:7:"p_close";i:1;a:0:{}i:2;i:832;}i:42;a:2:{i:0;s:6:"plugin";i:1;a:4:{i:0;s:7:"uparrow";i:1;a:1:{i:0;s:42:"lib/plugins/uparrow/images/tango-small.png";}i:2;i:1;i:3;s:6:"~~UP~~";}}i:43;a:3:{i:0;s:13:"section_close";i:1;a:0:{}i:2;i:834;}i:44;a:3:{i:0;s:12:"section_edit";i:1;a:4:{i:0;i:1;i:1;i:833;i:2;i:1;i:3;s:6:"Videos";}i:2;i:834;}i:45;a:3:{i:0;s:6:"header";i:1;a:3:{i:0;s:16:"Google Tech Talk";i:1;i:2;i:2;i:834;}i:2;i:834;}i:46;a:3:{i:0;s:12:"section_open";i:1;a:1:{i:0;i:2;}i:2;i:834;}i:47;a:3:{i:0;s:6:"p_open";i:1;a:0:{}i:2;i:862;}i:48;a:3:{i:0;s:5:"cdata";i:1;a:1:{i:0;s:1:"
";}i:2;i:863;}i:49;a:3:{i:0;s:12:"externallink";i:1;a:2:{i:0;s:42:"http://www.youtube.com/watch?v=4XpnKHJAok8";i:1;s:19:"Linus Torvalds: Git";}i:2;i:864;}i:50;a:3:{i:0;s:5:"cdata";i:1;a:1:{i:0;s:1:" ";}i:2;i:930;}i:51;a:3:{i:0;s:9:"linebreak";i:1;a:0:{}i:2;i:931;}i:52;a:3:{i:0;s:5:"cdata";i:1;a:1:{i:0;s:1:"
";}i:2;i:933;}i:53;a:3:{i:0;s:12:"externallink";i:1;a:2:{i:0;s:42:"http://www.youtube.com/watch?v=rKnDgT73v8s";i:1;s:37:"Rob Pike: The Go Programming Language";}i:2;i:934;}i:54;a:3:{i:0;s:5:"cdata";i:1;a:1:{i:0;s:1:" ";}i:2;i:1018;}i:55;a:3:{i:0;s:9:"linebreak";i:1;a:0:{}i:2;i:1019;}i:56;a:3:{i:0;s:5:"cdata";i:1;a:1:{i:0;s:1:"
";}i:2;i:1021;}i:57;a:3:{i:0;s:12:"externallink";i:1;a:2:{i:0;s:58:"http://video.google.com/videoplay?docid=810232012617965344";i:1;s:96:"Rob Pike: Advanced Topics in Programming Languages: Concurrency and Message Passing In Newsqueak";}i:2;i:1022;}i:58;a:3:{i:0;s:5:"cdata";i:1;a:1:{i:0;s:1:" ";}i:2;i:1181;}i:59;a:3:{i:0;s:9:"linebreak";i:1;a:0:{}i:2;i:1182;}i:60;a:3:{i:0;s:5:"cdata";i:1;a:1:{i:0;s:1:"
";}i:2;i:1184;}i:61;a:3:{i:0;s:6:"plugin";i:1;a:4:{i:0;s:11:"htmlcomment";i:1;a:2:{i:0;i:5;i:1;s:7:" [[|]] ";}i:2;i:5;i:3;s:14:"<!-- [[|]] -->";}i:2;i:1185;}i:62;a:3:{i:0;s:7:"p_close";i:1;a:0:{}i:2;i:1199;}i:63;a:2:{i:0;s:6:"plugin";i:1;a:4:{i:0;s:7:"uparrow";i:1;a:1:{i:0;s:42:"lib/plugins/uparrow/images/tango-small.png";}i:2;i:1;i:3;s:6:"~~UP~~";}}i:64;a:3:{i:0;s:13:"section_close";i:1;a:0:{}i:2;i:1201;}i:65;a:3:{i:0;s:12:"section_edit";i:1;a:4:{i:0;i:834;i:1;i:1200;i:2;i:2;i:3;s:16:"Google Tech Talk";}i:2;i:1201;}i:66;a:3:{i:0;s:6:"header";i:1;a:3:{i:0;s:14:"Authors@Google";i:1;i:2;i:2;i:1201;}i:2;i:1201;}i:67;a:3:{i:0;s:12:"section_open";i:1;a:1:{i:0;i:2;}i:2;i:1201;}i:68;a:3:{i:0;s:6:"p_open";i:1;a:0:{}i:2;i:1227;}i:69;a:3:{i:0;s:5:"cdata";i:1;a:1:{i:0;s:1:"
";}i:2;i:1228;}i:70;a:3:{i:0;s:12:"externallink";i:1;a:2:{i:0;s:42:"http://www.youtube.com/watch?v=DZ2vtQCESpk";i:1;s:13:"Garr Reynolds";}i:2;i:1229;}i:71;a:3:{i:0;s:5:"cdata";i:1;a:1:{i:0;s:1:" ";}i:2;i:1289;}i:72;a:3:{i:0;s:9:"linebreak";i:1;a:0:{}i:2;i:1290;}i:73;a:3:{i:0;s:5:"cdata";i:1;a:1:{i:0;s:1:"
";}i:2;i:1292;}i:74;a:3:{i:0;s:6:"plugin";i:1;a:4:{i:0;s:11:"htmlcomment";i:1;a:2:{i:0;i:5;i:1;s:7:" [[|]] ";}i:2;i:5;i:3;s:14:"<!-- [[|]] -->";}i:2;i:1293;}i:75;a:3:{i:0;s:7:"p_close";i:1;a:0:{}i:2;i:1307;}i:76;a:2:{i:0;s:6:"plugin";i:1;a:4:{i:0;s:7:"uparrow";i:1;a:1:{i:0;s:42:"lib/plugins/uparrow/images/tango-small.png";}i:2;i:1;i:3;s:6:"~~UP~~";}}i:77;a:3:{i:0;s:13:"section_close";i:1;a:0:{}i:2;i:1309;}i:78;a:3:{i:0;s:12:"section_edit";i:1;a:4:{i:0;i:1201;i:1;i:1308;i:2;i:2;i:3;s:14:"Authors@Google";}i:2;i:1309;}i:79;a:3:{i:0;s:6:"header";i:1;a:3:{i:0;s:26:"TED: Ideas Worth Spreading";i:1;i:2;i:2;i:1309;}i:2;i:1309;}i:80;a:3:{i:0;s:12:"section_open";i:1;a:1:{i:0;i:2;}i:2;i:1309;}i:81;a:3:{i:0;s:6:"p_open";i:1;a:0:{}i:2;i:1347;}i:82;a:3:{i:0;s:5:"cdata";i:1;a:1:{i:0;s:1:"
";}i:2;i:1348;}i:83;a:3:{i:0;s:12:"externallink";i:1;a:2:{i:0;s:59:"http://www.ted.com/talks/mark_roth_suspended_animation.html";i:1;s:50:"Mark Roth: Suspended animation is within our grasp";}i:2;i:1349;}i:84;a:3:{i:0;s:5:"cdata";i:1;a:1:{i:0;s:1:" ";}i:2;i:1463;}i:85;a:3:{i:0;s:9:"linebreak";i:1;a:0:{}i:2;i:1464;}i:86;a:3:{i:0;s:5:"cdata";i:1;a:1:{i:0;s:1:"
";}i:2;i:1466;}i:87;a:3:{i:0;s:12:"externallink";i:1;a:2:{i:0;s:72:"http://www.ted.com/talks/bobby_mcferrin_hacks_your_brain_with_music.html";i:1;s:42:"Bobby McFerrin hacks your brain with music";}i:2;i:1467;}i:88;a:3:{i:0;s:5:"cdata";i:1;a:1:{i:0;s:1:" ";}i:2;i:1586;}i:89;a:3:{i:0;s:9:"linebreak";i:1;a:0:{}i:2;i:1587;}i:90;a:3:{i:0;s:5:"cdata";i:1;a:1:{i:0;s:1:"
";}i:2;i:1589;}i:91;a:3:{i:0;s:6:"plugin";i:1;a:4:{i:0;s:11:"htmlcomment";i:1;a:2:{i:0;i:5;i:1;s:7:" [[|]] ";}i:2;i:5;i:3;s:14:"<!-- [[|]] -->";}i:2;i:1590;}i:92;a:3:{i:0;s:7:"p_close";i:1;a:0:{}i:2;i:1604;}i:93;a:2:{i:0;s:6:"plugin";i:1;a:4:{i:0;s:7:"uparrow";i:1;a:1:{i:0;s:42:"lib/plugins/uparrow/images/tango-small.png";}i:2;i:1;i:3;s:6:"~~UP~~";}}i:94;a:3:{i:0;s:13:"section_close";i:1;a:0:{}i:2;i:1607;}i:95;a:3:{i:0;s:12:"section_edit";i:1;a:4:{i:0;i:1309;i:1;i:1606;i:2;i:2;i:3;s:26:"TED: Ideas Worth Spreading";}i:2;i:1607;}i:96;a:3:{i:0;s:6:"header";i:1;a:3:{i:0;s:5:"Music";i:1;i:2;i:2;i:1607;}i:2;i:1607;}i:97;a:3:{i:0;s:12:"section_open";i:1;a:1:{i:0;i:2;}i:2;i:1607;}i:98;a:3:{i:0;s:6:"p_open";i:1;a:0:{}i:2;i:1624;}i:99;a:3:{i:0;s:5:"cdata";i:1;a:1:{i:0;s:1:"
";}i:2;i:1625;}i:100;a:3:{i:0;s:12:"externallink";i:1;a:2:{i:0;s:53:"http://www.gearwire.com/korg-kaossilatorpro-demo.html";i:1;s:20:"Korg Kaossilator Pro";}i:2;i:1626;}i:101;a:3:{i:0;s:5:"cdata";i:1;a:1:{i:0;s:1:" ";}i:2;i:1704;}i:102;a:3:{i:0;s:9:"linebreak";i:1;a:0:{}i:2;i:1705;}i:103;a:3:{i:0;s:5:"cdata";i:1;a:1:{i:0;s:1:"
";}i:2;i:1707;}i:104;a:3:{i:0;s:12:"externallink";i:1;a:2:{i:0;s:42:"http://www.youtube.com/watch?v=98ew0VtHmik";i:1;s:36:"Super Mario Castle Theme Death Metal";}i:2;i:1708;}i:105;a:3:{i:0;s:5:"cdata";i:1;a:1:{i:0;s:1:" ";}i:2;i:1791;}i:106;a:3:{i:0;s:9:"linebreak";i:1;a:0:{}i:2;i:1792;}i:107;a:3:{i:0;s:5:"cdata";i:1;a:1:{i:0;s:1:"
";}i:2;i:1794;}i:108;a:3:{i:0;s:12:"externallink";i:1;a:2:{i:0;s:42:"http://www.youtube.com/watch?v=9UagxOZ-DDQ";i:1;s:55:"Learning How To Play Guitar Well Enough To Get You Laid";}i:2;i:1795;}i:109;a:3:{i:0;s:5:"cdata";i:1;a:1:{i:0;s:1:" ";}i:2;i:1897;}i:110;a:3:{i:0;s:9:"linebreak";i:1;a:0:{}i:2;i:1898;}i:111;a:3:{i:0;s:5:"cdata";i:1;a:1:{i:0;s:1:"
";}i:2;i:1900;}i:112;a:3:{i:0;s:6:"plugin";i:1;a:4:{i:0;s:11:"htmlcomment";i:1;a:2:{i:0;i:5;i:1;s:7:" [[|]] ";}i:2;i:5;i:3;s:14:"<!-- [[|]] -->";}i:2;i:1901;}i:113;a:3:{i:0;s:7:"p_close";i:1;a:0:{}i:2;i:1915;}i:114;a:3:{i:0;s:6:"plugin";i:1;a:4:{i:0;s:7:"tag_tag";i:1;a:1:{i:0;s:5:"links";}i:2;i:5;i:3;s:13:"{{tag>links}}";}i:2;i:1917;}i:115;a:2:{i:0;s:6:"plugin";i:1;a:4:{i:0;s:7:"uparrow";i:1;a:1:{i:0;s:42:"lib/plugins/uparrow/images/tango-small.png";}i:2;i:1;i:3;s:6:"~~UP~~";}}i:116;a:3:{i:0;s:13:"section_close";i:1;a:0:{}i:2;i:1930;}i:117;a:3:{i:0;s:12:"section_edit";i:1;a:4:{i:0;i:1607;i:1;i:0;i:2;i:2;i:3;s:5:"Music";}i:2;i:1930;}i:118;a:3:{i:0;s:12:"document_end";i:1;a:0:{}i:2;i:1930;}}