a:57:{i:0;a:3:{i:0;s:14:"document_start";i:1;a:0:{}i:2;i:0;}i:1;a:3:{i:0;s:6:"p_open";i:1;a:0:{}i:2;i:0;}i:2;a:3:{i:0;s:7:"p_close";i:1;a:0:{}i:2;i:1;}i:3;a:3:{i:0;s:12:"section_edit";i:1;a:4:{i:0;i:-1;i:1;i:0;i:2;i:1;i:3;s:0:"";}i:2;i:1;}i:4;a:3:{i:0;s:6:"header";i:1;a:3:{i:0;s:7:"Firefox";i:1;i:1;i:2;i:1;}i:2;i:1;}i:5;a:3:{i:0;s:12:"section_open";i:1;a:1:{i:0;i:1;}i:2;i:1;}i:6;a:2:{i:0;s:6:"plugin";i:1;a:4:{i:0;s:7:"uparrow";i:1;a:1:{i:0;s:42:"lib/plugins/uparrow/images/tango-small.png";}i:2;i:1;i:3;s:6:"~~UP~~";}}i:7;a:3:{i:0;s:13:"section_close";i:1;a:0:{}i:2;i:24;}i:8;a:3:{i:0;s:12:"section_edit";i:1;a:4:{i:0;i:1;i:1;i:23;i:2;i:1;i:3;s:7:"Firefox";}i:2;i:24;}i:9;a:3:{i:0;s:6:"header";i:1;a:3:{i:0;s:12:"Nice Add-ons";i:1;i:2;i:2;i:24;}i:2;i:24;}i:10;a:3:{i:0;s:12:"section_open";i:1;a:1:{i:0;i:2;}i:2;i:24;}i:11;a:3:{i:0;s:6:"p_open";i:1;a:0:{}i:2;i:48;}i:12;a:3:{i:0;s:5:"cdata";i:1;a:1:{i:0;s:1:"
";}i:2;i:49;}i:13;a:3:{i:0;s:12:"externallink";i:1;a:2:{i:0;s:51:"https://addons.mozilla.org/en-US/firefox/addon/1865";i:1;s:12:"Adblock Plus";}i:2;i:50;}i:14;a:3:{i:0;s:5:"cdata";i:1;a:1:{i:0;s:1:" ";}i:2;i:118;}i:15;a:3:{i:0;s:9:"linebreak";i:1;a:0:{}i:2;i:119;}i:16;a:3:{i:0;s:5:"cdata";i:1;a:1:{i:0;s:1:"
";}i:2;i:121;}i:17;a:3:{i:0;s:12:"externallink";i:1;a:2:{i:0;s:51:"https://addons.mozilla.org/en-US/firefox/addon/6937";i:1;s:26:"Multirow Bookmarks Toolbar";}i:2;i:122;}i:18;a:3:{i:0;s:5:"cdata";i:1;a:1:{i:0;s:1:" ";}i:2;i:204;}i:19;a:3:{i:0;s:9:"linebreak";i:1;a:0:{}i:2;i:205;}i:20;a:3:{i:0;s:5:"cdata";i:1;a:1:{i:0;s:1:"
";}i:2;i:207;}i:21;a:3:{i:0;s:12:"externallink";i:1;a:2:{i:0;s:51:"https://addons.mozilla.org/en-US/firefox/addon/2410";i:1;s:33:"Xmarks Bookmark and Password Sync";}i:2;i:208;}i:22;a:3:{i:0;s:5:"cdata";i:1;a:1:{i:0;s:1:" ";}i:2;i:297;}i:23;a:3:{i:0;s:9:"linebreak";i:1;a:0:{}i:2;i:298;}i:24;a:3:{i:0;s:5:"cdata";i:1;a:1:{i:0;s:1:"
";}i:2;i:300;}i:25;a:3:{i:0;s:6:"plugin";i:1;a:4:{i:0;s:11:"htmlcomment";i:1;a:2:{i:0;i:5;i:1;s:7:" [[|]] ";}i:2;i:5;i:3;s:14:"<!-- [[|]] -->";}i:2;i:301;}i:26;a:3:{i:0;s:7:"p_close";i:1;a:0:{}i:2;i:315;}i:27;a:2:{i:0;s:6:"plugin";i:1;a:4:{i:0;s:7:"uparrow";i:1;a:1:{i:0;s:42:"lib/plugins/uparrow/images/tango-small.png";}i:2;i:1;i:3;s:6:"~~UP~~";}}i:28;a:3:{i:0;s:13:"section_close";i:1;a:0:{}i:2;i:317;}i:29;a:3:{i:0;s:12:"section_edit";i:1;a:4:{i:0;i:24;i:1;i:316;i:2;i:2;i:3;s:12:"Nice Add-ons";}i:2;i:317;}i:30;a:3:{i:0;s:6:"header";i:1;a:3:{i:0;s:21:"Extension Development";i:1;i:2;i:2;i:317;}i:2;i:317;}i:31;a:3:{i:0;s:12:"section_open";i:1;a:1:{i:0;i:2;}i:2;i:317;}i:32;a:3:{i:0;s:6:"p_open";i:1;a:0:{}i:2;i:350;}i:33;a:3:{i:0;s:5:"cdata";i:1;a:1:{i:0;s:1:"
";}i:2;i:351;}i:34;a:3:{i:0;s:12:"externallink";i:1;a:2:{i:0;s:52:"http://www.rietta.com/firefox/Tutorial/overview.html";i:1;s:35:"Firefox Plugin Development Tutorial";}i:2;i:352;}i:35;a:3:{i:0;s:5:"cdata";i:1;a:1:{i:0;s:1:" ";}i:2;i:444;}i:36;a:3:{i:0;s:9:"linebreak";i:1;a:0:{}i:2;i:445;}i:37;a:3:{i:0;s:5:"cdata";i:1;a:1:{i:0;s:1:"
";}i:2;i:447;}i:38;a:3:{i:0;s:12:"externallink";i:1;a:2:{i:0;s:69:"https://developer.mozilla.org/en/Extension_Frequently_Asked_Questions";i:1;s:33:"Firefox Extension Development FAQ";}i:2;i:448;}i:39;a:3:{i:0;s:5:"cdata";i:1;a:1:{i:0;s:1:" ";}i:2;i:555;}i:40;a:3:{i:0;s:9:"linebreak";i:1;a:0:{}i:2;i:556;}i:41;a:3:{i:0;s:5:"cdata";i:1;a:1:{i:0;s:1:"
";}i:2;i:558;}i:42;a:3:{i:0;s:12:"externallink";i:1;a:2:{i:0;s:71:"http://www.w3schools.com/jsref/tryit.asp?filename=tryjsref_match_regexp";i:1;s:29:"Javascript online interpreter";}i:2;i:559;}i:43;a:3:{i:0;s:5:"cdata";i:1;a:1:{i:0;s:1:" ";}i:2;i:664;}i:44;a:3:{i:0;s:9:"linebreak";i:1;a:0:{}i:2;i:665;}i:45;a:3:{i:0;s:5:"cdata";i:1;a:1:{i:0;s:1:"
";}i:2;i:667;}i:46;a:3:{i:0;s:12:"externallink";i:1;a:2:{i:0;s:54:"http://slayeroffice.com/tools/modi/v2.0/modi_help.html";i:1;s:19:"Mouse DOM Inspector";}i:2;i:668;}i:47;a:3:{i:0;s:5:"cdata";i:1;a:1:{i:0;s:1:" ";}i:2;i:746;}i:48;a:3:{i:0;s:9:"linebreak";i:1;a:0:{}i:2;i:747;}i:49;a:3:{i:0;s:5:"cdata";i:1;a:1:{i:0;s:1:"
";}i:2;i:749;}i:50;a:3:{i:0;s:6:"plugin";i:1;a:4:{i:0;s:11:"htmlcomment";i:1;a:2:{i:0;i:5;i:1;s:7:" [[|]] ";}i:2;i:5;i:3;s:14:"<!-- [[|]] -->";}i:2;i:750;}i:51;a:3:{i:0;s:5:"cdata";i:1;a:1:{i:0;s:1:"
";}i:2;i:764;}i:52;a:3:{i:0;s:7:"p_close";i:1;a:0:{}i:2;i:764;}i:53;a:2:{i:0;s:6:"plugin";i:1;a:4:{i:0;s:7:"uparrow";i:1;a:1:{i:0;s:42:"lib/plugins/uparrow/images/tango-small.png";}i:2;i:1;i:3;s:6:"~~UP~~";}}i:54;a:3:{i:0;s:13:"section_close";i:1;a:0:{}i:2;i:764;}i:55;a:3:{i:0;s:12:"section_edit";i:1;a:4:{i:0;i:317;i:1;i:0;i:2;i:2;i:3;s:21:"Extension Development";}i:2;i:764;}i:56;a:3:{i:0;s:12:"document_end";i:1;a:0:{}i:2;i:764;}}