a:68:{i:0;a:3:{i:0;s:14:"document_start";i:1;a:0:{}i:2;i:0;}i:1;a:3:{i:0;s:6:"p_open";i:1;a:0:{}i:2;i:0;}i:2;a:3:{i:0;s:7:"p_close";i:1;a:0:{}i:2;i:1;}i:3;a:3:{i:0;s:12:"section_edit";i:1;a:4:{i:0;i:-1;i:1;i:0;i:2;i:1;i:3;s:0:"";}i:2;i:1;}i:4;a:3:{i:0;s:6:"header";i:1;a:3:{i:0;s:5:"Linux";i:1;i:1;i:2;i:1;}i:2;i:1;}i:5;a:3:{i:0;s:12:"section_open";i:1;a:1:{i:0;i:1;}i:2;i:1;}i:6;a:2:{i:0;s:6:"plugin";i:1;a:4:{i:0;s:7:"uparrow";i:1;a:1:{i:0;s:42:"lib/plugins/uparrow/images/tango-small.png";}i:2;i:1;i:3;s:6:"~~UP~~";}}i:7;a:3:{i:0;s:13:"section_close";i:1;a:0:{}i:2;i:22;}i:8;a:3:{i:0;s:12:"section_edit";i:1;a:4:{i:0;i:1;i:1;i:21;i:2;i:1;i:3;s:5:"Linux";}i:2;i:22;}i:9;a:3:{i:0;s:6:"header";i:1;a:3:{i:0;s:37:"How to fix an unsucessful instalation";i:1;i:2;i:2;i:22;}i:2;i:22;}i:10;a:3:{i:0;s:12:"section_open";i:1;a:1:{i:0;i:2;}i:2;i:22;}i:11;a:3:{i:0;s:6:"p_open";i:1;a:0:{}i:2;i:71;}i:12;a:3:{i:0;s:5:"cdata";i:1;a:1:{i:0;s:99:"
If your Linux instalation was not sucessful, but at least you have access to a terminal, try this:";}i:2;i:72;}i:13;a:3:{i:0;s:7:"p_close";i:1;a:0:{}i:2;i:171;}i:14;a:3:{i:0;s:4:"code";i:1;a:3:{i:0;s:223:"
$ sudo apt-get check
# for dependency problems
$ sudo apt-get install -f
# for configuration problems
$ sudo dpkg --configure -a
# for whole distribution atualization
$ sudo apt-get -f dist-upgrade ou update-manager -d -c
";i:1;s:4:"bash";i:2;N;}i:2;i:178;}i:15;a:2:{i:0;s:6:"plugin";i:1;a:4:{i:0;s:7:"uparrow";i:1;a:1:{i:0;s:42:"lib/plugins/uparrow/images/tango-small.png";}i:2;i:1;i:3;s:6:"~~UP~~";}}i:16;a:3:{i:0;s:13:"section_close";i:1;a:0:{}i:2;i:416;}i:17;a:3:{i:0;s:12:"section_edit";i:1;a:4:{i:0;i:22;i:1;i:415;i:2;i:2;i:3;s:37:"How to fix an unsucessful instalation";}i:2;i:416;}i:18;a:3:{i:0;s:6:"header";i:1;a:3:{i:0;s:27:"How to change apt-get hosts";i:1;i:2;i:2;i:416;}i:2;i:416;}i:19;a:3:{i:0;s:12:"section_open";i:1;a:1:{i:0;i:2;}i:2;i:416;}i:20;a:3:{i:0;s:6:"p_open";i:1;a:0:{}i:2;i:455;}i:21;a:3:{i:0;s:5:"cdata";i:1;a:1:{i:0;s:142:"
If your apt-get can't resolve some host (maybe the host itself is offline), you can edit the file /etc/apt/sources.list and change the hosts.";}i:2;i:456;}i:22;a:3:{i:0;s:7:"p_close";i:1;a:0:{}i:2;i:598;}i:23;a:2:{i:0;s:6:"plugin";i:1;a:4:{i:0;s:7:"uparrow";i:1;a:1:{i:0;s:42:"lib/plugins/uparrow/images/tango-small.png";}i:2;i:1;i:3;s:6:"~~UP~~";}}i:24;a:3:{i:0;s:13:"section_close";i:1;a:0:{}i:2;i:600;}i:25;a:3:{i:0;s:12:"section_edit";i:1;a:4:{i:0;i:416;i:1;i:599;i:2;i:2;i:3;s:27:"How to change apt-get hosts";}i:2;i:600;}i:26;a:3:{i:0;s:6:"header";i:1;a:3:{i:0;s:38:"How to get information about a package";i:1;i:2;i:2;i:600;}i:2;i:600;}i:27;a:3:{i:0;s:12:"section_open";i:1;a:1:{i:0;i:2;}i:2;i:600;}i:28;a:3:{i:0;s:4:"code";i:1;a:3:{i:0;s:31:"
$ apt-cache show package_name
";i:1;s:4:"bash";i:2;N;}i:2;i:657;}i:29;a:2:{i:0;s:6:"plugin";i:1;a:4:{i:0;s:7:"uparrow";i:1;a:1:{i:0;s:42:"lib/plugins/uparrow/images/tango-small.png";}i:2;i:1;i:3;s:6:"~~UP~~";}}i:30;a:3:{i:0;s:13:"section_close";i:1;a:0:{}i:2;i:703;}i:31;a:3:{i:0;s:12:"section_edit";i:1;a:4:{i:0;i:600;i:1;i:702;i:2;i:2;i:3;s:38:"How to get information about a package";}i:2;i:703;}i:32;a:3:{i:0;s:6:"header";i:1;a:3:{i:0;s:18:"How to get your IP";i:1;i:2;i:2;i:703;}i:2;i:703;}i:33;a:3:{i:0;s:12:"section_open";i:1;a:1:{i:0;i:2;}i:2;i:703;}i:34;a:3:{i:0;s:4:"code";i:1;a:3:{i:0;s:12:"
$ ifconfig
";i:1;s:4:"bash";i:2;N;}i:2;i:740;}i:35;a:2:{i:0;s:6:"plugin";i:1;a:4:{i:0;s:7:"uparrow";i:1;a:1:{i:0;s:42:"lib/plugins/uparrow/images/tango-small.png";}i:2;i:1;i:3;s:6:"~~UP~~";}}i:36;a:3:{i:0;s:13:"section_close";i:1;a:0:{}i:2;i:767;}i:37;a:3:{i:0;s:12:"section_edit";i:1;a:4:{i:0;i:703;i:1;i:766;i:2;i:2;i:3;s:18:"How to get your IP";}i:2;i:767;}i:38;a:3:{i:0;s:6:"header";i:1;a:3:{i:0;s:19:"How to install GLUI";i:1;i:2;i:2;i:767;}i:2;i:767;}i:39;a:3:{i:0;s:12:"section_open";i:1;a:1:{i:0;i:2;}i:2;i:767;}i:40;a:3:{i:0;s:4:"code";i:1;a:3:{i:0;s:138:"
# download it from source-forge
$ make
$ sudo cp -r include/* /usr/include
$ sudo cp -r lib/* /usr/lib
$ sudo apt-get install libxmu-dev
";i:1;s:4:"bash";i:2;N;}i:2;i:805;}i:41;a:2:{i:0;s:6:"plugin";i:1;a:4:{i:0;s:7:"uparrow";i:1;a:1:{i:0;s:42:"lib/plugins/uparrow/images/tango-small.png";}i:2;i:1;i:3;s:6:"~~UP~~";}}i:42;a:3:{i:0;s:13:"section_close";i:1;a:0:{}i:2;i:958;}i:43;a:3:{i:0;s:12:"section_edit";i:1;a:4:{i:0;i:767;i:1;i:957;i:2;i:2;i:3;s:19:"How to install GLUI";}i:2;i:958;}i:44;a:3:{i:0;s:6:"header";i:1;a:3:{i:0;s:12:"How to print";i:1;i:2;i:2;i:958;}i:2;i:958;}i:45;a:3:{i:0;s:12:"section_open";i:1;a:1:{i:0;i:2;}i:2;i:958;}i:46;a:3:{i:0;s:4:"code";i:1;a:3:{i:0;s:46:"
$ smbclient //impressoras/lj72 -U kssilveira
";i:1;s:4:"bash";i:2;N;}i:2;i:989;}i:47;a:2:{i:0;s:6:"plugin";i:1;a:4:{i:0;s:7:"uparrow";i:1;a:1:{i:0;s:42:"lib/plugins/uparrow/images/tango-small.png";}i:2;i:1;i:3;s:6:"~~UP~~";}}i:48;a:3:{i:0;s:13:"section_close";i:1;a:0:{}i:2;i:1050;}i:49;a:3:{i:0;s:12:"section_edit";i:1;a:4:{i:0;i:958;i:1;i:1049;i:2;i:2;i:3;s:12:"How to print";}i:2;i:1050;}i:50;a:3:{i:0;s:6:"header";i:1;a:3:{i:0;s:20:"How to open 7z files";i:1;i:2;i:2;i:1050;}i:2;i:1050;}i:51;a:3:{i:0;s:12:"section_open";i:1;a:1:{i:0;i:2;}i:2;i:1050;}i:52;a:3:{i:0;s:4:"code";i:1;a:3:{i:0;s:30:"
$ sudo apt-get install p7zip
";i:1;s:4:"bash";i:2;N;}i:2;i:1089;}i:53;a:2:{i:0;s:6:"plugin";i:1;a:4:{i:0;s:7:"uparrow";i:1;a:1:{i:0;s:42:"lib/plugins/uparrow/images/tango-small.png";}i:2;i:1;i:3;s:6:"~~UP~~";}}i:54;a:3:{i:0;s:13:"section_close";i:1;a:0:{}i:2;i:1134;}i:55;a:3:{i:0;s:12:"section_edit";i:1;a:4:{i:0;i:1050;i:1;i:1133;i:2;i:2;i:3;s:20:"How to open 7z files";}i:2;i:1134;}i:56;a:3:{i:0;s:6:"header";i:1;a:3:{i:0;s:5:"Links";i:1;i:2;i:2;i:1134;}i:2;i:1134;}i:57;a:3:{i:0;s:12:"section_open";i:1;a:1:{i:0;i:2;}i:2;i:1134;}i:58;a:3:{i:0;s:6:"p_open";i:1;a:0:{}i:2;i:1151;}i:59;a:3:{i:0;s:5:"cdata";i:1;a:1:{i:0;s:1:"
";}i:2;i:1152;}i:60;a:3:{i:0;s:12:"externallink";i:1;a:2:{i:0;s:85:"http://kevin.vanzonneveld.net/techblog/article/schedule_tasks_on_linux_using_crontab/";i:1;s:23:"Schedule Tasks on Linux";}i:2;i:1153;}i:61;a:3:{i:0;s:5:"cdata";i:1;a:1:{i:0;s:1:"
";}i:2;i:1266;}i:62;a:3:{i:0;s:6:"plugin";i:1;a:4:{i:0;s:11:"htmlcomment";i:1;a:2:{i:0;i:5;i:1;s:7:" [[|]] ";}i:2;i:5;i:3;s:14:"<!-- [[|]] -->";}i:2;i:1267;}i:63;a:3:{i:0;s:7:"p_close";i:1;a:0:{}i:2;i:1281;}i:64;a:2:{i:0;s:6:"plugin";i:1;a:4:{i:0;s:7:"uparrow";i:1;a:1:{i:0;s:42:"lib/plugins/uparrow/images/tango-small.png";}i:2;i:1;i:3;s:6:"~~UP~~";}}i:65;a:3:{i:0;s:13:"section_close";i:1;a:0:{}i:2;i:1282;}i:66;a:3:{i:0;s:12:"section_edit";i:1;a:4:{i:0;i:1134;i:1;i:0;i:2;i:2;i:3;s:5:"Links";}i:2;i:1282;}i:67;a:3:{i:0;s:12:"document_end";i:1;a:0:{}i:2;i:1282;}}