a:17:{i:0;a:3:{i:0;s:14:"document_start";i:1;a:0:{}i:2;i:0;}i:1;a:3:{i:0;s:6:"p_open";i:1;a:0:{}i:2;i:0;}i:2;a:3:{i:0;s:7:"p_close";i:1;a:0:{}i:2;i:1;}i:3;a:3:{i:0;s:12:"section_edit";i:1;a:4:{i:0;i:-1;i:1;i:0;i:2;i:1;i:3;s:0:"";}i:2;i:1;}i:4;a:3:{i:0;s:6:"header";i:1;a:3:{i:0;s:4:"Diff";i:1;i:1;i:2;i:1;}i:2;i:1;}i:5;a:3:{i:0;s:12:"section_open";i:1;a:1:{i:0;i:1;}i:2;i:1;}i:6;a:2:{i:0;s:6:"plugin";i:1;a:4:{i:0;s:7:"uparrow";i:1;a:1:{i:0;s:42:"lib/plugins/uparrow/images/tango-small.png";}i:2;i:1;i:3;s:6:"~~UP~~";}}i:7;a:3:{i:0;s:13:"section_close";i:1;a:0:{}i:2;i:21;}i:8;a:3:{i:0;s:12:"section_edit";i:1;a:4:{i:0;i:1;i:1;i:20;i:2;i:1;i:3;s:4:"Diff";}i:2;i:21;}i:9;a:3:{i:0;s:6:"header";i:1;a:3:{i:0;s:38:"How to compare two folders recursively";i:1;i:2;i:2;i:21;}i:2;i:21;}i:10;a:3:{i:0;s:12:"section_open";i:1;a:1:{i:0;i:2;}i:2;i:21;}i:11;a:3:{i:0;s:4:"code";i:1;a:3:{i:0;s:159:"
# Comparing two folder recursively, paginating, output in two columns, reporting identical files.
$ diff -r -l -y -s path/to/folder/a path/to/folder/b | less
";i:1;s:4:"bash";i:2;N;}i:2;i:78;}i:12;a:3:{i:0;s:6:"plugin";i:1;a:4:{i:0;s:7:"tag_tag";i:1;a:1:{i:0;s:11:"programming";}i:2;i:5;i:3;s:19:"{{tag>programming}}";}i:2;i:252;}i:13;a:2:{i:0;s:6:"plugin";i:1;a:4:{i:0;s:7:"uparrow";i:1;a:1:{i:0;s:42:"lib/plugins/uparrow/images/tango-small.png";}i:2;i:1;i:3;s:6:"~~UP~~";}}i:14;a:3:{i:0;s:13:"section_close";i:1;a:0:{}i:2;i:271;}i:15;a:3:{i:0;s:12:"section_edit";i:1;a:4:{i:0;i:21;i:1;i:0;i:2;i:2;i:3;s:38:"How to compare two folders recursively";}i:2;i:271;}i:16;a:3:{i:0;s:12:"document_end";i:1;a:0:{}i:2;i:271;}}