a:75:{i:0;a:3:{i:0;s:14:"document_start";i:1;a:0:{}i:2;i:0;}i:1;a:3:{i:0;s:6:"p_open";i:1;a:0:{}i:2;i:0;}i:2;a:3:{i:0;s:7:"p_close";i:1;a:0:{}i:2;i:1;}i:3;a:3:{i:0;s:12:"section_edit";i:1;a:4:{i:0;i:-1;i:1;i:0;i:2;i:1;i:3;s:0:"";}i:2;i:1;}i:4;a:3:{i:0;s:6:"header";i:1;a:3:{i:0;s:13:"Élémentaire";i:1;i:1;i:2;i:1;}i:2;i:1;}i:5;a:3:{i:0;s:12:"section_open";i:1;a:1:{i:0;i:1;}i:2;i:1;}i:6;a:3:{i:0;s:6:"p_open";i:1;a:0:{}i:2;i:28;}i:7;a:3:{i:0;s:5:"cdata";i:1;a:1:{i:0;s:1:"
";}i:2;i:29;}i:8;a:3:{i:0;s:12:"internallink";i:1;a:2:{i:0;s:18:".:basic:sequence01";i:1;N;}i:2;i:30;}i:9;a:3:{i:0;s:5:"cdata";i:1;a:1:{i:0;s:1:" ";}i:2;i:52;}i:10;a:3:{i:0;s:9:"linebreak";i:1;a:0:{}i:2;i:53;}i:11;a:3:{i:0;s:5:"cdata";i:1;a:1:{i:0;s:1:"
";}i:2;i:55;}i:12;a:3:{i:0;s:12:"internallink";i:1;a:2:{i:0;s:18:".:basic:sequence02";i:1;N;}i:2;i:56;}i:13;a:3:{i:0;s:5:"cdata";i:1;a:1:{i:0;s:1:" ";}i:2;i:78;}i:14;a:3:{i:0;s:9:"linebreak";i:1;a:0:{}i:2;i:79;}i:15;a:3:{i:0;s:5:"cdata";i:1;a:1:{i:0;s:1:"
";}i:2;i:81;}i:16;a:3:{i:0;s:12:"internallink";i:1;a:2:{i:0;s:18:".:basic:sequence03";i:1;N;}i:2;i:82;}i:17;a:3:{i:0;s:5:"cdata";i:1;a:1:{i:0;s:1:" ";}i:2;i:104;}i:18;a:3:{i:0;s:9:"linebreak";i:1;a:0:{}i:2;i:105;}i:19;a:3:{i:0;s:5:"cdata";i:1;a:1:{i:0;s:1:"
";}i:2;i:107;}i:20;a:3:{i:0;s:12:"internallink";i:1;a:2:{i:0;s:18:".:basic:sequence04";i:1;N;}i:2;i:108;}i:21;a:3:{i:0;s:5:"cdata";i:1;a:1:{i:0;s:1:" ";}i:2;i:130;}i:22;a:3:{i:0;s:9:"linebreak";i:1;a:0:{}i:2;i:131;}i:23;a:3:{i:0;s:5:"cdata";i:1;a:1:{i:0;s:1:"
";}i:2;i:133;}i:24;a:3:{i:0;s:12:"internallink";i:1;a:2:{i:0;s:18:".:basic:sequence05";i:1;N;}i:2;i:134;}i:25;a:3:{i:0;s:5:"cdata";i:1;a:1:{i:0;s:1:" ";}i:2;i:156;}i:26;a:3:{i:0;s:9:"linebreak";i:1;a:0:{}i:2;i:157;}i:27;a:3:{i:0;s:5:"cdata";i:1;a:1:{i:0;s:1:"
";}i:2;i:159;}i:28;a:3:{i:0;s:12:"internallink";i:1;a:2:{i:0;s:18:".:basic:sequence06";i:1;N;}i:2;i:160;}i:29;a:3:{i:0;s:5:"cdata";i:1;a:1:{i:0;s:1:" ";}i:2;i:182;}i:30;a:3:{i:0;s:9:"linebreak";i:1;a:0:{}i:2;i:183;}i:31;a:3:{i:0;s:5:"cdata";i:1;a:1:{i:0;s:1:"
";}i:2;i:185;}i:32;a:3:{i:0;s:12:"internallink";i:1;a:2:{i:0;s:18:".:basic:sequence07";i:1;N;}i:2;i:186;}i:33;a:3:{i:0;s:5:"cdata";i:1;a:1:{i:0;s:1:" ";}i:2;i:208;}i:34;a:3:{i:0;s:9:"linebreak";i:1;a:0:{}i:2;i:209;}i:35;a:3:{i:0;s:5:"cdata";i:1;a:1:{i:0;s:1:"
";}i:2;i:211;}i:36;a:3:{i:0;s:12:"internallink";i:1;a:2:{i:0;s:18:".:basic:sequence08";i:1;N;}i:2;i:212;}i:37;a:3:{i:0;s:5:"cdata";i:1;a:1:{i:0;s:1:" ";}i:2;i:234;}i:38;a:3:{i:0;s:9:"linebreak";i:1;a:0:{}i:2;i:235;}i:39;a:3:{i:0;s:5:"cdata";i:1;a:1:{i:0;s:1:"
";}i:2;i:237;}i:40;a:3:{i:0;s:12:"internallink";i:1;a:2:{i:0;s:18:".:basic:sequence09";i:1;N;}i:2;i:238;}i:41;a:3:{i:0;s:5:"cdata";i:1;a:1:{i:0;s:1:" ";}i:2;i:260;}i:42;a:3:{i:0;s:9:"linebreak";i:1;a:0:{}i:2;i:261;}i:43;a:3:{i:0;s:5:"cdata";i:1;a:1:{i:0;s:1:"
";}i:2;i:263;}i:44;a:3:{i:0;s:12:"internallink";i:1;a:2:{i:0;s:18:".:basic:sequence10";i:1;N;}i:2;i:264;}i:45;a:3:{i:0;s:5:"cdata";i:1;a:1:{i:0;s:1:" ";}i:2;i:286;}i:46;a:3:{i:0;s:9:"linebreak";i:1;a:0:{}i:2;i:287;}i:47;a:3:{i:0;s:5:"cdata";i:1;a:1:{i:0;s:1:"
";}i:2;i:289;}i:48;a:3:{i:0;s:12:"internallink";i:1;a:2:{i:0;s:18:".:basic:sequence11";i:1;N;}i:2;i:290;}i:49;a:3:{i:0;s:5:"cdata";i:1;a:1:{i:0;s:1:" ";}i:2;i:312;}i:50;a:3:{i:0;s:9:"linebreak";i:1;a:0:{}i:2;i:313;}i:51;a:3:{i:0;s:5:"cdata";i:1;a:1:{i:0;s:1:"
";}i:2;i:315;}i:52;a:3:{i:0;s:12:"internallink";i:1;a:2:{i:0;s:18:".:basic:sequence12";i:1;N;}i:2;i:316;}i:53;a:3:{i:0;s:5:"cdata";i:1;a:1:{i:0;s:1:" ";}i:2;i:338;}i:54;a:3:{i:0;s:9:"linebreak";i:1;a:0:{}i:2;i:339;}i:55;a:3:{i:0;s:5:"cdata";i:1;a:1:{i:0;s:1:"
";}i:2;i:341;}i:56;a:3:{i:0;s:12:"internallink";i:1;a:2:{i:0;s:18:".:basic:sequence13";i:1;N;}i:2;i:342;}i:57;a:3:{i:0;s:5:"cdata";i:1;a:1:{i:0;s:1:" ";}i:2;i:364;}i:58;a:3:{i:0;s:9:"linebreak";i:1;a:0:{}i:2;i:365;}i:59;a:3:{i:0;s:5:"cdata";i:1;a:1:{i:0;s:1:"
";}i:2;i:367;}i:60;a:3:{i:0;s:12:"internallink";i:1;a:2:{i:0;s:18:".:basic:sequence14";i:1;N;}i:2;i:368;}i:61;a:3:{i:0;s:5:"cdata";i:1;a:1:{i:0;s:1:" ";}i:2;i:390;}i:62;a:3:{i:0;s:9:"linebreak";i:1;a:0:{}i:2;i:391;}i:63;a:3:{i:0;s:5:"cdata";i:1;a:1:{i:0;s:1:"
";}i:2;i:393;}i:64;a:3:{i:0;s:12:"internallink";i:1;a:2:{i:0;s:18:".:basic:sequence15";i:1;N;}i:2;i:394;}i:65;a:3:{i:0;s:5:"cdata";i:1;a:1:{i:0;s:1:" ";}i:2;i:416;}i:66;a:3:{i:0;s:9:"linebreak";i:1;a:0:{}i:2;i:417;}i:67;a:3:{i:0;s:5:"cdata";i:1;a:1:{i:0;s:1:"
";}i:2;i:419;}i:68;a:3:{i:0;s:12:"internallink";i:1;a:2:{i:0;s:18:".:basic:sequence16";i:1;N;}i:2;i:420;}i:69;a:3:{i:0;s:5:"cdata";i:1;a:1:{i:0;s:1:" ";}i:2;i:442;}i:70;a:3:{i:0;s:9:"linebreak";i:1;a:0:{}i:2;i:443;}i:71;a:3:{i:0;s:7:"p_close";i:1;a:0:{}i:2;i:445;}i:72;a:2:{i:0;s:6:"plugin";i:1;a:4:{i:0;s:7:"uparrow";i:1;a:1:{i:0;s:42:"lib/plugins/uparrow/images/tango-small.png";}i:2;i:1;i:3;s:6:"~~UP~~";}}i:73;a:3:{i:0;s:13:"section_close";i:1;a:0:{}i:2;i:446;}i:74;a:3:{i:0;s:12:"document_end";i:1;a:0:{}i:2;i:446;}}