a:30:{i:0;a:3:{i:0;s:14:"document_start";i:1;a:0:{}i:2;i:0;}i:1;a:3:{i:0;s:6:"p_open";i:1;a:0:{}i:2;i:0;}i:2;a:3:{i:0;s:7:"p_close";i:1;a:0:{}i:2;i:1;}i:3;a:3:{i:0;s:12:"section_edit";i:1;a:4:{i:0;i:-1;i:1;i:0;i:2;i:1;i:3;s:0:"";}i:2;i:1;}i:4;a:3:{i:0;s:6:"header";i:1;a:3:{i:0;s:8:"Irrlicht";i:1;i:1;i:2;i:1;}i:2;i:1;}i:5;a:3:{i:0;s:12:"section_open";i:1;a:1:{i:0;i:1;}i:2;i:1;}i:6;a:3:{i:0;s:6:"p_open";i:1;a:0:{}i:2;i:23;}i:7;a:3:{i:0;s:5:"cdata";i:1;a:1:{i:0;s:1:"
";}i:2;i:24;}i:8;a:3:{i:0;s:12:"externallink";i:1;a:2:{i:0;s:32:"http://irrlicht.sourceforge.net/";i:1;s:8:"Irrlicht";}i:2;i:25;}i:9;a:3:{i:0;s:5:"cdata";i:1;a:1:{i:0;s:2:": ";}i:2;i:70;}i:10;a:3:{i:0;s:13:"interwikilink";i:1;a:4:{i:0;s:18:"wp>Irrlicht_Engine";i:1;s:8:"Irrlicht";i:2;s:2:"wp";i:3;s:15:"Irrlicht_Engine";}i:2;i:72;}i:11;a:3:{i:0;s:5:"cdata";i:1;a:1:{i:0;s:13:" - 3D Engine ";}i:2;i:103;}i:12;a:3:{i:0;s:9:"linebreak";i:1;a:0:{}i:2;i:116;}i:13;a:3:{i:0;s:7:"p_close";i:1;a:0:{}i:2;i:118;}i:14;a:2:{i:0;s:6:"plugin";i:1;a:4:{i:0;s:7:"uparrow";i:1;a:1:{i:0;s:42:"lib/plugins/uparrow/images/tango-small.png";}i:2;i:1;i:3;s:6:"~~UP~~";}}i:15;a:3:{i:0;s:13:"section_close";i:1;a:0:{}i:2;i:120;}i:16;a:3:{i:0;s:12:"section_edit";i:1;a:4:{i:0;i:1;i:1;i:119;i:2;i:1;i:3;s:8:"Irrlicht";}i:2;i:120;}i:17;a:3:{i:0;s:6:"header";i:1;a:3:{i:0;s:26:"My Projects Using Irrlicht";i:1;i:2;i:2;i:120;}i:2;i:120;}i:18;a:3:{i:0;s:12:"section_open";i:1;a:1:{i:0;i:2;}i:2;i:120;}i:19;a:3:{i:0;s:6:"p_open";i:1;a:0:{}i:2;i:158;}i:20;a:3:{i:0;s:5:"cdata";i:1;a:1:{i:0;s:1:"
";}i:2;i:159;}i:21;a:3:{i:0;s:12:"externallink";i:1;a:2:{i:0;s:26:"http://h5n1.googlecode.com";i:1;s:4:"H5N1";}i:2;i:160;}i:22;a:3:{i:0;s:5:"cdata";i:1;a:1:{i:0;s:1:" ";}i:2;i:195;}i:23;a:3:{i:0;s:9:"linebreak";i:1;a:0:{}i:2;i:196;}i:24;a:3:{i:0;s:5:"cdata";i:1;a:1:{i:0;s:1:"
";}i:2;i:198;}i:25;a:3:{i:0;s:7:"p_close";i:1;a:0:{}i:2;i:198;}i:26;a:2:{i:0;s:6:"plugin";i:1;a:4:{i:0;s:7:"uparrow";i:1;a:1:{i:0;s:42:"lib/plugins/uparrow/images/tango-small.png";}i:2;i:1;i:3;s:6:"~~UP~~";}}i:27;a:3:{i:0;s:13:"section_close";i:1;a:0:{}i:2;i:198;}i:28;a:3:{i:0;s:12:"section_edit";i:1;a:4:{i:0;i:120;i:1;i:0;i:2;i:2;i:3;s:26:"My Projects Using Irrlicht";}i:2;i:198;}i:29;a:3:{i:0;s:12:"document_end";i:1;a:0:{}i:2;i:198;}}