a:27:{i:0;a:3:{i:0;s:14:"document_start";i:1;a:0:{}i:2;i:0;}i:1;a:3:{i:0;s:6:"p_open";i:1;a:0:{}i:2;i:0;}i:2;a:3:{i:0;s:7:"p_close";i:1;a:0:{}i:2;i:1;}i:3;a:3:{i:0;s:12:"section_edit";i:1;a:4:{i:0;i:-1;i:1;i:0;i:2;i:1;i:3;s:0:"";}i:2;i:1;}i:4;a:3:{i:0;s:6:"header";i:1;a:3:{i:0;s:6:"Images";i:1;i:1;i:2;i:1;}i:2;i:1;}i:5;a:3:{i:0;s:12:"section_open";i:1;a:1:{i:0;i:1;}i:2;i:1;}i:6;a:3:{i:0;s:6:"p_open";i:1;a:0:{}i:2;i:21;}i:7;a:3:{i:0;s:5:"cdata";i:1;a:1:{i:0;s:1:"
";}i:2;i:22;}i:8;a:3:{i:0;s:13:"internalmedia";i:1;a:7:{i:0;s:20:":main:images:cs2.jpg";i:1;N;i:2;s:6:"center";i:3;s:3:"750";i:4;N;i:5;s:5:"cache";i:6;s:7:"details";}i:2;i:23;}i:9;a:3:{i:0;s:5:"cdata";i:1;a:1:{i:0;s:1:" ";}i:2;i:53;}i:10;a:3:{i:0;s:9:"linebreak";i:1;a:0:{}i:2;i:54;}i:11;a:3:{i:0;s:5:"cdata";i:1;a:1:{i:0;s:1:"
";}i:2;i:56;}i:12;a:3:{i:0;s:13:"internalmedia";i:1;a:7:{i:0;s:20:":main:images:cs3.jpg";i:1;N;i:2;s:6:"center";i:3;s:3:"750";i:4;N;i:5;s:5:"cache";i:6;s:7:"details";}i:2;i:57;}i:13;a:3:{i:0;s:5:"cdata";i:1;a:1:{i:0;s:1:" ";}i:2;i:87;}i:14;a:3:{i:0;s:9:"linebreak";i:1;a:0:{}i:2;i:88;}i:15;a:3:{i:0;s:5:"cdata";i:1;a:1:{i:0;s:1:"
";}i:2;i:90;}i:16;a:3:{i:0;s:13:"internalmedia";i:1;a:7:{i:0;s:20:":main:images:cs1.jpg";i:1;N;i:2;s:6:"center";i:3;s:3:"750";i:4;N;i:5;s:5:"cache";i:6;s:7:"details";}i:2;i:91;}i:17;a:3:{i:0;s:5:"cdata";i:1;a:1:{i:0;s:1:" ";}i:2;i:121;}i:18;a:3:{i:0;s:9:"linebreak";i:1;a:0:{}i:2;i:122;}i:19;a:3:{i:0;s:5:"cdata";i:1;a:1:{i:0;s:1:"
";}i:2;i:124;}i:20;a:3:{i:0;s:13:"internalmedia";i:1;a:7:{i:0;s:20:":main:images:cs4.jpg";i:1;N;i:2;s:6:"center";i:3;s:3:"750";i:4;N;i:5;s:5:"cache";i:6;s:7:"details";}i:2;i:125;}i:21;a:3:{i:0;s:5:"cdata";i:1;a:1:{i:0;s:1:" ";}i:2;i:155;}i:22;a:3:{i:0;s:9:"linebreak";i:1;a:0:{}i:2;i:156;}i:23;a:3:{i:0;s:7:"p_close";i:1;a:0:{}i:2;i:158;}i:24;a:2:{i:0;s:6:"plugin";i:1;a:4:{i:0;s:7:"uparrow";i:1;a:1:{i:0;s:42:"lib/plugins/uparrow/images/tango-small.png";}i:2;i:1;i:3;s:6:"~~UP~~";}}i:25;a:3:{i:0;s:13:"section_close";i:1;a:0:{}i:2;i:159;}i:26;a:3:{i:0;s:12:"document_end";i:1;a:0:{}i:2;i:159;}}