a:69:{i:0;a:3:{i:0;s:14:"document_start";i:1;a:0:{}i:2;i:0;}i:1;a:3:{i:0;s:6:"p_open";i:1;a:0:{}i:2;i:0;}i:2;a:3:{i:0;s:7:"p_close";i:1;a:0:{}i:2;i:1;}i:3;a:3:{i:0;s:12:"section_edit";i:1;a:4:{i:0;i:-1;i:1;i:0;i:2;i:1;i:3;s:0:"";}i:2;i:1;}i:4;a:3:{i:0;s:6:"header";i:1;a:3:{i:0;s:4:"News";i:1;i:1;i:2;i:1;}i:2;i:1;}i:5;a:3:{i:0;s:12:"section_open";i:1;a:1:{i:0;i:1;}i:2;i:1;}i:6;a:2:{i:0;s:6:"plugin";i:1;a:4:{i:0;s:7:"uparrow";i:1;a:1:{i:0;s:42:"lib/plugins/uparrow/images/tango-small.png";}i:2;i:1;i:3;s:6:"~~UP~~";}}i:7;a:3:{i:0;s:13:"section_close";i:1;a:0:{}i:2;i:21;}i:8;a:3:{i:0;s:12:"section_edit";i:1;a:4:{i:0;i:1;i:1;i:20;i:2;i:1;i:3;s:4:"News";}i:2;i:21;}i:9;a:3:{i:0;s:6:"header";i:1;a:3:{i:0;s:4:"2010";i:1;i:2;i:2;i:21;}i:2;i:21;}i:10;a:3:{i:0;s:12:"section_open";i:1;a:1:{i:0;i:2;}i:2;i:21;}i:11;a:2:{i:0;s:6:"plugin";i:1;a:4:{i:0;s:7:"uparrow";i:1;a:1:{i:0;s:42:"lib/plugins/uparrow/images/tango-small.png";}i:2;i:1;i:3;s:6:"~~UP~~";}}i:12;a:3:{i:0;s:13:"section_close";i:1;a:0:{}i:2;i:39;}i:13;a:3:{i:0;s:12:"section_edit";i:1;a:4:{i:0;i:21;i:1;i:38;i:2;i:2;i:3;s:4:"2010";}i:2;i:39;}i:14;a:3:{i:0;s:6:"header";i:1;a:3:{i:0;s:5:"April";i:1;i:3;i:2;i:39;}i:2;i:39;}i:15;a:3:{i:0;s:12:"section_open";i:1;a:1:{i:0;i:3;}i:2;i:39;}i:16;a:3:{i:0;s:6:"p_open";i:1;a:0:{}i:2;i:54;}i:17;a:3:{i:0;s:5:"cdata";i:1;a:1:{i:0;s:1:"
";}i:2;i:55;}i:18;a:3:{i:0;s:12:"externallink";i:1;a:2:{i:0;s:58:"http://www.nytimes.com/2010/04/20/technology/20google.html";i:1;s:49:"Cyberattack on Google Said to Hit Password System";}i:2;i:56;}i:19;a:3:{i:0;s:5:"cdata";i:1;a:1:{i:0;s:1:" ";}i:2;i:168;}i:20;a:3:{i:0;s:9:"linebreak";i:1;a:0:{}i:2;i:169;}i:21;a:3:{i:0;s:5:"cdata";i:1;a:1:{i:0;s:1:"
";}i:2;i:171;}i:22;a:3:{i:0;s:12:"externallink";i:1;a:2:{i:0;s:57:"http://www.ns.umich.edu/htdocs/releases/story.php?id=7633";i:1;s:50:"Cat brain: A step toward the electronic equivalent";}i:2;i:172;}i:23;a:3:{i:0;s:5:"cdata";i:1;a:1:{i:0;s:1:" ";}i:2;i:284;}i:24;a:3:{i:0;s:9:"linebreak";i:1;a:0:{}i:2;i:285;}i:25;a:3:{i:0;s:5:"cdata";i:1;a:1:{i:0;s:1:"
";}i:2;i:287;}i:26;a:3:{i:0;s:12:"externallink";i:1;a:2:{i:0;s:31:"http://www2.cnrs.fr/en/1725.htm";i:1;s:50:"Deciphering the movement of pedestrians in a crowd";}i:2;i:288;}i:27;a:3:{i:0;s:5:"cdata";i:1;a:1:{i:0;s:1:" ";}i:2;i:374;}i:28;a:3:{i:0;s:9:"linebreak";i:1;a:0:{}i:2;i:375;}i:29;a:3:{i:0;s:5:"cdata";i:1;a:1:{i:0;s:1:"
";}i:2;i:377;}i:30;a:3:{i:0;s:12:"externallink";i:1;a:2:{i:0;s:86:"http://www.pcworld.com/article/194021/multitoe_project_offers_new_touch_interface.html";i:1;s:43:"Multitoe Project Offers New Touch Interface";}i:2;i:378;}i:31;a:3:{i:0;s:5:"cdata";i:1;a:1:{i:0;s:1:" ";}i:2;i:512;}i:32;a:3:{i:0;s:9:"linebreak";i:1;a:0:{}i:2;i:513;}i:33;a:3:{i:0;s:5:"cdata";i:1;a:1:{i:0;s:1:"
";}i:2;i:515;}i:34;a:3:{i:0;s:12:"externallink";i:1;a:2:{i:0;s:41:"http://www.physorg.com/news189868063.html";i:1;s:61:"Online e-Expo Features More Than 100 University Robotics Labs";}i:2;i:516;}i:35;a:3:{i:0;s:5:"cdata";i:1;a:1:{i:0;s:1:" ";}i:2;i:623;}i:36;a:3:{i:0;s:9:"linebreak";i:1;a:0:{}i:2;i:624;}i:37;a:3:{i:0;s:5:"cdata";i:1;a:1:{i:0;s:1:"
";}i:2;i:626;}i:38;a:3:{i:0;s:12:"externallink";i:1;a:2:{i:0;s:41:"http://www.physorg.com/news189919411.html";i:1;s:50:"'Mind-Reading' Brain-Scan Software Showcased in NY";}i:2;i:627;}i:39;a:3:{i:0;s:5:"cdata";i:1;a:1:{i:0;s:1:" ";}i:2;i:723;}i:40;a:3:{i:0;s:9:"linebreak";i:1;a:0:{}i:2;i:724;}i:41;a:3:{i:0;s:5:"cdata";i:1;a:1:{i:0;s:1:"
";}i:2;i:726;}i:42;a:3:{i:0;s:12:"externallink";i:1;a:2:{i:0;s:63:"http://www.nytimes.com/2010/04/11/business/global/11russia.html";i:1;s:35:"Innovation, by Order of the Kremlin";}i:2;i:727;}i:43;a:3:{i:0;s:5:"cdata";i:1;a:1:{i:0;s:1:" ";}i:2;i:830;}i:44;a:3:{i:0;s:9:"linebreak";i:1;a:0:{}i:2;i:831;}i:45;a:3:{i:0;s:5:"cdata";i:1;a:1:{i:0;s:1:"
";}i:2;i:833;}i:46;a:3:{i:0;s:12:"externallink";i:1;a:2:{i:0;s:148:"http://tigger.uic.edu/htbin/cgiwrap/bin/newsbureau/cgi-bin/index.cgi?from=Releases&to=Release&id=2843&start=1263048276&end=1270824276&topic=0&dept=0";i:1;s:35:"Battling Botnets With an Awesome OS";}i:2;i:834;}i:47;a:3:{i:0;s:5:"cdata";i:1;a:1:{i:0;s:1:" ";}i:2;i:1022;}i:48;a:3:{i:0;s:9:"linebreak";i:1;a:0:{}i:2;i:1023;}i:49;a:3:{i:0;s:5:"cdata";i:1;a:1:{i:0;s:1:"
";}i:2;i:1025;}i:50;a:3:{i:0;s:12:"externallink";i:1;a:2:{i:0;s:73:"http://www.networkworld.com/news/2010/040910-steganography-data-loss.html";i:1;s:82:"Steganography Discovery Could Help Data Thieves, But Also Improve Radar, Sonograms";}i:2;i:1026;}i:51;a:3:{i:0;s:5:"cdata";i:1;a:1:{i:0;s:1:" ";}i:2;i:1186;}i:52;a:3:{i:0;s:9:"linebreak";i:1;a:0:{}i:2;i:1187;}i:53;a:3:{i:0;s:5:"cdata";i:1;a:1:{i:0;s:1:"
";}i:2;i:1189;}i:54;a:3:{i:0;s:12:"externallink";i:1;a:2:{i:0;s:100:"http://cordis.europa.eu/ictresults/index.cfm?section=news&tpl=article&BrowsingType=Features&ID=91251";i:1;s:51:"Augmented Reality Brings Movie Magic to City Visits";}i:2;i:1190;}i:55;a:3:{i:0;s:5:"cdata";i:1;a:1:{i:0;s:1:" ";}i:2;i:1346;}i:56;a:3:{i:0;s:9:"linebreak";i:1;a:0:{}i:2;i:1347;}i:57;a:3:{i:0;s:5:"cdata";i:1;a:1:{i:0;s:1:"
";}i:2;i:1349;}i:58;a:3:{i:0;s:12:"externallink";i:1;a:2:{i:0;s:54:"http://web.mit.edu/newsoffice/2010/ai-unification.html";i:1;s:28:"A grand unified theory of AI";}i:2;i:1350;}i:59;a:3:{i:0;s:5:"cdata";i:1;a:1:{i:0;s:1:" ";}i:2;i:1437;}i:60;a:3:{i:0;s:9:"linebreak";i:1;a:0:{}i:2;i:1438;}i:61;a:3:{i:0;s:5:"cdata";i:1;a:1:{i:0;s:1:"
";}i:2;i:1440;}i:62;a:3:{i:0;s:6:"plugin";i:1;a:4:{i:0;s:11:"htmlcomment";i:1;a:2:{i:0;i:5;i:1;s:7:" [[|]] ";}i:2;i:5;i:3;s:14:"<!-- [[|]] -->";}i:2;i:1441;}i:63;a:3:{i:0;s:7:"p_close";i:1;a:0:{}i:2;i:1455;}i:64;a:3:{i:0;s:6:"plugin";i:1;a:4:{i:0;s:7:"tag_tag";i:1;a:1:{i:0;s:5:"links";}i:2;i:5;i:3;s:13:"{{tag>links}}";}i:2;i:1457;}i:65;a:2:{i:0;s:6:"plugin";i:1;a:4:{i:0;s:7:"uparrow";i:1;a:1:{i:0;s:42:"lib/plugins/uparrow/images/tango-small.png";}i:2;i:1;i:3;s:6:"~~UP~~";}}i:66;a:3:{i:0;s:13:"section_close";i:1;a:0:{}i:2;i:1470;}i:67;a:3:{i:0;s:12:"section_edit";i:1;a:4:{i:0;i:39;i:1;i:0;i:2;i:3;i:3;s:5:"April";}i:2;i:1470;}i:68;a:3:{i:0;s:12:"document_end";i:1;a:0:{}i:2;i:1470;}}