a:32:{i:0;a:3:{i:0;s:14:"document_start";i:1;a:0:{}i:2;i:0;}i:1;a:3:{i:0;s:6:"p_open";i:1;a:0:{}i:2;i:0;}i:2;a:3:{i:0;s:7:"p_close";i:1;a:0:{}i:2;i:1;}i:3;a:3:{i:0;s:12:"section_edit";i:1;a:4:{i:0;i:-1;i:1;i:0;i:2;i:1;i:3;s:0:"";}i:2;i:1;}i:4;a:3:{i:0;s:6:"header";i:1;a:3:{i:0;s:16:"Tagindex Manager";i:1;i:1;i:2;i:1;}i:2;i:1;}i:5;a:3:{i:0;s:12:"section_open";i:1;a:1:{i:0;i:1;}i:2;i:1;}i:6;a:3:{i:0;s:6:"p_open";i:1;a:0:{}i:2;i:31;}i:7;a:3:{i:0;s:5:"cdata";i:1;a:1:{i:0;s:55:"
This page allows you to rebuild the index used by the ";}i:2;i:32;}i:8;a:3:{i:0;s:12:"externallink";i:1;a:2:{i:0;s:37:"http://wiki.splitbrain.org/plugin:tag";i:1;s:10:"Tag Plugin";}i:2;i:87;}i:9;a:3:{i:0;s:5:"cdata";i:1;a:1:{i:0;s:205:".
This isn't needed generally as  the index builds and updates itself while
you tag your sites. However if you just upgraded, added or removed
a lot of files it may be a good idea to cleanup the the index.";}i:2;i:139;}i:10;a:3:{i:0;s:7:"p_close";i:1;a:0:{}i:2;i:344;}i:11;a:3:{i:0;s:6:"p_open";i:1;a:0:{}i:2;i:344;}i:12;a:3:{i:0;s:5:"cdata";i:1;a:1:{i:0;s:126:"This Manager needs a recent browser as it makes use of modern JavaScript
to carry out multiple tasks in the background (using ";}i:2;i:346;}i:13;a:3:{i:0;s:13:"interwikilink";i:1;a:4:{i:0;s:7:"wp>AJAX";i:1;N;i:2;s:2:"wp";i:3;s:4:"AJAX";}i:2;i:472;}i:14;a:3:{i:0;s:5:"cdata";i:1;a:1:{i:0;s:2:").";}i:2;i:483;}i:15;a:3:{i:0;s:7:"p_close";i:1;a:0:{}i:2;i:485;}i:16;a:3:{i:0;s:6:"p_open";i:1;a:0:{}i:2;i:485;}i:17;a:3:{i:0;s:5:"cdata";i:1;a:1:{i:0;s:103:"Rebuilding the index takes a long time. You should leave the page open
until the indexing has finished.";}i:2;i:487;}i:18;a:3:{i:0;s:7:"p_close";i:1;a:0:{}i:2;i:590;}i:19;a:3:{i:0;s:6:"p_open";i:1;a:0:{}i:2;i:590;}i:20;a:3:{i:0;s:6:"smiley";i:1;a:1:{i:0;s:3:":!:";}i:2;i:592;}i:21;a:3:{i:0;s:5:"cdata";i:1;a:1:{i:0;s:20:" Making a backup of ";}i:2;i:595;}i:22;a:3:{i:0;s:14:"monospace_open";i:1;a:0:{}i:2;i:615;}i:23;a:3:{i:0;s:5:"cdata";i:1;a:1:{i:0;s:18:"data/index/tag.idx";}i:2;i:617;}i:24;a:3:{i:0;s:15:"monospace_close";i:1;a:0:{}i:2;i:635;}i:25;a:3:{i:0;s:5:"cdata";i:1;a:1:{i:0;s:63:" is recommended in case something goes wrong during rebuiling. ";}i:2;i:637;}i:26;a:3:{i:0;s:6:"smiley";i:1;a:1:{i:0;s:3:":!:";}i:2;i:700;}i:27;a:3:{i:0;s:5:"cdata";i:1;a:1:{i:0;s:1:"
";}i:2;i:703;}i:28;a:3:{i:0;s:7:"p_close";i:1;a:0:{}i:2;i:703;}i:29;a:2:{i:0;s:6:"plugin";i:1;a:4:{i:0;s:7:"uparrow";i:1;a:1:{i:0;s:42:"lib/plugins/uparrow/images/tango-small.png";}i:2;i:1;i:3;s:6:"~~UP~~";}}i:30;a:3:{i:0;s:13:"section_close";i:1;a:0:{}i:2;i:703;}i:31;a:3:{i:0;s:12:"document_end";i:1;a:0:{}i:2;i:703;}}