a:20:{i:0;a:3:{i:0;s:14:"document_start";i:1;a:0:{}i:2;i:0;}i:1;a:3:{i:0;s:6:"p_open";i:1;a:0:{}i:2;i:0;}i:2;a:3:{i:0;s:7:"p_close";i:1;a:0:{}i:2;i:1;}i:3;a:3:{i:0;s:12:"section_edit";i:1;a:4:{i:0;i:-1;i:1;i:0;i:2;i:1;i:3;s:0:"";}i:2;i:1;}i:4;a:3:{i:0;s:6:"header";i:1;a:3:{i:0;s:3:"C++";i:1;i:1;i:2;i:1;}i:2;i:1;}i:5;a:3:{i:0;s:12:"section_open";i:1;a:1:{i:0;i:1;}i:2;i:1;}i:6;a:3:{i:0;s:6:"p_open";i:1;a:0:{}i:2;i:18;}i:7;a:3:{i:0;s:5:"cdata";i:1;a:1:{i:0;s:1:"
";}i:2;i:19;}i:8;a:3:{i:0;s:13:"interwikilink";i:1;a:4:{i:0;s:6:"wp>C++";i:1;N;i:2;s:2:"wp";i:3;s:3:"C++";}i:2;i:20;}i:9;a:3:{i:0;s:7:"p_close";i:1;a:0:{}i:2;i:30;}i:10;a:2:{i:0;s:6:"plugin";i:1;a:4:{i:0;s:7:"uparrow";i:1;a:1:{i:0;s:42:"lib/plugins/uparrow/images/tango-small.png";}i:2;i:1;i:3;s:6:"~~UP~~";}}i:11;a:3:{i:0;s:13:"section_close";i:1;a:0:{}i:2;i:32;}i:12;a:3:{i:0;s:12:"section_edit";i:1;a:4:{i:0;i:1;i:1;i:31;i:2;i:1;i:3;s:3:"C++";}i:2;i:32;}i:13;a:3:{i:0;s:6:"header";i:1;a:3:{i:0;s:21:"How to use exceptions";i:1;i:2;i:2;i:32;}i:2;i:32;}i:14;a:3:{i:0;s:12:"section_open";i:1;a:1:{i:0;i:2;}i:2;i:32;}i:15;a:3:{i:0;s:4:"code";i:1;a:3:{i:0;s:217:"
#include <iostream>
using namespace std;

int f(int x)
{
	if(x < 0) throw 0;
	return 1;
}

int main()
{
	try {
		cout << f(0) << endl;
		cout << f(-1) << endl;
	} catch(int e) {
		cout << "catch " << e << endl;
	}
}
";i:1;s:3:"c++";i:2;N;}i:2;i:72;}i:16;a:2:{i:0;s:6:"plugin";i:1;a:4:{i:0;s:7:"uparrow";i:1;a:1:{i:0;s:42:"lib/plugins/uparrow/images/tango-small.png";}i:2;i:1;i:3;s:6:"~~UP~~";}}i:17;a:3:{i:0;s:13:"section_close";i:1;a:0:{}i:2;i:302;}i:18;a:3:{i:0;s:12:"section_edit";i:1;a:4:{i:0;i:32;i:1;i:0;i:2;i:2;i:3;s:21:"How to use exceptions";}i:2;i:302;}i:19;a:3:{i:0;s:12:"document_end";i:1;a:0:{}i:2;i:302;}}