a:55:{i:0;a:3:{i:0;s:14:"document_start";i:1;a:0:{}i:2;i:0;}i:1;a:3:{i:0;s:6:"p_open";i:1;a:0:{}i:2;i:0;}i:2;a:3:{i:0;s:7:"p_close";i:1;a:0:{}i:2;i:1;}i:3;a:3:{i:0;s:12:"section_edit";i:1;a:4:{i:0;i:-1;i:1;i:0;i:2;i:1;i:3;s:0:"";}i:2;i:1;}i:4;a:3:{i:0;s:6:"header";i:1;a:3:{i:0;s:4:"Bash";i:1;i:1;i:2;i:1;}i:2;i:1;}i:5;a:3:{i:0;s:12:"section_open";i:1;a:1:{i:0;i:1;}i:2;i:1;}i:6;a:2:{i:0;s:6:"plugin";i:1;a:4:{i:0;s:7:"uparrow";i:1;a:1:{i:0;s:42:"lib/plugins/uparrow/images/tango-small.png";}i:2;i:1;i:3;s:6:"~~UP~~";}}i:7;a:3:{i:0;s:13:"section_close";i:1;a:0:{}i:2;i:21;}i:8;a:3:{i:0;s:12:"section_edit";i:1;a:4:{i:0;i:1;i:1;i:20;i:2;i:1;i:3;s:4:"Bash";}i:2;i:21;}i:9;a:3:{i:0;s:6:"header";i:1;a:3:{i:0;s:43:"How to change escape characters association";i:1;i:2;i:2;i:21;}i:2;i:21;}i:10;a:3:{i:0;s:12:"section_open";i:1;a:1:{i:0;i:2;}i:2;i:21;}i:11;a:3:{i:0;s:6:"p_open";i:1;a:0:{}i:2;i:76;}i:12;a:3:{i:0;s:5:"cdata";i:1;a:1:{i:0;s:235:"
Sometimes you can't send a program some characters association (e.g. Ctrl+S) because the bash window intercepts then. In order to the program to work correctly, you must remove this character association from bash. Here is an example:";}i:2;i:77;}i:13;a:3:{i:0;s:7:"p_close";i:1;a:0:{}i:2;i:312;}i:14;a:3:{i:0;s:4:"code";i:1;a:3:{i:0;s:191:"
# see escape characters association
$ stty -a
# shows ... ; stop = ^S; ...
# let's associate stop to Ctrl+Q
$ stty stop ^Q
# now CTRL-S will be passed to the program running inside the bash
";i:1;s:4:"bash";i:2;N;}i:2;i:319;}i:15;a:2:{i:0;s:6:"plugin";i:1;a:4:{i:0;s:7:"uparrow";i:1;a:1:{i:0;s:42:"lib/plugins/uparrow/images/tango-small.png";}i:2;i:1;i:3;s:6:"~~UP~~";}}i:16;a:3:{i:0;s:13:"section_close";i:1;a:0:{}i:2;i:525;}i:17;a:3:{i:0;s:12:"section_edit";i:1;a:4:{i:0;i:21;i:1;i:524;i:2;i:2;i:3;s:43:"How to change escape characters association";}i:2;i:525;}i:18;a:3:{i:0;s:6:"header";i:1;a:3:{i:0;s:32:"How to change bash configuration";i:1;i:2;i:2;i:525;}i:2;i:525;}i:19;a:3:{i:0;s:12:"section_open";i:1;a:1:{i:0;i:2;}i:2;i:525;}i:20;a:3:{i:0;s:6:"p_open";i:1;a:0:{}i:2;i:569;}i:21;a:3:{i:0;s:5:"cdata";i:1;a:1:{i:0;s:223:"
The file ~/.bashrc is read and executed every time you open bash. So if you want that a configuration change (like stty) to be true the next time you open bash, you must append it to the ~/.bashrc. Here is an example code:";}i:2;i:570;}i:22;a:3:{i:0;s:7:"p_close";i:1;a:0:{}i:2;i:793;}i:23;a:3:{i:0;s:4:"code";i:1;a:3:{i:0;s:58:"
# append to ~/.bashrc
$ echo 'stty stop ^Q' >> ~/.bashrc
";i:1;s:4:"bash";i:2;N;}i:2;i:800;}i:24;a:2:{i:0;s:6:"plugin";i:1;a:4:{i:0;s:7:"uparrow";i:1;a:1:{i:0;s:42:"lib/plugins/uparrow/images/tango-small.png";}i:2;i:1;i:3;s:6:"~~UP~~";}}i:25;a:3:{i:0;s:13:"section_close";i:1;a:0:{}i:2;i:873;}i:26;a:3:{i:0;s:12:"section_edit";i:1;a:4:{i:0;i:525;i:1;i:872;i:2;i:2;i:3;s:32:"How to change bash configuration";}i:2;i:873;}i:27;a:3:{i:0;s:6:"header";i:1;a:3:{i:0;s:51:"How to use same bash configuration file on many PCs";i:1;i:2;i:2;i:873;}i:2;i:873;}i:28;a:3:{i:0;s:12:"section_open";i:1;a:1:{i:0;i:2;}i:2;i:873;}i:29;a:3:{i:0;s:6:"p_open";i:1;a:0:{}i:2;i:936;}i:30;a:3:{i:0;s:5:"cdata";i:1;a:1:{i:0;s:158:"
If order to use the same configuration file on many PCs (e.g. your work and you home), you can include your main file on the ~/.bashrc of those PCs. Example:";}i:2;i:937;}i:31;a:3:{i:0;s:7:"p_close";i:1;a:0:{}i:2;i:1095;}i:32;a:3:{i:0;s:4:"code";i:1;a:3:{i:0;s:119:"
# append to ~/.bashrc (do this on each PC)
$ echo 'source /path/to/your/main/configuration/file/.bashrc' >> ~/.bashrc
";i:1;s:4:"bash";i:2;N;}i:2;i:1102;}i:33;a:2:{i:0;s:6:"plugin";i:1;a:4:{i:0;s:7:"uparrow";i:1;a:1:{i:0;s:42:"lib/plugins/uparrow/images/tango-small.png";}i:2;i:1;i:3;s:6:"~~UP~~";}}i:34;a:3:{i:0;s:13:"section_close";i:1;a:0:{}i:2;i:1236;}i:35;a:3:{i:0;s:12:"section_edit";i:1;a:4:{i:0;i:873;i:1;i:1235;i:2;i:2;i:3;s:51:"How to use same bash configuration file on many PCs";}i:2;i:1236;}i:36;a:3:{i:0;s:6:"header";i:1;a:3:{i:0;s:23:"How to make a fork bomb";i:1;i:2;i:2;i:1236;}i:2;i:1236;}i:37;a:3:{i:0;s:12:"section_open";i:1;a:1:{i:0;i:2;}i:2;i:1236;}i:38;a:3:{i:0;s:4:"code";i:1;a:3:{i:0;s:16:"
$ :(){ :|:&};:
";i:1;s:4:"bash";i:2;N;}i:2;i:1278;}i:39;a:2:{i:0;s:6:"plugin";i:1;a:4:{i:0;s:7:"uparrow";i:1;a:1:{i:0;s:42:"lib/plugins/uparrow/images/tango-small.png";}i:2;i:1;i:3;s:6:"~~UP~~";}}i:40;a:3:{i:0;s:13:"section_close";i:1;a:0:{}i:2;i:1309;}i:41;a:3:{i:0;s:12:"section_edit";i:1;a:4:{i:0;i:1236;i:1;i:1308;i:2;i:2;i:3;s:23:"How to make a fork bomb";}i:2;i:1309;}i:42;a:3:{i:0;s:6:"header";i:1;a:3:{i:0;s:42:"How to recursively change file permissions";i:1;i:2;i:2;i:1309;}i:2;i:1309;}i:43;a:3:{i:0;s:12:"section_open";i:1;a:1:{i:0;i:2;}i:2;i:1309;}i:44;a:3:{i:0;s:4:"code";i:1;a:3:{i:0;s:29:"
$ chmod a+rwx -R foldername
";i:1;s:4:"bash";i:2;N;}i:2;i:1370;}i:45;a:2:{i:0;s:6:"plugin";i:1;a:4:{i:0;s:7:"uparrow";i:1;a:1:{i:0;s:42:"lib/plugins/uparrow/images/tango-small.png";}i:2;i:1;i:3;s:6:"~~UP~~";}}i:46;a:3:{i:0;s:13:"section_close";i:1;a:0:{}i:2;i:1414;}i:47;a:3:{i:0;s:12:"section_edit";i:1;a:4:{i:0;i:1309;i:1;i:1413;i:2;i:2;i:3;s:42:"How to recursively change file permissions";}i:2;i:1414;}i:48;a:3:{i:0;s:6:"header";i:1;a:3:{i:0;s:23:"How to see folder sizes";i:1;i:2;i:2;i:1414;}i:2;i:1414;}i:49;a:3:{i:0;s:12:"section_open";i:1;a:1:{i:0;i:2;}i:2;i:1414;}i:50;a:3:{i:0;s:4:"code";i:1;a:3:{i:0;s:23:"
$ du * -s | sort -rg 
";i:1;s:4:"bash";i:2;N;}i:2;i:1456;}i:51;a:2:{i:0;s:6:"plugin";i:1;a:4:{i:0;s:7:"uparrow";i:1;a:1:{i:0;s:42:"lib/plugins/uparrow/images/tango-small.png";}i:2;i:1;i:3;s:6:"~~UP~~";}}i:52;a:3:{i:0;s:13:"section_close";i:1;a:0:{}i:2;i:1493;}i:53;a:3:{i:0;s:12:"section_edit";i:1;a:4:{i:0;i:1414;i:1;i:0;i:2;i:2;i:3;s:23:"How to see folder sizes";}i:2;i:1493;}i:54;a:3:{i:0;s:12:"document_end";i:1;a:0:{}i:2;i:1493;}}