#           v(n1)      ddv(n1)    dv(n1)    
-1.         100.      -9.99~K     1.001     
-0.5        50.       -4.99~K     0.5005    
 0.         0.         0.         0.        
 0.5       -50.        4.99~K    -0.5005    
 1.        -100.       9.99~K    -1.001     
