* p type inv amp w/bti 
.model my_rcdmodel rcd ( tnom=NA( 27.) anneal=NA(1) rem=NA( 1.Meg) Re=NA( 1.) Rc=NA( 1.))
.model bti_ptm_approx bti_sum ( params=((1.28936788433,-0.0*s,13.433303380408852,43.576925888911987*s,1.4509831704140836),(0.0425895446518,-0.0*s,4.1230027350333067,44.168622555330224*s,0.35639368027120355),(0.00986204739979,-0.046730726782108274*s,6.9322844619511379,34.467824008855281*s,19.76034507753667),(323556.834838,-0.74091304338940822*s,7.9999074744048002,50.0*s,25.0),(65734.7534834,-0.0*s,7.6851098109742111,33.944029750879885*s,20.802215970322095),(25.5541996901,-46.321386556453803*s,16.844440862184946,11.976323270474861*s,23.296371309229073)) tnom=NA( 27.) rcd_number=6 anneal=NA(1) rcd_model_name=my_rcdmodel weight=1.23)
.model bti_ptm_approx_symm bti_sum ( params=((1.28936788433,-0.0*s,13.433303380408852,43.576925888911987*s,1.4509831704140836),(0.0425895446518,-0.0*s,4.1230027350333067,44.168622555330224*s,0.35639368027120355),(0.00986204739979,-0.046730726782108274*s,6.9322844619511379,34.467824008855281*s,19.76034507753667),(323556.834838,-0.74091304338940822*s,7.9999074744048002,50.0*s,25.0),(65734.7534834,-0.0*s,7.6851098109742111,33.944029750879885*s,20.802215970322095),(25.5541996901,-46.321386556453803*s,16.844440862184946,11.976323270474861*s,23.296371309229073)) tnom=NA( 27.) rcd_number=12 anneal=NA(1) rcd_model_name=my_rcdmodel weight=1.23)
#TTime      hidden(0)  v(nctrl)   dvth(MPregl.BTI) dvth(MPsymm.BTI) max(MPregl.BTI) max(MPsymm.BTI) E(MPregl.BTI.RCD0) E(MPsymm.BTI.RCD0) E(MPsymm.BTI.RCD6)
 0.         0.         0.         0.         0.         0.         0.         6.2538u    6.2538u    6.2538u   
 100.u      1.         4.         97.652n    95.561n    0.         94.046n    6.2539u    6.2539u    6.2539u   
 200.u      1.         4.         195.32n    191.14n    0.         188.11n    6.2541u    6.2541u    6.2541u   
 310.u      1.         4.         300.35n    294.02n    0.         289.44n    6.2542u    6.2542u    6.2542u   
 710.u      3.         4.         693.5n     677.94n    0.         666.67n    6.2548u    6.2548u    6.2548u   
 0.0014548  4.         4.         1.4215u    1.3895u    0.         1.3664u    6.2559u    6.2559u    6.2559u   
 0.0030548  6.         4.         2.9839u    2.9186u    0.         2.8714u    6.2582u    6.2582u    6.2582u   
 0.0062548  11.        4.         6.1061u    5.9746u    0.         5.8793u    6.2629u    6.2629u    6.2629u   
 0.012655   12.        4.         12.36u     12.092u    0.         11.898u    6.2723u    6.2723u    6.2722u   
 0.025455   17.        4.         24.856u    24.321u    0.         23.933u    6.2911u    6.2911u    6.2908u   
 0.051055   14.        4.         49.841u    48.769u    0.         47.993u    6.3286u    6.3286u    6.328u    
 0.10225    20.        4.         99.788u    97.639u    0.         96.082u    6.4036u    6.4036u    6.4024u   
 0.20465    17.        4.         199.57u    195.26u    0.         192.14u    6.5537u    6.5537u    6.5511u   
 0.40945    18.        4.         398.7u     390.04u    0.         383.76u    6.8538u    6.8538u    6.8486u   
 0.81905    17.        4.         795.28u    777.76u    0.         765.04u    7.454u     7.454u     7.4432u   
 1.6383     21.        4.         0.0015817  0.0015459  0.         0.0015198  8.6544u    8.6544u    8.631u    
 3.2767     12.        4.         0.003128   0.0030536  0.         0.0029989  11.055u    11.055u    11.001u   
 6.5535     11.        4.         0.0061178  0.0059581  0.         0.0058396  15.857u    15.857u    15.718u   
 13.107     18.        4.         0.01171    0.011354   0.         0.011083   25.459u    25.459u    25.063u   
 26.214     26.        4.         0.021524   0.020702   0.         0.020056   44.659u    44.659u    43.399u   
 52.429     12.        4.         0.036831   0.034973   0.         0.033428   83.048u    83.048u    78.7u     
 104.86     16.        4.         0.056576   0.052838   0.         0.049509   159.77u    159.77u    144.13u   
 209.72     14.        4.         0.077822   0.071705   0.         0.065859   313.01u    313.01u    256.6u    
 419.43     12.        4.         0.10366    0.095183   0.         0.086331   618.63u    618.63u    423.17u   
 838.86     30.        4.         0.14234    0.13146    0.         0.11837    0.0012265  0.0012265  607.75u   
 1.6777K    23.        4.         0.19403    0.1816     0.         0.16332    0.002429   0.002429   725.64u   
 3.3554K    13.        4.         0.2473     0.23492    0.         0.21206    0.0047814  0.0047814  753.28u   
 5.K        21.        4.         0.27195    0.25982    0.         0.23479    0.0070211  0.0070211  754.34u   
Gnucap   System status
iterations: op=0, dc=0, tran=0, fourier=0, total=156195
transient timesteps: accepted=39327, rejected=0, total=39326
twotime timesteps: accepted=371, rejected=0, total=371
nodes: user=4, subckt=0, model=0, total=4
dctran density=75.0%, ac density=75.0%
#TTime      hidden(0)  v(nctrl)   dvth(MPregl.BTI) dvth(MPsymm.BTI) max(MPregl.BTI) max(MPsymm.BTI) E(MPregl.BTI.RCD0) E(MPsymm.BTI.RCD0) E(MPsymm.BTI.RCD6)
 0.         0.         0.         0.         0.         0.         0.         6.2538u    6.2538u    6.2538u   
 100.u      1.         4.         97.652n    95.561n    0.         94.046n    6.2539u    6.2539u    6.2539u   
 200.u      1.         4.         195.32n    191.14n    0.         188.11n    6.2541u    6.2541u    6.2541u   
 310.u      1.         4.         300.35n    294.02n    0.         289.44n    6.2542u    6.2542u    6.2542u   
 710.u      3.         4.         692.37n    676.71n    0.         665.38n    6.2548u    6.2548u    6.2548u   
 0.0014548  4.         4.         1.4212u    1.3885u    0.         1.3649u    6.2559u    6.2559u    6.2559u   
 0.0030548  6.         4.         2.9828u    2.9165u    0.         2.8684u    6.2582u    6.2582u    6.2582u   
 0.0062548  11.        4.         6.1064u    5.9734u    0.         5.8772u    6.2629u    6.2629u    6.2629u   
 0.012655   12.        4.         12.361u    12.091u    0.         11.896u    6.2723u    6.2723u    6.2722u   
 0.025455   17.        4.         24.86u     24.322u    0.         23.933u    6.2911u    6.2911u    6.2908u   
 0.051055   14.        4.         49.843u    48.768u    0.         47.99u     6.3286u    6.3286u    6.328u    
 0.10225    20.        4.         99.794u    97.64u     0.         96.079u    6.4036u    6.4036u    6.4024u   
 0.20465    17.        4.         199.58u    195.27u    0.         192.14u    6.5537u    6.5537u    6.5511u   
 0.40945    18.        4.         398.71u    390.04u    0.         383.75u    6.8538u    6.8538u    6.8486u   
 0.81905    17.        4.         795.28u    777.76u    0.         765.03u    7.454u     7.454u     7.4432u   
 1.6383     21.        4.         0.0015817  0.0015459  0.         0.0015198  8.6544u    8.6544u    8.631u    
 3.2767     12.        4.         0.003128   0.0030536  0.         0.0029989  11.055u    11.055u    11.001u   
 6.5535     11.        4.         0.0061178  0.0059581  0.         0.0058396  15.857u    15.857u    15.718u   
 13.107     18.        4.         0.01171    0.011354   0.         0.011083   25.459u    25.459u    25.063u   
 26.214     26.        4.         0.021524   0.020702   0.         0.020056   44.659u    44.659u    43.399u   
 52.429     12.        4.         0.036831   0.034973   0.         0.033428   83.048u    83.048u    78.7u     
 104.86     16.        4.         0.056576   0.052838   0.         0.049509   159.77u    159.77u    144.13u   
 209.72     14.        4.         0.077822   0.071705   0.         0.065859   313.01u    313.01u    256.6u    
 419.43     12.        4.         0.10366    0.095183   0.         0.086331   618.63u    618.63u    423.17u   
 838.86     30.        4.         0.14234    0.13146    0.         0.11837    0.0012265  0.0012265  607.75u   
 1.6777K    23.        4.         0.19403    0.1816     0.         0.16332    0.002429   0.002429   725.64u   
 3.3554K    13.        4.         0.2473     0.23492    0.         0.21206    0.0047814  0.0047814  753.28u   
 5.K        21.        4.         0.27195    0.25982    0.         0.23479    0.0070211  0.0070211  754.34u   
Gnucap   System status
iterations: op=0, dc=0, tran=0, fourier=0, total=312390
transient timesteps: accepted=78654, rejected=0, total=78652
twotime timesteps: accepted=371, rejected=0, total=742
nodes: user=4, subckt=0, model=0, total=4
dctran density=75.0%, ac density=75.0%
