v1 ( 1 0 ) pulse iv= 0. pv=-1. delay= 5.p rise= 1.p fall=NA( 0.) width=NA( Inf) period=NA( Inf)  DC  0.  AC  1.
v2 ( 2 0 ) pulse iv= 0. pv=-1. delay= 5.p rise= 1.p fall=NA( 0.) width=NA( Inf) period=NA( Inf)
#Time       v(1)       v(2)       control(0)
 0.         0.         0.         1.        
-1.         0.         0.         1.        
 0.         0.         0.         1.        
 0.         0.         0.         1.        
-1.         0.         0.         1.        
 1.p        0.         0.         1.        
 0.         0.         0.         1.        
-1.         0.         0.         1.        
 2.p        0.         0.         1.        
 0.         0.         0.         1.        
-1.         0.         0.         1.        
 3.p        0.         0.         1.        
 0.         0.         0.         1.        
-1.         0.         0.         1.        
 4.p        0.         0.         1.        
 0.         0.         0.         1.        
-1.         0.         0.         1.        
 5.p        0.         0.         1.        
 0.         0.         0.         1.        
-1.        -1.        -1.         1.        
-2.        -1.        -1.         1.        
 6.p       -1.        -1.         1.        
 0.        -1.        -1.         1.        
-1.        -1.        -1.         1.        
 7.p       -1.        -1.         1.        
 0.        -1.        -1.         1.        
-1.        -1.        -1.         1.        
 8.p       -1.        -1.         1.        
 0.        -1.        -1.         1.        
-1.        -1.        -1.         1.        
 9.p       -1.        -1.         1.        
 0.        -1.        -1.         1.        
-1.        -1.        -1.         1.        
 10.p      -1.        -1.         1.        
 0.        -1.        -1.         1.        
-1.        -1.        -1.         1.        
 11.p      -1.        -1.         1.        
 0.        -1.        -1.         1.        
-1.        -1.        -1.         1.        
 12.p      -1.        -1.         1.        
 0.        -1.        -1.         1.        
-1.        -1.        -1.         1.        
 13.p      -1.        -1.         1.        
 0.        -1.        -1.         1.        
-1.        -1.        -1.         1.        
 14.p      -1.        -1.         1.        
 0.        -1.        -1.         1.        
-1.        -1.        -1.         1.        
 15.p      -1.        -1.         1.        
 0.        -1.        -1.         1.        
-1.        -1.        -1.         1.        
 16.p      -1.        -1.         1.        
 0.        -1.        -1.         1.        
-1.        -1.        -1.         1.        
 17.p      -1.        -1.         1.        
 0.        -1.        -1.         1.        
-1.        -1.        -1.         1.        
 18.p      -1.        -1.         1.        
 0.        -1.        -1.         1.        
-1.        -1.        -1.         1.        
 19.p      -1.        -1.         1.        
 0.        -1.        -1.         1.        
-1.        -1.        -1.         1.        
 20.p      -1.        -1.         1.        
 0.        -1.        -1.         1.        
-1.        -1.        -1.         1.        
 21.p      -1.        -1.         1.        
 0.        -1.        -1.         1.        
-1.        -1.        -1.         1.        
 22.p      -1.        -1.         1.        
 0.        -1.        -1.         1.        
-1.        -1.        -1.         1.        
 23.p      -1.        -1.         1.        
 0.        -1.        -1.         1.        
-1.        -1.        -1.         1.        
 24.p      -1.        -1.         1.        
 0.        -1.        -1.         1.        
-1.        -1.        -1.         1.        
 25.p      -1.        -1.         1.        
 0.        -1.        -1.         1.        
-1.        -1.        -1.         1.        
 26.p      -1.        -1.         1.        
 0.        -1.        -1.         1.        
-1.        -1.        -1.         1.        
 27.p      -1.        -1.         1.        
 0.        -1.        -1.         1.        
-1.        -1.        -1.         1.        
 28.p      -1.        -1.         1.        
 0.        -1.        -1.         1.        
-1.        -1.        -1.         1.        
 29.p      -1.        -1.         1.        
 0.        -1.        -1.         1.        
-1.        -1.        -1.         1.        
 30.p      -1.        -1.         1.        
 0.        -1.        -1.         1.        
-1.        -1.        -1.         1.        
 31.p      -1.        -1.         1.        
 0.        -1.        -1.         1.        
-1.        -1.        -1.         1.        
 32.p      -1.        -1.         1.        
 0.        -1.        -1.         1.        
-1.        -1.        -1.         1.        
 33.p      -1.        -1.         1.        
 0.        -1.        -1.         1.        
-1.        -1.        -1.         1.        
 34.p      -1.        -1.         1.        
 0.        -1.        -1.         1.        
-1.        -1.        -1.         1.        
 35.p      -1.        -1.         1.        
 0.        -1.        -1.         1.        
-1.        -1.        -1.         1.        
 36.p      -1.        -1.         1.        
 0.        -1.        -1.         1.        
-1.        -1.        -1.         1.        
 37.p      -1.        -1.         1.        
 0.        -1.        -1.         1.        
-1.        -1.        -1.         1.        
 38.p      -1.        -1.         1.        
 0.        -1.        -1.         1.        
-1.        -1.        -1.         1.        
 39.p      -1.        -1.         1.        
 0.        -1.        -1.         1.        
-1.        -1.        -1.         1.        
 40.p      -1.        -1.         1.        
 0.        -1.        -1.         1.        
-1.        -1.        -1.         1.        
 41.p      -1.        -1.         1.        
 0.        -1.        -1.         1.        
-1.        -1.        -1.         1.        
 42.p      -1.        -1.         1.        
 0.        -1.        -1.         1.        
-1.        -1.        -1.         1.        
 43.p      -1.        -1.         1.        
 0.        -1.        -1.         1.        
-1.        -1.        -1.         1.        
 44.p      -1.        -1.         1.        
 0.        -1.        -1.         1.        
-1.        -1.        -1.         1.        
 45.p      -1.        -1.         1.        
 0.        -1.        -1.         1.        
-1.        -1.        -1.         1.        
 46.p      -1.        -1.         1.        
 0.        -1.        -1.         1.        
-1.        -1.        -1.         1.        
 47.p      -1.        -1.         1.        
 0.        -1.        -1.         1.        
-1.        -1.        -1.         1.        
 48.p      -1.        -1.         1.        
 0.        -1.        -1.         1.        
-1.        -1.        -1.         1.        
 49.p      -1.        -1.         1.        
 0.        -1.        -1.         1.        
-1.        -1.        -1.         1.        
 50.p      -1.        -1.         1.        
