.model my_rcd rcd ( tnom=NA( 27.) anneal=NA(1) rem=NA( 1.Meg) Re=NA( 1.) Rc=NA( 1.))
*// swapped
z1 ( nin 0 ) my_rcd weight=10 rc1=-1 rc0=0 re1=0 re0=20 mu=NA( 10.u)
z2 ( nin 0 ) my_rcd weight=1 rc1=-1 rc0=0 re1=0 re0=20 mu=NA( 10.u)
z3 ( nin 0 ) my_rcd weight=100 rc1=-.1 rc0=0 re1=0 re0=20 mu=NA( 10.u)
#Time           v(nin)         P(z1)          P(z2)          P(z3)          E(z1)          E(z2)          E(z3)          stress(z1)     stress(z2)     stress(z3)     tau(z1)        tau(z2)        tau(z3)        zero(z1)       zero(z2)       zero(z3)      
 0.             1.             0.             0.             0.             0.999999998    0.999999998    0.999999998    1.             1.             1.             0.367879441    0.367879441    0.904837416    0.999999998    0.999999998    0.999999998   
 0.1            1.             3.10108934E-9  310.10893E-12  2.05224147E-9  0.999999998    0.999999998    0.999999998    1.             1.             1.             0.367879441    0.367879441    0.904837416    0.999999998    0.999999998    0.999999998   
 0.2            1.             5.46407343E-9  546.40734E-12  3.88975903E-9  0.999999998    0.999999998    0.999999998    1.             1.             1.             0.367879441    0.367879441    0.904837416    0.999999998    0.999999998    0.999999998   
 0.3            1.             7.26463227E-9  726.46323E-12  5.53501901E-9  0.999999999    0.999999999    0.999999998    1.             1.             1.             0.367879441    0.367879441    0.904837416    0.999999998    0.999999998    0.999999998   
 0.4            1.             8.63663141E-9  863.66314E-12  7.00813713E-9  0.999999999    0.999999999    0.999999998    1.             1.             1.             0.367879441    0.367879441    0.904837416    0.999999998    0.999999998    0.999999998   
 0.5            1.             9.68207441E-9  968.20744E-12  8.32712441E-9  0.999999999    0.999999999    0.999999998    1.             1.             1.             0.367879441    0.367879441    0.904837416    0.999999998    0.999999998    0.999999998   
 0.6            1.             10.4786865E-9  1.04786865E-9  9.5081074E-9   0.999999999    0.999999999    0.999999998    1.             1.             1.             0.367879441    0.367879441    0.904837416    0.999999998    0.999999998    0.999999998   
 0.7            1.             11.085693E-9   1.1085693E-9   10.5655254E-9  0.999999999    0.999999999    0.999999998    1.             1.             1.             0.367879441    0.367879441    0.904837416    0.999999998    0.999999998    0.999999998   
 0.8            1.             11.5482231E-9  1.15482231E-9  11.5123068E-9  0.999999999    0.999999999    0.999999998    1.             1.             1.             0.367879441    0.367879441    0.904837416    0.999999998    0.999999998    0.999999998   
 0.9            1.             11.9006641E-9  1.19006641E-9  12.3600274E-9  0.999999999    0.999999999    0.999999998    1.             1.             1.             0.367879441    0.367879441    0.904837416    0.999999998    0.999999998    0.999999998   
 1.             1.             12.1692189E-9  1.21692189E-9  13.1190519E-9  0.999999999    0.999999999    0.999999998    1.             1.             1.             0.367879441    0.367879441    0.904837416    0.999999998    0.999999998    0.999999998   
 1.1            1.             12.3738537E-9  1.23738537E-9  13.7986604E-9  0.999999999    0.999999999    0.999999998    1.             1.             1.             0.367879441    0.367879441    0.904837416    0.999999998    0.999999998    0.999999998   
 1.2            1.             12.5297824E-9  1.25297824E-9  14.4071622E-9  0.999999999    0.999999999    0.999999998    1.             1.             1.             0.367879441    0.367879441    0.904837416    0.999999998    0.999999998    0.999999998   
 1.3            1.             12.6485977E-9  1.26485977E-9  14.9519971E-9  0.999999999    0.999999999    0.999999998    1.             1.             1.             0.367879441    0.367879441    0.904837416    0.999999998    0.999999998    0.999999998   
 1.4            1.             12.7391332E-9  1.27391332E-9  15.4398265E-9  0.999999999    0.999999999    0.999999998    1.             1.             1.             0.367879441    0.367879441    0.904837416    0.999999998    0.999999998    0.999999998   
 1.5            1.             12.80812E-9    1.280812E-9    15.8766147E-9  0.999999999    0.999999999    0.999999998    1.             1.             1.             0.367879441    0.367879441    0.904837416    0.999999998    0.999999998    0.999999998   
 1.6            1.             12.8606868E-9  1.28606868E-9  16.2677023E-9  0.999999999    0.999999999    0.999999998    1.             1.             1.             0.367879441    0.367879441    0.904837416    0.999999998    0.999999998    0.999999998   
 1.7            1.             12.900742E-9   1.2900742E-9   16.6178708E-9  0.999999999    0.999999999    0.999999998    1.             1.             1.             0.367879441    0.367879441    0.904837416    0.999999998    0.999999998    0.999999998   
 1.8            1.             12.9312635E-9  1.29312635E-9  16.9314015E-9  0.999999999    0.999999999    0.999999998    1.             1.             1.             0.367879441    0.367879441    0.904837416    0.999999998    0.999999998    0.999999998   
 1.9            1.             12.9545203E-9  1.29545203E-9  17.2121278E-9  0.999999999    0.999999999    0.999999998    1.             1.             1.             0.367879441    0.367879441    0.904837416    0.999999998    0.999999998    0.999999998   
 2.             1.             12.9722417E-9  1.29722417E-9  17.463482E-9   0.999999999    0.999999999    0.999999998    1.             1.             1.             0.367879441    0.367879441    0.904837416    0.999999998    0.999999998    0.999999998   
 2.1            1.             12.9857452E-9  1.29857452E-9  17.6885373E-9  0.999999999    0.999999999    0.999999998    1.             1.             1.             0.367879441    0.367879441    0.904837416    0.999999998    0.999999998    0.999999998   
 2.2            1.             12.9960346E-9  1.29960346E-9  17.8900453E-9  0.999999999    0.999999999    0.999999998    1.             1.             1.             0.367879441    0.367879441    0.904837416    0.999999998    0.999999998    0.999999998   
 2.3            1.             13.003875E-9   1.3003875E-9   18.0704697E-9  0.999999999    0.999999999    0.999999998    1.             1.             1.             0.367879441    0.367879441    0.904837416    0.999999998    0.999999998    0.999999998   
 2.4            1.             13.0098493E-9  1.30098493E-9  18.2320164E-9  0.999999999    0.999999999    0.999999998    1.             1.             1.             0.367879441    0.367879441    0.904837416    0.999999998    0.999999998    0.999999998   
 2.5            1.             13.0144016E-9  1.30144016E-9  18.3766608E-9  0.999999999    0.999999999    0.999999998    1.             1.             1.             0.367879441    0.367879441    0.904837416    0.999999998    0.999999998    0.999999998   
 2.6            1.             13.0178704E-9  1.30178704E-9  18.5061711E-9  0.999999999    0.999999999    0.999999998    1.             1.             1.             0.367879441    0.367879441    0.904837416    0.999999998    0.999999998    0.999999998   
 2.7            1.             13.0205135E-9  1.30205135E-9  18.6221309E-9  0.999999999    0.999999999    0.999999998    1.             1.             1.             0.367879441    0.367879441    0.904837416    0.999999998    0.999999998    0.999999998   
 2.8            1.             13.0225276E-9  1.30225276E-9  18.7259579E-9  0.999999999    0.999999999    0.999999998    1.             1.             1.             0.367879441    0.367879441    0.904837416    0.999999998    0.999999998    0.999999998   
 2.9            1.             13.0240622E-9  1.30240622E-9  18.8189216E-9  0.999999999    0.999999999    0.999999998    1.             1.             1.             0.367879441    0.367879441    0.904837416    0.999999998    0.999999998    0.999999998   
 3.             1.             13.0252316E-9  1.30252316E-9  18.9021586E-9  0.999999999    0.999999999    0.999999998    1.             1.             1.             0.367879441    0.367879441    0.904837416    0.999999998    0.999999998    0.999999998   
 3.1            1.             13.0261227E-9  1.30261227E-9  18.9766867E-9  0.999999999    0.999999999    0.999999998    1.             1.             1.             0.367879441    0.367879441    0.904837416    0.999999998    0.999999998    0.999999998   
 3.2            1.             13.0268017E-9  1.30268017E-9  19.0434169E-9  0.999999999    0.999999999    0.999999998    1.             1.             1.             0.367879441    0.367879441    0.904837416    0.999999998    0.999999998    0.999999998   
 3.3            1.             13.0273191E-9  1.30273191E-9  19.1031652E-9  0.999999999    0.999999999    0.999999998    1.             1.             1.             0.367879441    0.367879441    0.904837416    0.999999998    0.999999998    0.999999998   
 3.4            1.             13.0277133E-9  1.30277133E-9  19.1566621E-9  0.999999999    0.999999999    0.999999998    1.             1.             1.             0.367879441    0.367879441    0.904837416    0.999999998    0.999999998    0.999999998   
 3.5            1.             13.0280137E-9  1.30280137E-9  19.2045617E-9  0.999999999    0.999999999    0.999999998    1.             1.             1.             0.367879441    0.367879441    0.904837416    0.999999998    0.999999998    0.999999998   
 3.6            1.             13.0282426E-9  1.30282426E-9  19.2474496E-9  0.999999999    0.999999999    0.999999998    1.             1.             1.             0.367879441    0.367879441    0.904837416    0.999999998    0.999999998    0.999999998   
 3.7            1.             13.028417E-9   1.3028417E-9   19.2858502E-9  0.999999999    0.999999999    0.999999998    1.             1.             1.             0.367879441    0.367879441    0.904837416    0.999999998    0.999999998    0.999999998   
 3.8            1.             13.0285499E-9  1.30285499E-9  19.3202329E-9  0.999999999    0.999999999    0.999999998    1.             1.             1.             0.367879441    0.367879441    0.904837416    0.999999998    0.999999998    0.999999998   
 3.9            1.             13.0286512E-9  1.30286512E-9  19.3510183E-9  0.999999999    0.999999999    0.999999998    1.             1.             1.             0.367879441    0.367879441    0.904837416    0.999999998    0.999999998    0.999999998   
 4.             1.             13.0287283E-9  1.30287283E-9  19.3785826E-9  0.999999999    0.999999999    0.999999998    1.             1.             1.             0.367879441    0.367879441    0.904837416    0.999999998    0.999999998    0.999999998   
 4.1            1.             13.0287871E-9  1.30287871E-9  19.4032628E-9  0.999999999    0.999999999    0.999999998    1.             1.             1.             0.367879441    0.367879441    0.904837416    0.999999998    0.999999998    0.999999998   
 4.2            1.             13.028832E-9   1.3028832E-9   19.4253608E-9  0.999999999    0.999999999    0.999999998    1.             1.             1.             0.367879441    0.367879441    0.904837416    0.999999998    0.999999998    0.999999998   
 4.3            1.             13.0288661E-9  1.30288661E-9  19.4451467E-9  0.999999999    0.999999999    0.999999998    1.             1.             1.             0.367879441    0.367879441    0.904837416    0.999999998    0.999999998    0.999999998   
 4.4            1.             13.0288921E-9  1.30288921E-9  19.4628625E-9  0.999999999    0.999999999    0.999999998    1.             1.             1.             0.367879441    0.367879441    0.904837416    0.999999998    0.999999998    0.999999998   
 4.5            1.             13.0289119E-9  1.30289119E-9  19.4787246E-9  0.999999999    0.999999999    0.999999998    1.             1.             1.             0.367879441    0.367879441    0.904837416    0.999999998    0.999999998    0.999999998   
 4.6            1.             13.028927E-9   1.3028927E-9   19.4929271E-9  0.999999999    0.999999999    0.999999998    1.             1.             1.             0.367879441    0.367879441    0.904837416    0.999999998    0.999999998    0.999999998   
 4.7            1.             13.0289385E-9  1.30289385E-9  19.5056436E-9  0.999999999    0.999999999    0.999999998    1.             1.             1.             0.367879441    0.367879441    0.904837416    0.999999998    0.999999998    0.999999998   
 4.8            1.             13.0289473E-9  1.30289473E-9  19.5170296E-9  0.999999999    0.999999999    0.999999998    1.             1.             1.             0.367879441    0.367879441    0.904837416    0.999999998    0.999999998    0.999999998   
 4.9            1.             13.028954E-9   1.3028954E-9   19.5272243E-9  0.999999999    0.999999999    0.999999998    1.             1.             1.             0.367879441    0.367879441    0.904837416    0.999999998    0.999999998    0.999999998   
 5.             1.             13.0289591E-9  1.30289591E-9  19.5363524E-9  0.999999999    0.999999999    0.999999998    1.             1.             1.             0.367879441    0.367879441    0.904837416    0.999999998    0.999999998    0.999999998   
 5.1            1.             13.028963E-9   1.3028963E-9   19.5445253E-9  0.999999999    0.999999999    0.999999998    1.             1.             1.             0.367879441    0.367879441    0.904837416    0.999999998    0.999999998    0.999999998   
 5.2            1.             13.0289659E-9  1.30289659E-9  19.5518432E-9  0.999999999    0.999999999    0.999999998    1.             1.             1.             0.367879441    0.367879441    0.904837416    0.999999998    0.999999998    0.999999998   
 5.3            1.             13.0289682E-9  1.30289682E-9  19.5583954E-9  0.999999999    0.999999999    0.999999998    1.             1.             1.             0.367879441    0.367879441    0.904837416    0.999999998    0.999999998    0.999999998   
 5.4            1.             13.0289699E-9  1.30289699E-9  19.564262E-9   0.999999999    0.999999999    0.999999998    1.             1.             1.             0.367879441    0.367879441    0.904837416    0.999999998    0.999999998    0.999999998   
 5.5            1.             13.0289712E-9  1.30289712E-9  19.5695148E-9  0.999999999    0.999999999    0.999999998    1.             1.             1.             0.367879441    0.367879441    0.904837416    0.999999998    0.999999998    0.999999998   
 5.6            1.             13.0289722E-9  1.30289722E-9  19.5742181E-9  0.999999999    0.999999999    0.999999998    1.             1.             1.             0.367879441    0.367879441    0.904837416    0.999999998    0.999999998    0.999999998   
 5.7            1.             13.028973E-9   1.3028973E-9   19.5784292E-9  0.999999999    0.999999999    0.999999998    1.             1.             1.             0.367879441    0.367879441    0.904837416    0.999999998    0.999999998    0.999999998   
 5.8            1.             13.0289735E-9  1.30289735E-9  19.5821997E-9  0.999999999    0.999999999    0.999999998    1.             1.             1.             0.367879441    0.367879441    0.904837416    0.999999998    0.999999998    0.999999998   
 5.9            1.             13.028974E-9   1.3028974E-9   19.5855757E-9  0.999999999    0.999999999    0.999999998    1.             1.             1.             0.367879441    0.367879441    0.904837416    0.999999998    0.999999998    0.999999998   
 6.             1.             13.0289743E-9  1.30289743E-9  19.5885985E-9  0.999999999    0.999999999    0.999999998    1.             1.             1.             0.367879441    0.367879441    0.904837416    0.999999998    0.999999998    0.999999998   
 6.1            1.             13.0289746E-9  1.30289746E-9  19.591305E-9   0.999999999    0.999999999    0.999999998    1.             1.             1.             0.367879441    0.367879441    0.904837416    0.999999998    0.999999998    0.999999998   
 6.2            1.             13.0289748E-9  1.30289748E-9  19.5937284E-9  0.999999999    0.999999999    0.999999998    1.             1.             1.             0.367879441    0.367879441    0.904837416    0.999999998    0.999999998    0.999999998   
 6.3            1.             13.0289749E-9  1.30289749E-9  19.5958982E-9  0.999999999    0.999999999    0.999999998    1.             1.             1.             0.367879441    0.367879441    0.904837416    0.999999998    0.999999998    0.999999998   
 6.4            1.             13.028975E-9   1.3028975E-9   19.5978409E-9  0.999999999    0.999999999    0.999999998    1.             1.             1.             0.367879441    0.367879441    0.904837416    0.999999998    0.999999998    0.999999998   
 6.5            1.             13.0289751E-9  1.30289751E-9  19.5995804E-9  0.999999999    0.999999999    0.999999998    1.             1.             1.             0.367879441    0.367879441    0.904837416    0.999999998    0.999999998    0.999999998   
 6.6            1.             13.0289752E-9  1.30289752E-9  19.6011379E-9  0.999999999    0.999999999    0.999999998    1.             1.             1.             0.367879441    0.367879441    0.904837416    0.999999998    0.999999998    0.999999998   
 6.7            1.             13.0289752E-9  1.30289752E-9  19.6025324E-9  0.999999999    0.999999999    0.999999998    1.             1.             1.             0.367879441    0.367879441    0.904837416    0.999999998    0.999999998    0.999999998   
 6.8            1.             13.0289753E-9  1.30289753E-9  19.6037811E-9  0.999999999    0.999999999    0.999999998    1.             1.             1.             0.367879441    0.367879441    0.904837416    0.999999998    0.999999998    0.999999998   
 6.9            1.             13.0289753E-9  1.30289753E-9  19.6048991E-9  0.999999999    0.999999999    0.999999998    1.             1.             1.             0.367879441    0.367879441    0.904837416    0.999999998    0.999999998    0.999999998   
 7.             1.             13.0289753E-9  1.30289753E-9  19.6059001E-9  0.999999999    0.999999999    0.999999998    1.             1.             1.             0.367879441    0.367879441    0.904837416    0.999999998    0.999999998    0.999999998   
 7.1            1.             13.0289753E-9  1.30289753E-9  19.6067963E-9  0.999999999    0.999999999    0.999999998    1.             1.             1.             0.367879441    0.367879441    0.904837416    0.999999998    0.999999998    0.999999998   
 7.2            1.             13.0289753E-9  1.30289753E-9  19.6075988E-9  0.999999999    0.999999999    0.999999998    1.             1.             1.             0.367879441    0.367879441    0.904837416    0.999999998    0.999999998    0.999999998   
 7.3            1.             13.0289754E-9  1.30289754E-9  19.6083174E-9  0.999999999    0.999999999    0.999999998    1.             1.             1.             0.367879441    0.367879441    0.904837416    0.999999998    0.999999998    0.999999998   
 7.4            1.             13.0289754E-9  1.30289754E-9  19.6089607E-9  0.999999999    0.999999999    0.999999998    1.             1.             1.             0.367879441    0.367879441    0.904837416    0.999999998    0.999999998    0.999999998   
 7.5            1.             13.0289754E-9  1.30289754E-9  19.6095368E-9  0.999999999    0.999999999    0.999999998    1.             1.             1.             0.367879441    0.367879441    0.904837416    0.999999998    0.999999998    0.999999998   
 7.6            1.             13.0289754E-9  1.30289754E-9  19.6100525E-9  0.999999999    0.999999999    0.999999998    1.             1.             1.             0.367879441    0.367879441    0.904837416    0.999999998    0.999999998    0.999999998   
 7.7            1.             13.0289754E-9  1.30289754E-9  19.6105143E-9  0.999999999    0.999999999    0.999999998    1.             1.             1.             0.367879441    0.367879441    0.904837416    0.999999998    0.999999998    0.999999998   
 7.8            1.             13.0289754E-9  1.30289754E-9  19.6109278E-9  0.999999999    0.999999999    0.999999998    1.             1.             1.             0.367879441    0.367879441    0.904837416    0.999999998    0.999999998    0.999999998   
 7.9            1.             13.0289754E-9  1.30289754E-9  19.6112981E-9  0.999999999    0.999999999    0.999999998    1.             1.             1.             0.367879441    0.367879441    0.904837416    0.999999998    0.999999998    0.999999998   
 8.             1.             13.0289754E-9  1.30289754E-9  19.6116295E-9  0.999999999    0.999999999    0.999999998    1.             1.             1.             0.367879441    0.367879441    0.904837416    0.999999998    0.999999998    0.999999998   
 8.1            1.             13.0289754E-9  1.30289754E-9  19.6119263E-9  0.999999999    0.999999999    0.999999998    1.             1.             1.             0.367879441    0.367879441    0.904837416    0.999999998    0.999999998    0.999999998   
 8.2            1.             13.0289754E-9  1.30289754E-9  19.6121921E-9  0.999999999    0.999999999    0.999999998    1.             1.             1.             0.367879441    0.367879441    0.904837416    0.999999998    0.999999998    0.999999998   
 8.3            1.             13.0289754E-9  1.30289754E-9  19.61243E-9    0.999999999    0.999999999    0.999999998    1.             1.             1.             0.367879441    0.367879441    0.904837416    0.999999998    0.999999998    0.999999998   
 8.4            1.             13.0289754E-9  1.30289754E-9  19.6126431E-9  0.999999999    0.999999999    0.999999998    1.             1.             1.             0.367879441    0.367879441    0.904837416    0.999999998    0.999999998    0.999999998   
 8.5            1.             13.0289754E-9  1.30289754E-9  19.6128339E-9  0.999999999    0.999999999    0.999999998    1.             1.             1.             0.367879441    0.367879441    0.904837416    0.999999998    0.999999998    0.999999998   
 8.6            1.             13.0289754E-9  1.30289754E-9  19.6130047E-9  0.999999999    0.999999999    0.999999998    1.             1.             1.             0.367879441    0.367879441    0.904837416    0.999999998    0.999999998    0.999999998   
 8.7            1.             13.0289754E-9  1.30289754E-9  19.6131576E-9  0.999999999    0.999999999    0.999999998    1.             1.             1.             0.367879441    0.367879441    0.904837416    0.999999998    0.999999998    0.999999998   
 8.8            1.             13.0289754E-9  1.30289754E-9  19.6132945E-9  0.999999999    0.999999999    0.999999998    1.             1.             1.             0.367879441    0.367879441    0.904837416    0.999999998    0.999999998    0.999999998   
 8.9            1.             13.0289754E-9  1.30289754E-9  19.6134171E-9  0.999999999    0.999999999    0.999999998    1.             1.             1.             0.367879441    0.367879441    0.904837416    0.999999998    0.999999998    0.999999998   
 9.             1.             13.0289754E-9  1.30289754E-9  19.6135269E-9  0.999999999    0.999999999    0.999999998    1.             1.             1.             0.367879441    0.367879441    0.904837416    0.999999998    0.999999998    0.999999998   
 9.1            1.             13.0289754E-9  1.30289754E-9  19.6136252E-9  0.999999999    0.999999999    0.999999998    1.             1.             1.             0.367879441    0.367879441    0.904837416    0.999999998    0.999999998    0.999999998   
 9.2            1.             13.0289754E-9  1.30289754E-9  19.6137132E-9  0.999999999    0.999999999    0.999999998    1.             1.             1.             0.367879441    0.367879441    0.904837416    0.999999998    0.999999998    0.999999998   
 9.3            1.             13.0289754E-9  1.30289754E-9  19.613792E-9   0.999999999    0.999999999    0.999999998    1.             1.             1.             0.367879441    0.367879441    0.904837416    0.999999998    0.999999998    0.999999998   
 9.4            1.             13.0289754E-9  1.30289754E-9  19.6138625E-9  0.999999999    0.999999999    0.999999998    1.             1.             1.             0.367879441    0.367879441    0.904837416    0.999999998    0.999999998    0.999999998   
 9.5            1.             13.0289754E-9  1.30289754E-9  19.6139257E-9  0.999999999    0.999999999    0.999999998    1.             1.             1.             0.367879441    0.367879441    0.904837416    0.999999998    0.999999998    0.999999998   
 9.6            1.             13.0289754E-9  1.30289754E-9  19.6139823E-9  0.999999999    0.999999999    0.999999998    1.             1.             1.             0.367879441    0.367879441    0.904837416    0.999999998    0.999999998    0.999999998   
 9.7            1.             13.0289754E-9  1.30289754E-9  19.6140329E-9  0.999999999    0.999999999    0.999999998    1.             1.             1.             0.367879441    0.367879441    0.904837416    0.999999998    0.999999998    0.999999998   
 9.8            1.             13.0289754E-9  1.30289754E-9  19.6140782E-9  0.999999999    0.999999999    0.999999998    1.             1.             1.             0.367879441    0.367879441    0.904837416    0.999999998    0.999999998    0.999999998   
 9.9            1.             13.0289754E-9  1.30289754E-9  19.6141188E-9  0.999999999    0.999999999    0.999999998    1.             1.             1.             0.367879441    0.367879441    0.904837416    0.999999998    0.999999998    0.999999998   
 10.            1.             13.0289754E-9  1.30289754E-9  19.6141552E-9  0.999999999    0.999999999    0.999999998    1.             1.             1.             0.367879441    0.367879441    0.904837416    0.999999998    0.999999998    0.999999998   
