#           v(V1)      v(V2)      v(V3)     
 0.         0.         0.         0.        
-1.         0.         0.         0.        
 0.         0.         0.         0.        
 0.         0.         0.         0.        
-1.         1.         0.         0.        
 1.         1.         0.         0.        
 0.         0.         0.         0.        
-1.         0.         1.         0.        
 0.         0.         1.         0.        
 0.         0.         1.         0.        
-1.         1.         1.         0.        
 1.         1.         1.         0.        
 0.         0.         1.         0.        
-1.         0.         2.         0.        
 0.         0.         2.         0.        
 0.         0.         2.         0.        
-1.         1.         2.         0.        
 1.         1.         2.         0.        
 0.         0.         0.         0.        
-1.         0.         0.         1.        
 0.         0.         0.         1.        
 0.         0.         0.         1.        
-1.         1.         0.         1.        
 1.         1.         0.         1.        
 0.         0.         0.         1.        
-1.         0.         1.         1.        
 0.         0.         1.         1.        
 0.         0.         1.         1.        
-1.         1.         1.         1.        
 1.         1.         1.         1.        
 0.         0.         1.         1.        
-1.         0.         2.         1.        
 0.         0.         2.         1.        
 0.         0.         2.         1.        
-1.         1.         2.         1.        
 1.         1.         2.         1.        
