nmos n gate, saturated, is/js default 
cmosn: rsh - rs - rd conflict: using rsh
#           v(2)       v(3)       v(4)       iter(0)   
 27.        2.0079     5.         0.         7.        
#           i(Vds)     i(Vbs)     ps(Vds)    ps(Vbs)   
 27.       -29.921u    2.7842p    149.6u     0.        
#           id(M1)     vgs(M1)    vds(M1)    vbs(M1)    vth(M1)    vdsat(M1) 
 27.        29.921u    2.0079     2.0079     27.84E-18  0.84435    1.1636    
#           gm(M1)     gds(M1)    gmb(M1)    cbd(M1)    cbs(M1)   
 27.        51.43u     0.         28.652u    0.         0.        
#           cgsovl(M1) cgdovl(M1) cgbovl(M1) cgate(M1)  region(M1)
 27.        1.9707f    0.         0.         62.973f    7.        
#           cgs(M1)    cgd(M1)    cgb(M1)    vgst(M1)   von(M1)   
 27.        41.982f    0.         0.         1.1636     0.84435   
#           cgst(M1)   cgdt(M1)   cgbt(M1)   is(M1)     ig(M1)     ib(M1)    
 27.        43.953f    0.         0.        -29.921u    0.         2.7842p   
#           p(M1)      pd(M1)     ps(M1)     ids(M1)    idstray(M1) iderror(M1)
 27.        60.078u    60.078u    0.         29.921u   -2.7842p    ??        
#           vdm(M1)    vgm(M1)    vbm(M1)    vsm(M1)   
 27.        1.004      1.004     -1.004     -1.004     
#           vd(M1)     vg(M1)     vb(M1)     vs(M1)    
 27.        2.0079     2.0079     27.84E-18  0.        
#           v(M1.Ddb)  i(M1.Ddb)  p(M1.Ddb)  cap(M1.Ddb) r(M1.Ddb)  region(M1.Ddb)
 27.       -2.0079    -2.7842p    5.5905p    0.         721.17G   -1.        
#           v(M1.Dsb)  i(M1.Dsb)  p(M1.Dsb)  cap(M1.Dsb) r(M1.Dsb)  region(M1.Dsb)
 27.        27.84E-18  38.94E-30  1.084E-45  0.         721.17G    1.        
