'parameter test with subckt 
.subckt foo ( a b c )
v1 ( a b ) zzz
v2 ( b c ) xxx
.ends foo
x1 ( 1 0 3 ) foo xxx=b zzz=a
x2 ( 2 0 4 ) foo xxx=a zzz=83
#           v(1)       v(2)       v(3)       v(4)      
 27.        13.        83.       -923.      -13.       
.subckt foo ( a b c )
v1 ( a b ) zzz
v2 ( b c ) xxx
.ends foo
x1 ( 1 0 3 ) foo xxx=b zzz=a
x2 ( 2 0 4 ) foo xxx=a zzz=83
