name   ...
have 14 nodes. model: 1 sckt: 6 adp 0

3        3 matrix_number 11, user_number 4 nm[t]  vdc  0.
5        5 matrix_number 9, user_number 6 nm[t]  vdc  0.
6        6 matrix_number 10, user_number 5 nm[t]  vdc  0.
8        8 matrix_number 8, user_number 7 nm[t]  vdc  0.
ne1      ne1 matrix_number 14, user_number 1 nm[t]  vdc  0.
ne3      ne3 matrix_number 13, user_number 2 nm[t]  vdc  0.
ne4      ne4 matrix_number 12, user_number 3 nm[t]  vdc  0.
-X1
ni    X1.ni matrix_number 7, user_number 8 nm[t]  vdc  0.
nii   X1.nii matrix_number 6, user_number 9 nm[t]  vdc  0.
niii  X1.niii matrix_number 5, user_number 10 nm[t]  vdc  0.
-X2
ni    X2.ni matrix_number 4, user_number 11 nm[t]  vdc  0.
nii   X2.nii matrix_number 3, user_number 12 nm[t]  vdc  0.
niii  X2.niii matrix_number 2, user_number 13 nm[t]  vdc  0.
-m1
.m1.id m1..m1.id matrix_number 1, user_number 14 nm[t]  vdc  0.
-m1.Dsb
-m1.Ddb
forward 
****......*....
**......*......
*.*.....0..*...
*..*....0..0.*.
....*...0..0.0*
.....***0..0.0*
.....***0..0.0*
.....***0..0.0*
.*000000**.0.00
........***0.00
*........**0.00
..*00000000**00
...........***0
...*00000000**0
....****000000*
sinkr 
*....*......***
.*......****...
..**....0000*..
..***...00000..
...**...00000*.
*....**.000000.
.....***000000.
......**000000*
.*000000***0000
.*000000***0000
.*000000***0000
.*000000000*000
*.*000000000*00
*...*00000000*0
*......*000000*
sink forward 
****......*....
**......*......
*.*.....0..*...
*..*....0..0.*.
....*...0..0.0*
.....***0..0.0*
.....***0..0.0*
.....***0..0.0*
.*000000**.0.00
........***0.00
*........**0.00
..*00000000**00
...........***0
...*00000000**0
....****000000*
reverse 
*....*......***
.*......****...
..**....0000*..
..***...00000..
...**...00000*.
*....**.000000.
.....***000000.
......**000000*
.*000000***0000
.*000000***0000
.*000000***0000
.*000000000*000
*.*000000000*00
*...*00000000*0
*......*000000*
tree 
*....***..*....
.*............*
..***.........*
..***.........*
..***.........*
*....*..*.....0
*.....*.0..*..0
*......*0..0.*0
.....*00**.0.00
........***0.00
*........**0.00
......*0000**00
...........***0
.......*0000**0
.****000000000*
comp 
*.*.*.*..*.....
.***...........
***0...........
.*0**..........
*..**..........
.....***.......
*....**0.......
.....*0**......
.......***.....
*.......**.....
..........****.
..........****.
..........*****
..........****0
............*0*
