'inductance check, no tolerance 
#           v(3)      
 1.         0.99999   
 2.         2.        
 3.         3.        
 4.         4.        
 5.         5.        
 6.         5.9999    
 7.         6.9999    
 8.         7.9999    
 9.         8.9999    
 10.        9.9999    
#Freq       v(3)      
 0.1        0.84672   
 0.12589    0.78429   
 0.15849    0.70858   
 0.19953    0.62357   
 0.25119    0.53521   
 0.31623    0.44956   
 0.39811    0.37121   
 0.50119    0.30266   
 0.63096    0.24458   
 0.79433    0.19646   
 1.         0.15718   
 1.2589     0.12542   
 1.5849     0.099916  
 1.9953     0.079513  
 2.5119     0.063233  
 3.1623     0.050265  
 3.9811     0.039946  
 5.0119     0.031739  
 6.3096     0.025216  
 7.9433     0.020032  
 10.        0.015913  
Gnucap   System status
iterations: op=0, dc=20, tran=0, fourier=0, total=41
transient timesteps: accepted=0, rejected=0, total=0
nodes: user=3, subckt=0, model=0, total=3
dctran density=77.8%, ac density=77.8%
