#TTime     
 0.        
 10.       
 20.       
 31.       
 71.       
 100.      
*test (1), tran (0)
#TTime     
 0.        
 10.       
 20.       
 31.       
 71.       
 100.      
test (1), tran (0), *tt (1)
