' 
#           v(2)       v(3)       v(4)       v(5)       v(6)       iter(0)   
 27.        0.5        1.         0.5        2.         0.5        4.        
#Freq       v(1)       v(2)       v(3)       v(4)       v(5)       v(6)      
 1.K        1.         0.5        0.         0.5        0.         0.5       
#Freq       vp(1)      vp(2)      vp(3)      vp(4)      vp(5)      vp(6)     
 1.K        0.         0.         0.         0.         0.         0.        
#Time       v(2)       v(3)       v(4)       v(5)       v(6)       iter(0)   
 0.         0.5        1.         0.5        1.         0.5        4.        
 100.u      0.5        1.         0.5        1.5878     0.38643    8.        
 200.u      0.5        1.         0.5        1.9511     0.33886    8.        
 300.u      0.5        1.         0.5        1.9511     0.33886    6.        
 400.u      0.5        1.         0.5        1.5878     0.38643    4.        
 500.u      0.5        1.         0.5        1.         0.5        4.        
 600.u      0.5        1.         0.5        0.41221    0.70811    4.        
 700.u      0.5        1.         0.5        0.048943   0.95334    4.        
 800.u      0.5        1.         0.5        0.048943   0.95334    3.        
 900.u      0.5        1.         0.5        0.41221    0.70811    4.        
 0.001      0.5        1.         0.5        1.         0.5        4.        
