#           v(nin)     v(nout)   
 0.         0.         0.        
#Freq       v(nin)     v(nout)    vp(nin)    vp(nout)  
 0.001      1.         0.99951   -17.982n   -1.7994    
 0.002      1.         0.99803   -35.858n   -3.5953    
 0.004      1.         0.9922    -70.881n   -7.1625    
 0.008      1.         0.96984   -135.44n   -14.108    
 0.016      1.         0.89348   -229.91n   -26.687    
 0.032      1.         0.70523   -286.47n   -45.152    
 0.064      1.         0.44532   -228.45n   -63.556    
 0.128      1.         0.24133   -134.18n   -76.035    
 0.256      1.         0.12339   -70.157n   -82.912    
 0.512      1.         0.06205   -35.484n   -86.443    
 1.024      1.         0.03107   -17.793n   -88.22     
 2.048      1.         0.015541  -8.903n    -89.11     
 4.096      1.         0.007771  -4.4523n   -89.555    
 8.192      1.         0.0038856 -2.2263n   -89.777    
 16.384     1.         0.0019428 -1.1131n   -89.889    
 32.768     1.         971.4u    -556.57p   -89.944    
 65.536     1.         485.7u    -278.29p   -89.972    
 131.07     1.         242.85u   -139.14p   -89.986    
