' 
#           v(1)       v(2)       v(3)      
 27.        1.         0.         1.        
v(1)  -2.               -1.               0.                1.               2.
v(2)  -2.               -1.               0.                1.               2.
        +-----------------+----------------+-----------------+----------------+
 0.     |                 .                +                *.                |
 10.n   |                 .                .     +           .         *      |
 20.n   |                 .                .         +       .               *|
 30.n   |                 .                .         +       .               *|
 40.n   |                 .                .     +           .         *      |
 50.n   |                 .                +                 *                |
 60.n   |                 .          +     .      *          .                |
 70.n   |                 .       +        .*                .                |
 80.n   |                 .       +        .*                .                |
 90.n   |                 .          +     .      *          .                |
 100.n  |                 .                +                *.                |
 110.n  |                 .                .     +           .         *      |
 120.n  |                 .                .         +       .               *|
 130.n  |                 .                .         +       .               *|
 140.n  |                 .                .     +           .         *      |
 150.n  |                 .                +                 *                |
 160.n  |                 .          +     .      *          .                |
 170.n  |                 .       +        .*                .                |
 180.n  |                 .       +        .*                .                |
 190.n  |                 .          +     .      *          .                |
 200.n  |                 .                +                *.                |
 210.n  |                 .                .     +           .         *      |
 220.n  |                 .                .         +       .               *|
 230.n  |                 .                .         +       .               *|
 240.n  |                 .                .     +           .         *      |
 250.n  |                 .                +                 *                |
 260.n  |                 .          +     .      *          .                |
 270.n  |                 .       +        .*                .                |
 280.n  |                 .       +        .*                .                |
 290.n  |                 .          +     .      *          .                |
 300.n  |                 .                +                *.                |
 310.n  |                 .                .     +           .         *      |
 320.n  |                 .                .         +       .               *|
 330.n  |                 .                .         +       .               *|
 340.n  |                 .                .     +           .         *      |
 350.n  |                 .                +                 *                |
 360.n  |                 .          +     .      *          .                |
 370.n  |                 .       +        .*                .                |
 380.n  |                 .       +        .*                .                |
 390.n  |                 .          +     .      *          .                |
 400.n  |                 .                +                *.                |
 410.n  |                 .                .     +           .         *      |
 420.n  |                 .                .         +       .               *|
 430.n  |                 .                .         +       .               *|
 440.n  |                 .                .     +           .         *      |
 450.n  |                 .                +                 *                |
 460.n  |                 .          +     .      *          .                |
 470.n  |                 .       +        .*                .                |
 480.n  |                 .       +        .*                .                |
 490.n  |                 .          +     .      *          .                |
 500.n  |                 .                +                *.                |
 510.n  |                 .                .     +           .         *      |
 520.n  |                 .                .         +       .               *|
 530.n  |                 .                .         +       .               *|
 540.n  |                 .                .     +           .         *      |
 550.n  |                 .                +                 *                |
 560.n  |                 .          +     .      *          .                |
 570.n  |                 .       +        .*                .                |
 580.n  |                 .       +        .*                .                |
 590.n  |                 .          +     .      *          .                |
 600.n  |                 .                +                *.                |
 610.n  |                 .                .      +          .         *      |
 620.n  |                 .                .         +       .               *|
 630.n  |                 .                .         +       .               *|
 640.n  |                 .                .     +           .         *      |
 650.n  |                 .                +                 *                |
 660.n  |                 .          +     .      *          .                |
 670.n  |                 .       +        .*                .                |
 680.n  |                 .       +        .*                .                |
 690.n  |                 .          +     .      *          .                |
 700.n  |                 .                +                *.                |
 710.n  |                 .                .      +          .         *      |
 720.n  |                 .                .         +       .               *|
 730.n  |                 .                .         +       .               *|
 740.n  |                 .                .      +          .         *      |
 750.n  |                 .                +                 *                |
 760.n  |                 .          +     .      *          .                |
 770.n  |                 .       +        .*                .                |
 780.n  |                 .       +        .*                .                |
 790.n  |                 .          +     .      *          .                |
 800.n  |                 .                +                *.                |
 810.n  |                 .                .      +          .         *      |
 820.n  |                 .                .         +       .               *|
 830.n  |                 .                .         +       .               *|
 840.n  |                 .                .      +          .         *      |
 850.n  |                 .                +                 *                |
 860.n  |                 .          +     .      *          .                |
 870.n  |                 .       +        .*                .                |
 880.n  |                 .       +        .*                .                |
 890.n  |                 .          +     .      *          .                |
 900.n  |                 .                +                *.                |
 910.n  |                 .                .      +          .         *      |
 920.n  |                 .                .         +       .               *|
 930.n  |                 .                .         +       .               *|
 940.n  |                 .                .      +          .         *      |
 950.n  |                 .                +                 *                |
 960.n  |                 .          +     .      *          .                |
 970.n  |                 .       +        .*                .                |
 980.n  |                 .       +        .*                .                |
 990.n  |                 .          +     .      *          .                |
 1.u    |                 .                +                *.                |
 1.01u  |                 .                .      +          .         *      |
 1.02u  |                 .                .         +       .               *|
 1.03u  |                 .                .         +       .               *|
 1.04u  |                 .                .      +          .         *      |
 1.05u  |                 .                +                 *                |
 1.06u  |                 .          +     .      *          .                |
 1.07u  |                 .       +        .*                .                |
 1.08u  |                 .       +        .*                .                |
 1.09u  |                 .          +     .      *          .                |
 1.1u   |                 .                +                *.                |
 1.11u  |                 .                .      +          .         *      |
 1.12u  |                 .                .         +       .               *|
 1.13u  |                 .                .         +       .               *|
 1.14u  |                 .                .      +          .         *      |
 1.15u  |                 .                +                 *                |
 1.16u  |                 .          +     .      *          .                |
 1.17u  |                 .       +        .*                .                |
 1.18u  |                 .       +        .*                .                |
 1.19u  |                 .          +     .      *          .                |
 1.2u   |                 .                +                *.                |
 1.21u  |                 .                .      +          .         *      |
 1.22u  |                 .                .         +       .               *|
 1.23u  |                 .                .         +       .               *|
 1.24u  |                 .                .      +          .         *      |
 1.25u  |                 .                +                 *                |
 1.26u  |                 .          +     .      *          .                |
 1.27u  |                 .       +        .*                .                |
 1.28u  |                 .       +        .*                .                |
 1.29u  |                 .          +     .      *          .                |
 1.3u   |                 .                +                *.                |
 1.31u  |                 .                .      +          .         *      |
 1.32u  |                 .                .          +      .               *|
 1.33u  |                 .                .          +      .               *|
 1.34u  |                 .                .      +          .         *      |
 1.35u  |                 .                +                 *                |
 1.36u  |                 .          +     .      *          .                |
 1.37u  |                 .       +        .*                .                |
 1.38u  |                 .       +        .*                .                |
 1.39u  |                 .          +     .      *          .                |
 1.4u   |                 .                +                *.                |
 1.41u  |                 .                .      +          .         *      |
 1.42u  |                 .                .          +      .               *|
 1.43u  |                 .                .          +      .               *|
 1.44u  |                 .                .      +          .         *      |
 1.45u  |                 .                +                 *                |
 1.46u  |                 .          +     .      *          .                |
 1.47u  |                 .       +        .*                .                |
 1.48u  |                 .       +        .*                .                |
 1.49u  |                 .          +     .      *          .                |
 1.5u   |                 .                +                *.                |
 1.51u  |                 .                .      +          .         *      |
 1.52u  |                 .                .          +      .               *|
 1.53u  |                 .                .          +      .               *|
 1.54u  |                 .                .      +          .         *      |
 1.55u  |                 .                +                 *                |
 1.56u  |                 .          +     .      *          .                |
 1.57u  |                 .       +        .*                .                |
 1.58u  |                 .       +        .*                .                |
 1.59u  |                 .          +     .      *          .                |
 1.6u   |                 .                +                *.                |
 1.61u  |                 .                .      +          .         *      |
 1.62u  |                 .                .          +      .               *|
 1.63u  |                 .                .          +      .               *|
 1.64u  |                 .                .      +          .         *      |
 1.65u  |                 .                +                 *                |
 1.66u  |                 .          +     .      *          .                |
 1.67u  |                 .       +        .*                .                |
 1.68u  |                 .       +        .*                .                |
 1.69u  |                 .          +     .      *          .                |
 1.7u   |                 .                +                *.                |
 1.71u  |                 .                .      +          .         *      |
 1.72u  |                 .                .          +      .               *|
 1.73u  |                 .                .          +      .               *|
 1.74u  |                 .                .      +          .         *      |
 1.75u  |                 .                +                 *                |
 1.76u  |                 .          +     .      *          .                |
 1.77u  |                 .       +        .*                .                |
 1.78u  |                 .       +        .*                .                |
 1.79u  |                 .          +     .      *          .                |
 1.8u   |                 .                +                *.                |
 1.81u  |                 .                .      +          .         *      |
 1.82u  |                 .                .          +      .               *|
 1.83u  |                 .                .          +      .               *|
 1.84u  |                 .                .      +          .         *      |
 1.85u  |                 .                +                 *                |
 1.86u  |                 .          +     .      *          .                |
 1.87u  |                 .       +        .*                .                |
 1.88u  |                 .       +        .*                .                |
 1.89u  |                 .          +     .      *          .                |
 1.9u   |                 .                +                *.                |
 1.91u  |                 .                .      +          .         *      |
 1.92u  |                 .                .          +      .               *|
 1.93u  |                 .                .          +      .               *|
 1.94u  |                 .                .      +          .         *      |
 1.95u  |                 .                +                 *                |
 1.96u  |                 .          +     .      *          .                |
 1.97u  |                 .       +        .*                .                |
 1.98u  |                 .       +        .*                .                |
 1.99u  |                 .          +     .      *          .                |
 2.u    |                 .                +                *.                |
 2.01u  |                 .                .      +          .         *      |
 2.02u  |                 .                .          +      .               *|
 2.03u  |                 .                .          +      .               *|
 2.04u  |                 .                .      +          .         *      |
 2.05u  |                 .                +                 *                |
 2.06u  |                 .          +     .      *          .                |
 2.07u  |                 .       +        .*                .                |
 2.08u  |                 .       +        .*                .                |
 2.09u  |                 .          +     .      *          .                |
 2.1u   |                 .                +                *.                |
 2.11u  |                 .                .      +          .         *      |
 2.12u  |                 .                .          +      .               *|
 2.13u  |                 .                .          +      .               *|
 2.14u  |                 .                .      +          .         *      |
 2.15u  |                 .                +                 *                |
 2.16u  |                 .          +     .      *          .                |
 2.17u  |                 .       +        .*                .                |
 2.18u  |                 .       +        .*                .                |
 2.19u  |                 .          +     .      *          .                |
 2.2u   |                 .                +                *.                |
 2.21u  |                 .                .      +          .         *      |
 2.22u  |                 .                .          +      .               *|
 2.23u  |                 .                .          +      .               *|
 2.24u  |                 .                .      +          .         *      |
 2.25u  |                 .                +                 *                |
 2.26u  |                 .          +     .      *          .                |
 2.27u  |                 .       +        .*                .                |
 2.28u  |                 .       +        .*                .                |
 2.29u  |                 .          +     .      *          .                |
 2.3u   |                 .                +                *.                |
 2.31u  |                 .                .      +          .         *      |
 2.32u  |                 .                .          +      .               *|
 2.33u  |                 .                .          +      .               *|
 2.34u  |                 .                .      +          .         *      |
 2.35u  |                 .                +                 *                |
 2.36u  |                 .          +     .      *          .                |
 2.37u  |                 .       +        .*                .                |
 2.38u  |                 .       +        .*                .                |
 2.39u  |                 .          +     .      *          .                |
 2.4u   |                 .                +                *.                |
 2.41u  |                 .                .      +          .         *      |
 2.42u  |                 .                .          +      .               *|
 2.43u  |                 .                .          +      .               *|
 2.44u  |                 .                .      +          .         *      |
 2.45u  |                 .                +                 *                |
 2.46u  |                 .          +     .      *          .                |
 2.47u  |                 .       +        .*                .                |
 2.48u  |                 .       +        .*                .                |
 2.49u  |                 .          +     .      *          .                |
 2.5u   |                 .                +                *.                |
 2.51u  |                 .                .      +          .         *      |
 2.52u  |                 .                .          +      .               *|
 2.53u  |                 .                .          +      .               *|
 2.54u  |                 .                .      +          .         *      |
 2.55u  |                 .                +                 *                |
 2.56u  |                 .          +     .      *          .                |
 2.57u  |                 .       +        .*                .                |
 2.58u  |                 .       +        .*                .                |
 2.59u  |                 .          +     .      *          .                |
 2.6u   |                 .                +                *.                |
 2.61u  |                 .                .      +          .         *      |
 2.62u  |                 .                .          +      .               *|
 2.63u  |                 .                .          +      .               *|
 2.64u  |                 .                .      +          .         *      |
 2.65u  |                 .                +                 *                |
 2.66u  |                 .          +     .      *          .                |
 2.67u  |                 .       +        .*                .                |
 2.68u  |                 .       +        .*                .                |
 2.69u  |                 .          +     .      *          .                |
 2.7u   |                 .                +                *.                |
 2.71u  |                 .                .      +          .         *      |
 2.72u  |                 .                .          +      .               *|
 2.73u  |                 .                .          +      .               *|
 2.74u  |                 .                .      +          .         *      |
 2.75u  |                 .                +                 *                |
 2.76u  |                 .          +     .      *          .                |
 2.77u  |                 .       +        .*                .                |
 2.78u  |                 .       +        .*                .                |
 2.79u  |                 .          +     .      *          .                |
 2.8u   |                 .                +                *.                |
 2.81u  |                 .                .      +          .         *      |
 2.82u  |                 .                .          +      .               *|
 2.83u  |                 .                .          +      .               *|
 2.84u  |                 .                .      +          .         *      |
 2.85u  |                 .                +                 *                |
 2.86u  |                 .          +     .      *          .                |
 2.87u  |                 .       +        .*                .                |
 2.88u  |                 .       +        .*                .                |
 2.89u  |                 .          +     .      *          .                |
 2.9u   |                 .                +                *.                |
 2.91u  |                 .                .      +          .         *      |
 2.92u  |                 .                .          +      .               *|
 2.93u  |                 .                .          +      .               *|
 2.94u  |                 .                .      +          .         *      |
 2.95u  |                 .                +                 *                |
 2.96u  |                 .          +     .      *          .                |
 2.97u  |                 .       +        .*                .                |
 2.98u  |                 .       +        .*                .                |
 2.99u  |                 .          +     .      *          .                |
 3.u    |                 .                +                *.                |
 3.01u  |                 .                .      +          .         *      |
 3.02u  |                 .                .          +      .               *|
 3.03u  |                 .                .          +      .               *|
 3.04u  |                 .                .      +          .         *      |
 3.05u  |                 .                +                 *                |
 3.06u  |                 .          +     .      *          .                |
 3.07u  |                 .       +        .*                .                |
 3.08u  |                 .       +        .*                .                |
 3.09u  |                 .          +     .      *          .                |
 3.1u   |                 .                +                *.                |
 3.11u  |                 .                .      +          .         *      |
 3.12u  |                 .                .          +      .               *|
 3.13u  |                 .                .          +      .               *|
 3.14u  |                 .                .      +          .         *      |
 3.15u  |                 .                +                 *                |
 3.16u  |                 .          +     .      *          .                |
 3.17u  |                 .       +        .*                .                |
 3.18u  |                 .       +        .*                .                |
 3.19u  |                 .          +     .      *          .                |
 3.2u   |                 .                +                *.                |
 3.21u  |                 .                .      +          .         *      |
 3.22u  |                 .                .          +      .               *|
 3.23u  |                 .                .          +      .               *|
 3.24u  |                 .                .      +          .         *      |
 3.25u  |                 .                +                 *                |
 3.26u  |                 .          +     .      *          .                |
 3.27u  |                 .       +        .*                .                |
 3.28u  |                 .       +        .*                .                |
 3.29u  |                 .          +     .      *          .                |
 3.3u   |                 .                +                *.                |
 3.31u  |                 .                .      +          .         *      |
 3.32u  |                 .                .          +      .               *|
 3.33u  |                 .                .          +      .               *|
 3.34u  |                 .                .      +          .         *      |
 3.35u  |                 .                +                 *                |
 3.36u  |                 .          +     .      *          .                |
 3.37u  |                 .       +        .*                .                |
 3.38u  |                 .       +        .*                .                |
 3.39u  |                 .          +     .      *          .                |
 3.4u   |                 .                +                *.                |
 3.41u  |                 .                .      +          .         *      |
 3.42u  |                 .                .          +      .               *|
 3.43u  |                 .                .          +      .               *|
 3.44u  |                 .                .      +          .         *      |
 3.45u  |                 .                +                 *                |
 3.46u  |                 .          +     .      *          .                |
 3.47u  |                 .       +        .*                .                |
 3.48u  |                 .       +        .*                .                |
 3.49u  |                 .          +     .      *          .                |
 3.5u   |                 .                +                *.                |
 3.51u  |                 .                .      +          .         *      |
 3.52u  |                 .                .          +      .               *|
 3.53u  |                 .                .          +      .               *|
 3.54u  |                 .                .      +          .         *      |
 3.55u  |                 .                +                 *                |
 3.56u  |                 .          +     .      *          .                |
 3.57u  |                 .       +        .*                .                |
 3.58u  |                 .       +        .*                .                |
 3.59u  |                 .          +     .      *          .                |
 3.6u   |                 .                +                *.                |
 3.61u  |                 .                .      +          .         *      |
 3.62u  |                 .                .          +      .               *|
 3.63u  |                 .                .          +      .               *|
 3.64u  |                 .                .      +          .         *      |
 3.65u  |                 .                +                 *                |
 3.66u  |                 .          +     .      *          .                |
 3.67u  |                 .       +        .*                .                |
 3.68u  |                 .       +        .*                .                |
 3.69u  |                 .          +     .      *          .                |
 3.7u   |                 .                +                *.                |
 3.71u  |                 .                .      +          .         *      |
 3.72u  |                 .                .          +      .               *|
 3.73u  |                 .                .          +      .               *|
 3.74u  |                 .                .      +          .         *      |
 3.75u  |                 .                +                 *                |
 3.76u  |                 .          +     .      *          .                |
 3.77u  |                 .       +        .*                .                |
 3.78u  |                 .       +        .*                .                |
 3.79u  |                 .          +     .      *          .                |
 3.8u   |                 .                +                *.                |
 3.81u  |                 .                .      +          .         *      |
 3.82u  |                 .                .          +      .               *|
 3.83u  |                 .                .          +      .               *|
 3.84u  |                 .                .      +          .         *      |
 3.85u  |                 .                +                 *                |
 3.86u  |                 .          +     .      *          .                |
 3.87u  |                 .       +        .*                .                |
 3.88u  |                 .       +        .*                .                |
 3.89u  |                 .          +     .      *          .                |
 3.9u   |                 .                +                *.                |
 3.91u  |                 .                .      +          .         *      |
 3.92u  |                 .                .          +      .               *|
 3.93u  |                 .                .          +      .               *|
 3.94u  |                 .                .      +          .         *      |
 3.95u  |                 .                +                 *                |
 3.96u  |                 .          +     .      *          .                |
 3.97u  |                 .       +        .*                .                |
 3.98u  |                 .       +        .*                .                |
 3.99u  |                 .          +     .      *          .                |
 4.u    |                 .                +                *.                |
 4.01u  |                 .                .      +          .         *      |
 4.02u  |                 .                .          +      .               *|
 4.03u  |                 .                .          +      .               *|
 4.04u  |                 .                .      +          .         *      |
 4.05u  |                 .                +                 *                |
 4.06u  |                 .          +     .      *          .                |
 4.07u  |                 .       +        .*                .                |
 4.08u  |                 .       +        .*                .                |
 4.09u  |                 .          +     .      *          .                |
 4.1u   |                 .                +                *.                |
 4.11u  |                 .                .      +          .         *      |
 4.12u  |                 .                .          +      .               *|
 4.13u  |                 .                .          +      .               *|
 4.14u  |                 .                .      +          .         *      |
 4.15u  |                 .                +                 *                |
 4.16u  |                 .          +     .      *          .                |
 4.17u  |                 .       +        .*                .                |
 4.18u  |                 .       +        .*                .                |
 4.19u  |                 .          +     .      *          .                |
 4.2u   |                 .                .+               *.                |
 4.21u  |                 .                .      +          .         *      |
 4.22u  |                 .                .          +      .               *|
 4.23u  |                 .                .          +      .               *|
 4.24u  |                 .                .      +          .         *      |
 4.25u  |                 .                .+                *                |
 4.26u  |                 .          +     .      *          .                |
 4.27u  |                 .       +        .*                .                |
 4.28u  |                 .       +        .*                .                |
 4.29u  |                 .          +     .      *          .                |
 4.3u   |                 .                .+               *.                |
 4.31u  |                 .                .      +          .         *      |
 4.32u  |                 .                .          +      .               *|
 4.33u  |                 .                .          +      .               *|
 4.34u  |                 .                .      +          .         *      |
 4.35u  |                 .                .+                *                |
 4.36u  |                 .          +     .      *          .                |
 4.37u  |                 .       +        .*                .                |
 4.38u  |                 .       +        .*                .                |
 4.39u  |                 .          +     .      *          .                |
 4.4u   |                 .                .+               *.                |
 4.41u  |                 .                .      +          .         *      |
 4.42u  |                 .                .          +      .               *|
 4.43u  |                 .                .          +      .               *|
 4.44u  |                 .                .      +          .         *      |
 4.45u  |                 .                .+                *                |
 4.46u  |                 .          +     .      *          .                |
 4.47u  |                 .       +        .*                .                |
 4.48u  |                 .       +        .*                .                |
 4.49u  |                 .          +     .      *          .                |
 4.5u   |                 .                .+               *.                |
 4.51u  |                 .                .      +          .         *      |
 4.52u  |                 .                .          +      .               *|
 4.53u  |                 .                .          +      .               *|
 4.54u  |                 .                .      +          .         *      |
 4.55u  |                 .                .+                *                |
 4.56u  |                 .          +     .      *          .                |
 4.57u  |                 .       +        .*                .                |
 4.58u  |                 .       +        .*                .                |
 4.59u  |                 .          +     .      *          .                |
 4.6u   |                 .                .+               *.                |
 4.61u  |                 .                .      +          .         *      |
 4.62u  |                 .                .          +      .               *|
 4.63u  |                 .                .          +      .               *|
 4.64u  |                 .                .      +          .         *      |
 4.65u  |                 .                .+                *                |
 4.66u  |                 .          +     .      *          .                |
 4.67u  |                 .       +        .*                .                |
 4.68u  |                 .       +        .*                .                |
 4.69u  |                 .          +     .      *          .                |
 4.7u   |                 .                .+               *.                |
 4.71u  |                 .                .      +          .         *      |
 4.72u  |                 .                .          +      .               *|
 4.73u  |                 .                .          +      .               *|
 4.74u  |                 .                .      +          .         *      |
 4.75u  |                 .                .+                *                |
 4.76u  |                 .          +     .      *          .                |
 4.77u  |                 .       +        .*                .                |
 4.78u  |                 .       +        .*                .                |
 4.79u  |                 .          +     .      *          .                |
 4.8u   |                 .                .+               *.                |
 4.81u  |                 .                .      +          .         *      |
 4.82u  |                 .                .          +      .               *|
 4.83u  |                 .                .          +      .               *|
 4.84u  |                 .                .      +          .         *      |
 4.85u  |                 .                .+                *                |
 4.86u  |                 .          +     .      *          .                |
 4.87u  |                 .       +        .*                .                |
 4.88u  |                 .       +        .*                .                |
 4.89u  |                 .           +    .      *          .                |
 4.9u   |                 .                .+               *.                |
 4.91u  |                 .                .      +          .         *      |
 4.92u  |                 .                .          +      .               *|
 4.93u  |                 .                .          +      .               *|
 4.94u  |                 .                .      +          .         *      |
 4.95u  |                 .                .+                *                |
 4.96u  |                 .           +    .      *          .                |
 4.97u  |                 .       +        .*                .                |
 4.98u  |                 .       +        .*                .                |
 4.99u  |                 .           +    .      *          .                |
 5.u    |                 .                .+               *.                |
        +-----------------+----------------+-----------------+----------------+
Gnucap   System status
iterations: op=4, dc=0, tran=2471, fourier=0, total=2980
transient timesteps: accepted=505, rejected=0, total=505
nodes: user=3, subckt=0, model=0, total=3
dctran density=100.0%, ac density=100.0%
