2 stage op-amp, conected as voltage follower 02/16/88 
* i/o
.options  includepath=.  libpath=  noacct  nolist  clobber  out=80
+  ydivisions= 4.  phase=degrees  harmonics=9  edit  language=spice
+  insensitive  units=spice  recursion=20

* accuracy, i/o
.options  numdgt=5  floor= 1.E-21  vfloor= 1.f  roundofftol= 100.f

* accuracy, tolerances
.options  gmin= 1.p  short= 10.u  reltol= 0.001  abstol= 1.p
+  vntol= 1.u  trtol= 7.  chgtol= 10.f  pivtol= 100.f
+  bypasstol= 0.1  loadtol= 0.1

* accuracy, algorithms
.options  method=trap  bypass  incmode  lcbypass  lubypass  fbbypass  traceload
+  order=auto  mode=mixed  transits=2  noquitconvfail

* iteration limiting and heuristics
.options  itl1=100  itl2=50  itl3=6  itl4=20  itl5=0  itl6=5000
+  itl7=1  itl8=99  itermin=1  ttsteporder=2  vmax= 5.  vmin=-5.
+  dampmax= 1.  dampmin= 0.5  dampstrategy=11

* time step control
.options  dtmin= 1.p  dtratio= 1.G  ttstepgrow= 1.1  trstepgrow= 1.E+99
+  trstephold= 1.E+99  trstepshrink= 2.  trreject= 0.5
+  trsteporder=3  trstepcoef1= 0.25  trstepcoef2= 0.04166667
+  trstepcoef3= 0.005208333

* circuit environment
.options  tnom= 27.  temperature= 27.  rstray  cstray  defl= 100.u
+  defw= 100.u  defad= 0.  defas= 0.

#           iter(0)    v(1)       v(3)       v(4)       v(5)       v(6)      
+ v(7)       v(8)       v(9)      
 27.        23.       -1.         1.5729     1.5796    -1.9277    -0.99985   
+-1.6303    -2.5        2.5       
vdb(6)-90.              -60.             -30.               0.              30.
vp(6)-180.              -90.              0.                90.            180.
        +-----------------+----------------+-----------------+----------------+
 1.     |                 .                +                *.                |
 1.5849 |                 .                +                *.                |
 2.5119 |                 .                +                *.                |
 3.9811 |                 .                +                *.                |
 6.3096 |                 .                +                *.                |
 10.    |                 .                +                *.                |
 15.849 |                 .                +                *.                |
 25.119 |                 .                +                *.                |
 39.811 |                 .                +                *.                |
 63.096 |                 .                +                *.                |
 100.   |                 .                +                *.                |
 158.49 |                 .                +                *.                |
 251.19 |                 .                +                *.                |
 398.11 |                 .                +                *.                |
 630.96 |                 .                +                 *                |
 1.K    |                 .                +                 *                |
 1.5849K|                 .               +.                 *                |
 2.5119K|                 .               +.                 *                |
 3.9811K|                 .              + .                 *                |
 6.3096K|                 .             +  .                 *                |
 10.K   |                 .           +    .                 *                |
 15.849K|                 .        +       .                 *                |
 25.119K|                 . +              .                 *                |
 39.811K|        +        .                .               * .                |
 63.096K| +               .                .          *      .                |
 100.K  |                 .                .      *          .             +  |
 158.49K|                 .                .  *              .         +      |
 251.19K|                 .                *                 .      +         |
 398.11K|                 .             *  .                 .   +            |
 630.96K|                 .           *    .                 . +              |
 1.Meg  |                 .        *       .                 .+               |
 1.5849M|                 .      *         .                 +                |
 2.5119M|                 .   *            .                +.                |
 3.9811M|                 . *              .               + .                |
 6.3096M|                *.                .              +  .                |
 10.Meg |              *  .                .            +    .                |
        +-----------------+----------------+-----------------+----------------+
v(6)  -4.               -2.               0.                2.               4.
        +-----------------+----------------+-----------------+----------------+
-5.     |            *    .                .                 .                |
-4.8    |            *    .                .                 .                |
-4.6    |            *    .                .                 .                |
-4.4    |            *    .                .                 .                |
-4.2    |            *    .                .                 .                |
-4.     |            *    .                .                 .                |
-3.8    |            *    .                .                 .                |
-3.6    |            *    .                .                 .                |
-3.4    |            *    .                .                 .                |
-3.2    |            *    .                .                 .                |
-3.     |            *    .                .                 .                |
-2.8    |            *    .                .                 .                |
-2.6    |            *    .                .                 .                |
-2.4    |             *   .                .                 .                |
-2.2    |               * .                .                 .                |
-2.     |                *.                .                 .                |
-1.8    |                 .*               .                 .                |
-1.6    |                 .  *             .                 .                |
-1.4    |                 .    *           .                 .                |
-1.2    |                 .      *         .                 .                |
-1.     |                 .       *        .                 .                |
-0.8    |                 .         *      .                 .                |
-0.6    |                 .           *    .                 .                |
-0.4    |                 .             *  .                 .                |
-0.2    |                 .              * .                 .                |
 0.     |                 .                *                 .                |
 0.2    |                 .                . *               .                |
 0.4    |                 .                .   *             .                |
 0.6    |                 .                .    *            .                |
 0.8    |                 .                .      *          .                |
 1.     |                 .                .        *        .                |
 1.2    |                 .                .         *       .                |
 1.4    |                 .                .           *     .                |
 1.6    |                 .                .             *   .                |
 1.8    |                 .                .               * .                |
 2.     |                 .                .                *.                |
 2.2    |                 .                .                 .*               |
 2.4    |                 .                .                 .  *             |
 2.6    |                 .                .                 .   *            |
 2.8    |                 .                .                 .   *            |
 3.     |                 .                .                 .   *            |
 3.2    |                 .                .                 .   *            |
 3.4    |                 .                .                 .   *            |
 3.6    |                 .                .                 .   *            |
 3.8    |                 .                .                 .   *            |
 4.     |                 .                .                 .   *            |
 4.2    |                 .                .                 .   *            |
 4.4    |                 .                .                 .   *            |
 4.6    |                 .                .                 .   *            |
 4.8    |                 .                .                 .   *            |
 5.     |                 .                .                 .   *            |
        +-----------------+----------------+-----------------+----------------+
v(6)  -4.               -2.               0.                2.               4.
        +-----------------+----------------+-----------------+----------------+
 0.     |                 .       *        .                 .                |
 10.u   |                 .       *        .                 .                |
 20.u   |                 .       *        .                 .                |
 30.u   |                 .       *        .                 .                |
 40.u   |                 .       *        .                 .                |
 50.u   |                 .       *        .                 .                |
 60.u   |                 .       *        .                 .                |
 70.u   |                 .       *        .                 .                |
 80.u   |                 .       *        .                 .                |
 90.u   |                 .       *        .                 .                |
 100.u  |                 .       *        .                 .                |
 110.u  |                 .       *        .                 .                |
 120.u  |                 .       *        .                 .                |
 130.u  |                 .       *        .                 .                |
 140.u  |                 .       *        .                 .                |
 150.u  |                 .       *        .                 .                |
 160.u  |                 .       *        .                 .                |
 170.u  |                 .       *        .                 .                |
 180.u  |                 .       *        .                 .                |
 190.u  |                 .       *        .                 .                |
 200.u  |                 .       *        .                 .                |
 210.u  |                 .           *    .                 .                |
 220.u  |                 .                . *               .                |
 230.u  |                 .                .      *          .                |
 240.u  |                 .                .        *        .                |
 250.u  |                 .                .        *        .                |
 260.u  |                 .                .        *        .                |
 270.u  |                 .                .        *        .                |
 280.u  |                 .                .        *        .                |
 290.u  |                 .                .        *        .                |
 300.u  |                 .                .        *        .                |
 310.u  |                 .                .        *        .                |
 320.u  |                 .                .        *        .                |
 330.u  |                 .                .        *        .                |
 340.u  |                 .                .        *        .                |
 350.u  |                 .                .        *        .                |
 360.u  |                 .                .        *        .                |
 370.u  |                 .                .        *        .                |
 380.u  |                 .                .        *        .                |
 390.u  |                 .                .        *        .                |
 400.u  |                 .                .        *        .                |
 410.u  |                 .                .        *        .                |
 420.u  |                 .                .        *        .                |
 430.u  |                 .                .        *        .                |
 440.u  |                 .                .        *        .                |
 450.u  |                 .                .        *        .                |
 460.u  |                 .                .        *        .                |
 470.u  |                 .                .        *        .                |
 480.u  |                 .                .        *        .                |
 490.u  |                 .                .        *        .                |
 500.u  |                 .                .        *        .                |
 510.u  |                 .                .        *        .                |
 520.u  |                 .                .       *         .                |
 530.u  |                 .                .      *          .                |
 540.u  |                 .                .    *            .                |
 550.u  |                 .                .   *             .                |
 560.u  |                 .                .  *              .                |
 570.u  |                 .                .*                .                |
 580.u  |                 .                *                 .                |
 590.u  |                 .               *.                 .                |
 600.u  |                 .             *  .                 .                |
 610.u  |                 .            *   .                 .                |
 620.u  |                 .           *    .                 .                |
 630.u  |                 .         *      .                 .                |
 640.u  |                 .        *       .                 .                |
 650.u  |                 .      *         .                 .                |
 660.u  |                 .    *           .                 .                |
 670.u  |                 .      *         .                 .                |
 680.u  |                 .        *       .                 .                |
 690.u  |                 .       *        .                 .                |
 700.u  |                 .       *        .                 .                |
 710.u  |                 .       *        .                 .                |
 720.u  |                 .       *        .                 .                |
 730.u  |                 .       *        .                 .                |
 740.u  |                 .       *        .                 .                |
 750.u  |                 .       *        .                 .                |
 760.u  |                 .       *        .                 .                |
 770.u  |                 .       *        .                 .                |
 780.u  |                 .       *        .                 .                |
 790.u  |                 .       *        .                 .                |
 800.u  |                 .       *        .                 .                |
 810.u  |                 .           *    .                 .                |
 820.u  |                 .                . *               .                |
 830.u  |                 .                .      *          .                |
 840.u  |                 .                .        *        .                |
 850.u  |                 .                .        *        .                |
 860.u  |                 .                .        *        .                |
 870.u  |                 .                .        *        .                |
 880.u  |                 .                .        *        .                |
 890.u  |                 .                .        *        .                |
 900.u  |                 .                .        *        .                |
 910.u  |                 .                .        *        .                |
 920.u  |                 .                .        *        .                |
 930.u  |                 .                .        *        .                |
 940.u  |                 .                .        *        .                |
 950.u  |                 .                .        *        .                |
 960.u  |                 .                .        *        .                |
 970.u  |                 .                .        *        .                |
 980.u  |                 .                .        *        .                |
 990.u  |                 .                .        *        .                |
 0.001  |                 .                .        *        .                |
        +-----------------+----------------+-----------------+----------------+
Gnucap   System status
iterations: op=23, dc=348, tran=8~~, fourier=0, total=14~~
transient timesteps: accepted=1~~, rejected=~, total=1~~
nodes: user=8, subckt=0, model=16, total=24
dctran density=47.9%, ac density=47.9%
