#TTime      lt(0)     
 0.         0.        
 1.         1.        
 2.         1.        
 3.1        1.        
 7.1        1.        
 10.        1.        
#TTime      lt(0)     
 11.        1.        
 12.        1.        
 13.1       1.        
 17.1       1.        
 20.        1.        
