>>>>>
>>>>>* hmmm
>>>>>options nocstray
>>>>>
>>>>>
>>>>>*.include inv_amp_p.mod
>>>>>param vdd=5
>>>>>spice
>>>>>.MODEL cmosn NMOS (  LEVEL   = 49  ALPHA0 = 1e-7 BETA0 = 1  H0 = 1e11  ) 
>>>>>.print tw  dvth(MN1)  tt(MN1.HCI)  stress(MN1.HCI)  v(nout)  von(MN1)  v(nin)  hidden(0)  ttorder(MN1.HCI) 
VDD: vdd is not a .model++++
>>>>>.options ttsteporder=2 
>>>>>.param ttend 2.5e8 
>>>>>.ttr 0 {ttend} 10u 1u * 1.2 new trace=n > hci7tt.out echo agemode=once tran age 
TTT sweep cont 0 cont_tt 0 new 1 cont_dc 0
TTT sweep Tstart 0.000000 Tstop 250000000.000000 Tstep 1.200000 stepmode 2
#TTime           dvth(MN1)       tt(MN1.HCI)     stress(MN1.HCI) v(nout)         von(MN1)        v(nin)          hidden(0)       ttorder(MN1.HCI)
 0.              0.              0.              0.              0.              0.              0.              0.              0.             
new max = 5, new limit = 5.5
 10.E-6          19.42090948E-6  886.021772E-12  88.60217715E-6  1.139769518     1.968452089     3.              1.              0.             
 20.E-6          19.42090948E-6  886.021772E-12  88.60217715E-6  1.139808208     1.968468445     3.              1.              1.             
 30.E-6          19.42090948E-6  886.021772E-12  88.60217715E-6  1.139808208     1.968468445     3.              1.              2.             
 41.E-6          19.9842277E-6   974.623949E-12  88.60217715E-6  1.13980933      1.96846892      3.              1.              2.             
 53.1E-6         21.05964047E-6  1.160688521E-9  88.60217715E-6  1.139811473     1.968469825     3.              1.              2.             
 66.41E-6        22.53212429E-6  1.453961727E-9  88.60217715E-6  1.139814406     1.968471066     3.              1.              2.             
 91.2932E-6      24.3636215E-6   1.886623879E-9  88.60217715E-6  1.139818055     1.968472608     3.              2.              2.             
 114.952682E-6   25.55081359E-6  2.210861951E-9  88.60217715E-6  1.13982042      1.968473608     3.              2.              2.             
 143.5806552E-6  27.93163214E-6  2.975319163E-9  88.60217715E-6  1.139825163     1.968475613     3.              2.              2.             
 178.2205028E-6  31.13429846E-6  4.272441533E-9  88.60217715E-6  1.139831544     1.968478311     3.              2.              2.             
 220.1347184E-6  34.8377005E-6   6.214088745E-9  88.60217715E-6  1.139838921     1.96848143      3.              2.              2.             
 282.0520826E-6  38.98666852E-6  9.042036704E-9  88.60217715E-6  1.139847187     1.968484924     3.              3.              2.             
 356.3529197E-6  41.56666186E-6  11.19514377E-9  88.60217715E-6  1.139852327     1.968487097     3.              5.              2.             
 443.7408882E-6  45.73410402E-6  15.39382096E-9  88.60217715E-6  1.139860629     1.968490607     3.              4.              2.             
 550.7340936E-6  50.43486286E-6  21.32956481E-9  88.60217715E-6  1.139869994     1.968494566     3.              4.              2.             
 679.12594E-6    54.36384918E-6  27.3892313E-9   88.60217715E-6  1.139877822     1.968497875     3.              6.              2.             
 831.4023657E-6  59.23107289E-6  36.45114529E-9  88.60217715E-6  1.139887518     1.968501974     3.              5.              2.             
 0.001016286625  64.84241021E-6  49.28820606E-9  88.60217715E-6  1.139898698     1.9685067       3.              4.              2.             
 0.001238147735  70.58502152E-6  65.40149641E-9  88.60217715E-6  1.139910138     1.968511537     3.              4.              2.             
 0.001504381068  76.00002683E-6  83.6742187E-9   88.60217715E-6  1.139920926     1.968516097     3.              6.              2.             
 0.001823861067  81.74147589E-6  106.6647116E-9  88.60217715E-6  1.139932365     1.968520933     3.              6.              2.             
 0.002207237067  86.20413269E-6  127.3423332E-9  88.60217715E-6  1.139941255     1.968524691     3.              15.             2.             
 0.002667288266  92.18385921E-6  159.2436533E-9  88.60217715E-6  1.139953169     1.968529728     3.              10.             2.             
 0.003219349705  98.86441288E-6  201.0693246E-9  88.60217715E-6  1.139966478     1.968535354     3.              8.              2.             
 0.003881823431  105.8781523E-6  252.6777649E-9  88.60217715E-6  1.139980452     1.968541261     3.              8.              2.             
 0.004676791903  112.749225E-6   311.5954192E-9  88.60217715E-6  1.139994141     1.968547048     3.              13.             2.             
 0.005629315538  120.5004322E-6  388.9029129E-9  88.60217715E-6  1.140009584     1.968553576     3.              8.              2.             
 0.006774070138  128.7545755E-6  485.0145321E-9  88.60217715E-6  1.140026028     1.968560528     3.              6.              2.             
 0.008147775657  136.9106439E-6  595.2095489E-9  88.60217715E-6  1.140042278     1.968567397     3.              13.             2.             
 0.009796222281  145.6478161E-6  731.5192691E-9  88.60217715E-6  1.140059685     1.968574756     3.              11.             2.             
 0.01177435823   154.8846717E-6  897.9262031E-9  88.60217715E-6  1.140078088     1.968582535     3.              10.             2.             
 0.01414812137   163.8214986E-6  1.082552154E-6  88.60217715E-6  1.140095894     1.968590062     3.              29.             2.             
 0.01699663713   174.0334026E-6  1.324304591E-6  88.60217715E-6  1.140116239     1.968598662     3.              12.             2.             
 0.02041485605   184.365659E-6   1.605015685E-6  88.60217715E-6  1.140136825     1.968607364     3.              25.             2.             
 0.02451671875   195.7427892E-6  1.959589433E-6  88.60217715E-6  1.140159493     1.968616946     3.              10.             2.             
 0.029438954     207.5590797E-6  2.382419865E-6  88.60217715E-6  1.140183036     1.968626898     3.              15.             2.             
 0.03534563629   220.0578066E-6  2.895132515E-6  88.60217715E-6  1.140207938     1.968637424     3.              12.             2.             
 0.04243365504   233.2492349E-6  3.515172212E-6  88.60217715E-6  1.140234222     1.968648534     3.              9.              2.             
 0.05093927754   246.8440381E-6  4.245752317E-6  88.60217715E-6  1.140261309     1.968659984     3.              26.             2.             
 0.06114602454   261.0921777E-6  5.119081561E-6  88.60217715E-6  1.140289698     1.968671984     3.              35.             2.             
 0.07339412094   276.4049546E-6  6.19011322E-6   88.60217715E-6  1.140320208     1.96868488      3.              16.             2.             
 0.08809183662   292.5643703E-6  7.480844545E-6  88.60217715E-6  1.140352406     1.968698489     3.              13.             2.             
 0.1057290954    309.6247621E-6  9.036455901E-6  88.60217715E-6  1.140386399     1.968712858     3.              8.              2.             
 0.126893806     327.3736504E-6  10.8815706E-6   88.60217715E-6  1.140421765     1.968727806     3.              34.             2.             
 0.1522914587    346.3019668E-6  13.12388372E-6  88.60217715E-6  1.140459481     1.968743747     3.              9.              2.             
 0.1827686419    366.1797553E-6  15.8073941E-6   88.60217715E-6  1.140499089     1.968760488     3.              19.             2.             
 0.2193412618    387.1998592E-6  19.03983365E-6  88.60217715E-6  1.140540974     1.968778191     3.              9.              2.             
 0.2632284057    409.3621544E-6  22.92124197E-6  88.60217715E-6  1.140585136     1.968796855     3.              8.              2.             
 0.3158929783    432.6624351E-6  27.56617324E-6  88.60217715E-6  1.140631565     1.968816479     3.              24.             2.             
 0.3790904655    457.259309E-6   33.14522969E-6  88.60217715E-6  1.14068058      1.968837194     3.              23.             2.             
 0.45492745      483.2627826E-6  39.85569142E-6  88.60217715E-6  1.140732397     1.968859093     3.              10.             2.             
 0.5459318315    510.6809847E-6  47.9047014E-6   88.60217715E-6  1.140787035     1.968882184     3.              16.             2.             
 0.6551370893    539.6260003E-6  57.56900671E-6  88.60217715E-6  1.140844717     1.968906561     3.              13.             2.             
 0.7861833987    570.1822797E-6  69.17113481E-6  88.60217715E-6  1.140905611     1.968932294     3.              10.             2.             
 0.9434389699    602.4339462E-6  83.09546058E-6  88.60217715E-6  1.140969884     1.968959456     3.              10.             2.             
 1.132145655     636.4107702E-6  99.77098266E-6  88.60217715E-6  1.141037597     1.96898807      3.              50.             2.             
 1.358593678     672.3474462E-6  119.8188221E-6  88.60217715E-6  1.141109217     1.969018334     3.              18.             2.             
 1.630331305     710.2744954E-6  143.8687868E-6  88.60217715E-6  1.141184806     1.969050275     3.              30.             2.             
 1.956416458     750.3461689E-6  172.750009E-6   88.60217715E-6  1.14126467      1.969084022     3.              12.             2.             
 2.347718641     792.6491665E-6  207.4033999E-6  88.60217715E-6  1.141348984     1.969119647     3.              19.             2.             
 2.81728126      837.3231707E-6  248.99438E-6    88.60217715E-6  1.141438026     1.969157269     3.              15.             2.             
 3.380756404     884.4993161E-6  298.9079862E-6  88.60217715E-6  1.141532058     1.969196998     3.              13.             2.             
 4.056926576     934.3207363E-6  358.8110474E-6  88.60217715E-6  1.141631365     1.969238955     3.              8.              2.             
 4.868330783     986.9247831E-6  430.6846202E-6  88.60217715E-6  1.141736222     1.969283254     3.              21.             2.             
 5.842015831     0.001042481438  516.940173E-6   88.60217715E-6  1.141846969     1.96933004      3.              17.             2.             
 7.010437888     0.001101153067  620.4471907E-6  88.60217715E-6  1.141963928     1.969379449     3.              20.             2.             
 8.412544357     0.001163121842  744.6689022E-6  88.60217715E-6  1.142087465     1.969431633     3.              9.              2.             
 10.09507212     0.001228567724  893.736551E-6   88.60217715E-6  1.142217939     1.969486746     3.              9.              2.             
 12.11410544     0.001297685966  0.001072616666  88.60217715E-6  1.142355739     1.969544951     3.              12.             2.             
 14.53694541     0.001370684934  0.001287274931  88.60217715E-6  1.142501283     1.969606423     3.              12.             2.             
 17.44435339     0.001447782835  0.001544865203  88.60217715E-6  1.142655006     1.969671346     3.              14.             2.             
 20.93324296     0.00152921145   0.001853976896  88.60217715E-6  1.142817372     1.969739916     3.              13.             2.             
 25.11991044     0.001615214176  0.002224912346  88.60217715E-6  1.142988868     1.969812336     3.              14.             2.             
 30.14391142     0.001706049302  0.002670040025  88.60217715E-6  1.143170009     1.969888825     3.              11.             2.             
 36.1727126      0.00180198458   0.003204173924  88.60217715E-6  1.143361331     1.969969608     3.              35.             2.             
 43.40727401     0.001903312897  0.003845148779  88.60217715E-6  1.143563421     1.970054932     3.              26.             2.             
 52.0887477      0.002010337966  0.004614338275  88.60217715E-6  1.143776886     1.970145051     3.              9.              2.             
 62.50651613     0.002123377969  0.005537369923  88.60217715E-6  1.144002363     1.970240233     3.              6.              2.             
 75.00783825     0.002242770835  0.006645008078  88.60217715E-6  1.144240529     1.970340764     3.              7.              2.             
 90.00942479     0.002368871634  0.007974147637  88.60217715E-6  1.144492095     1.970446941     3.              38.             2.             
 108.0113286     0.002502062678  0.009569144879  88.60217715E-6  1.144757826     1.970559087     3.              12.             2.             
 129.6136133     0.002642740473  0.01148314635   88.60217715E-6  1.145038517     1.970677534     3.              9.              2.             
 155.5363548     0.002791325946  0.01377995149   88.60217715E-6  1.145335013     1.970802638     3.              7.              2.             
 186.6436447     0.002948263723  0.01653611978   88.60217715E-6  1.145648204     1.970934772     3.              6.              2.             
 223.9723925     0.003114023488  0.01984352368   88.60217715E-6  1.145979033     1.97107433      3.              5.              2.             
 268.7668899     0.003289101247  0.02381240835   88.60217715E-6  1.146328495     1.971221731     3.              6.              2.             
 322.5202867     0.003474021017  0.02857507103   88.60217715E-6  1.146697642     1.971377415     3.              6.              2.             
 387.024363      0.003669336156  0.03429026553   88.60217715E-6  1.147087587     1.971541848     3.              8.              2.             
 464.4292545     0.003875630553  0.04114847554   88.60217715E-6  1.147499501     1.971715519     3.              36.             2.             
 557.3151242     0.004093523014  0.04937835697   88.60217715E-6  1.147934629     1.97189895      3.              10.             2.             
 668.778168      0.004323664866  0.05925421646   88.60217715E-6  1.148394282     1.972092688     3.              10.             2.             
 802.5338205     0.004566744861  0.07110525139   88.60217715E-6  1.148879844     1.972297313     3.              8.              2.             
 963.0406035     0.004823490357  0.08532649295   88.60217715E-6  1.149392782     1.972513435     3.              10.             2.             
 1.155648743E+3  0.005094669714  0.1023919846    88.60217715E-6  1.149934643     1.9727417       3.              10.             2.             
 1.386778511E+3  0.005381094456  0.1228705772    88.60217715E-6  1.150507063     1.97298279      3.              9.              2.             
 1.664134232E+3  0.005683621688  0.1474448891    88.60217715E-6  1.151111771     1.973237425     3.              10.             2.             
 1.996961097E+3  0.006003156773  0.1769340686    88.60217715E-6  1.151750595     1.973506367     3.              6.              2.             
 2.396353335E+3  0.006340655875  0.2123210852    88.60217715E-6  1.152425468     1.973790417     3.              6.              2.             
 2.875624021E+3  0.006697128837  0.254785491     88.60217715E-6  1.15313843      1.974090425     3.              23.             2.             
 3.450748844E+3  0.007073642602  0.3057427901    88.60217715E-6  1.153891641     1.974407286     3.              14.             2.             
 4.140898632E+3  0.007471323836  0.3668915558    88.60217715E-6  1.154687383     1.974741946     3.              9.              2.             
 4.969078377E+3  0.007891362561  0.4402700781    88.60217715E-6  1.155528068     1.975095404     3.              7.              2.             
 5.962894071E+3  0.008335015653  0.528324292     88.60217715E-6  1.156416246     1.975468715     3.              23.             2.             
 7.155472904E+3  0.008803610868  0.6339893659    88.60217715E-6  1.157354615     1.975862993     3.              8.              2.             
 8.586567504E+3  0.009298550392  0.760787457     88.60217715E-6  1.158346026     1.976279415     3.              7.              2.             
 10.30388102E+3  0.009821315303  0.9129451657    88.60217715E-6  1.159393493     1.976719222     3.              9.              2.             
 12.36465725E+3  0.0103734699    1.095534396     88.60217715E-6  1.160500206     1.977183727     3.              33.             2.             
 14.83758872E+3  0.01095666659   1.31464149      88.60217715E-6  1.161669535     1.977674315     3.              21.             2.             
 17.80510648E+3  0.01157265051   1.577570003     88.60217715E-6  1.162905047     1.978192449     3.              24.             2.             
 21.36612779E+3  0.01222326499   1.893084229     88.60217715E-6  1.164210515     1.978739673     3.              17.             2.             
 25.63935337E+3  0.01291045697   2.271701312     88.60217715E-6  1.165589926     1.979317618     3.              8.              2.             
 30.76722406E+3  0.01363628281   2.72604181      88.60217715E-6  1.167047503     1.979928006     3.              11.             2.             
 36.92066889E+3  0.01440291451   3.271250413     88.60217715E-6  1.168587709     1.980572657     3.              7.              2.             
 44.30480269E+3  0.0152126462    3.925500738     88.60217715E-6  1.17021527      1.981253489     3.              6.              2.             
 53.16576325E+3  0.01606790093   4.71060113      88.60217715E-6  1.171935184     1.981972529     3.              6.              2.             
 63.79891592E+3  0.01697123803   5.652721597     88.60217715E-6  1.17375274      1.98273192      3.              10.             2.             
 76.55869912E+3  0.01792536069   6.783266154     88.60217715E-6  1.175673538     1.983533919     3.              17.             2.             
 91.87043896E+3  0.01893312407   8.139919619     88.60217715E-6  1.177703503     1.984380913     3.              24.             2.             
 110.2445268E+3  0.01999754385   9.767903784     88.60217715E-6  1.179848907     1.98527542      3.              20.             2.             
 132.2934321E+3  0.02112180527   11.7214848      88.60217715E-6  1.182116392     1.986220101     3.              10.             2.             
 158.7521186E+3  0.02230927262   14.06578201     88.60217715E-6  1.184512988     1.987217763     3.              7.              2.             
 190.5025423E+3  0.02356349933   16.87893867     88.60217715E-6  1.187046142     1.988271368     3.              9.              2.             
 228.6030508E+3  0.02488823862   20.25472667     88.60217715E-6  1.18972374      1.989384047     3.              8.              2.             
 274.323661E+3   0.02628745469   24.30567227     88.60217715E-6  1.192554134     1.990559101     3.              6.              2.             
 329.1883932E+3  0.02776533464   29.16680699     88.60217715E-6  1.195546174     1.991800017     3.              5.              2.             
 395.0260719E+3  0.02932630094   35.00016865     88.60217715E-6  1.198709237     1.993110475     3.              7.              2.             
 474.0312863E+3  0.03097502472   42.00020264     88.60217715E-6  1.202053257     1.994494359     3.              9.              2.             
 568.8375436E+3  0.03271643968   50.40024344     88.60217715E-6  1.205588768     1.995955768     3.              9.              2.             
 682.6050523E+3  0.03455575693   60.48029239     88.60217715E-6  1.209326934     1.997499029     3.              7.              2.             
 819.1260628E+3  0.03649848054   72.57635114     88.60217715E-6  1.213279593     1.99912871      3.              9.              2.             
 982.9512753E+3  0.038550424     87.09162163     88.60217715E-6  1.217459298     2.000849629     3.              15.             2.             
 1.17954153E+6   0.04071772765   104.5099462     88.60217715E-6  1.221879367     2.002666871     3.              8.              2.             
 1.415449837E+6  0.04300687704   125.4119358     88.60217715E-6  1.226553927     2.004585804     3.              7.              2.             
 1.698539804E+6  0.04542472234   150.4943232     88.60217715E-6  1.231497972     2.00661209      3.              7.              2.             
 2.038247765E+6  0.04797849881   180.5931881     88.60217715E-6  1.236727415     2.008751705     3.              8.              2.             
 2.445897318E+6  0.05067584852   216.711826      88.60217715E-6  1.242259153     2.011010951     3.              10.             2.             
 2.935076781E+6  0.05352484314   260.0541915     88.60217715E-6  1.248111128     2.013396481     3.              12.             2.             
 3.522092137E+6  0.05653400815   312.06503       88.60217715E-6  1.254302401     2.015915308     3.              9.              2.             
 4.226510565E+6  0.05971234832   374.4780363     88.60217715E-6  1.260853226     2.018574836     3.              11.             2.             
 5.071812678E+6  0.06306937467   449.3736439     88.60217715E-6  1.267785131     2.021382868     3.              13.             2.             
 6.086175213E+6  0.06661513293   539.2483729     88.60217715E-6  1.275121004     2.024347639     3.              14.             2.             
 7.303410256E+6  0.07036023361   647.0980478     88.60217715E-6  1.282885191     2.027477831     3.              18.             2.             
 8.764092307E+6  0.07431588374   776.5176577     88.60217715E-6  1.291103594     2.030782599     3.              13.             2.             
 10.51691077E+6  0.07849392038   931.8211895     88.60217715E-6  1.299803782     2.034271597     3.              7.              2.             
 12.62029292E+6  0.08290684611   1.118185428E+3  88.60217715E-6  1.309015113     2.037955003     3.              8.              2.             
 15.14435151E+6  0.08756786639   1.341822514E+3  88.60217715E-6  1.318768858     2.041843545     3.              6.              2.             
 18.17322181E+6  0.09249092908   1.610187017E+3  88.60217715E-6  1.329098344     2.045948532     3.              6.              2.             
 21.80786617E+6  0.0976907662    1.93222442E+3   88.60217715E-6  1.340039105     2.050281881     3.              19.             2.             
 26.1694394E+6   0.103182938     2.318669304E+3  88.60217715E-6  1.351629045     2.054856152     3.              11.             2.             
 31.40332729E+6  0.1089838795    2.782403166E+3  88.60217715E-6  1.363908624     2.059684574     3.              13.             2.             
 37.68399274E+6  0.1151109498    3.338883799E+3  88.60217715E-6  1.376921045     2.064781085     3.              8.              2.             
 45.22079129E+6  0.1215824838    4.006660559E+3  88.60217715E-6  1.390712478     2.070160363     3.              7.              2.             
 54.26494955E+6  0.1284178472    4.807992671E+3  88.60217715E-6  1.405332288     2.075837865     3.              11.             2.             
 65.11793946E+6  0.1356374945    5.769591206E+3  88.60217715E-6  1.420833298     2.081829862     3.              22.             2.             
 78.14152735E+6  0.1432630301    6.923509448E+3  88.60217715E-6  1.43727207      2.088153478     3.              30.             2.             
 93.76983282E+6  0.1513172732    8.308211337E+3  88.60217715E-6  1.454709218     2.094826732     3.              19.             2.             
 112.5237994E+6  0.1598243255    9.969853605E+3  88.60217715E-6  1.473209758     2.101868576     3.              21.             2.             
 135.0285593E+6  0.168809644     11.96382433E+3  88.60217715E-6  1.492843489     2.10929894      3.              12.             2.             
 162.0342711E+6  0.1783001169    14.35658919E+3  88.60217715E-6  1.513685417     2.117138772     3.              14.             2.             
 194.4411253E+6  0.1883241438    17.22790703E+3  88.60217715E-6  1.535816239     2.125410079     3.              11.             2.             
 233.3293504E+6  0.1989117213    20.67348844E+3  88.60217715E-6  1.559322865     2.134135976     3.              7.              2.             
 250.E+6         0.203072711     22.15054429E+3  88.60217715E-6  1.568598364     2.137562364     3.              3.              2.             
>>>>>.echo >> hci7tt.out 
>>>>>.ttr 0 {ttend} 10u 1u * 1.2 new trace=n >> hci7tt.out echo tran age 
TTT sweep cont 0 cont_tt 0 new 1 cont_dc 0
TTT sweep Tstart 0.000000 Tstop 250000000.000000 Tstep 1.200000 stepmode 2
#TTime           dvth(MN1)       tt(MN1.HCI)     stress(MN1.HCI) v(nout)         von(MN1)        v(nin)          hidden(0)       ttorder(MN1.HCI)
 0.              0.              0.              0.              0.              2.137562364     0.              0.              0.             
 10.E-6          19.42090948E-6  886.021772E-12  88.60217715E-6  1.139769518     1.968452089     3.              1.              0.             
 20.E-6          23.91114498E-6  1.772340205E-9  88.63184339E-6  1.139808208     1.968468445     3.              1.              1.             
tt step rejected: MN1.HCI
new
new=0.000010  required=0.000010
 30.E-6          27.0046398E-6   2.658727391E-9  88.63871853E-6  1.139817154     1.968472227     3.              1.              2.             
 40.E-6          29.43927205E-6  3.545161875E-9  88.64344846E-6  1.139823316     1.968474833     3.              1.              2.             
 51.E-6          31.66546462E-6  4.520280613E-9  88.6475053E-6   1.139828603     1.968477067     3.              1.              2.             
 63.1E-6         33.75426011E-6  5.592952826E-9  88.65116379E-6  1.13983337      1.968479083     3.              1.              2.             
 87.9832E-6      37.29473848E-6  7.798978702E-9  88.65715356E-6  1.139841175     1.968482382     3.              2.              2.             
 114.717292E-6   40.38524732E-6  10.16923624E-9  88.66223913E-6  1.139847801     1.968485184     3.              2.              2.             
 147.0655433E-6  43.51045137E-6  13.03740457E-9  88.66729347E-6  1.139854387     1.968487968     3.              2.              2.             
 186.2069274E-6  46.70304808E-6  16.50808132E-9  88.67239301E-6  1.139861031     1.968490777     3.              2.              2.             
 233.5680022E-6  49.98925727E-6  20.70783969E-9  88.67759396E-6  1.139867808     1.968493641     3.              2.              2.             
 290.8749026E-6  53.39134616E-6  25.78984608E-9  88.68294087E-6  1.139874774     1.968496586     3.              2.              2.             
 360.2162522E-6  56.92911974E-6  31.93944824E-9  88.68847122E-6  1.139881978     1.968499632     3.              2.              2.             
 444.1192851E-6  60.62085571E-6  39.38093793E-9  88.69421807E-6  1.139889465     1.968502797     3.              2.              2.             
 545.641955E-6   64.4839227E-6   48.38573502E-9  88.70021177E-6  1.139897272     1.968506098     3.              2.              2.             
 668.4843856E-6  68.535209E-6    59.2822919E-9   88.706481E-6    1.139905438     1.96850955      3.              2.              2.             
 817.1237265E-6  72.79143352E-6  72.46807992E-9  88.71305358E-6  1.139913999     1.968513169     3.              2.              2.             
 996.9773291E-6  77.26938114E-6  88.42409569E-9  88.71995696E-6  1.13992299      1.96851697      3.              2.              2.             
 0.001214600188  81.98608853E-6  107.7324172E-9  88.72721863E-6  1.139932447     1.968520968     3.              2.              2.             
 0.001477923848  86.95899669E-6  131.0974512E-9  88.73486647E-6  1.139942407     1.968525178     3.              2.              2.             
 0.001796545476  92.20608125E-6  159.371648E-9   88.74292899E-6  1.139952906     1.968529616     3.              2.              2.             
 0.002179921475  97.71697042E-6  193.3952604E-9  88.75139104E-6  1.139963924     1.968534274     3.              2.              2.             
 0.002639972674  103.4969755E-6  234.227586E-9   88.76026148E-6  1.139975473     1.968539157     3.              2.              2.             
 0.003192034113  109.5667213E-6  283.2314007E-9  88.76957261E-6  1.139987595     1.968544281     3.              2.              2.             
 0.00385450784   115.9471813E-6  342.0423107E-9  88.77935711E-6  1.140000332     1.968549665     3.              2.              2.             
 0.004649476312  122.6598415E-6  412.623392E-9   88.78964845E-6  1.140013728     1.968555328     3.              2.              2.             
 0.005603438478  129.7268422E-6  497.3307773E-9  88.80048098E-6  1.140027827     1.968561288     3.              2.              2.             
 0.006748193078  137.1711048E-6  598.9923863E-9  88.81189027E-6  1.140042675     1.968567565     3.              2.              2.             
 0.008121898598  145.0164484E-6  721.0024317E-9  88.8239132E-6   1.140058321     1.968574179     3.              2.              2.             
 0.009770345221  153.2877003E-6  867.434869E-9   88.8365882E-6   1.140074813     1.96858115      3.              2.              2.             
 0.01174848117   162.0108011E-6  1.043179584E-6  88.8499554E-6   1.140092203     1.968588502     3.              2.              2.             
 0.01412224431   171.2129096E-6  1.254105887E-6  88.86405681E-6  1.140110547     1.968596256     3.              2.              2.             
 0.01697076007   180.9225052E-6  1.507258781E-6  88.87893645E-6  1.140129901     1.968604437     3.              2.              2.             
 0.02038897899   191.169492E-6   1.811094593E-6  88.89464059E-6  1.140150325     1.968613071     3.              2.              2.             
 0.02449084169   201.9853046E-6  2.175763861E-6  88.91121783E-6  1.140171881     1.968622183     3.              2.              2.             
 0.02941307694   213.4030159E-6  2.613450967E-6  88.92871933E-6  1.140194636     1.968631801     3.              2.              2.             
 0.03531975923   225.4574484E-6  3.138781898E-6  88.94719898E-6  1.140218659     1.968641956     3.              2.              2.             
 0.04240777798   238.1852896E-6  3.769313846E-6  88.96671359E-6  1.140244023     1.968652677     3.              2.              2.             
 0.05091340048   251.6252115E-6  4.52612305E-6   88.98732302E-6  1.140270805     1.968663998     3.              2.              2.             
 0.06112014748   265.8179957E-6  5.434510649E-6  89.00909051E-6  1.140299088     1.968675953     3.              2.              2.             
 0.07336824388   280.8066641E-6  6.524850242E-6  89.03208274E-6  1.140328956     1.968688577     3.              2.              2.             
 0.08806595956   296.6366157E-6  7.833605669E-6  89.05637018E-6  1.1403605       1.96870191      3.              2.              2.             
 0.1057032184    313.3557702E-6  9.40455321E-6   89.08202723E-6  1.140393815     1.968715992     3.              2.              2.             
 0.126867929     331.0147193E-6  11.29024936E-6  89.10913253E-6  1.140429004     1.968730865     3.              2.              2.             
 0.1522655816    349.6668857E-6  13.55379353E-6  89.13776915E-6  1.140466172     1.968746575     3.              2.              2.             
 0.1827427649    369.3686911E-6  16.27094518E-6  89.16802497E-6  1.140505431     1.968763168     3.              2.              2.             
 0.2193153848    390.1797324E-6  19.53266652E-6  89.19999286E-6  1.140546901     1.968780696     3.              2.              2.             
 0.2632025286    412.1629689E-6  23.44817676E-6  89.23377104E-6  1.140590707     1.96879921      3.              2.              2.             
 0.3158671012    435.3849194E-6  28.14862081E-6  89.2694634E-6   1.140636982     1.968818768     3.              2.              2.             
 0.3790645884    459.9158703E-6  33.79147641E-6  89.30717986E-6  1.140685866     1.968839428     3.              2.              2.             
 0.454901573     485.8300965E-6  40.56584851E-6  89.34703671E-6  1.140737507     1.968861253     3.              2.              2.             
 0.5459059545    513.2060938E-6  48.69883018E-6  89.38915703E-6  1.140792062     1.968884308     3.              2.              2.             
 0.6551112123    542.1268262E-6  58.46314496E-6  89.43367106E-6  1.140849696     1.968908665     3.              2.              2.             
 0.7861575216    572.6799866E-6  70.18633002E-6  89.4807167E-6   1.140910584     1.968934396     3.              2.              2.             
 0.9434130929    604.9582737E-6  84.26177098E-6  89.53043994E-6  1.140974911     1.96896158      3.              2.              2.             
 1.132119778     639.0596847E-6  101.1619634E-6  89.58299535E-6  1.141042873     1.968990299     3.              2.              2.             
 1.358567801     675.0878261E-6  121.454451E-6   89.63854668E-6  1.141114676     1.969020641     3.              2.              2.             
 1.630305428     713.1522425E-6  145.8209829E-6  89.69726736E-6  1.141190539     1.969052697     3.              2.              2.             
 1.956390581     753.3687658E-6  175.0805421E-6  89.75934112E-6  1.141270692     1.969086566     3.              2.              2.             
 2.347692764     795.8598852E-6  210.2170304E-6  89.82496268E-6  1.141355382     1.96912235      3.              2.              2.             
 2.817255383     840.75514E-6    252.4125537E-6  89.89433841E-6  1.141444865     1.969160159     3.              2.              2.             
 3.380730527     888.1915364E-6  303.0874464E-6  89.96768707E-6  1.141539416     1.969200107     3.              2.              2.             
 4.056900699     938.3139899E-6  363.9484037E-6  90.04524061E-6  1.141639324     1.969242317     3.              2.              2.             
 4.868304906     991.2757952E-6  437.0463722E-6  90.12724503E-6  1.141744894     1.969286918     3.              2.              2.             
 5.841989954     0.001047239125  524.846185E-6   90.21396127E-6  1.141856452     1.969334046     3.              2.              2.             
 7.010412011     0.001106375562  630.3103356E-6  90.30566621E-6  1.141974338     1.969383846     3.              2.              2.             
 8.41251848      0.00116886666   756.9997772E-6  90.40265367E-6  1.142098917     1.969436471     3.              2.              2.             
 10.09504624     0.001234904546  909.1952227E-6  90.5052356E-6   1.142230572     1.969492082     3.              2.              2.             
 12.11407956     0.001304692556  0.001092043142  90.61374323E-6  1.142369708     1.969550851     3.              2.              2.             
 14.53691954     0.001378445916  0.001311731508  90.72852839E-6  1.142516757     1.969612958     3.              2.              2.             
 17.44432751     0.001456392463  0.001575701406  90.84996491E-6  1.142672173     1.969678596     3.              2.              2.             
 20.93321708     0.001538773413  0.001892901842  90.9784501E-6   1.142836439     1.969747967     3.              2.              2.             
 25.11988456     0.001625844188  0.002274096673  91.1144064E-6   1.143010065     1.969821287     3.              2.              2.             
 30.14388554     0.00171787528   0.002732234355  91.25828312E-6  1.143193592     1.969898783     3.              2.              2.             
 36.17268672     0.001815153192  0.003282893492  91.41055832E-6  1.143387594     1.969980697     3.              2.              2.             
 43.40724813     0.001917981431  0.003944819843  91.57174083E-6  1.143592677     1.970067283     3.              2.              2.             
 52.08872182     0.002026681565  0.004740573718  91.74237253E-6  1.143809485     1.970158812     3.              2.              2.             
 62.50649026     0.002141594368  0.005697310654  91.92303066E-6  1.1440387       1.970255572     3.              2.              2.             
 75.00781237     0.002263081022  0.006847723084  92.11433048E-6  1.144281046     1.970357865     3.              2.              2.             
 90.00939892     0.002391524423  0.008231176514  92.31692803E-6  1.144537288     1.970466015     3.              2.              2.             
 108.0113028     0.002527330564  0.00989508081   92.53152324E-6  1.14480824      1.970580362     3.              2.              2.             
 129.6135874     0.002670930024  0.01189654579   92.75886324E-6  1.145094766     1.970701269     3.              2.              2.             
 155.5363289     0.002822779561  0.01430438074   92.99974598E-6  1.14539778      1.97082912      3.              2.              2.             
 186.6436188     0.002983363821  0.01720151016   93.25502422E-6  1.145718255     1.970964324     3.              2.              2.             
 223.9723666     0.00315319717   0.0206878936    93.52560981E-6  1.146057222     1.971107311     3.              2.              2.             
 268.766864      0.003332825663  0.02488405598   93.81247845E-6  1.146415776     1.971258543     3.              2.              2.             
 322.5202609     0.003522829165  0.02993535809   94.11667487E-6  1.146795083     1.971418506     3.              2.              2.             
 387.0243371     0.003723823621  0.03601716471   94.43931847E-6  1.147196378     1.971587719     3.              2.              2.             
 464.4292286     0.003936463515  0.04334110193   94.78160961E-6  1.147620978     1.971766731     3.              2.              2.             
 557.3150984     0.004161444505  0.05216263705   95.14483641E-6  1.148070279     1.971956128     3.              2.              2.             
 668.7781421     0.004399506281  0.06279026566   95.53038236E-6  1.14854577      1.972156532     3.              2.              2.             
 802.5337946     0.004651435635  0.07559665271   95.9397346E-6   1.149049035     1.972368604     3.              2.              2.             
 963.0405776     0.004918069794  0.09103215124   96.37449316E-6  1.149581757     1.972593048     3.              2.              2.             
 1.155648717E+3  0.005200300015  0.1096412166    96.83638111E-6  1.150145733     1.972830612     3.              2.              2.             
 1.386778485E+3  0.005499075488  0.1320823494    97.32725592E-6  1.150742877     1.973082095     3.              2.              2.             
 1.664134206E+3  0.00581540756   0.1591523429    97.84912192E-6  1.151375227     1.973348346     3.              2.              2.             
 1.996961071E+3  0.006150374332  0.1918157854    98.4041443E-6   1.152044959     1.973630271     3.              2.              2.             
 2.396353309E+3  0.006505125645  0.2312409854    98.99466466E-6  1.152754396     1.973928836     3.              2.              2.             
 2.875623995E+3  0.006880888515  0.2788437525    99.62321831E-6  1.153506018     1.974245072     3.              2.              2.             
 3.450748818E+3  0.007278973057  0.3363408004    100.2925538E-6  1.154302474     1.974580079     3.              2.              2.             
 4.140898606E+3  0.007700778944  0.4058149449    101.0056544E-6  1.155146599     1.974935032     3.              2.              2.             
 4.969078351E+3  0.008147802475  0.4897947815    101.7657631E-6  1.156041423     1.975311187     3.              2.              2.             
 5.962894045E+3  0.008621644303  0.5913521574    102.5764094E-6  1.156990193     1.975709888     3.              2.              2.             
 7.155472878E+3  0.009124017919  0.7142215427    103.4414409E-6  1.157996387     1.976132573     3.              2.              2.             
 8.586567478E+3  0.009656758949  0.86294639      104.365058E-6   1.159063735     1.976580782     3.              2.              2.             
 10.303881E+3    0.0102218354    1.043058801     105.3518541E-6  1.16019624      1.977056166     3.              2.              2.             
 12.36465722E+3  0.01082135894   1.261300369     106.4068601E-6  1.161398202     1.977560497     3.              2.              2.             
 14.83758869E+3  0.01145759732   1.525893993     107.535596E-6   1.162674244     1.978095675     3.              2.              2.             
 17.80510645E+3  0.01213298817   1.846878932     108.7441298E-6  1.164029342     1.978663744     3.              2.              2.             
 21.36612777E+3  0.01285015419   2.236524412     110.0391443E-6  1.165468857     1.979266904     3.              2.              2.             
 25.63935334E+3  0.01361192011   2.709841058     111.4280138E-6  1.166998568     1.979907519     3.              2.              2.             
 30.76722404E+3  0.01442133147   3.285214345     112.918893E-6   1.168624719     1.980588143     3.              2.              2.             
 36.92066887E+3  0.01528167557   3.985190612     114.5208189E-6  1.170354055     1.981311527     3.              2.              2.             
 44.30480267E+3  0.01619650491   4.837454243     116.2438291E-6  1.172193881     1.982080645     3.              2.              2.             
 53.16576322E+3  0.01716966331   5.876044959     118.0990987E-6  1.174152112     1.982898715     3.              2.              2.             
 63.79891589E+3  0.01820531536   7.142877498     120.0991E-6     1.176237337     1.983769222     3.              2.              2.             
 76.55869909E+3  0.01930797943   8.689643077     122.2577895E-6  1.178458893     1.984695943     3.              2.              2.             
 91.87043894E+3  0.02048256487   10.5801943      124.6528201E-6  1.180826945     1.985682983     3.              2.              2.             
 110.2445267E+3  0.02173515313   12.89500539     127.1805629E-6  1.183354067     1.986735428     3.              2.              2.             
 132.2934321E+3  0.0230706343    15.73056413     129.9199077E-6  1.186050483     1.987857358     3.              2.              2.             
 158.7521186E+3  0.02449554286   19.2089109      132.8937284E-6  1.188929796     1.98905423      3.              2.              2.             
 190.5025423E+3  0.02601683961   23.48159784     136.1276142E-6  1.192006541     1.990331855     3.              2.              2.             
 228.6030508E+3  0.02764215236   28.73770187     139.650724E-6   1.195296687     1.991696594     3.              2.              2.             
 274.323661E+3   0.02937985689   35.21368166     143.4964034E-6  1.198817811     1.993155432     3.              2.              2.             
 329.1883932E+3  0.03123917017   43.20600816     147.7029292E-6  1.202589309     1.99471605      3.              2.              2.             
 395.0260719E+3  0.03323025786   53.0874117      152.314413E-6   1.206632633     1.996386914     3.              2.              2.             
 474.0312863E+3  0.03536435887   65.32786684     157.3819023E-6  1.210971572     1.998177379     3.              2.              2.             
 568.8375435E+3  0.03765393015   80.52181507     162.9647302E-6  1.215632576     2.000097808     3.              2.              2.             
 682.6050523E+3  0.04011281569   99.42364338     169.1321788E-6  1.220645134     2.002159708     3.              2.              2.             
 819.1260627E+3  0.04275644457   122.9941515     175.9655433E-6  1.226042232     2.004375897     3.              2.              2.             
 982.9512753E+3  0.04560206406   152.4617317     183.560707E-6   1.231860873     2.006760691     3.              2.              2.             
 1.17954153E+6   0.04866901524   189.4033735     192.0313771E-6  1.238142719     2.009330132     3.              2.              2.             
 1.415449836E+6  0.0519790603    235.8525594     201.5131801E-6  1.244934836     2.012102254     3.              2.              2.             
 1.698539804E+6  0.05555677344   294.4439024     212.1688819E-6  1.252290608     2.015097404     3.              2.              2.             
 2.038247765E+6  0.05943000982   368.6083654     224.1950976E-6  1.260270826     2.018338622     3.              2.              2.             
 2.445897318E+6  0.06363047154   462.8386866     237.8309861E-6  1.268945018     2.021852104     3.              2.              2.             
 2.935076781E+6  0.06819439468   583.0531013     253.3696209E-6  1.278393074     2.025667759     3.              2.              2.             
 3.522092137E+6  0.07316338831   737.0979684     271.1730006E-6  1.288707249     2.02981989      3.              2.              2.             
 4.226510565E+6  0.07858546598   935.4486575     291.6920686E-6  1.29999464      2.034348027     3.              2.              2.             
 5.071812678E+6  0.08451632263   1.192196442E+3  315.4937047E-6  1.312380285     2.039297964     3.              2.              2.             
 6.086175213E+6  0.09102092695   1.526452732E+3  343.297541E-6   1.326011065     2.044723036     3.              2.              2.             
 7.303410256E+6  0.09817552277   1.96436983E+3   376.026807E-6   1.34106066      2.050685733     3.              2.              2.             
 8.764092307E+6  0.1060701654    2.542084605E+3  414.8794949E-6  1.357735912     2.057259727     3.              2.              2.             
 10.51691077E+6  0.1148119647    3.310063636E+3  461.4294064E-6  1.376285059     2.064532469     3.              2.              2.             
 12.62029292E+6  0.1245292709    4.339609633E+3  517.7718641E-6  1.397008525     2.072608515     3.              2.              2.             
 15.14435151E+6  0.1353771311    5.732757023E+3  586.7373681E-6  1.420273223     2.081613856     3.              2.              2.             
 18.17322181E+6  0.14754448      7.637579336E+3  672.2105778E-6  1.44653175      2.091701579     3.              2.              2.             
 21.80786617E+6  0.1612637212    10.27230968E+3  779.6159225E-6  1.476348523     2.103059388     3.              2.              2.             
 26.1694394E+6   0.1768236494    13.96412342E+3  916.6726497E-6  1.510435894     2.11591966      3.              2.              2.             
 31.40332729E+6  0.1945870992    19.21288839E+3  0.001094595921  1.549704904     2.130573079     3.              2.              2.             
 37.68399274E+6  0.2150153647    26.79852128E+3  0.001330055159  1.595337925     2.147387295     3.              2.              2.             
 45.22079129E+6  0.2387024435    37.96663113E+3  0.001648452788  1.648894703     2.166832778     3.              2.              2.             
 54.26494955E+6  0.2664236922    54.75897658E+3  0.002089570625  1.712470661     2.189518931     3.              2.              2.             
 65.11793946E+6  0.2992057889    80.62056169E+3  0.002717583634  1.788938919     2.216244886     3.              2.              2.             
 78.14152735E+6  0.3384282143    121.553571E+3   0.00363934672   1.882330106     2.248070905     3.              2.              2.             
 93.76983282E+6  0.3859705991    188.3909028E+3  0.005038668439  1.998444769     2.286417228     3.              2.              2.             
 112.5237994E+6  0.4444228477    301.4396938E+3  0.0072414872    2.145866033     2.333193991     3.              2.              2.             
 135.0285593E+6  0.5173641419    500.2651655E+3  0.01083724704   2.337657233     2.390945784     3.              2.              2.             
 162.0342711E+6  0.6096405507    864.5537578E+3  0.01687287792   2.594112307     2.462911434     3.              2.              2.             
 194.4411253E+6  0.7271920234    1.556119227E+6  0.02691279912   2.946089472     2.55258698      3.              2.              2.             
 233.3293504E+6  0.8741553268    2.874139709E+6  0.04105680914   3.429832993     2.661238709     3.              2.              2.             
 250.E+6         0.9359261246    3.608702499E+6  0.04568371091   3.646992413     2.70581089      3.              1.              2.             
>>>>>.status notime 
Gnucap   System status
iterations: op=0, dc=0, tran=0, fourier=0, total=137987
transient timesteps: accepted=36148, rejected=0, total=36146
twotime timesteps: accepted=317, rejected=0, total=2259
nodes: user=4, subckt=0, model=0, total=4
dctran density=62.5%, ac density=62.5%
>>>>>.end 
