<?xml version="1.0" encoding="UTF-8" standalone="no"?>
<!-- Created with Inkscape (http://www.inkscape.org/) -->

<svg
   xmlns:svg="http://www.w3.org/2000/svg"
   xmlns="http://www.w3.org/2000/svg"
   xmlns:xlink="http://www.w3.org/1999/xlink"
   version="1.1"
   width="15.999711"
   height="16"
   id="svg7384">
  <title
     id="title9167">Moblin Icon Theme</title>
  <defs
     id="defs7386" />
  <g
     transform="translate(-67.999995,-216)"
     id="layer3"
     style="display:inline">
    <rect
       width="16"
       height="15.651207"
       x="-232"
       y="68.348495"
       transform="matrix(0,-1,1,0,0,0)"
       id="rect3790"
       style="opacity:0;fill:#ffffff;fill-opacity:1;stroke:none;display:inline" />
    <path
       d="m 73.84375,217 a 1.0001,1.0001 0 0 0 -0.5625,0.28125 L 70.46875,220 69,220 a 1.0001,1.0001 0 0 0 -1,1 l 0,5.96875 a 1.0001,1.0001 0 0 0 1,1 l 1.4375,0 2.84375,2.75 A 1.0001,1.0001 0 0 0 74.96875,230 l 0,-12 a 1.0001,1.0001 0 0 0 -1.125,-1 z m -0.875,3.34375 0,7.28125 -1.40625,-1.375 a 1.0001,1.0001 0 0 0 -0.71875,-0.28125 l -0.84375,0 0,-3.96875 0.875,0 a 1.0001,1.0001 0 0 0 0.6875,-0.28125 l 1.40625,-1.375 z"
       id="path3792"
       style="font-size:medium;font-style:normal;font-variant:normal;font-weight:normal;font-stretch:normal;text-indent:0;text-align:start;text-decoration:none;line-height:normal;letter-spacing:normal;word-spacing:normal;text-transform:none;direction:ltr;block-progression:tb;writing-mode:lr-tb;text-anchor:start;color:#000000;fill:#bebebe;fill-opacity:1;stroke:none;stroke-width:2;marker:none;visibility:visible;display:inline;overflow:visible;enable-background:accumulate;font-family:Bitstream Vera Sans;-inkscape-font-specification:Bitstream Vera Sans" />
    <path
       d="m 76.78125,221.125 a 1.0001,1.0001 0 0 0 -0.78125,1 l 0,3.71875 a 1.0001,1.0001 0 1 0 2,0 l 0,-3.71875 a 1.0001,1.0001 0 0 0 -1.21875,-1 z"
       id="path3796"
       style="font-size:medium;font-style:normal;font-variant:normal;font-weight:normal;font-stretch:normal;text-indent:0;text-align:start;text-decoration:none;line-height:normal;letter-spacing:normal;word-spacing:normal;text-transform:none;direction:ltr;block-progression:tb;writing-mode:lr-tb;text-anchor:start;color:#000000;fill:#bebebe;fill-opacity:1;stroke:none;stroke-width:2;marker:none;visibility:visible;display:inline;overflow:visible;enable-background:accumulate;font-family:Bitstream Vera Sans;-inkscape-font-specification:Bitstream Vera Sans" />
  </g>
  <g
     transform="translate(-67.999995,-216)"
     id="layer2"
     style="display:none">
    <g
       id="g3923"
       style="display:inline">
      <g
         transform="translate(-1375.001,-47.99646)"
         id="g10266">
        <rect
           width="24"
           height="24"
           x="-1579.001"
           y="291.99646"
           transform="scale(-1,1)"
           id="rect7002"
           style="opacity:0;fill:#ffffff;fill-opacity:1;stroke:none;display:inline" />
        <path
           d="m 1559.9823,300.99646 -1.95,0 0,4.03125 -2,0 0,5.9375 1.9688,0 0,4 20.0312,0 0,-13.96875 -2.0762,0"
           id="path9832-1-1"
           style="color:#000000;fill:none;stroke:#bebebe;stroke-width:2;stroke-linecap:round;stroke-linejoin:round;stroke-miterlimit:4;stroke-opacity:1;stroke-dasharray:none;stroke-dashoffset:0;marker:none;visibility:visible;display:inline;overflow:visible;enable-background:accumulate" />
        <path
           d="m 1563.001,302.99646 4,-4.0625 2,2 4.125,-2 -4.125,4 -2.0625,-2.0625 -3.9375,2.125 z"
           id="path3914"
           style="color:#000000;fill:none;stroke:#bebebe;stroke-width:2;stroke-linecap:round;stroke-linejoin:round;stroke-miterlimit:4;stroke-opacity:1;stroke-dasharray:none;stroke-dashoffset:0;marker:none;visibility:visible;display:inline;overflow:visible;enable-background:accumulate" />
      </g>
      <g
         transform="translate(-1411.001,-47.99646)"
         id="g10285">
        <rect
           width="24"
           height="24"
           x="-1551.001"
           y="291.99646"
           transform="scale(-1,1)"
           id="rect6974"
           style="opacity:0;fill:#ffffff;fill-opacity:1;stroke:none;display:inline" />
        <path
           d="m 1550.0323,296.99646 -20,0 0,4.03125 -2,0 0,5.9375 1.9688,0 0,4 20.0312,0 0,-13.96875 z"
           id="path9832-1"
           style="color:#000000;fill:none;stroke:#bebebe;stroke-width:2;stroke-linecap:round;stroke-linejoin:round;stroke-miterlimit:4;stroke-opacity:1;stroke-dasharray:none;stroke-dashoffset:0;marker:none;visibility:visible;display:inline;overflow:visible;enable-background:accumulate" />
        <path
           d="m 1546.0324,300.99646 0,6"
           id="path9840-0"
           style="color:#000000;fill:none;stroke:#bebebe;stroke-width:2;stroke-linecap:round;stroke-linejoin:round;stroke-miterlimit:4;stroke-opacity:1;stroke-dasharray:none;stroke-dashoffset:0;marker:none;visibility:visible;display:inline;overflow:visible;enable-background:accumulate" />
      </g>
      <g
         transform="translate(-1420.001,-47.99646)"
         id="g10311">
        <rect
           width="24"
           height="24"
           x="-1464.001"
           y="291.99646"
           transform="scale(-1,1)"
           id="rect6863"
           style="opacity:0;fill:#ffffff;fill-opacity:1;stroke:none;display:inline" />
        <path
           d="m 43.03125,273 -20,0 0,4.03125 -2,0 0,5.9375 1.96875,0 0,4 20.03125,0 0,-13.96875 z"
           transform="translate(1420.001,23.99646)"
           id="path9832"
           style="color:#000000;fill:none;stroke:#bebebe;stroke-width:2;stroke-linecap:round;stroke-linejoin:round;stroke-miterlimit:4;stroke-opacity:1;stroke-dasharray:none;stroke-dashoffset:0;marker:none;visibility:visible;display:inline;overflow:visible;enable-background:accumulate" />
        <path
           d="m 1447.0323,300.99646 0,6"
           id="path9834"
           style="color:#000000;fill:none;stroke:#bebebe;stroke-width:2;stroke-linecap:round;stroke-linejoin:round;stroke-miterlimit:4;stroke-opacity:1;stroke-dasharray:none;stroke-dashoffset:0;marker:none;visibility:visible;display:inline;overflow:visible;enable-background:accumulate" />
        <path
           d="m 1451.0323,300.99646 0,6"
           id="path9836"
           style="color:#000000;fill:none;stroke:#bebebe;stroke-width:2;stroke-linecap:round;stroke-linejoin:round;stroke-miterlimit:4;stroke-opacity:1;stroke-dasharray:none;stroke-dashoffset:0;marker:none;visibility:visible;display:inline;overflow:visible;enable-background:accumulate" />
        <path
           d="m 1455.0323,300.99646 0,6"
           id="path9838"
           style="color:#000000;fill:none;stroke:#bebebe;stroke-width:2;stroke-linecap:round;stroke-linejoin:round;stroke-miterlimit:4;stroke-opacity:1;stroke-dasharray:none;stroke-dashoffset:0;marker:none;visibility:visible;display:inline;overflow:visible;enable-background:accumulate" />
        <path
           d="m 1459.0323,300.99646 0,6"
           id="path9840"
           style="color:#000000;fill:none;stroke:#bebebe;stroke-width:2;stroke-linecap:round;stroke-linejoin:round;stroke-miterlimit:4;stroke-opacity:1;stroke-dasharray:none;stroke-dashoffset:0;marker:none;visibility:visible;display:inline;overflow:visible;enable-background:accumulate" />
      </g>
      <g
         transform="translate(-1417.001,-47.99646)"
         id="g10326">
        <rect
           width="24"
           height="24"
           x="-1493.001"
           y="291.99646"
           transform="scale(-1,1)"
           id="rect6919"
           style="opacity:0;fill:#ffffff;fill-opacity:1;stroke:none;display:inline" />
        <path
           d="m 1492.0323,296.99646 -20,0 0,4.03125 -2,0 0,5.9375 1.9688,0 0,4 20.0312,0 0,-13.96875 z"
           id="path9832-4"
           style="color:#000000;fill:none;stroke:#bebebe;stroke-width:2;stroke-linecap:round;stroke-linejoin:round;stroke-miterlimit:4;stroke-opacity:1;stroke-dasharray:none;stroke-dashoffset:0;marker:none;visibility:visible;display:inline;overflow:visible;enable-background:accumulate" />
        <path
           d="m 1480.0324,300.99646 0,6"
           id="path9836-4"
           style="color:#000000;fill:none;stroke:#bebebe;stroke-width:2;stroke-linecap:round;stroke-linejoin:round;stroke-miterlimit:4;stroke-opacity:1;stroke-dasharray:none;stroke-dashoffset:0;marker:none;visibility:visible;display:inline;overflow:visible;enable-background:accumulate" />
        <path
           d="m 1484.0324,300.99646 0,6"
           id="path9838-9"
           style="color:#000000;fill:none;stroke:#bebebe;stroke-width:2;stroke-linecap:round;stroke-linejoin:round;stroke-miterlimit:4;stroke-opacity:1;stroke-dasharray:none;stroke-dashoffset:0;marker:none;visibility:visible;display:inline;overflow:visible;enable-background:accumulate" />
        <path
           d="m 1488.0324,300.99646 0,6"
           id="path9840-1"
           style="color:#000000;fill:none;stroke:#bebebe;stroke-width:2;stroke-linecap:round;stroke-linejoin:round;stroke-miterlimit:4;stroke-opacity:1;stroke-dasharray:none;stroke-dashoffset:0;marker:none;visibility:visible;display:inline;overflow:visible;enable-background:accumulate" />
      </g>
      <g
         transform="translate(-1434.001,-47.99646)"
         id="g10298">
        <rect
           width="24"
           height="24"
           x="-1542.001"
           y="291.99646"
           transform="scale(-1,1)"
           id="rect6947"
           style="opacity:0;fill:#ffffff;fill-opacity:1;stroke:none;display:inline" />
        <path
           d="m 1541.0323,296.99646 -20,0 0,4.03125 -2,0 0,5.9375 1.9688,0 0,4 20.0312,0 0,-13.96875 z"
           id="path9832-8"
           style="color:#000000;fill:none;stroke:#bebebe;stroke-width:2;stroke-linecap:round;stroke-linejoin:round;stroke-miterlimit:4;stroke-opacity:1;stroke-dasharray:none;stroke-dashoffset:0;marker:none;visibility:visible;display:inline;overflow:visible;enable-background:accumulate" />
        <path
           d="m 1533.0324,300.99646 0,6"
           id="path9838-3"
           style="color:#000000;fill:none;stroke:#bebebe;stroke-width:2;stroke-linecap:round;stroke-linejoin:round;stroke-miterlimit:4;stroke-opacity:1;stroke-dasharray:none;stroke-dashoffset:0;marker:none;visibility:visible;display:inline;overflow:visible;enable-background:accumulate" />
        <path
           d="m 1537.0324,300.99646 0,6"
           id="path9840-7"
           style="color:#000000;fill:none;stroke:#bebebe;stroke-width:2;stroke-linecap:round;stroke-linejoin:round;stroke-miterlimit:4;stroke-opacity:1;stroke-dasharray:none;stroke-dashoffset:0;marker:none;visibility:visible;display:inline;overflow:visible;enable-background:accumulate" />
      </g>
      <g
         transform="translate(-1379.001,-47.99646)"
         id="g10342">
        <path
           d="m 1550.0323,308.05896 0,-11.0625 -20,0 0,4.03125 -2,0 0,5.9375 1.9688,0 0,4 1.9999,0"
           id="path9832-7"
           style="color:#000000;fill:none;stroke:#bebebe;stroke-width:2;stroke-linecap:round;stroke-linejoin:round;stroke-miterlimit:4;stroke-opacity:1;stroke-dasharray:none;stroke-dashoffset:0;marker:none;visibility:visible;display:inline;overflow:visible;enable-background:accumulate" />
        <rect
           width="24"
           height="24"
           x="-1551.001"
           y="291.99646"
           transform="scale(-1,1)"
           id="rect10344"
           style="opacity:0;fill:#ffffff;fill-opacity:1;stroke:none;display:inline" />
        <path
           d="m 162.84375,276 c -0.2985,0.0465 -0.57125,0.23634 -0.71875,0.5 l -8,14 c -0.3505,0.60722 0.1739,1.50619 0.875,1.5 l 16,-0.0313 c 0.7011,0.006 1.2255,-0.89278 0.875,-1.5 l -8,-13.96875 c -0.1983,-0.35517 -0.62955,-0.56426 -1.03125,-0.5 z m 0.0313,4 a 1.0001,1.0001 0 0 1 0.0313,0 1.0001,1.0001 0 0 1 1.09375,1.03125 l 0,4.9375 a 1.0001,1.0001 0 1 1 -2,0 l 0,-4.9375 a 1.0001,1.0001 0 0 1 0.78125,-1 A 1.0001,1.0001 0 0 1 162.875,280 z m 0.125,8 c 0.55228,0 1,0.44772 1,1 0,0.55228 -0.44772,1 -1,1 -0.55228,0 -1,-0.44772 -1,-1 0,-0.55228 0.44772,-1 1,-1 z"
           transform="translate(1379.001,23.99646)"
           id="rect16671-4"
           style="font-size:medium;font-style:normal;font-variant:normal;font-weight:normal;font-stretch:normal;text-indent:0;text-align:start;text-decoration:none;line-height:normal;letter-spacing:normal;word-spacing:normal;text-transform:none;direction:ltr;block-progression:tb;writing-mode:lr-tb;text-anchor:start;color:#000000;fill:#bebebe;fill-opacity:1;stroke:none;stroke-width:2;marker:none;visibility:visible;display:inline;overflow:visible;enable-background:accumulate;font-family:Bitstream Vera Sans;-inkscape-font-specification:Bitstream Vera Sans" />
      </g>
      <g
         transform="translate(-1343.001,-47.99646)"
         id="g3951">
        <rect
           width="24"
           height="24"
           x="-1579.001"
           y="291.99646"
           transform="scale(-1,1)"
           id="rect3953"
           style="opacity:0;fill:#ffffff;fill-opacity:1;stroke:none;display:inline" />
        <path
           d="m 1559.9823,300.99646 -1.95,0 0,4.03125 -2,0 0,5.9375 1.9688,0 0,4 20.0312,0 0,-13.96875 -2.0762,0"
           id="path3955"
           style="color:#000000;fill:none;stroke:#bebebe;stroke-width:2;stroke-linecap:round;stroke-linejoin:round;stroke-miterlimit:4;stroke-opacity:1;stroke-dasharray:none;stroke-dashoffset:0;marker:none;visibility:visible;display:inline;overflow:visible;enable-background:accumulate" />
        <path
           d="m 1563.001,302.99646 4,-4.0625 2,2 4.125,-2 -4.125,4 -2.0625,-2.0625 -3.9375,2.125 z"
           id="path3957"
           style="color:#000000;fill:none;stroke:#bebebe;stroke-width:2;stroke-linecap:round;stroke-linejoin:round;stroke-miterlimit:4;stroke-opacity:1;stroke-dasharray:none;stroke-dashoffset:0;marker:none;visibility:visible;display:inline;overflow:visible;enable-background:accumulate" />
        <path
           d="m 1574.001,304.99646 0,6"
           id="path9840-0-9"
           style="color:#000000;fill:none;stroke:#bebebe;stroke-width:2;stroke-linecap:round;stroke-linejoin:round;stroke-miterlimit:4;stroke-opacity:1;stroke-dasharray:none;stroke-dashoffset:0;marker:none;visibility:visible;display:inline;overflow:visible;enable-background:accumulate" />
      </g>
      <g
         transform="translate(-1309.001,-47.99646)"
         id="g3968">
        <rect
           width="24"
           height="24"
           x="-1579.001"
           y="291.99646"
           transform="scale(-1,1)"
           id="rect3970"
           style="opacity:0;fill:#ffffff;fill-opacity:1;stroke:none;display:inline" />
        <path
           d="m 1559.9823,300.99646 -1.95,0 0,4.03125 -2,0 0,5.9375 1.9688,0 0,4 20.0312,0 0,-13.96875 -2.0762,0"
           id="path3972"
           style="color:#000000;fill:none;stroke:#bebebe;stroke-width:2;stroke-linecap:round;stroke-linejoin:round;stroke-miterlimit:4;stroke-opacity:1;stroke-dasharray:none;stroke-dashoffset:0;marker:none;visibility:visible;display:inline;overflow:visible;enable-background:accumulate" />
        <path
           d="m 1563.001,302.99646 4,-4.0625 2,2 4.125,-2 -4.125,4 -2.0625,-2.0625 -3.9375,2.125 z"
           id="path3974"
           style="color:#000000;fill:none;stroke:#bebebe;stroke-width:2;stroke-linecap:round;stroke-linejoin:round;stroke-miterlimit:4;stroke-opacity:1;stroke-dasharray:none;stroke-dashoffset:0;marker:none;visibility:visible;display:inline;overflow:visible;enable-background:accumulate" />
        <path
           d="m 1574.001,304.99646 0,6"
           id="path3976"
           style="color:#000000;fill:none;stroke:#bebebe;stroke-width:2;stroke-linecap:round;stroke-linejoin:round;stroke-miterlimit:4;stroke-opacity:1;stroke-dasharray:none;stroke-dashoffset:0;marker:none;visibility:visible;display:inline;overflow:visible;enable-background:accumulate" />
        <path
           d="m 1570.001,306.05896 0,4.9375"
           id="path3978"
           style="color:#000000;fill:none;stroke:#bebebe;stroke-width:2;stroke-linecap:round;stroke-linejoin:round;stroke-miterlimit:4;stroke-opacity:1;stroke-dasharray:none;stroke-dashoffset:0;marker:none;visibility:visible;display:inline;overflow:visible;enable-background:accumulate" />
      </g>
      <g
         transform="translate(-1277.001,-47.99646)"
         id="g3980">
        <rect
           width="24"
           height="24"
           x="-1579.001"
           y="291.99646"
           transform="scale(-1,1)"
           id="rect3982"
           style="opacity:0;fill:#ffffff;fill-opacity:1;stroke:none;display:inline" />
        <path
           d="m 1559.9823,300.99646 -1.95,0 0,4.03125 -2,0 0,5.9375 1.9688,0 0,4 20.0312,0 0,-13.96875 -2.0762,0"
           id="path3984"
           style="color:#000000;fill:none;stroke:#bebebe;stroke-width:2;stroke-linecap:round;stroke-linejoin:round;stroke-miterlimit:4;stroke-opacity:1;stroke-dasharray:none;stroke-dashoffset:0;marker:none;visibility:visible;display:inline;overflow:visible;enable-background:accumulate" />
        <path
           d="m 1563.001,302.99646 4,-4.0625 2,2 4.125,-2 -4.125,4 -2.0625,-2.0625 -3.9375,2.125 z"
           id="path3986"
           style="color:#000000;fill:none;stroke:#bebebe;stroke-width:2;stroke-linecap:round;stroke-linejoin:round;stroke-miterlimit:4;stroke-opacity:1;stroke-dasharray:none;stroke-dashoffset:0;marker:none;visibility:visible;display:inline;overflow:visible;enable-background:accumulate" />
        <path
           d="m 1574.001,304.99646 0,6"
           id="path3988"
           style="color:#000000;fill:none;stroke:#bebebe;stroke-width:2;stroke-linecap:round;stroke-linejoin:round;stroke-miterlimit:4;stroke-opacity:1;stroke-dasharray:none;stroke-dashoffset:0;marker:none;visibility:visible;display:inline;overflow:visible;enable-background:accumulate" />
        <path
           d="m 1570.001,306.05896 0,4.9375"
           id="path3990"
           style="color:#000000;fill:none;stroke:#bebebe;stroke-width:2;stroke-linecap:round;stroke-linejoin:round;stroke-miterlimit:4;stroke-opacity:1;stroke-dasharray:none;stroke-dashoffset:0;marker:none;visibility:visible;display:inline;overflow:visible;enable-background:accumulate" />
        <path
           d="m 1566.001,305.99646 0,5"
           id="path3992"
           style="color:#000000;fill:none;stroke:#bebebe;stroke-width:2;stroke-linecap:round;stroke-linejoin:round;stroke-miterlimit:4;stroke-opacity:1;stroke-dasharray:none;stroke-dashoffset:0;marker:none;visibility:visible;display:inline;overflow:visible;enable-background:accumulate" />
      </g>
    </g>
  </g>
  <g
     transform="translate(-67.999995,-216)"
     id="layer1">
    <image
       xlink:href="data:image/png;base64,iVBORw0KGgoAAAANSUhEUgAAAPoAAAAoCAYAAADXGucZAAAABHNCSVQICAgIfAhkiAAAAAlwSFlz AAAN1wAADdcBQiibeAAAABl0RVh0U29mdHdhcmUAd3d3Lmlua3NjYXBlLm9yZ5vuPBoAAAAXdEVY dFRpdGxlAE1vYmxpbiBJY29uIFRoZW1lcD2TBwAAABx0RVh0U291cmNlAGh0dHA6Ly93d3cubW9i bGluLm9yZwip9fwAAABSdEVYdENvcHlyaWdodABDQyBBdHRyaWJ1dGlvbi1TaGFyZUFsaWtlIGh0 dHA6Ly9jcmVhdGl2ZWNvbW1vbnMub3JnL2xpY2Vuc2VzL2J5LXNhLzMuMC9eg1q8AAAbXUlEQVR4 nO2deZwVxdX3v+fODDsu8KgoCjSCAlEwCSbEBSSLIp3ok6jR1+SJ5pHXLaIYt0ajBH2FRgU0JnHJ o0GNS6ISNTS4475iUBEIojTESBRFTVgUGKbeP05dpm7d7jt3YCJ5dH6fz3zmdm19qqtOLefUOSXG GLIQhPEXgQOAwcC+wG7AG8Bf7N/MNIlezMk7AhjiBf8iTaIPMl+meUYBuzpBf0mT6I689DZPHfBN 4Cv2b19gNfAC8CLwTJpEzzZRxs7ASV7w+2kS/bKJfAJcANR6UQ+nSfRURvqDgIMqlZmDzPKqRRDG uwDfQL/NV4ABwCL0G70APJIm0d+aUV4AHG/LGQD0Bj4C3gZmATekSbTUyzMG2C6nyDXA323+F9Mk Wl0tLTn0dQNO9oKn+TR93uB3UoIw7gxMBU7ISL+P/QP4eRDGDwInp0mUeulGAGd4YV2B0RVoGQV8 1Xm+F8hl9CCMBwC3AF/yonYAAuBom+5OS2PeILM7MC6j/IfSJFpUgd5BwCUZ4V2ALMY8KOs9VeCT nPKaRBDGJ6Bt2dmLGmz/TgXWBGF8VppE1zVRVhvgbOBnQHsvupv9+zJwehDGx6ZJlDjxY4CeVZC8 Lgjjh4Cr0iR6uIr0WehG+Xd+DFi6meV9JlBwH+ysM49sJs/CwcCcIIy/WUXaky1zbhGCMJYgjM8E XqKcybNwFDAvCOODc+I75YSf2ES5h+aE966Cpn8pgjDeKQjjPwH/QzmT++gIXBuE8YwgjHeqkO4G 4FLKmdzHNsB9QRhXGtTz0Bb4NvBQEMa3BmGc1zataCY2MXoQxgcAj1DdyOuiCzAtCON2TaSrBaY0 s+ws/NyW09T7XOwC3G8HMh95nem4IIzbVihzRE74VmV02w6PowzTHITAY1ntGITxscAPm1FWARhm tzebi2OBWa3M3jIoANiPeRPeDA98iDLVUeh+/WfoMmijlyZMk+iTKt53SBDGze2AmxCE8ZeA8zOi /gyMBYYB3wEmAP6+U4D/CcK4gxee15G6Akfk0LEtsF8emc3o4A8Av2/ib0GVZRUxAdjTCzPA72jc Hv0Ybe8GL10/4OKMMk/NCHseONKWdw6wxIn7NfD9NImyBUC6FSnW7wlUrpKFA4A4J64VzUBxjz6Z 8pnoeeDoNImWOWFPA5cGYTwMuBNdxh2aJtErTbzHoIwGMDkI4wfSJNrQHELt7Hoz5XKFq4BzvPJm BGE8Fe3chzjhu6PLzzOdsEpL2xOB2zLCv5lBRxHt0BXE2xXKLSJKk+jlKtJVhSCMD6RcNrIS+GGa RPc7YS+gq7Bb0Prt6MSdFYTx9DSJnrNl1qL7eRcbgSPSJCrW8YUgjG8D5gC/TJNoQhOkTk6T6B6H 7gI6OE1CB2oXJwZhPCVNoiW0YrNRG4TxXpTvR1cAh6RJ9I+sTGkSPR6E8VeAXdMker6K98wA9keX +XugQrnmLuNHAV/wwu5Kk2hMDo3vB2F8GDoj7u5EnR6E8dQ0if5qn/0Z3R2UhgVhvGeGUG5ETvoi elMdo7c0plC+KjvOY/JNSJPoEbssdwVfBeBy4ECbpj4I47Xo/rmIT/Bm4TSJlgdh/OU0if7eXKLT JGoAFgZhfDjK7Oc40XWo0PMHzS23ORg+fHztkvZt9sCYnQuFuvlpcs47zcm/+2GTemzc0LBXobbw ds/Vn8yfPXtcfXNp6Dvy6rb1sqq/iPRoaJC3NtSuW/T2fePWVpPXald6oyvRt4AlaRJ9VIyvBb6W ke+CPCYvwqorllZZhw+Ai4CiyuqiIIxvTpPo/SrzQ/lSeT1wbhM0rg/C+DzgLie4gC438xj9OWAg KqQCHQTP8tIUGd0A91MumOsNPFmJtpZGEMbtgS96wQ970u8yWGafQemefnAQxrVpEhU766votqiI jsAVVlr/T6esZjO5R4sJwngs8J9AXyfq/wRhfHqaRCu3pPws9BoZ/0CEc+nQtn8B6hABNhKE8TvA XAw3LZ0V/cEYyrYhPQ6/bJdCfUMsmBCkixQE02BY2qHtuiCMnwNzXpqMLZsIrfp5VmmouQ7kSCh0 NQZEoK6h7epeIyddW9+uIf7b9LGZdbcD9WjK1dkmCONHgWuAe7OWZVDKGMUCr0ZVV3m4OE2iSvvJ a4FT0Fl5W+D/Ua7vrASfzrkZar0s3AfUU7rUHoxuPaCc0VcAdwM/ss/HBWF8fppE6wCCMN6bRn3/ K6gAM4vRq8HzQRjn7WMBnk+TaFiFeBf7ADVe2N1V5r2bUkZvB/RHNTCg38qnYxRwRBDGNwO3pEn0 UpXvqog0iTYGYTwF7aBFCKqzb7HBs+e3494CN4lwQE6SbsChCIf2GjnxBBm/foQZN26TTCP49sQx BeQSgU7lCzraAsNAng1Gxr/p2Gnd6Nf+MG59ZYrkJL8YMXRCzNl16+SAviOvPmjxzNHr3PggjC9H VZ6ZBdJ4fmKvAuUM9K475Tv4DqqbzvvbMSPPJqRJtJHSvfGoIIwHVspThBV+9fWC/1JNXrt3f9ML duvs79HXAtOcZ18o5y7bH0aZ3cfuGWFZaIN2ikp/1SJrwK7qG+Wkc1WX16CCQx/bozKBOUEYzw/C OGohKXnWoNG/BcoFIBg+vl3BMF1MLpO7WGak5gyXyXuPnPQjjEwVkyvILUIQTly9tu3kLaOYIRsL ay51A4IwHkI+k7v4aZpEbxUoPY0G0JzldLOQJtFDwJ/sYw16mKMa7EL5sPleM17tp3Xr7DfWWlSz 4Aoh3ZNz7uz9MLqs9bE1VGx+O0L13ygr3S7FH3YPHQKXAXlC1AHAROClFjgvkbVt7LKFZW6CdGhz BXrgyYVB5TlPAsWZ85WNtYX9ls44d2ExUc+REwcYMddQnrkeeMJk8I8YTuv17Ynfa4Ksj42RC6Sh YZARMwphvhvZYEqEygAjM8o4HT0sdjhwHXBzmkQ3gO5X53mJ+wRh7C8BWxI/RffXAF8Pwvi7VeRZ DHzshfVpxjv9tO4s7DP6x1YtdLMTNjQI4352tirOAuuAJ9MkWgG865WxNRg9a2VR7TfKSvea+5Am 0cY0ic5Dj0JHaJtkYQ/g7irOVVSCL2sAlehvMeT7d9YY5L+94A0F4eA0ib6QJtFQ1q7bzhi+UWvW Df3rvecuL8lfkFMAX0V7VZ0xu6RJNCxYu25n02BCVGDZmM+Irw3xCJN46czzJiyZdf6rS2eMvUFg fEk09O9+2Hj3vb7Q9WN0y9UNmJUm0clpEh3nJvaXSW0p18MCXIm+fDw6WmwW0iR6A/iFE3R5EwdT sEIhvyPvVc37gjDuilbehVvnrBkdVM/s4kR0z1Nnn59Nk6iY1qdtpyCMO9I0jkE7dd7ff1VRRhFZ y92qvlFOuj9nJUyT6N00iSahfWQ48Eey9fHVnJbMgy9YakBVgluM3muWDMA/3Sc89OaMxiO36exx nyydGT26eOa4f/r5xYi/3F9ba9ZdtHjm2PcAZs8eV7901tiZImXykX2HDx+fp5IFMU+4j/U1hae9 FDVtN7TfzXn2NSnt0RXXs8CHQRj/xmrUABVQZTXoRWgn3IQ0ia4s/g7CeB/KDUGag0tQYdeO6H42 U0XmYQ6lHaBPEMaHp0l0bxP5svYx7uyQyehpEr0ZhPGTWDWTpdddPj7k/H4VPQ7sojflqyUfi1pQ j/468E/0CGoRp1hVYq6Kxg6yp3nBKxwdeSbsqucx9DTdscCtXpJ9UbVqs5DTtxa40v0twUbYu0x0 1iBV0Tl8+PhaOrTduyTQ8HDWgNAg3C2mRCXYPu3Yvi+w0E8LgJgSdV5NvfiDJ6Zu4ybS0yR6ymoo fk65LKcjKiwdFYTxI8AxBWA2an3k4ugtOcHWFGyjXeAEXUBliT407u1dTLJGOJkIwnhPygeRFZTO Dn5+d4swzfndldIZ1tU9Zy2bP9Xlu2U8v8N2R08zVsJ5QC8vrEwlF4TxwCCMZ+d873son9Wbe5S6 qNG4h/Lz9L9ubll5ECPlB2+koRqhHFY3XrplEQ4Mho8v26ZIQ9nAv0HWfFyNlqhqpEkUo1qs36P9 OgvfACbXpkm0wpoRTvMS3BOE8ThgohXGuGjTAnTeiB6t/CLKbBWNL9IkejAI42moiWQRe6LCnyPT JCoRigVh/J9onfxGOC1NolXOc97SHVStdDWNe7LivugjSpfKmyuQa1PNXrbK48Wgg9q3KB00x1rT zZ+kSbRpELMz+VWUz57v4K2CgjAeiVoSdgYeCcL4UE+nfRrle8ZK6rY6W+86dJDpgx6I+R7lQtf7 0iQqE35tLmppP7eeNesp6cNyZM8RkyYsu/+8TQKwfodf1nmV+Xijf2DFiDwpxvRzgranfZvTBw++ fuqcOSduABXYFUSO9V79cjp7XLXt2ByYNImOAQjCeDdU+3IM8H0nzddrAdIkuikI4yMp1aXWoLru nwZh/BIwHx2lB9ICs1WaRA12gHm8GdnGoHs/V8LcF5gbhPECdKbuhNpd98rIPz1Noju9sFxGT5No VRDG0yk36Jht1YVFLESl0XVOWDXfqJpThZChqM1CmkTvBWF8MuX68x8DRwVhPAeVLPdDO8Q2lOMU 16TXWqFNpVFHvy+wOAjjp1Eh5EFkqxMrmdb+oenaALCc6i0pq8LimaPXBWH8AKVHbdsUasycYGQ8 C+Etge4Ghrah7cK9ho8PX5s9zjkFuPF2KJyAO7CJTFq54wfnBmGcAIMKIr5EHzElwt0WgeWfqYGa Yt+B9sN6dCXnos4dhU+k1DChiC7oLDEG+C7aqFtilbQJaRI9QePBlWrS/wM4DnVW4KKACpT+Gx3J emVkX4pnnGGNT3yhmS/dn5ZRVomttNXV+3uvanXpLYo0iaajh5N8dEKZ8lTg62Qz+bXuGXSLvpQf xNkenRROILueN6VJNLcZZGfhFdRYqsXVvTX1taMwLPeC2yF8Fzjd6LmJHYCha9q3fXD3b03atpho 6YzzZ2PM2LJCha6oHKeMyTHct2RmZUcmzUUQxifRqJ4+Ch3cF6AHxPb3kj+6idHt8cWB6DHVSqe1 srAWNZ7YHJyDp4qohDSJHkVPgVX0HOPhJmBQmkS+Gqwj5YOWL7h6lMbjskVkOUXwl+9bzVw1TaJT 0FVI1sGnLPwD+JHN52MM8NtmvP4ZtkxQuxo9cvzlljT4cfHGA2evaMB8n3K1aDmErzW0aSiZjNKZ Yy/DyJWUyyXKYXisvqHtjzeX1groQvmklIWVwOUl+6o0idakSTQaHfFfoXJF6tHzuv8F7JQmUVMS 5kxY67hmnRyyKroDUSFepc68DLWyOj5Hapt1sqnk42Xo1N9Kk+j1jHy+QK6XtcraKkiT6FZgb2Am 2lZZqEdPvA1Mk+iWnHIa0Jn7B5QeIvLxHnpgY3jxuHCVWI8OkreigsEBaRJN8bZGLY5lM8c+3XHt uj5iuJTywV1hWCnC5AaRo/2odOZ5Z5qahn2N5G5RViDm+HRmNPyt+8/MdaG2uUiTaCIqiCse8fbR gKrghqZJNDdTr5cm0WPAPvaAyCD0OGQ/9NTPMnSGe7nCsupiVO9eRFN+wC5GvaG4qGi1YzvChCCM J6LLx8GoK6PVqCBoTppETVkgvYeeJHKRlWcC6mEF8kfRayi3EXBXRleSvQ34lyFVX3ChFXwNQr9P f1QVNwdtwyZnBTvY3QbcFoRxDxpdiv0HKoVehJ4rWJVTxAFkm/U2AH9vrslyE1hAdW2K3Xv/bPDg 68e/3+2jPpiGAQXDzkhhUcPG+teW3n9+RSOdpfed/2fgwL4jJ+6wAdkbkf4UzPKGjTWvvjXrnCVZ hjAA9R3bPl67al0JjV3f7Vqizlzasdd7vVa9WTGNtfU43ApWB6Bt0h6VbcxJHV+AkuccshWtaMVn B1ttadmKVrTi00Mro7eiFZ8DtDJ6K1rxOUAro7eiFZ8DtDJ6K1rxOUAro7eiFZ8DfKYZXUQ6i0iz rahyyvqCiLTI0d8q3rV306kq5u8kIr4u+VPDp/mt/p0hIr7X4q2GgojkXX73vwIism2F6P1R98Et gUdong+3LcGWOkEcTPVuuv4V+DS/1b8zHtnaBBRRAKaLyNCtTcjmQEQOBm53njuJiO/mZ6tARCo6 y/ysQERqRKTr1qajFZVRAA4zptSNzf8WGGMepNTu9myavhzx00LWefjPInbj32jmakU2CoARkRIz RBEpiMiuIlLmYMLGdReRghfeRkTa298d8vaIItJLRHbOI0hE2vnbCRHp6u75bPmdLd1GROpEpB96 9npHEeknItt7ZXQWkSxPqXl01DSxLUBEOorIf3hhO1taCpaOvk5cnYgMEJFq/MkV82wrIrm+xkSk i99+FdJ2FpEuXtg27ipIFF29NNuJSNlSXER6oHYGbW1dAy++RkR659Fv+1KZd1f7XWvs7+4ispMT JyLSR0Tq/Hw57+giIoNEZAcnrFBsNxHZyW0jG9amqbbPeM821azibNll/V9E2hf5TUS2b4JHSvjB i9vd/V4u7gGG2DPvBeBC4A3UddN81MSzBvXIMQG9deUJ1PxtPFBn8x5J453mM9EbT14Cetj47sDL qNub54FbjDH4f6ip7BLnuQNq4PINJ+yXqO3vEEv/Dva9r6E+8O5A3TKPQO10rwVeRP2XvwrskfVu W/Z2ts4foqawr6DGIO8A7Wya3ugs9ldbp9eBg23cKfb96+3/G2z4acV623yHVKDhI9TybI6l4QN0 i7KDk+Z41Ab+D5bG3wAdbNxBwD1O2r1Q89Eltk3nAfvZuNHAjU7ar9nv3dkJmwf0zKDzIttPPrR1 nWzD30FXWgtQv3LvAD9x8nVCjYBetfT/BTjeib8XtWR7xrbfMtQbzvFo35qO+uo/ocI3FNSL0YOo O637gStsXDf7zqPt9xhrw3vY+jyLWoW9AhyQ9w6b5wuWzmdRa87FwLDid3DSdUHvAnzXpv878GMn fhJqxfkw2qdfs3Vt76QZjfa1Yl+fArSxcXsCc20/mQtc7dFZwuhn2Be1t8+1wED7+yqczoY6drwb uNQ+j0AtuwY5hf8auMb+/hXwU7fiFT7e68De9vf30I52nRO/CHV+MITSDv1zYIzzPAJluAOdsGnA 7yq8ezpqSdfFqef1qOPFdmgnfRPtdLU2zb7ofVdfcpnV+d0R9em1vX3eBqipQMMqlHG72edtUeu3 R+zzEajAzmXGy7HMhMPo6CpnOepRpWDDhqEdrg/qv/1dJ+4KdLD8gX3uCcypQGsv4GUv7B3b3gWH ng1Ov7oDZeSiUVU7dNDq7sQ/SWMnrrM0XuO8YyDqx6BNBdraes8z0Imjm22PCU5cG5R5DnXCuqOM Kznlb4MOQqETtgfQ0WV0dNCZjVppdnDSzQWOcvruMkoH82eAk+zvE1DG7+CUeT1wrH2+1Wkzwfa1 PEZfCHwvo0IdUZvXfl74Pqi3lxqUqR7z4vcHnrC/R9mKHYhdBVRooAnAz+zv36FS5BQdePoDD9i4 ahj9Ja/s/cjpuChTbwR29cI70cjox+N1bIdBpmUxun1+1qbpWanuDqN38cK6ooPWHrbTHOzF93S+ 9UE0MvoY4P6Md0wDrrS/n8TOXJbO/YE/2edTsDNeMxl9by/sdXRlsRM6m/lMeCZwusPoo7z4q4HT vLB5wIAmvmVn+94QnZi+hTJ6A7Czk+4Q4NGM/LcB++eUfTSwoMK7i4w+BF31tPPiRwHPOX33Ci/+ J8Av7O9Xga948YOA6fb32aj7riFkTCL+3mlXsh3l9wDeN8b4V/e8gna+4p7At/tdSaMTvhtt/KnA b0Xkt8aYS8nGXcB1InIZEBhj5ojIE6hDjIHorFst3vCel5N/5XFPYLExpuRudWPMahEp2scHZPu5 ewq9nCIP30G3G3fY/dVZxhjfd3cRG40xJc4KjDErRWQ+2ha7AqNFyi4i+FvG3rV3Dr2Po67BQN15 HS4iH6NM+7Td622PMoh/yWQ1yPvuu6J94qaMbabrnde/334l5e3m9q8SWNpvR7dB89DbbWvQWXoe 8KYxxrU33xXoKSJ3ZBTn3wvg5nkuJ85FALxgjPE9KT2FTmpFZNW5WL8AiETEv8Ot2E+uRN2lnQvs JSK/MsZcVUzkf7iFaIf8lRe+GOgkIvsZY55xwocD9caY5SJS8R41Y0wDunSaYYUW80XkLmOMfyUx xpg/WyHNj2j0n34L6t2yF/lX6BrKDwGZSnR5SIE9RKSfO6iJSHcavdS+DEwVkTHGDqUWh1HqZaak Fxtj3kf3VFNE5CS0gYfl0FErIj2NMZs8uojIbuggtwhtp4eMMVdnZfYYaD667JvoJfuuQ+/dqMus ehoH0TuBY4Eds9rIrRrZB6/yvvvr6MroLGPMv/Jq6WOAp40xlxQDRKSXE+97sFmIDgQ/NMZUe+Xx QuBsEakxxlTyiPMyMExEungDuN9nKmEB8EdjTKYnIEvzXcBdoofEXhaRO40xy6G8gS4FzhGRY610 cEcROd4WMg64XESGWcnnQWjnKXeUlwEROUNEhtjZrCe676rkWWQ6evNE0WvLo9grno0xeb6+/gEM tVLLLOeHFWGZ8UaUGQdZuvuj++ViQ96HLj0ni8huorr7/4suCd3DOUZEvioi3axkd7yVoHcEdqZy 3QGuFpG9LA0D0BH7TmPMW+h3P0tEhhalr1bqW5zNV6L7elA3WB1F5EJLx3YicgY6aEy19X4b9bZz FLotAN0yXULZ9b5lWAXsKSI9qpE6G2NWocLUqS7j+ZL+FsC76AxdlN53RuucR9czqOzlEkciXxBP e+PhQXQWvrYouReRI0SkeMXVahFpZ4xZiA6cvxbVutSJyFGob70Lq6zPeOACEdl0iYnt58X2Hysi A0W1Yb3QSXxTH6tFZ4hVtrL3isgnqMPGC9CP9ScREWPMZBFZge4zt7dxsTHmj7asf1J+X/onNOqT 56N3du2Ojk4/NMZkeZ0t4nagjzHmNUtbg4jcSKmj+lWW/iJ+j96t/RTKGPMovyNsHdl+2Is4Fd0v 3SUi6yzdJ6N7xDbGmE9E5BBUsFJcbbyKSlrdpddFKJOtQd1P16Mrmnao1uK4rJfbhnsa7QRX2JVS B3Tgu9B+i2dF/YZfiA6+76IutMYCy4wx80RksYgcYIx5SvRA1ET7XoNqIPbzZpfrgb7F2cwYs1hE ZtGEa2ZjzAciMsV+i8Wod9iXKPc3uIBG770R+p1vF5E1qJR/gQ3HluP7Avwbtp/mlOnjj8BXgcdF ZBE6UC9CB7T16Czr4zB0QnvAftP1qLQ+y6suxph6EfkW2tZ3261PSuO9dVPQ1dSvUA/F56B9tC2q ATnGGPOiTftORv0+RIW8GGNm2v54sR203kMnttNtugXoKrGHrdt3jDGbLs/8/93CI+dtbFf6AAAA AElFTkSuQmCC "
       x="24"
       y="29"
       width="250"
       height="40"
       id="image4200" />
  </g>
</svg>
