#define cursor_zoom_rotate_mask_width 20
#define cursor_zoom_rotate_mask_height 20
static unsigned char cursor_zoom_rotate_mask_bits[] = {
    0x00, 0x00, 0x00, 0x00, 0x00, 0x00, 0x00, 0x70, 0x00, 0xe0, 0xff, 0x01,
    0xe0, 0xff, 0x03, 0xe0, 0xdf, 0x07, 0xf0, 0x3f, 0x0f, 0xf8, 0x77, 0x0e,
    0xf8, 0x7f, 0x04, 0xf8, 0x7f, 0x00, 0xf8, 0x7f, 0x00, 0x70, 0xf8, 0x0f,
    0xe0, 0xff, 0x0f, 0xc0, 0xff, 0x0f, 0xe0, 0xf7, 0x0f, 0xe0, 0xe1, 0x0f,
    0xc0, 0xf7, 0x0f, 0x80, 0xff, 0x0f, 0x00, 0x7f, 0x0f, 0x00, 0x1c, 0x02
};
