/* XPM */
static char * gjt_icon_xpm[] = {
"32 32 187 2",
"  	c None",
". 	c #312E0E",
"+ 	c #5C5512",
"@ 	c #7A6F1A",
"# 	c #766B18",
"$ 	c #7F741C",
"% 	c #736916",
"& 	c #756A17",
"* 	c #675D16",
"= 	c #585321",
"- 	c #68622F",
"; 	c #655F1A",
"> 	c #625710",
", 	c #372C10",
"' 	c #403B37",
") 	c #2C2A23",
"! 	c #817F51",
"~ 	c #C6C269",
"{ 	c #DCD67B",
"] 	c #DDD879",
"^ 	c #DCD775",
"/ 	c #DDD87E",
"( 	c #DAD672",
"_ 	c #C6C26A",
": 	c #ACA862",
"< 	c #A8A66E",
"[ 	c #ADAA73",
"} 	c #BAB654",
"| 	c #887C2A",
"1 	c #4E4531",
"2 	c #52504E",
"3 	c #494949",
"4 	c #4F4F4F",
"5 	c #3C3C3C",
"6 	c #424243",
"7 	c #363636",
"8 	c #434343",
"9 	c #717171",
"0 	c #5F5B57",
"a 	c #918578",
"b 	c #867B70",
"c 	c #302F2C",
"d 	c #A3A29A",
"e 	c #CFCFC1",
"f 	c #E0E0D1",
"g 	c #E0DFD0",
"h 	c #DFDFCF",
"i 	c #E1E0D1",
"j 	c #DADACB",
"k 	c #C5C5B7",
"l 	c #B4B4A9",
"m 	c #AFAFA7",
"n 	c #B5B5AC",
"o 	c #C8C7AF",
"p 	c #929181",
"q 	c #B0AEAA",
"r 	c #B1B1B0",
"s 	c #B3B3B3",
"t 	c #B2B2B2",
"u 	c #838383",
"v 	c #8E8E8E",
"w 	c #858585",
"x 	c #9F9F9F",
"y 	c #656565",
"z 	c #5D5D5D",
"A 	c #6B6B6B",
"B 	c #635F58",
"C 	c #73664F",
"D 	c #605440",
"E 	c #383329",
"F 	c #3C3B38",
"G 	c #383837",
"H 	c #41413F",
"I 	c #3F3F3D",
"J 	c #3D3D3B",
"K 	c #434440",
"L 	c #3C3C3A",
"M 	c #383836",
"N 	c #40403E",
"O 	c #515150",
"P 	c #4C4C4A",
"Q 	c #4B4A42",
"R 	c #555555",
"S 	c #666565",
"T 	c #5F5F5F",
"U 	c #666666",
"V 	c #636363",
"W 	c #626262",
"X 	c #4D4D4D",
"Y 	c #4C4C4C",
"Z 	c #6C6D6D",
"` 	c #797A7A",
" .	c #1E1E1E",
"..	c #262626",
"+.	c #292721",
"@.	c #352E21",
"#.	c #2C271D",
"$.	c #1A170D",
"%.	c #262405",
"&.	c #322E05",
"*.	c #3D3803",
"=.	c #3E3904",
"-.	c #3E3804",
";.	c #3F3B03",
">.	c #3D3704",
",.	c #383304",
"'.	c #3B3811",
").	c #524E30",
"!.	c #4B4821",
"~.	c #564A0C",
"{.	c #5C5133",
"].	c #615A4C",
"^.	c #646464",
"/.	c #565656",
"(.	c #5B5B5B",
"_.	c #424242",
":.	c #444444",
"<.	c #2D2D2D",
"[.	c #454545",
"}.	c #383838",
"|.	c #131105",
"1.	c #574701",
"2.	c #9B7C00",
"3.	c #A88500",
"4.	c #B08B00",
"5.	c #B58E00",
"6.	c #AA8700",
"7.	c #B89000",
"8.	c #A78300",
"9.	c #8D7105",
"0.	c #8A7523",
"a.	c #8F7824",
"b.	c #876609",
"c.	c #6A521D",
"d.	c #40351D",
"e.	c #1B1301",
"f.	c #342400",
"g.	c #4F3500",
"h.	c #503600",
"i.	c #4B3200",
"j.	c #573A00",
"k.	c #473000",
"l.	c #4A3200",
"m.	c #3B2B0A",
"n.	c #4A3A18",
"o.	c #30240D",
"p.	c #464034",
"q.	c #999999",
"r.	c #141414",
"s.	c #111111",
"t.	c #0E0E0E",
"u.	c #0B0B0B",
"v.	c #080808",
"w.	c #040404",
"x.	c #010101",
"y.	c #000000",
"z.	c #181818",
"A.	c #151515",
"B.	c #00A000",
"C.	c #0C0C0C",
"D.	c #050505",
"E.	c #020202",
"F.	c #1C1C1C",
"G.	c #161616",
"H.	c #131313",
"I.	c #090909",
"J.	c #060606",
"K.	c #030303",
"L.	c #202020",
"M.	c #1D1D1D",
"N.	c #1A1A1A",
"O.	c #171717",
"P.	c #101010",
"Q.	c #0A0A0A",
"R.	c #070707",
"S.	c #252525",
"T.	c #212121",
"U.	c #292929",
"V.	c #1F1F1F",
"W.	c #191919",
"X.	c #121212",
"Y.	c #0F0F0F",
"Z.	c #313131",
"`.	c #2A2A2A",
" +	c #272727",
".+	c #242424",
"++	c #0D0D0D",
"                                                                ",
"                                                                ",
"                                                                ",
"                                                                ",
"                                                                ",
"                                                                ",
"              . + @ @ # $ % & * = - ; > ,                       ",
"        '   ) ! ~ { ] ^ / ( _ : < [ } | 1 2 3 4   5   6 7       ",
"  8 9 0 a b c d e f g h i j k l m n o p q r s t t u v w v x y   ",
"  z A B C D E F G H I J K L M N O P Q R S T U V W X Y X R A Z ` ",
"   ...+.@.#.$.%.&.*.=.-.;.>.,.'.).!.~.{.].^./.(.^._.:.:.<.[.}.  ",
"            |.1.2.3.4.5.6.7.8.9.0.a.b.c.d.                      ",
"              e.f.g.h.i.j.k.g.l.m.n.o.p.                        ",
"                                                                ",
"                                                                ",
"                                                                ",
"                                                                ",
"                                                                ",
"                                                                ",
"  q.q.q.q.q.q.q.q.q.q.q.q.q.q.q.q.q.q.q.q.q.q.q.q.q.q.q.q.q.q.  ",
"  q.r.s.t.u.v.w.x.y.y.y.y.y.y.y.y.y.y.y.y.y.y.y.y.y.y.y.y.y.q.  ",
"  q.z.A.B.B.C.v.D.E.y.y.B.y.y.B.B.y.y.y.y.y.y.B.y.B.B.B.B.y.q.  ",
"  q.F.B.G.H.B.C.I.J.K.B.B.y.B.y.y.B.y.y.y.y.B.B.y.y.y.y.B.y.q.  ",
"  q.L.M.N.O.B.P.B.Q.R.w.B.y.B.y.y.B.y.y.B.y.y.B.y.y.y.B.y.y.q.  ",
"  q.S.T. .B.z.A.s.t.u.v.B.x.B.y.y.B.y.y.y.y.y.B.y.y.B.y.y.y.q.  ",
"  q.U.S.B.V.F.W.A.X.Y.C.B.D.B.y.y.B.y.y.y.y.y.B.y.y.B.y.y.y.q.  ",
"  q.<.B.B.B.B.M.B.G.H.P.B.I.J.B.B.y.y.y.B.y.y.B.y.y.B.y.y.y.q.  ",
"  q.Z.<.`. +.+T.M.N.O.r.s.++Q.R.w.x.y.y.y.y.y.y.y.y.y.y.y.y.q.  ",
"  q.q.q.q.q.q.q.q.q.q.q.q.q.q.q.q.q.q.q.q.q.q.q.q.q.q.q.q.q.q.  ",
"                                                                ",
"                                                                ",
"                                                                "};
