EESchema Schematic File Version 4
EELAYER 30 0
EELAYER END
$Descr A4 11693 8268
encoding utf-8
Sheet 5 9
Title "FPC-III"
Date "2020-01-21"
Rev "1.0"
Comp "Gary Wong"
Comment1 "100BASE-TX Ethernet"
Comment2 ""
Comment3 ""
Comment4 ""
$EndDescr
$Comp
L fpc-iii:GND #PWR?
U 1 1 5E156D91
P 10050 5150
AR Path="/5E11FD2E/5E156D91" Ref="#PWR?"  Part="1" 
AR Path="/5E15624E/5E156D91" Ref="#PWR093"  Part="1" 
F 0 "#PWR093" H 10050 4900 50  0001 C CNN
F 1 "GND" H 10045 4977 50  0000 C CNN
F 2 "" H 10050 5150 50  0001 C CNN
F 3 "" H 10050 5150 50  0001 C CNN
	1    10050 5150
	1    0    0    -1  
$EndComp
Wire Wire Line
	10050 5050 10050 5150
$Comp
L fpc-iii:GND #PWR083
U 1 1 5E158B80
P 6750 6050
F 0 "#PWR083" H 6750 5800 50  0001 C CNN
F 1 "GND" H 6745 5877 50  0000 C CNN
F 2 "" H 6750 6050 50  0001 C CNN
F 3 "" H 6750 6050 50  0001 C CNN
	1    6750 6050
	1    0    0    -1  
$EndComp
Wire Wire Line
	6750 6050 6750 5950
$Comp
L power:+3V3 #PWR085
U 1 1 5E49C6FC
P 6950 2750
F 0 "#PWR085" H 6950 2600 50  0001 C CNN
F 1 "+3V3" H 6965 2923 50  0000 C CNN
F 2 "" H 6950 2750 50  0001 C CNN
F 3 "" H 6950 2750 50  0001 C CNN
	1    6950 2750
	1    0    0    -1  
$EndComp
$Comp
L Device:C_Small C48
U 1 1 5E49CB69
P 6350 2850
F 0 "C48" H 6442 2896 50  0000 L CNN
F 1 "100n" H 6442 2805 50  0000 L CNN
F 2 "Capacitor_SMD:C_0402_1005Metric" H 6350 2850 50  0001 C CNN
F 3 "~" H 6350 2850 50  0001 C CNN
F 4 "*" H 6350 2850 50  0001 C CNN "Tolerance"
F 5 "1276-1004-1" H 6350 2850 50  0001 C CNN "Digikey part"
F 6 "CL05F104ZO5NNNC" H 6350 2850 50  0001 C CNN "part#"
	1    6350 2850
	1    0    0    -1  
$EndComp
$Comp
L fpc-iii:GND #PWR081
U 1 1 5E49D001
P 6350 2950
F 0 "#PWR081" H 6350 2700 50  0001 C CNN
F 1 "GND" H 6345 2777 50  0000 C CNN
F 2 "" H 6350 2950 50  0001 C CNN
F 3 "" H 6350 2950 50  0001 C CNN
	1    6350 2950
	1    0    0    -1  
$EndComp
$Comp
L Device:C_Small C47
U 1 1 5E1AD2D8
P 6000 2850
F 0 "C47" H 6092 2896 50  0000 L CNN
F 1 "1u" H 6092 2805 50  0000 L CNN
F 2 "Capacitor_SMD:C_0402_1005Metric" H 6000 2850 50  0001 C CNN
F 3 "~" H 6000 2850 50  0001 C CNN
F 4 "*" H 6000 2850 50  0001 C CNN "Tolerance"
F 5 "1276-1235-1" H 6000 2850 50  0001 C CNN "Digikey part"
F 6 "CL05A105MQ5NNNC" H 6000 2850 50  0001 C CNN "part#"
	1    6000 2850
	1    0    0    -1  
$EndComp
$Comp
L fpc-iii:GND #PWR080
U 1 1 5E1AD2DE
P 6000 2950
F 0 "#PWR080" H 6000 2700 50  0001 C CNN
F 1 "GND" H 5995 2777 50  0000 C CNN
F 2 "" H 6000 2950 50  0001 C CNN
F 3 "" H 6000 2950 50  0001 C CNN
	1    6000 2950
	1    0    0    -1  
$EndComp
Wire Wire Line
	6000 2750 6350 2750
Wire Wire Line
	6650 2750 6650 3250
Connection ~ 6350 2750
Wire Wire Line
	6350 2750 6650 2750
$Comp
L Device:C_Small C50
U 1 1 5E1AD90D
P 6950 2850
F 0 "C50" H 7042 2896 50  0000 L CNN
F 1 "100n" H 7042 2805 50  0000 L CNN
F 2 "Capacitor_SMD:C_0402_1005Metric" H 6950 2850 50  0001 C CNN
F 3 "~" H 6950 2850 50  0001 C CNN
F 4 "*" H 6950 2850 50  0001 C CNN "Tolerance"
F 5 "1276-1004-1" H 6950 2850 50  0001 C CNN "Digikey part"
F 6 "CL05F104ZO5NNNC" H 6950 2850 50  0001 C CNN "part#"
	1    6950 2850
	1    0    0    -1  
$EndComp
$Comp
L Device:C_Small C52
U 1 1 5E1ADEC2
P 7350 2850
F 0 "C52" H 7442 2896 50  0000 L CNN
F 1 "10u" H 7442 2805 50  0000 L CNN
F 2 "Capacitor_SMD:C_0805_2012Metric" H 7350 2850 50  0001 C CNN
F 3 "~" H 7350 2850 50  0001 C CNN
F 4 "1276-6455-1" H 7350 2850 50  0001 C CNN "Digikey part"
F 5 "CL21A106KOQNNNG" H 7350 2850 50  0001 C CNN "part#"
	1    7350 2850
	1    0    0    -1  
$EndComp
$Comp
L fpc-iii:GND #PWR086
U 1 1 5E1AE1DD
P 6950 2950
F 0 "#PWR086" H 6950 2700 50  0001 C CNN
F 1 "GND" H 6945 2777 50  0000 C CNN
F 2 "" H 6950 2950 50  0001 C CNN
F 3 "" H 6950 2950 50  0001 C CNN
	1    6950 2950
	1    0    0    -1  
$EndComp
$Comp
L fpc-iii:GND #PWR088
U 1 1 5E1AE3BD
P 7350 2950
F 0 "#PWR088" H 7350 2700 50  0001 C CNN
F 1 "GND" H 7345 2777 50  0000 C CNN
F 2 "" H 7350 2950 50  0001 C CNN
F 3 "" H 7350 2950 50  0001 C CNN
	1    7350 2950
	1    0    0    -1  
$EndComp
Wire Wire Line
	6850 2750 6950 2750
Connection ~ 6950 2750
Wire Wire Line
	6950 2750 7350 2750
$Comp
L Oscillator:ECS-2520MV-xxx-xx X?
U 1 1 5E1BD678
P 4850 6350
AR Path="/5E2D6BE4/5E1BD678" Ref="X?"  Part="1" 
AR Path="/5E15624E/5E1BD678" Ref="X1"  Part="1" 
F 0 "X1" H 4550 6600 50  0000 L CNN
F 1 "25M" H 5000 6600 50  0000 L CNN
F 2 "Oscillator:Oscillator_SMD_ECS_2520MV-xxx-xx-4Pin_2.5x2.0mm" H 5300 6000 50  0001 C CNN
F 3 "https://www.ecsxtal.com/store/pdf/ECS-2520MV.pdf" H 4675 6475 50  0001 C CNN
F 4 "DSC6013JE2A-025.0000TCT" H 4850 6350 50  0001 C CNN "Digikey part"
F 5 "DSC6013JE2A-025.0000T" H 4850 6350 50  0001 C CNN "part#"
	1    4850 6350
	1    0    0    -1  
$EndComp
$Comp
L power:+3V3 #PWR?
U 1 1 5E1BD67E
P 4850 6050
AR Path="/5E2D6BE4/5E1BD67E" Ref="#PWR?"  Part="1" 
AR Path="/5E15624E/5E1BD67E" Ref="#PWR074"  Part="1" 
F 0 "#PWR074" H 4850 5900 50  0001 C CNN
F 1 "+3V3" H 4865 6223 50  0000 C CNN
F 2 "" H 4850 6050 50  0001 C CNN
F 3 "" H 4850 6050 50  0001 C CNN
	1    4850 6050
	1    0    0    -1  
$EndComp
$Comp
L fpc-iii:GND #PWR?
U 1 1 5E1BD684
P 4850 6650
AR Path="/5E2D6BE4/5E1BD684" Ref="#PWR?"  Part="1" 
AR Path="/5E15624E/5E1BD684" Ref="#PWR075"  Part="1" 
F 0 "#PWR075" H 4850 6400 50  0001 C CNN
F 1 "GND" H 4845 6477 50  0000 C CNN
F 2 "" H 4850 6650 50  0001 C CNN
F 3 "" H 4850 6650 50  0001 C CNN
	1    4850 6650
	1    0    0    -1  
$EndComp
$Comp
L Device:C_Small C?
U 1 1 5E1BD68B
P 4050 6150
AR Path="/5E2D6BE4/5E1BD68B" Ref="C?"  Part="1" 
AR Path="/5E15624E/5E1BD68B" Ref="C45"  Part="1" 
F 0 "C45" H 4142 6196 50  0000 L CNN
F 1 "100n" H 4142 6105 50  0000 L CNN
F 2 "Capacitor_SMD:C_0402_1005Metric" H 4050 6150 50  0001 C CNN
F 3 "~" H 4050 6150 50  0001 C CNN
F 4 "1276-1004-1" H 4050 6150 50  0001 C CNN "Digikey part"
F 5 "*" H 4050 6150 50  0001 C CNN "Tolerance"
F 6 "CL05F104ZO5NNNC" H 4050 6150 50  0001 C CNN "part#"
	1    4050 6150
	1    0    0    -1  
$EndComp
Connection ~ 4850 6050
$Comp
L fpc-iii:GND #PWR?
U 1 1 5E1BD692
P 4050 6250
AR Path="/5E2D6BE4/5E1BD692" Ref="#PWR?"  Part="1" 
AR Path="/5E15624E/5E1BD692" Ref="#PWR073"  Part="1" 
F 0 "#PWR073" H 4050 6000 50  0001 C CNN
F 1 "GND" H 4045 6077 50  0000 C CNN
F 2 "" H 4050 6250 50  0001 C CNN
F 3 "" H 4050 6250 50  0001 C CNN
	1    4050 6250
	1    0    0    -1  
$EndComp
NoConn ~ 5950 5650
Wire Wire Line
	4050 6050 4850 6050
Text Label 7550 3650 0    50   ~ 0
RX-
Text Label 7550 3750 0    50   ~ 0
RX+
Text Label 7550 3950 0    50   ~ 0
TX-
Text Label 7550 4050 0    50   ~ 0
TX+
$Comp
L Device:R_Small_US R23
U 1 1 5E1BF933
P 8350 5000
F 0 "R23" H 8418 5046 50  0000 L CNN
F 1 "6K49" H 8418 4955 50  0000 L CNN
F 2 "Resistor_SMD:R_0402_1005Metric" H 8350 5000 50  0001 C CNN
F 3 "~" H 8350 5000 50  0001 C CNN
F 4 "RMCF0402FT6K49CT" H 8350 5000 50  0001 C CNN "Digikey part"
F 5 "RMCF0402FT6K49" H 8350 5000 50  0001 C CNN "part#"
	1    8350 5000
	1    0    0    -1  
$EndComp
$Comp
L fpc-iii:GND #PWR091
U 1 1 5E1BFFC5
P 8350 5100
F 0 "#PWR091" H 8350 4850 50  0001 C CNN
F 1 "GND" H 8345 4927 50  0000 C CNN
F 2 "" H 8350 5100 50  0001 C CNN
F 3 "" H 8350 5100 50  0001 C CNN
	1    8350 5100
	1    0    0    -1  
$EndComp
$Comp
L Device:Ferrite_Bead_Small FB1
U 1 1 5E1BFEBD
P 6750 1800
F 0 "FB1" H 6850 1846 50  0000 L CNN
F 1 "1K" H 6850 1755 50  0000 L CNN
F 2 "Inductor_SMD:L_0402_1005Metric" V 6680 1800 50  0001 C CNN
F 3 "~" H 6750 1800 50  0001 C CNN
F 4 "587-1841-1" H 6750 1800 50  0001 C CNN "Digikey part"
F 5 "BK1005HS102-T" H 6750 1800 50  0001 C CNN "part#"
	1    6750 1800
	1    0    0    -1  
$EndComp
$Comp
L fpc-iii:KSZ8081MNX U7
U 1 1 5E1C7599
P 6750 4650
F 0 "U7" H 6100 6000 50  0000 C CNN
F 1 "KSZ8081MNX" H 7200 6000 50  0000 C CNN
F 2 "Package_DFN_QFN:QFN-32-1EP_5x5mm_P0.5mm_EP3.1x3.1mm" H 6750 3400 50  0001 C CNN
F 3 "http://ww1.microchip.com/downloads/en/DeviceDoc/00002202C.pdf" H 4500 4850 50  0001 C CNN
F 4 "576-4171-1" H 6750 4650 50  0001 C CNN "Digikey part"
F 5 "KSZ8081MNXCA" H 6750 4650 50  0001 C CNN "part#"
	1    6750 4650
	1    0    0    -1  
$EndComp
Wire Wire Line
	7550 4900 8350 4900
Wire Wire Line
	6850 2750 6850 3250
$Comp
L power:+3V3 #PWR082
U 1 1 5E1CB7B7
P 6750 1700
F 0 "#PWR082" H 6750 1550 50  0001 C CNN
F 1 "+3V3" H 6765 1873 50  0000 C CNN
F 2 "" H 6750 1700 50  0001 C CNN
F 3 "" H 6750 1700 50  0001 C CNN
	1    6750 1700
	1    0    0    -1  
$EndComp
$Comp
L Device:C_Small C49
U 1 1 5E1CC27A
P 6950 2100
F 0 "C49" H 7042 2146 50  0000 L CNN
F 1 "100n" H 7042 2055 50  0000 L CNN
F 2 "Capacitor_SMD:C_0402_1005Metric" H 6950 2100 50  0001 C CNN
F 3 "~" H 6950 2100 50  0001 C CNN
F 4 "*" H 6950 2100 50  0001 C CNN "Tolerance"
F 5 "1276-1004-1" H 6950 2100 50  0001 C CNN "Digikey part"
F 6 "CL05F104ZO5NNNC" H 6950 2100 50  0001 C CNN "part#"
	1    6950 2100
	1    0    0    -1  
$EndComp
$Comp
L Device:C_Small C51
U 1 1 5E1CC280
P 7350 2100
F 0 "C51" H 7442 2146 50  0000 L CNN
F 1 "10u" H 7442 2055 50  0000 L CNN
F 2 "Capacitor_SMD:C_0805_2012Metric" H 7350 2100 50  0001 C CNN
F 3 "~" H 7350 2100 50  0001 C CNN
F 4 "1276-6455-1" H 7350 2100 50  0001 C CNN "Digikey part"
F 5 "CL21A106KOQNNNG" H 7350 2100 50  0001 C CNN "part#"
	1    7350 2100
	1    0    0    -1  
$EndComp
$Comp
L fpc-iii:GND #PWR084
U 1 1 5E1CC286
P 6950 2200
F 0 "#PWR084" H 6950 1950 50  0001 C CNN
F 1 "GND" H 6945 2027 50  0000 C CNN
F 2 "" H 6950 2200 50  0001 C CNN
F 3 "" H 6950 2200 50  0001 C CNN
	1    6950 2200
	1    0    0    -1  
$EndComp
$Comp
L fpc-iii:GND #PWR087
U 1 1 5E1CC28C
P 7350 2200
F 0 "#PWR087" H 7350 1950 50  0001 C CNN
F 1 "GND" H 7345 2027 50  0000 C CNN
F 2 "" H 7350 2200 50  0001 C CNN
F 3 "" H 7350 2200 50  0001 C CNN
	1    7350 2200
	1    0    0    -1  
$EndComp
Wire Wire Line
	6950 2000 7200 2000
Wire Wire Line
	6750 2000 6950 2000
Wire Wire Line
	6750 2000 6750 3250
Connection ~ 6950 2000
Wire Wire Line
	6750 1900 6750 2000
Connection ~ 6750 2000
Wire Wire Line
	5950 5750 5350 5750
$Comp
L Device:C_Small C46
U 1 1 5E1D4EDB
P 5550 6450
F 0 "C46" H 5642 6496 50  0000 L CNN
F 1 "10u" H 5642 6405 50  0000 L CNN
F 2 "Capacitor_SMD:C_0805_2012Metric" H 5550 6450 50  0001 C CNN
F 3 "~" H 5550 6450 50  0001 C CNN
F 4 "1276-6455-1" H 5550 6450 50  0001 C CNN "Digikey part"
F 5 "CL21A106KOQNNNG" H 5550 6450 50  0001 C CNN "part#"
	1    5550 6450
	1    0    0    -1  
$EndComp
$Comp
L fpc-iii:GND #PWR079
U 1 1 5E1D562D
P 5550 6550
F 0 "#PWR079" H 5550 6300 50  0001 C CNN
F 1 "GND" H 5545 6377 50  0000 C CNN
F 2 "" H 5550 6550 50  0001 C CNN
F 3 "" H 5550 6550 50  0001 C CNN
	1    5550 6550
	1    0    0    -1  
$EndComp
$Comp
L Device:R_Small_US R20
U 1 1 5E1D5F3B
P 5550 6150
F 0 "R20" H 5618 6196 50  0000 L CNN
F 1 "10K" H 5618 6105 50  0000 L CNN
F 2 "Resistor_SMD:R_0402_1005Metric" H 5550 6150 50  0001 C CNN
F 3 "~" H 5550 6150 50  0001 C CNN
F 4 "RMCF0402JT10K0CT" H 5550 6150 50  0001 C CNN "Digikey part"
F 5 "RMCF0402JT10K0" H 5550 6150 50  0001 C CNN "part#"
	1    5550 6150
	1    0    0    -1  
$EndComp
$Comp
L power:+3V3 #PWR078
U 1 1 5E1D72BB
P 5550 6050
F 0 "#PWR078" H 5550 5900 50  0001 C CNN
F 1 "+3V3" H 5565 6223 50  0000 C CNN
F 2 "" H 5550 6050 50  0001 C CNN
F 3 "" H 5550 6050 50  0001 C CNN
	1    5550 6050
	1    0    0    -1  
$EndComp
Wire Wire Line
	7700 4850 9150 4850
$Comp
L Device:R_Small_US R21
U 1 1 5E1D9C69
P 7850 4450
F 0 "R21" H 7918 4496 50  0000 L CNN
F 1 "220" H 7918 4405 50  0000 L CNN
F 2 "Resistor_SMD:R_0402_1005Metric" H 7850 4450 50  0001 C CNN
F 3 "~" H 7850 4450 50  0001 C CNN
F 4 "RMCF0402JT220RCT" H 7850 4450 50  0001 C CNN "Digikey part"
F 5 "RMCF0402JT220R" H 7850 4450 50  0001 C CNN "part#"
	1    7850 4450
	1    0    0    -1  
$EndComp
$Comp
L power:+3V3 #PWR089
U 1 1 5E1DA577
P 7850 4350
F 0 "#PWR089" H 7850 4200 50  0001 C CNN
F 1 "+3V3" H 7865 4523 50  0000 C CNN
F 2 "" H 7850 4350 50  0001 C CNN
F 3 "" H 7850 4350 50  0001 C CNN
	1    7850 4350
	1    0    0    -1  
$EndComp
$Comp
L Device:R_Small_US R22
U 1 1 5E1DC9EA
P 8200 4450
F 0 "R22" H 8268 4496 50  0000 L CNN
F 1 "220" H 8268 4405 50  0000 L CNN
F 2 "Resistor_SMD:R_0402_1005Metric" H 8200 4450 50  0001 C CNN
F 3 "~" H 8200 4450 50  0001 C CNN
F 4 "RMCF0402JT220RCT" H 8200 4450 50  0001 C CNN "Digikey part"
F 5 "RMCF0402JT220R" H 8200 4450 50  0001 C CNN "part#"
	1    8200 4450
	1    0    0    -1  
$EndComp
$Comp
L power:+3V3 #PWR090
U 1 1 5E1DC9F0
P 8200 4350
F 0 "#PWR090" H 8200 4200 50  0001 C CNN
F 1 "+3V3" H 8215 4523 50  0000 C CNN
F 2 "" H 8200 4350 50  0001 C CNN
F 3 "" H 8200 4350 50  0001 C CNN
	1    8200 4350
	1    0    0    -1  
$EndComp
$Comp
L Connector:RJ45_Amphenol_RJMG1BD3B8K1ANR J7
U 1 1 5E1DE2F5
P 10050 4350
F 0 "J7" H 10050 5075 50  0000 C CNN
F 1 "RJ45_Amphenol_RJMG1BD3B8K1ANR" H 10050 4984 50  0000 C CNN
F 2 "Connector_RJ:RJ45_Amphenol_RJMG1BD3B8K1ANR" H 10050 5050 50  0001 C CNN
F 3 "https://www.amphenolcanada.com/ProductSearch/Drawings/AC/RJMG1BD3B8K1ANR.PDF" H 10050 5150 50  0001 C CNN
F 4 "RJMG1BD3B8K1ANR" H 10050 4350 50  0001 C CNN "Digikey part"
F 5 "RJMG1BD3B8K1ANR" H 10050 4350 50  0001 C CNN "part#"
	1    10050 4350
	1    0    0    -1  
$EndComp
Wire Wire Line
	7550 4750 7700 4750
Wire Wire Line
	7700 4750 7700 4850
Wire Wire Line
	7550 4650 9150 4650
Wire Wire Line
	8200 4550 9150 4550
Wire Wire Line
	9150 4750 7850 4750
Wire Wire Line
	7850 4750 7850 4550
Wire Wire Line
	7550 3950 8000 3950
Wire Wire Line
	8000 3950 8000 4050
Wire Wire Line
	8000 4050 9150 4050
Wire Wire Line
	7550 4050 7900 4050
Wire Wire Line
	7900 4050 7900 3850
Wire Wire Line
	7900 3850 9150 3850
Wire Wire Line
	9150 3950 9050 3950
Wire Wire Line
	9050 3950 9050 5250
Wire Wire Line
	9150 4250 8850 4250
Wire Wire Line
	8850 4250 8850 5250
$Comp
L fpc-iii:GND #PWR094
U 1 1 5E1F337C
P 10950 4750
F 0 "#PWR094" H 10950 4500 50  0001 C CNN
F 1 "GND" H 10945 4577 50  0000 C CNN
F 2 "" H 10950 4750 50  0001 C CNN
F 3 "" H 10950 4750 50  0001 C CNN
	1    10950 4750
	1    0    0    -1  
$EndComp
Wire Wire Line
	7550 3650 8450 3650
Wire Wire Line
	8450 3650 8450 4350
Wire Wire Line
	8450 4350 9150 4350
Wire Wire Line
	7550 3750 8550 3750
Wire Wire Line
	8550 3750 8550 4150
Wire Wire Line
	8550 4150 9150 4150
$Comp
L Device:C_Small C53
U 1 1 5E1F70FD
P 8850 5350
F 0 "C53" H 8650 5400 50  0000 L CNN
F 1 "100n" H 8600 5300 50  0000 L CNN
F 2 "Capacitor_SMD:C_0402_1005Metric" H 8850 5350 50  0001 C CNN
F 3 "~" H 8850 5350 50  0001 C CNN
F 4 "*" H 8850 5350 50  0001 C CNN "Tolerance"
F 5 "1276-1004-1" H 8850 5350 50  0001 C CNN "Digikey part"
F 6 "CL05F104ZO5NNNC" H 8850 5350 50  0001 C CNN "part#"
	1    8850 5350
	1    0    0    -1  
$EndComp
$Comp
L Device:C_Small C54
U 1 1 5E1FB26C
P 9050 5350
F 0 "C54" H 9150 5400 50  0000 L CNN
F 1 "100n" H 9150 5300 50  0000 L CNN
F 2 "Capacitor_SMD:C_0402_1005Metric" H 9050 5350 50  0001 C CNN
F 3 "~" H 9050 5350 50  0001 C CNN
F 4 "*" H 9050 5350 50  0001 C CNN "Tolerance"
F 5 "1276-1004-1" H 9050 5350 50  0001 C CNN "Digikey part"
F 6 "CL05F104ZO5NNNC" H 9050 5350 50  0001 C CNN "part#"
	1    9050 5350
	1    0    0    -1  
$EndComp
Wire Wire Line
	8850 5450 8950 5450
Wire Wire Line
	8950 5450 8950 5550
Connection ~ 8950 5450
Wire Wire Line
	8950 5450 9050 5450
$Comp
L fpc-iii:GND #PWR092
U 1 1 5E1FD510
P 8950 5550
F 0 "#PWR092" H 8950 5300 50  0001 C CNN
F 1 "GND" H 8945 5377 50  0000 C CNN
F 2 "" H 8950 5550 50  0001 C CNN
F 3 "" H 8950 5550 50  0001 C CNN
	1    8950 5550
	1    0    0    -1  
$EndComp
$Comp
L Device:R_Small_US R19
U 1 1 5E391B0E
P 5350 3000
F 0 "R19" H 5418 3046 50  0000 L CNN
F 1 "1K" H 5418 2955 50  0000 L CNN
F 2 "Resistor_SMD:R_0402_1005Metric" H 5350 3000 50  0001 C CNN
F 3 "~" H 5350 3000 50  0001 C CNN
F 4 "RMCF0402JT1K00CT" H 5350 3000 50  0001 C CNN "Digikey part"
F 5 "RMCF0402JT1K00" H 5350 3000 50  0001 C CNN "part#"
	1    5350 3000
	1    0    0    -1  
$EndComp
$Comp
L power:+3V3 #PWR077
U 1 1 5E391EF9
P 5350 2900
F 0 "#PWR077" H 5350 2750 50  0001 C CNN
F 1 "+3V3" H 5365 3073 50  0000 C CNN
F 2 "" H 5350 2900 50  0001 C CNN
F 3 "" H 5350 2900 50  0001 C CNN
	1    5350 2900
	1    0    0    -1  
$EndComp
Wire Wire Line
	5350 5050 5950 5050
NoConn ~ 7550 5100
NoConn ~ 4450 6350
Text GLabel 3350 3600 2    50   Output ~ 0
DEV0.SIWU
Text GLabel 1850 3600 0    50   Output ~ 0
DEV0.WR
Text GLabel 3350 3500 2    50   Output ~ 0
DEV0.RD
Text GLabel 1850 3500 0    50   Input ~ 0
DEV0.TXE
Text GLabel 1850 3900 0    50   Input ~ 0
DEV0.RXF
Text GLabel 3350 4000 2    50   BiDi ~ 0
DEV0.D7
Text GLabel 1850 4000 0    50   BiDi ~ 0
DEV0.D6
Text GLabel 3350 3900 2    50   BiDi ~ 0
DEV0.D5
Text GLabel 3350 4500 2    50   BiDi ~ 0
DEV0.D4
Text GLabel 1850 4700 0    50   BiDi ~ 0
DEV0.D3
Text GLabel 3350 4600 2    50   BiDi ~ 0
DEV0.D2
Text GLabel 3350 4800 2    50   BiDi ~ 0
DEV0.D1
Text GLabel 1850 4800 0    50   BiDi ~ 0
DEV0.D0
$Comp
L lfe5u-85:LFE5U-85F-6BG381C U?
U 5 1 5E33EF19
P 2600 4200
AR Path="/5E33EF19" Ref="U?"  Part="5" 
AR Path="/5E15624E/5E33EF19" Ref="U1"  Part="5" 
F 0 "U1" H 2600 5187 60  0000 C CNN
F 1 "LFE5U-85F-6BG381C" H 2600 5081 60  0000 C CNN
F 2 "Package_BGA:Lattice_caBGA-381_17.0x17.0mm_Layout20x20_P0.8mm_Ball0.4mm_Pad0.4mm_NSMD" H 1550 5150 60  0001 C CNN
F 3 "" H 1550 5150 60  0001 C CNN
F 4 "220-2177" H 2600 4200 50  0001 C CNN "Digikey part"
F 5 "LFE5U-85F-8BG381I" H 2600 4200 50  0001 C CNN "part#"
	5    2600 4200
	1    0    0    -1  
$EndComp
$Comp
L Device:R_Small_US R18
U 1 1 5E519276
P 5100 3000
F 0 "R18" H 5168 3046 50  0000 L CNN
F 1 "1K" H 5168 2955 50  0000 L CNN
F 2 "Resistor_SMD:R_0402_1005Metric" H 5100 3000 50  0001 C CNN
F 3 "~" H 5100 3000 50  0001 C CNN
F 4 "RMCF0402JT1K00CT" H 5100 3000 50  0001 C CNN "Digikey part"
F 5 "RMCF0402JT1K00" H 5100 3000 50  0001 C CNN "part#"
	1    5100 3000
	1    0    0    -1  
$EndComp
$Comp
L power:+3V3 #PWR076
U 1 1 5E519CA9
P 5100 2900
F 0 "#PWR076" H 5100 2750 50  0001 C CNN
F 1 "+3V3" H 5115 3073 50  0000 C CNN
F 2 "" H 5100 2900 50  0001 C CNN
F 3 "" H 5100 2900 50  0001 C CNN
	1    5100 2900
	1    0    0    -1  
$EndComp
Wire Wire Line
	5100 5350 5950 5350
Text Label 5950 3450 2    50   ~ 0
TXEN
Text Label 5950 3550 2    50   ~ 0
TXD0
Text Label 5950 3650 2    50   ~ 0
TXD1
Text Label 5950 3750 2    50   ~ 0
TXD2
Text Label 5950 3850 2    50   ~ 0
TXD3
Text Label 5950 3950 2    50   ~ 0
TXC
Text Label 5950 4150 2    50   ~ 0
RXDV
Text Label 5950 4250 2    50   ~ 0
RXD0
Text Label 5950 4350 2    50   ~ 0
RXD1
Text Label 5950 4450 2    50   ~ 0
RXD2
Text Label 5950 4550 2    50   ~ 0
RXD3
Text Label 5950 4650 2    50   ~ 0
RXC
Text Label 5950 4850 2    50   ~ 0
RXER
Text Label 5950 5050 2    50   ~ 0
MDIO
Text Label 5950 5150 2    50   ~ 0
MDC
Text Label 5950 5350 2    50   ~ 0
INTRP
Text Label 5950 5450 2    50   ~ 0
~RST
Text Label 7750 5200 0    50   ~ 0
CRS
Wire Wire Line
	7550 5200 7750 5200
Wire Bus Line
	1050 5350 4000 5350
Entry Wire Line
	3900 3700 4000 3800
Entry Wire Line
	3900 3800 4000 3900
Entry Wire Line
	3900 4100 4000 4200
Entry Wire Line
	3900 4200 4000 4300
Entry Wire Line
	3900 4300 4000 4400
Entry Wire Line
	3900 4400 4000 4500
Entry Wire Line
	3900 4700 4000 4800
Entry Wire Line
	3900 4900 4000 5000
Entry Wire Line
	3900 5000 4000 5100
Entry Wire Line
	4000 3450 4100 3550
Entry Wire Line
	4000 3550 4100 3650
Entry Wire Line
	4000 3650 4100 3750
Entry Wire Line
	4000 3750 4100 3850
Entry Wire Line
	4000 3850 4100 3950
Entry Wire Line
	4000 4050 4100 4150
Entry Wire Line
	4000 4150 4100 4250
Entry Wire Line
	4000 4250 4100 4350
Entry Wire Line
	4000 4350 4100 4450
Entry Wire Line
	4000 4450 4100 4550
Entry Wire Line
	4000 4550 4100 4650
Entry Wire Line
	4000 4750 4100 4850
Entry Wire Line
	4000 4950 4100 5050
Entry Wire Line
	4000 5050 4100 5150
Entry Wire Line
	4000 5250 4100 5350
Entry Wire Line
	1050 4200 1150 4100
Entry Wire Line
	1050 4300 1150 4200
Entry Wire Line
	1050 4400 1150 4300
Entry Wire Line
	1050 4500 1150 4400
Entry Wire Line
	1050 4600 1150 4500
Entry Wire Line
	1050 4700 1150 4600
Entry Wire Line
	1050 5100 1150 5000
Entry Wire Line
	1050 5200 1150 5100
Wire Wire Line
	4100 3450 5950 3450
Wire Wire Line
	5950 3550 4100 3550
Wire Wire Line
	4100 3650 5950 3650
Wire Wire Line
	5950 3750 4100 3750
Wire Wire Line
	4100 3850 5950 3850
Wire Wire Line
	5950 3950 4100 3950
Wire Wire Line
	5950 4150 4100 4150
Wire Wire Line
	4100 4250 5950 4250
Wire Wire Line
	5950 4350 4100 4350
Wire Wire Line
	4100 4450 5950 4450
Wire Wire Line
	4100 4550 5950 4550
Wire Wire Line
	5350 3100 5350 5050
Wire Wire Line
	5100 3100 5100 5350
Wire Wire Line
	4100 4650 5950 4650
Wire Wire Line
	5950 4850 4100 4850
Wire Wire Line
	5100 5350 4100 5350
Connection ~ 5100 5350
Wire Wire Line
	4100 5150 5950 5150
Wire Wire Line
	5350 5050 4100 5050
Connection ~ 5350 5050
Entry Wire Line
	4000 3350 4100 3450
Text Label 3350 3800 0    50   ~ 0
MDIO
Text Label 3350 4300 0    50   ~ 0
MDC
Text Label 3350 4900 0    50   ~ 0
RXD3
Text Label 3350 4400 0    50   ~ 0
RXD2
Wire Wire Line
	1850 4900 1650 4900
Wire Wire Line
	1650 4900 1650 5750
Wire Wire Line
	1650 5750 5350 5750
Connection ~ 5350 5750
Wire Wire Line
	5350 5750 5350 6350
Wire Wire Line
	5250 6350 5350 6350
Text Label 1850 4300 2    50   ~ 0
RXD1
Text Label 1850 4600 2    50   ~ 0
RXD0
Text Label 1850 5100 2    50   ~ 0
RXDV
Text Label 3350 4100 0    50   ~ 0
RXC
Text Label 3350 4200 0    50   ~ 0
RXER
Text Label 1850 4400 2    50   ~ 0
INTRP
Text Label 1850 5000 2    50   ~ 0
TXC
Text Label 3350 5000 0    50   ~ 0
TXEN
Text Label 3350 4700 0    50   ~ 0
TXD0
Text Label 1850 4100 2    50   ~ 0
TXD1
Text Label 1850 4500 2    50   ~ 0
TXD2
Text Label 1850 4200 2    50   ~ 0
TXD3
Text Label 3350 3700 0    50   ~ 0
CRS
Wire Wire Line
	5550 6250 5550 6300
Wire Wire Line
	5950 5450 5850 5450
Wire Wire Line
	5850 5450 5850 6300
Wire Wire Line
	5850 6300 5550 6300
Connection ~ 5550 6300
Wire Wire Line
	5550 6300 5550 6350
Text GLabel 6000 6300 2    50   Input ~ 0
ETH.~RST
Wire Wire Line
	6000 6300 5850 6300
Connection ~ 5850 6300
Wire Wire Line
	1150 4100 1850 4100
Wire Wire Line
	1850 4200 1150 4200
Wire Wire Line
	1150 4300 1850 4300
Wire Wire Line
	1850 4400 1150 4400
Wire Wire Line
	1150 4500 1850 4500
Wire Wire Line
	1850 4600 1150 4600
Wire Wire Line
	1150 5000 1850 5000
Wire Wire Line
	1850 5100 1150 5100
Wire Wire Line
	3900 3700 3350 3700
Wire Wire Line
	3350 3800 3900 3800
Wire Wire Line
	3900 4100 3350 4100
Wire Wire Line
	3350 4200 3900 4200
Wire Wire Line
	3900 4300 3350 4300
Wire Wire Line
	3350 4400 3900 4400
Wire Wire Line
	3900 4700 3350 4700
Wire Wire Line
	3350 4900 3900 4900
Wire Wire Line
	3900 5000 3350 5000
Text GLabel 1850 3700 0    50   Input ~ 0
DEV1.VSENSE
Text GLabel 1850 3800 0    50   Output ~ 0
DEV1.PULL-
Text Label 1850 4900 2    50   ~ 0
25MHz
$Comp
L power:PWR_FLAG #FLG09
U 1 1 5E375C44
P 7200 2000
F 0 "#FLG09" H 7200 2075 50  0001 C CNN
F 1 "PWR_FLAG" H 7200 2173 50  0000 C CNN
F 2 "" H 7200 2000 50  0001 C CNN
F 3 "~" H 7200 2000 50  0001 C CNN
	1    7200 2000
	1    0    0    -1  
$EndComp
Connection ~ 7200 2000
Wire Wire Line
	7200 2000 7350 2000
Wire Bus Line
	1050 4200 1050 5350
Wire Bus Line
	4000 3350 4000 5350
$EndSCHEMATC
