EESchema Schematic File Version 4
EELAYER 30 0
EELAYER END
$Descr A4 11693 8268
encoding utf-8
Sheet 4 9
Title "FPC-III"
Date "2020-01-21"
Rev "1.0"
Comp "Gary Wong"
Comment1 "FPGA configuration"
Comment2 ""
Comment3 ""
Comment4 ""
$EndDescr
$Comp
L lfe5u-85:LFE5U-85F-6BG381C U?
U 10 1 5E1989E1
P 3750 4500
AR Path="/5E1989E1" Ref="U?"  Part="10" 
AR Path="/5E196FAD/5E1989E1" Ref="U1"  Part="10" 
F 0 "U1" H 3250 4800 60  0000 L CNN
F 1 "LFE5U-85F-6BG381C" H 3250 4200 60  0000 L CNN
F 2 "Package_BGA:Lattice_caBGA-381_17.0x17.0mm_Layout20x20_P0.8mm_Ball0.4mm_Pad0.4mm_NSMD" H 2700 5450 60  0001 C CNN
F 3 "" H 2700 5450 60  0000 C CNN
F 4 "220-2177" H 3750 4500 50  0001 C CNN "Digikey part"
F 5 "LFE5U-85F-8BG381I" H 3750 4500 50  0001 C CNN "part#"
	10   3750 4500
	1    0    0    -1  
$EndComp
$Comp
L fpc-iii:GND #PWR066
U 1 1 5E0C4240
P 6350 5500
F 0 "#PWR066" H 6350 5250 50  0001 C CNN
F 1 "GND" H 6345 5327 50  0000 C CNN
F 2 "" H 6350 5500 50  0001 C CNN
F 3 "" H 6350 5500 50  0001 C CNN
	1    6350 5500
	1    0    0    -1  
$EndComp
Wire Wire Line
	6350 5500 6350 5400
Wire Wire Line
	6350 5400 6450 5400
Wire Wire Line
	6350 5400 6350 5200
Wire Wire Line
	6350 5200 6450 5200
Connection ~ 6350 5400
Wire Wire Line
	6250 5300 6450 5300
Wire Wire Line
	8200 4300 7950 4300
$Comp
L fpc-iii:S25FL064L U6
U 1 1 5E11FA14
P 6850 3250
F 0 "U6" H 6500 3950 50  0000 C CNN
F 1 "S25FL064L" H 7100 3950 50  0000 C CNN
F 2 "Package_SO:SOIC-8_5.275x5.275mm_P1.27mm" H 6850 3250 50  0001 C CNN
F 3 "https://www.cypress.com/file/316661/download" H 6850 3250 50  0001 C CNN
F 4 "2015-S25FL064LABMFN010" H 6850 3250 50  0001 C CNN "Digikey part"
F 5 "S25FL064LABMFN010" H 6850 3250 50  0001 C CNN "part#"
	1    6850 3250
	1    0    0    -1  
$EndComp
$Comp
L fpc-iii:GND #PWR068
U 1 1 5E128796
P 6850 3400
F 0 "#PWR068" H 6850 3150 50  0001 C CNN
F 1 "GND" H 6845 3227 50  0000 C CNN
F 2 "" H 6850 3400 50  0001 C CNN
F 3 "" H 6850 3400 50  0001 C CNN
	1    6850 3400
	1    0    0    -1  
$EndComp
$Comp
L Connector_Generic:Conn_02x03_Odd_Even J10
U 1 1 5E2352F7
P 2400 3800
F 0 "J10" H 2450 4117 50  0000 C CNN
F 1 "Conn_02x03_Odd_Even" H 2450 4026 50  0000 C CNN
F 2 "Connector_PinHeader_2.54mm:PinHeader_2x03_P2.54mm_Vertical" H 2400 3800 50  0001 C CNN
F 3 "~" H 2400 3800 50  0001 C CNN
	1    2400 3800
	1    0    0    -1  
$EndComp
$Comp
L power:+3V3 #PWR057
U 1 1 5E236652
P 1850 3500
F 0 "#PWR057" H 1850 3350 50  0001 C CNN
F 1 "+3V3" H 1865 3673 50  0000 C CNN
F 2 "" H 1850 3500 50  0001 C CNN
F 3 "" H 1850 3500 50  0001 C CNN
	1    1850 3500
	1    0    0    -1  
$EndComp
$Comp
L fpc-iii:GND #PWR058
U 1 1 5E237110
P 1850 3950
F 0 "#PWR058" H 1850 3700 50  0001 C CNN
F 1 "GND" H 1845 3777 50  0000 C CNN
F 2 "" H 1850 3950 50  0001 C CNN
F 3 "" H 1850 3950 50  0001 C CNN
	1    1850 3950
	1    0    0    -1  
$EndComp
Wire Wire Line
	2100 4450 2100 3900
Wire Wire Line
	2100 3900 2200 3900
Wire Wire Line
	2200 3800 1850 3800
Wire Wire Line
	1850 3800 1850 3950
Wire Wire Line
	1850 3500 1850 3700
Wire Wire Line
	1850 3700 2200 3700
Wire Wire Line
	2100 4450 3050 4450
Wire Wire Line
	2850 4650 3050 4650
Wire Wire Line
	2700 3800 3050 3800
Wire Wire Line
	3050 3800 3050 4350
Wire Wire Line
	2700 3700 2950 3700
Wire Wire Line
	2950 3700 2950 4550
Wire Wire Line
	2950 4550 3050 4550
Text Label 2100 3900 0    50   ~ 0
TDO
Text Label 2700 3800 0    50   ~ 0
TDI
Text Label 2700 3700 0    50   ~ 0
TCK
Wire Wire Line
	2850 4650 2850 3900
Wire Wire Line
	2850 3900 2700 3900
Text Label 2700 3900 0    50   ~ 0
TMS
Text Label 7950 4400 0    50   ~ 0
MOSI
Text Label 7950 4300 0    50   ~ 0
D2
Text Label 6450 4300 2    50   ~ 0
D3
Text Label 6450 4400 2    50   ~ 0
MISO
Text Label 6450 5000 2    50   ~ 0
MCLK
$Comp
L power:+3V3 #PWR067
U 1 1 5E37BE68
P 6850 2250
F 0 "#PWR067" H 6850 2100 50  0001 C CNN
F 1 "+3V3" H 6865 2423 50  0000 C CNN
F 2 "" H 6850 2250 50  0001 C CNN
F 3 "" H 6850 2250 50  0001 C CNN
	1    6850 2250
	1    0    0    -1  
$EndComp
$Comp
L power:+3V3 #PWR065
U 1 1 5E37C92F
P 6250 5300
F 0 "#PWR065" H 6250 5150 50  0001 C CNN
F 1 "+3V3" H 6265 5473 50  0000 C CNN
F 2 "" H 6250 5300 50  0001 C CNN
F 3 "" H 6250 5300 50  0001 C CNN
	1    6250 5300
	1    0    0    -1  
$EndComp
$Comp
L Connector_Generic:Conn_02x03_Odd_Even J11
U 1 1 5E2CC7AB
P 9150 2800
F 0 "J11" H 9200 3117 50  0000 C CNN
F 1 "Conn_02x03_Odd_Even" H 9200 3026 50  0000 C CNN
F 2 "Connector_PinHeader_2.54mm:PinHeader_2x03_P2.54mm_Vertical" H 9150 2800 50  0001 C CNN
F 3 "~" H 9150 2800 50  0001 C CNN
	1    9150 2800
	1    0    0    -1  
$EndComp
Entry Wire Line
	8200 4300 8300 4200
Entry Wire Line
	8200 4400 8300 4300
Wire Wire Line
	8200 4400 7950 4400
Wire Wire Line
	6200 4300 6450 4300
Wire Wire Line
	6200 4400 6450 4400
Wire Wire Line
	6200 5000 6450 5000
Entry Wire Line
	6100 4200 6200 4300
Entry Wire Line
	6100 4300 6200 4400
Entry Wire Line
	6100 4900 6200 5000
Entry Wire Line
	9700 2900 9800 3000
Entry Wire Line
	9700 2800 9800 2900
Entry Wire Line
	9700 2700 9800 2800
Entry Wire Line
	7600 2850 7700 2950
Entry Wire Line
	7600 2950 7700 3050
Entry Wire Line
	7600 3050 7700 3150
Entry Wire Line
	6100 3050 6200 2950
Entry Wire Line
	6100 3150 6200 3050
Entry Wire Line
	6100 2950 6200 2850
Connection ~ 8300 3700
Entry Wire Line
	8700 3000 8800 2900
Wire Wire Line
	8800 2900 8950 2900
Wire Wire Line
	9450 2700 9700 2700
Wire Wire Line
	9700 2800 9450 2800
Wire Wire Line
	9450 2900 9700 2900
Text Label 6350 2850 2    50   ~ 0
CS
Text Label 6350 2950 2    50   ~ 0
MISO
Text Label 6350 3050 2    50   ~ 0
D2
Text Label 7350 2850 0    50   ~ 0
D3
Text Label 7350 2950 0    50   ~ 0
MCLK
Text Label 7350 3050 0    50   ~ 0
MOSI
$Comp
L power:+3V3 #PWR071
U 1 1 5E2F2C25
P 8450 2600
F 0 "#PWR071" H 8450 2450 50  0001 C CNN
F 1 "+3V3" H 8465 2773 50  0000 C CNN
F 2 "" H 8450 2600 50  0001 C CNN
F 3 "" H 8450 2600 50  0001 C CNN
	1    8450 2600
	1    0    0    -1  
$EndComp
$Comp
L fpc-iii:GND #PWR072
U 1 1 5E2F2F1B
P 8450 2900
F 0 "#PWR072" H 8450 2650 50  0001 C CNN
F 1 "GND" H 8445 2727 50  0000 C CNN
F 2 "" H 8450 2900 50  0001 C CNN
F 3 "" H 8450 2900 50  0001 C CNN
	1    8450 2900
	1    0    0    -1  
$EndComp
Wire Wire Line
	8450 2900 8450 2800
Wire Wire Line
	8450 2600 8450 2700
Wire Wire Line
	8450 2700 8950 2700
Wire Wire Line
	8450 2800 8950 2800
Wire Bus Line
	8300 3700 8700 3700
Wire Bus Line
	8700 3000 8700 3700
Connection ~ 8700 3700
Wire Bus Line
	8700 3700 9800 3700
Text Label 9450 2800 0    50   ~ 0
MOSI
Text Label 8950 2900 2    50   ~ 0
MISO
Text Label 9450 2700 0    50   ~ 0
MCLK
Text Label 9450 2900 0    50   ~ 0
CS
Connection ~ 6100 3700
Connection ~ 7700 3700
Wire Bus Line
	7700 3700 8300 3700
Wire Bus Line
	6100 3700 7700 3700
$Comp
L Device:R_Small_US R12
U 1 1 5E2F9B23
P 5850 2850
F 0 "R12" V 5800 2700 50  0000 C CNN
F 1 "10K" V 5800 3000 50  0000 C CNN
F 2 "Resistor_SMD:R_0402_1005Metric" H 5850 2850 50  0001 C CNN
F 3 "~" H 5850 2850 50  0001 C CNN
F 4 "RMCF0402JT10K0CT" H 5850 2850 50  0001 C CNN "Digikey part"
F 5 "RMCF0402JT10K0" H 5850 2850 50  0001 C CNN "part#"
	1    5850 2850
	0    1    1    0   
$EndComp
$Comp
L Device:R_Small_US R13
U 1 1 5E2FA003
P 5850 2950
F 0 "R13" V 5800 2800 50  0000 C CNN
F 1 "10K" V 5800 3100 50  0000 C CNN
F 2 "Resistor_SMD:R_0402_1005Metric" H 5850 2950 50  0001 C CNN
F 3 "~" H 5850 2950 50  0001 C CNN
F 4 "RMCF0402JT10K0CT" H 5850 2950 50  0001 C CNN "Digikey part"
F 5 "RMCF0402JT10K0" H 5850 2950 50  0001 C CNN "part#"
	1    5850 2950
	0    1    1    0   
$EndComp
$Comp
L Device:R_Small_US R16
U 1 1 5E2FA122
P 7950 2950
F 0 "R16" V 7900 2800 50  0000 C CNN
F 1 "1K" V 7900 3100 50  0000 C CNN
F 2 "Resistor_SMD:R_0402_1005Metric" H 7950 2950 50  0001 C CNN
F 3 "~" H 7950 2950 50  0001 C CNN
F 4 "RMCF0402JT1K00CT" H 7950 2950 50  0001 C CNN "Digikey part"
F 5 "RMCF0402JT1K00" H 7950 2950 50  0001 C CNN "part#"
	1    7950 2950
	0    1    1    0   
$EndComp
$Comp
L power:+3V3 #PWR063
U 1 1 5E300823
P 5500 2750
F 0 "#PWR063" H 5500 2600 50  0001 C CNN
F 1 "+3V3" H 5515 2923 50  0000 C CNN
F 2 "" H 5500 2750 50  0001 C CNN
F 3 "" H 5500 2750 50  0001 C CNN
	1    5500 2750
	1    0    0    -1  
$EndComp
$Comp
L power:+3V3 #PWR070
U 1 1 5E304989
P 8250 2850
F 0 "#PWR070" H 8250 2700 50  0001 C CNN
F 1 "+3V3" H 8265 3023 50  0000 C CNN
F 2 "" H 8250 2850 50  0001 C CNN
F 3 "" H 8250 2850 50  0001 C CNN
	1    8250 2850
	1    0    0    -1  
$EndComp
Text GLabel 1900 4550 0    50   Input ~ 0
TCK
Text GLabel 1900 4650 0    50   Input ~ 0
TMS
Text GLabel 1900 4350 0    50   Input ~ 0
TDI
Text GLabel 1900 4450 0    50   Output ~ 0
TDO
Wire Wire Line
	1900 4350 3050 4350
Connection ~ 3050 4350
Wire Wire Line
	1900 4450 2100 4450
Connection ~ 2100 4450
Wire Wire Line
	1900 4550 2950 4550
Connection ~ 2950 4550
Wire Wire Line
	1900 4650 2850 4650
Connection ~ 2850 4650
$Comp
L lfe5u-85:LFE5U-85F-6BG381C U?
U 7 1 5E32510D
P 7200 4800
AR Path="/5E32510D" Ref="U?"  Part="7" 
AR Path="/5E196FAD/5E32510D" Ref="U1"  Part="7" 
F 0 "U1" H 7200 5787 60  0000 C CNN
F 1 "LFE5U-85F-6BG381C" H 7200 5681 60  0000 C CNN
F 2 "Package_BGA:Lattice_caBGA-381_17.0x17.0mm_Layout20x20_P0.8mm_Ball0.4mm_Pad0.4mm_NSMD" H 6150 5750 60  0001 C CNN
F 3 "" H 6150 5750 60  0001 C CNN
F 4 "220-2177" H 7200 4800 50  0001 C CNN "Digikey part"
F 5 "LFE5U-85F-8BG381I" H 7200 4800 50  0001 C CNN "part#"
	7    7200 4800
	1    0    0    -1  
$EndComp
Wire Wire Line
	6850 2250 6850 2500
$Comp
L Device:C_Small C44
U 1 1 5E432965
P 7450 2350
F 0 "C44" H 7542 2396 50  0000 L CNN
F 1 "100n" H 7542 2305 50  0000 L CNN
F 2 "Capacitor_SMD:C_0402_1005Metric" H 7450 2350 50  0001 C CNN
F 3 "~" H 7450 2350 50  0001 C CNN
F 4 "1276-1004-1" H 7450 2350 50  0001 C CNN "Digikey part"
F 5 "*" H 7450 2350 50  0001 C CNN "Tolerance"
F 6 "CL05F104ZO5NNNC" H 7450 2350 50  0001 C CNN "part#"
	1    7450 2350
	1    0    0    -1  
$EndComp
$Comp
L fpc-iii:GND #PWR069
U 1 1 5E43397B
P 7450 2450
F 0 "#PWR069" H 7450 2200 50  0001 C CNN
F 1 "GND" H 7445 2277 50  0000 C CNN
F 2 "" H 7450 2450 50  0001 C CNN
F 3 "" H 7450 2450 50  0001 C CNN
	1    7450 2450
	1    0    0    -1  
$EndComp
Wire Wire Line
	7450 2250 6850 2250
Connection ~ 6850 2250
Text Label 6450 4600 2    50   ~ 0
CS
Entry Wire Line
	6100 4500 6200 4600
Wire Wire Line
	6200 4600 6450 4600
$Comp
L Device:R_Small_US R14
U 1 1 5E4FE620
P 5850 3050
F 0 "R14" V 5800 2900 50  0000 C CNN
F 1 "10K" V 5800 3200 50  0000 C CNN
F 2 "Resistor_SMD:R_0402_1005Metric" H 5850 3050 50  0001 C CNN
F 3 "~" H 5850 3050 50  0001 C CNN
F 4 "RMCF0402JT10K0CT" H 5850 3050 50  0001 C CNN "Digikey part"
F 5 "RMCF0402JT10K0" H 5850 3050 50  0001 C CNN "part#"
	1    5850 3050
	0    1    1    0   
$EndComp
Wire Wire Line
	5750 3050 5500 3050
Wire Wire Line
	5500 3050 5500 2950
Wire Wire Line
	5750 2850 5500 2850
Connection ~ 5500 2850
Wire Wire Line
	5500 2850 5500 2750
Wire Wire Line
	5750 2950 5500 2950
Connection ~ 5500 2950
Wire Wire Line
	5500 2950 5500 2850
$Comp
L Device:R_Small_US R17
U 1 1 5E2FA49C
P 7950 3050
F 0 "R17" V 7900 2900 50  0000 C CNN
F 1 "10K" V 7900 3200 50  0000 C CNN
F 2 "Resistor_SMD:R_0402_1005Metric" H 7950 3050 50  0001 C CNN
F 3 "~" H 7950 3050 50  0001 C CNN
F 4 "RMCF0402JT10K0CT" H 7950 3050 50  0001 C CNN "Digikey part"
F 5 "RMCF0402JT10K0" H 7950 3050 50  0001 C CNN "part#"
	1    7950 3050
	0    1    1    0   
$EndComp
$Comp
L Device:R_Small_US R15
U 1 1 5E50AAC1
P 7950 2850
F 0 "R15" V 7900 2700 50  0000 C CNN
F 1 "10K" V 7900 3000 50  0000 C CNN
F 2 "Resistor_SMD:R_0402_1005Metric" H 7950 2850 50  0001 C CNN
F 3 "~" H 7950 2850 50  0001 C CNN
F 4 "RMCF0402JT10K0CT" H 7950 2850 50  0001 C CNN "Digikey part"
F 5 "RMCF0402JT10K0" H 7950 2850 50  0001 C CNN "part#"
	1    7950 2850
	0    1    1    0   
$EndComp
Wire Wire Line
	8050 2850 8250 2850
Wire Wire Line
	8250 2850 8250 2950
Wire Wire Line
	8250 2950 8050 2950
Connection ~ 8250 2850
Wire Wire Line
	8050 3050 8250 3050
Wire Wire Line
	8250 3050 8250 2950
Connection ~ 8250 2950
Wire Wire Line
	6450 4800 5100 4800
Wire Wire Line
	5100 4800 5100 4900
$Comp
L Device:R_Small_US R9
U 1 1 5E37B39B
P 5100 4600
F 0 "R9" H 5168 4646 50  0000 L CNN
F 1 "10K" H 5168 4555 50  0000 L CNN
F 2 "Resistor_SMD:R_0402_1005Metric" H 5100 4600 50  0001 C CNN
F 3 "~" H 5100 4600 50  0001 C CNN
F 4 "RMCF0402JT10K0CT" H 5100 4600 50  0001 C CNN "Digikey part"
F 5 "RMCF0402JT10K0" H 5100 4600 50  0001 C CNN "part#"
	1    5100 4600
	1    0    0    -1  
$EndComp
Wire Wire Line
	5100 4700 5100 4800
Connection ~ 5100 4800
$Comp
L power:+3V3 #PWR060
U 1 1 5E37DB61
P 5100 4400
F 0 "#PWR060" H 5100 4250 50  0001 C CNN
F 1 "+3V3" H 5115 4573 50  0000 C CNN
F 2 "" H 5100 4400 50  0001 C CNN
F 3 "" H 5100 4400 50  0001 C CNN
	1    5100 4400
	1    0    0    -1  
$EndComp
Wire Wire Line
	5100 4400 5100 4500
$Comp
L Device:C_Small C43
U 1 1 5E380492
P 5100 5000
F 0 "C43" H 5192 5046 50  0000 L CNN
F 1 "100n" H 5192 4955 50  0000 L CNN
F 2 "Capacitor_SMD:C_0402_1005Metric" H 5100 5000 50  0001 C CNN
F 3 "~" H 5100 5000 50  0001 C CNN
F 4 "1276-1004-1" H 5100 5000 50  0001 C CNN "Digikey part"
F 5 "*" H 5100 5000 50  0001 C CNN "Tolerance"
F 6 "CL05F104ZO5NNNC" H 5100 5000 50  0001 C CNN "part#"
	1    5100 5000
	1    0    0    -1  
$EndComp
$Comp
L fpc-iii:GND #PWR061
U 1 1 5E381086
P 5100 5200
F 0 "#PWR061" H 5100 4950 50  0001 C CNN
F 1 "GND" H 5095 5027 50  0000 C CNN
F 2 "" H 5100 5200 50  0001 C CNN
F 3 "" H 5100 5200 50  0001 C CNN
	1    5100 5200
	1    0    0    -1  
$EndComp
Wire Wire Line
	5100 5200 5100 5100
$Comp
L Switch:SW_Push SW2
U 1 1 5E383C31
P 4900 4800
F 0 "SW2" H 4900 4993 50  0000 C CNN
F 1 "SW_Push" H 4900 4994 50  0001 C CNN
F 2 "Button_Switch_SMD:SW_SPST_EVQQ2" H 4900 5000 50  0001 C CNN
F 3 "https://industrial.panasonic.com/ac/cdn/e/control/switch/light-touch/catalog/sw_lt_eng_6s_th.pdf" H 4900 5000 50  0001 C CNN
F 4 "P12932SCT" H 4900 4800 50  0001 C CNN "Digikey part"
F 5 "EVQ-Q2B03W" H 4900 4800 50  0001 C CNN "part#"
	1    4900 4800
	1    0    0    -1  
$EndComp
$Comp
L fpc-iii:GND #PWR059
U 1 1 5E38419A
P 4700 5200
F 0 "#PWR059" H 4700 4950 50  0001 C CNN
F 1 "GND" H 4695 5027 50  0000 C CNN
F 2 "" H 4700 5200 50  0001 C CNN
F 3 "" H 4700 5200 50  0001 C CNN
	1    4700 5200
	1    0    0    -1  
$EndComp
Wire Wire Line
	4700 5200 4700 4800
$Comp
L Device:LED_Small D1
U 1 1 5E386FCA
P 5400 4500
F 0 "D1" V 5400 4432 50  0000 R CNN
F 1 "LED_Small" V 5355 4432 50  0001 R CNN
F 2 "LED_SMD:LED_0603_1608Metric" V 5400 4500 50  0001 C CNN
F 3 "~" V 5400 4500 50  0001 C CNN
F 4 "150060VS75000" H 5400 4500 50  0001 C CNN "part#"
F 5 "732-4980-1" H 5400 4500 50  0001 C CNN "Digikey part"
	1    5400 4500
	0    -1   -1   0   
$EndComp
$Comp
L Device:R_Small_US R10
U 1 1 5E3872FE
P 5400 4200
F 0 "R10" H 5468 4246 50  0000 L CNN
F 1 "220" H 5468 4155 50  0000 L CNN
F 2 "Resistor_SMD:R_0402_1005Metric" H 5400 4200 50  0001 C CNN
F 3 "~" H 5400 4200 50  0001 C CNN
F 4 "RMCF0402JT220RCT" H 5400 4200 50  0001 C CNN "Digikey part"
F 5 "RMCF0402JT220R" H 5400 4200 50  0001 C CNN "part#"
	1    5400 4200
	1    0    0    -1  
$EndComp
$Comp
L power:+3V3 #PWR062
U 1 1 5E38755D
P 5400 4000
F 0 "#PWR062" H 5400 3850 50  0001 C CNN
F 1 "+3V3" H 5415 4173 50  0000 C CNN
F 2 "" H 5400 4000 50  0001 C CNN
F 3 "" H 5400 4000 50  0001 C CNN
	1    5400 4000
	1    0    0    -1  
$EndComp
$Comp
L Device:LED_Small D2
U 1 1 5E38A62E
P 5750 4500
F 0 "D2" V 5750 4432 50  0000 R CNN
F 1 "LED_Small" V 5705 4432 50  0001 R CNN
F 2 "LED_SMD:LED_0603_1608Metric" V 5750 4500 50  0001 C CNN
F 3 "~" V 5750 4500 50  0001 C CNN
F 4 "150060RS75000" H 5750 4500 50  0001 C CNN "part#"
F 5 "732-4978-1" H 5750 4500 50  0001 C CNN "Digikey part"
	1    5750 4500
	0    -1   -1   0   
$EndComp
$Comp
L Device:R_Small_US R11
U 1 1 5E38A634
P 5750 4200
F 0 "R11" H 5818 4246 50  0000 L CNN
F 1 "220" H 5818 4155 50  0000 L CNN
F 2 "Resistor_SMD:R_0402_1005Metric" H 5750 4200 50  0001 C CNN
F 3 "~" H 5750 4200 50  0001 C CNN
F 4 "RMCF0402JT220RCT" H 5750 4200 50  0001 C CNN "Digikey part"
F 5 "RMCF0402JT220R" H 5750 4200 50  0001 C CNN "part#"
	1    5750 4200
	1    0    0    -1  
$EndComp
$Comp
L power:+3V3 #PWR064
U 1 1 5E38A63A
P 5750 4000
F 0 "#PWR064" H 5750 3850 50  0001 C CNN
F 1 "+3V3" H 5765 4173 50  0000 C CNN
F 2 "" H 5750 4000 50  0001 C CNN
F 3 "" H 5750 4000 50  0001 C CNN
	1    5750 4000
	1    0    0    -1  
$EndComp
Wire Wire Line
	5400 4000 5400 4100
Wire Wire Line
	5750 4000 5750 4100
Wire Wire Line
	5750 4300 5750 4400
Wire Wire Line
	5750 4600 5750 4700
Wire Wire Line
	5750 4700 6450 4700
Wire Wire Line
	5400 4300 5400 4400
Wire Wire Line
	5400 4600 5400 5100
Wire Wire Line
	5400 5100 6450 5100
NoConn ~ 6450 4100
NoConn ~ 7950 4100
NoConn ~ 6450 4200
NoConn ~ 7950 4200
NoConn ~ 6450 4500
NoConn ~ 7950 4500
NoConn ~ 7950 4600
NoConn ~ 6450 4900
Wire Wire Line
	5950 2850 6350 2850
Wire Wire Line
	7350 2850 7850 2850
Wire Bus Line
	8300 3700 8300 4300
Wire Bus Line
	9800 2800 9800 3700
Wire Bus Line
	6100 2950 6100 3700
Wire Wire Line
	7350 2950 7850 2950
Wire Wire Line
	7350 3050 7850 3050
Wire Bus Line
	7700 2950 7700 3700
Wire Wire Line
	5950 2950 6350 2950
Wire Wire Line
	5950 3050 6350 3050
Wire Bus Line
	6100 3700 6100 4900
$EndSCHEMATC
