EESchema Schematic File Version 4
EELAYER 30 0
EELAYER END
$Descr A4 11693 8268
encoding utf-8
Sheet 9 9
Title "FPC-III"
Date "2020-01-21"
Rev "1.0"
Comp "Gary Wong"
Comment1 "144-148 MHz transceiver"
Comment2 ""
Comment3 ""
Comment4 ""
$EndDescr
$Comp
L Connector:Conn_Coaxial J2
U 1 1 5E258EB6
P 8950 3600
F 0 "J2" H 9050 3575 50  0000 L CNN
F 1 "Conn_Coaxial" H 9050 3484 50  0000 L CNN
F 2 "Connector_Coaxial:SMA_Molex_73251-2200_Horizontal" H 8950 3600 50  0001 C CNN
F 3 " ~" H 8950 3600 50  0001 C CNN
F 4 "WM9352" H 8950 3600 50  0001 C CNN "Digikey part"
F 5 "0732512200" H 8950 3600 50  0001 C CNN "part#"
	1    8950 3600
	1    0    0    -1  
$EndComp
$Comp
L power:+3V3 #PWR0192
U 1 1 5E25927B
P 5550 3200
F 0 "#PWR0192" H 5550 3050 50  0001 C CNN
F 1 "+3V3" H 5565 3373 50  0000 C CNN
F 2 "" H 5550 3200 50  0001 C CNN
F 3 "" H 5550 3200 50  0001 C CNN
	1    5550 3200
	1    0    0    -1  
$EndComp
$Comp
L Device:L_Small L4
U 1 1 5E2598AC
P 5550 3400
F 0 "L4" H 5400 3450 50  0000 L CNN
F 1 "1u" H 5400 3350 50  0000 L CNN
F 2 "Inductor_SMD:L_1008_2520Metric" H 5550 3400 50  0001 C CNN
F 3 "~" H 5550 3400 50  0001 C CNN
F 4 "445-16460-1" H 5550 3400 50  0001 C CNN "Digikey part"
F 5 "NLV25T-1R0J-EF" H 5550 3400 50  0001 C CNN "part#"
	1    5550 3400
	1    0    0    -1  
$EndComp
$Comp
L Device:C_Small C103
U 1 1 5E25A173
P 5750 3600
F 0 "C103" V 5521 3600 50  0000 C CNN
F 1 "1n" V 5612 3600 50  0000 C CNN
F 2 "Capacitor_SMD:C_0402_1005Metric" H 5750 3600 50  0001 C CNN
F 3 "~" H 5750 3600 50  0001 C CNN
F 4 "5%" H 5750 3600 50  0001 C CNN "Tolerance"
F 5 "1276-1032-1" H 5750 3600 50  0001 C CNN "Digikey part"
F 6 "CL05B102KB5NNNC" H 5750 3600 50  0001 C CNN "part#"
	1    5750 3600
	0    1    1    0   
$EndComp
Wire Wire Line
	5550 3200 5550 3300
Wire Wire Line
	5550 3500 5550 3600
Wire Wire Line
	5550 3600 5650 3600
Connection ~ 5550 3600
Wire Wire Line
	5850 3600 5950 3600
Wire Wire Line
	5950 3600 5950 3950
Wire Wire Line
	5950 3950 5850 3950
$Comp
L Device:C_Small C104
U 1 1 5E25AB02
P 5750 3950
F 0 "C104" V 5521 3950 50  0000 C CNN
F 1 "6p6" V 5612 3950 50  0000 C CNN
F 2 "Capacitor_SMD:C_0402_1005Metric" H 5750 3950 50  0001 C CNN
F 3 "~" H 5750 3950 50  0001 C CNN
F 4 "2%" H 5750 3950 50  0001 C CNN "Tolerance"
F 5 "490-11232-1" H 5750 3950 50  0001 C CNN "Digikey part"
F 6 "GJM1555C1H6R6BB01D" H 5750 3950 50  0001 C CNN "part#"
	1    5750 3950
	0    1    1    0   
$EndComp
Wire Wire Line
	5650 3950 5550 3950
Wire Wire Line
	5550 3950 5550 4050
Connection ~ 5550 3950
$Comp
L Device:L_Small L5
U 1 1 5E25B1D1
P 5550 4150
F 0 "L5" H 5400 4200 50  0000 L CNN
F 1 "270n" H 5300 4100 50  0000 L CNN
F 2 "Inductor_SMD:L_0603_1608Metric" H 5550 4150 50  0001 C CNN
F 3 "~" H 5550 4150 50  0001 C CNN
F 4 "2%" H 5550 4150 50  0001 C CNN "Tolerance"
F 5 "490-13392-1" H 5550 4150 50  0001 C CNN "Digikey part"
F 6 "LQW18ANR27G80D" H 5550 4150 50  0001 C CNN "part#"
	1    5550 4150
	1    0    0    -1  
$EndComp
Wire Wire Line
	5550 4250 5550 4350
Wire Wire Line
	5550 4350 5650 4350
Connection ~ 5550 4350
$Comp
L Device:L_Small L6
U 1 1 5E25B81E
P 5750 4350
F 0 "L6" V 5950 4300 50  0000 L CNN
F 1 "180n" V 5850 4250 50  0000 L CNN
F 2 "Inductor_SMD:L_0603_1608Metric" H 5750 4350 50  0001 C CNN
F 3 "~" H 5750 4350 50  0001 C CNN
F 4 "2%" H 5750 4350 50  0001 C CNN "Tolerance"
F 5 "490-6927-1" H 5750 4350 50  0001 C CNN "Digikey part"
F 6 "LQW18ANR18G00D" H 5750 4350 50  0001 C CNN "part#"
	1    5750 4350
	0    -1   -1   0   
$EndComp
Wire Wire Line
	5950 3950 5950 4350
Wire Wire Line
	5950 4350 5850 4350
Connection ~ 5950 3950
Wire Wire Line
	5550 4350 5550 4450
$Comp
L Device:C_Small C102
U 1 1 5E25C368
P 5550 4550
F 0 "C102" H 5350 4600 50  0000 L CNN
F 1 "13p" H 5300 4500 50  0000 L CNN
F 2 "Capacitor_SMD:C_0402_1005Metric" H 5550 4550 50  0001 C CNN
F 3 "~" H 5550 4550 50  0001 C CNN
F 4 "2%" H 5550 4550 50  0001 C CNN "Tolerance"
F 5 "490-8079-1" H 5550 4550 50  0001 C CNN "Digikey part"
F 6 "GJM1555C1H130GB01D" H 5550 4550 50  0001 C CNN "part#"
	1    5550 4550
	1    0    0    -1  
$EndComp
$Comp
L fpc-iii:GND #PWR0193
U 1 1 5E25D317
P 5550 4750
F 0 "#PWR0193" H 5550 4500 50  0001 C CNN
F 1 "GND" H 5545 4577 50  0000 C CNN
F 2 "" H 5550 4750 50  0001 C CNN
F 3 "" H 5550 4750 50  0001 C CNN
	1    5550 4750
	1    0    0    -1  
$EndComp
Wire Wire Line
	5550 4750 5550 4650
Wire Wire Line
	5950 3600 6450 3600
Wire Wire Line
	6450 3600 6450 3700
Connection ~ 5950 3600
Wire Wire Line
	6250 3800 6250 3700
Wire Wire Line
	6250 3700 6450 3700
Wire Wire Line
	6650 3700 6650 3800
Connection ~ 6450 3700
Wire Wire Line
	6450 3700 6650 3700
$Comp
L Device:C_Small C107
U 1 1 5E25DD04
P 6650 3900
F 0 "C107" H 6450 3950 50  0000 L CNN
F 1 "36p" H 6400 3850 50  0000 L CNN
F 2 "Capacitor_SMD:C_0402_1005Metric" H 6650 3900 50  0001 C CNN
F 3 "~" H 6650 3900 50  0001 C CNN
F 4 "2%" H 6650 3900 50  0001 C CNN "Tolerance"
F 5 "399-16079-1" H 6650 3900 50  0001 C CNN "Digikey part"
F 6 "CBR04C360F5GAC" H 6650 3900 50  0001 C CNN "part#"
	1    6650 3900
	1    0    0    -1  
$EndComp
$Comp
L Device:L_Small L7
U 1 1 5E25E1C8
P 6250 3900
F 0 "L7" H 6100 3950 50  0000 L CNN
F 1 "33n" H 6100 3850 50  0000 L CNN
F 2 "Inductor_SMD:L_0402_1005Metric" H 6250 3900 50  0001 C CNN
F 3 "~" H 6250 3900 50  0001 C CNN
F 4 "490-6804-1" H 6250 3900 50  0001 C CNN "Digikey part"
F 5 "2%" H 6250 3900 50  0001 C CNN "Tolerance"
F 6 "LQW15AN33NG00D" H 6250 3900 50  0001 C CNN "part#"
	1    6250 3900
	1    0    0    -1  
$EndComp
Wire Wire Line
	6250 4000 6250 4100
Wire Wire Line
	6250 4100 6450 4100
Wire Wire Line
	6650 4100 6650 4000
$Comp
L Device:R_Small_US R79
U 1 1 5E25EBBE
P 6450 4300
F 0 "R79" H 6518 4346 50  0000 L CNN
F 1 "51" H 6518 4255 50  0000 L CNN
F 2 "Resistor_SMD:R_0402_1005Metric" H 6450 4300 50  0001 C CNN
F 3 "~" H 6450 4300 50  0001 C CNN
F 4 "RMCF0402FT51R0CT" H 6450 4300 50  0001 C CNN "Digikey part"
F 5 "1%" H 6450 4300 50  0001 C CNN "Tolerance"
F 6 "RMCF0402FT51R0" H 6450 4300 50  0001 C CNN "part#"
	1    6450 4300
	1    0    0    -1  
$EndComp
Wire Wire Line
	6450 4100 6450 4200
Connection ~ 6450 4100
Wire Wire Line
	6450 4100 6650 4100
$Comp
L fpc-iii:GND #PWR0195
U 1 1 5E25F2A7
P 6450 4500
F 0 "#PWR0195" H 6450 4250 50  0001 C CNN
F 1 "GND" H 6445 4327 50  0000 C CNN
F 2 "" H 6450 4500 50  0001 C CNN
F 3 "" H 6450 4500 50  0001 C CNN
	1    6450 4500
	1    0    0    -1  
$EndComp
Wire Wire Line
	6450 4400 6450 4500
$Comp
L Device:L_Small L8
U 1 1 5E25FFBA
P 6900 3600
F 0 "L8" V 7100 3550 50  0000 L CNN
F 1 "120n" V 7000 3500 50  0000 L CNN
F 2 "Inductor_SMD:L_0603_1608Metric" H 6900 3600 50  0001 C CNN
F 3 "~" H 6900 3600 50  0001 C CNN
F 4 "2%" H 6900 3600 50  0001 C CNN "Tolerance"
F 5 "490-6920-1" H 6900 3600 50  0001 C CNN "Digikey part"
F 6 "LQW18ANR12G00D" H 6900 3600 50  0001 C CNN "part#"
	1    6900 3600
	0    -1   -1   0   
$EndComp
$Comp
L Device:L_Small L9
U 1 1 5E26041A
P 7300 3600
F 0 "L9" V 7500 3550 50  0000 L CNN
F 1 "160n" V 7400 3500 50  0000 L CNN
F 2 "Inductor_SMD:L_0603_1608Metric" H 7300 3600 50  0001 C CNN
F 3 "~" H 7300 3600 50  0001 C CNN
F 4 "2%" H 7300 3600 50  0001 C CNN "Tolerance"
F 5 "490-6925-1" H 7300 3600 50  0001 C CNN "Digikey part"
F 6 "LQW18ANR16G00D" H 7300 3600 50  0001 C CNN "part#"
	1    7300 3600
	0    -1   -1   0   
$EndComp
$Comp
L Device:L_Small L10
U 1 1 5E260ACE
P 7700 3600
F 0 "L10" V 7900 3550 50  0000 L CNN
F 1 "160n" V 7800 3500 50  0000 L CNN
F 2 "Inductor_SMD:L_0603_1608Metric" H 7700 3600 50  0001 C CNN
F 3 "~" H 7700 3600 50  0001 C CNN
F 4 "2%" H 7700 3600 50  0001 C CNN "Tolerance"
F 5 "490-6925-1" H 7700 3600 50  0001 C CNN "Digikey part"
F 6 "LQW18ANR16G00D" H 7700 3600 50  0001 C CNN "part#"
	1    7700 3600
	0    -1   -1   0   
$EndComp
$Comp
L Device:L_Small L11
U 1 1 5E261077
P 8100 3600
F 0 "L11" V 8300 3550 50  0000 L CNN
F 1 "120n" V 8200 3500 50  0000 L CNN
F 2 "Inductor_SMD:L_0603_1608Metric" H 8100 3600 50  0001 C CNN
F 3 "~" H 8100 3600 50  0001 C CNN
F 4 "2%" H 8100 3600 50  0001 C CNN "Tolerance"
F 5 "490-6920-1" H 8100 3600 50  0001 C CNN "Digikey part"
F 6 "LQW18ANR12G00D" H 8100 3600 50  0001 C CNN "part#"
	1    8100 3600
	0    -1   -1   0   
$EndComp
$Comp
L fpc-iii:GND #PWR0200
U 1 1 5E2617B1
P 8950 3900
F 0 "#PWR0200" H 8950 3650 50  0001 C CNN
F 1 "GND" H 8945 3727 50  0000 C CNN
F 2 "" H 8950 3900 50  0001 C CNN
F 3 "" H 8950 3900 50  0001 C CNN
	1    8950 3900
	1    0    0    -1  
$EndComp
Wire Wire Line
	8950 3900 8950 3800
Wire Wire Line
	7000 3600 7100 3600
Wire Wire Line
	7400 3600 7500 3600
Wire Wire Line
	7800 3600 7900 3600
Wire Wire Line
	8600 3600 8750 3600
Wire Wire Line
	7100 3600 7100 3700
$Comp
L Device:C_Small C108
U 1 1 5E2646FC
P 7100 3800
F 0 "C108" H 6900 3850 50  0000 L CNN
F 1 "24p" H 6850 3750 50  0000 L CNN
F 2 "Capacitor_SMD:C_0402_1005Metric" H 7100 3800 50  0001 C CNN
F 3 "~" H 7100 3800 50  0001 C CNN
F 4 "2%" H 7100 3800 50  0001 C CNN "Tolerance"
F 5 "311-3334-1" H 7100 3800 50  0001 C CNN "Digikey part"
F 6 "CC0402GRNPO9BN240" H 7100 3800 50  0001 C CNN "part#"
	1    7100 3800
	1    0    0    -1  
$EndComp
$Comp
L fpc-iii:GND #PWR0197
U 1 1 5E264702
P 7100 4000
F 0 "#PWR0197" H 7100 3750 50  0001 C CNN
F 1 "GND" H 7095 3827 50  0000 C CNN
F 2 "" H 7100 4000 50  0001 C CNN
F 3 "" H 7100 4000 50  0001 C CNN
	1    7100 4000
	1    0    0    -1  
$EndComp
Wire Wire Line
	7100 4000 7100 3900
Wire Wire Line
	7500 3600 7500 3700
$Comp
L Device:C_Small C109
U 1 1 5E264E3A
P 7500 3800
F 0 "C109" H 7300 3850 50  0000 L CNN
F 1 "27p" H 7250 3750 50  0000 L CNN
F 2 "Capacitor_SMD:C_0402_1005Metric" H 7500 3800 50  0001 C CNN
F 3 "~" H 7500 3800 50  0001 C CNN
F 4 "2%" H 7500 3800 50  0001 C CNN "Tolerance"
F 5 "311-1653-1" H 7500 3800 50  0001 C CNN "Digikey part"
F 6 "CC0402GRNPO9BN270" H 7500 3800 50  0001 C CNN "part#"
	1    7500 3800
	1    0    0    -1  
$EndComp
$Comp
L fpc-iii:GND #PWR0198
U 1 1 5E264E40
P 7500 4000
F 0 "#PWR0198" H 7500 3750 50  0001 C CNN
F 1 "GND" H 7495 3827 50  0000 C CNN
F 2 "" H 7500 4000 50  0001 C CNN
F 3 "" H 7500 4000 50  0001 C CNN
	1    7500 4000
	1    0    0    -1  
$EndComp
Wire Wire Line
	7500 4000 7500 3900
Wire Wire Line
	7900 3600 7900 3700
$Comp
L Device:C_Small C110
U 1 1 5E2659AB
P 7900 3800
F 0 "C110" H 7700 3850 50  0000 L CNN
F 1 "24p" H 7650 3750 50  0000 L CNN
F 2 "Capacitor_SMD:C_0402_1005Metric" H 7900 3800 50  0001 C CNN
F 3 "~" H 7900 3800 50  0001 C CNN
F 4 "2%" H 7900 3800 50  0001 C CNN "Tolerance"
F 5 "311-3334-1" H 7900 3800 50  0001 C CNN "Digikey part"
F 6 "CC0402GRNPO9BN240" H 7900 3800 50  0001 C CNN "part#"
	1    7900 3800
	1    0    0    -1  
$EndComp
$Comp
L fpc-iii:GND #PWR0199
U 1 1 5E2659B1
P 7900 4000
F 0 "#PWR0199" H 7900 3750 50  0001 C CNN
F 1 "GND" H 7895 3827 50  0000 C CNN
F 2 "" H 7900 4000 50  0001 C CNN
F 3 "" H 7900 4000 50  0001 C CNN
	1    7900 4000
	1    0    0    -1  
$EndComp
Wire Wire Line
	7900 4000 7900 3900
$Comp
L Device:C_Small C105
U 1 1 5E2639FA
P 6100 3300
F 0 "C105" H 5900 3350 50  0000 L CNN
F 1 "1n" H 5900 3250 50  0000 L CNN
F 2 "Capacitor_SMD:C_0402_1005Metric" H 6100 3300 50  0001 C CNN
F 3 "~" H 6100 3300 50  0001 C CNN
F 4 "1276-1032-1" H 6100 3300 50  0001 C CNN "Digikey part"
F 5 "5%" H 6100 3300 50  0001 C CNN "Tolerance"
F 6 "CL05B102KB5NNNC" H 6100 3300 50  0001 C CNN "part#"
	1    6100 3300
	1    0    0    -1  
$EndComp
$Comp
L fpc-iii:GND #PWR0194
U 1 1 5E264409
P 6100 3400
F 0 "#PWR0194" H 6100 3150 50  0001 C CNN
F 1 "GND" H 6250 3350 50  0000 C CNN
F 2 "" H 6100 3400 50  0001 C CNN
F 3 "" H 6100 3400 50  0001 C CNN
	1    6100 3400
	1    0    0    -1  
$EndComp
$Comp
L Device:C_Small C106
U 1 1 5E265993
P 6500 3300
F 0 "C106" H 6300 3350 50  0000 L CNN
F 1 "100n" H 6250 3250 50  0000 L CNN
F 2 "Capacitor_SMD:C_0402_1005Metric" H 6500 3300 50  0001 C CNN
F 3 "~" H 6500 3300 50  0001 C CNN
F 4 "*" H 6500 3300 50  0001 C CNN "Tolerance"
F 5 "1276-1004-1" H 6500 3300 50  0001 C CNN "Digikey part"
F 6 "CL05F104ZO5NNNC" H 6500 3300 50  0001 C CNN "part#"
	1    6500 3300
	1    0    0    -1  
$EndComp
$Comp
L fpc-iii:GND #PWR0196
U 1 1 5E265999
P 6500 3400
F 0 "#PWR0196" H 6500 3150 50  0001 C CNN
F 1 "GND" H 6650 3350 50  0000 C CNN
F 2 "" H 6500 3400 50  0001 C CNN
F 3 "" H 6500 3400 50  0001 C CNN
	1    6500 3400
	1    0    0    -1  
$EndComp
Wire Wire Line
	6500 3200 6100 3200
Connection ~ 5550 3200
Connection ~ 6100 3200
Wire Wire Line
	6100 3200 5550 3200
$Comp
L Device:C_Small C111
U 1 1 5E26A9A8
P 8500 3600
F 0 "C111" V 8271 3600 50  0000 C CNN
F 1 "1n" V 8362 3600 50  0000 C CNN
F 2 "Capacitor_SMD:C_0402_1005Metric" H 8500 3600 50  0001 C CNN
F 3 "~" H 8500 3600 50  0001 C CNN
F 4 "5%" H 8500 3600 50  0001 C CNN "Tolerance"
F 5 "1276-1032-1" H 8500 3600 50  0001 C CNN "Digikey part"
F 6 "CL05B102KB5NNNC" H 8500 3600 50  0001 C CNN "part#"
	1    8500 3600
	0    1    1    0   
$EndComp
Wire Wire Line
	8400 3600 8200 3600
Connection ~ 7900 3600
Wire Wire Line
	7900 3600 8000 3600
Connection ~ 7500 3600
Wire Wire Line
	7500 3600 7600 3600
Connection ~ 7100 3600
Wire Wire Line
	7100 3600 7200 3600
$Comp
L RF:Si4463 U15
U 1 1 5E2F18B1
P 4300 4100
F 0 "U15" H 4050 4750 50  0000 C CNN
F 1 "Si4463" H 4300 4300 50  0000 C CNN
F 2 "Package_DFN_QFN:QFN-20-1EP_4x4mm_P0.5mm_EP2.6x2.6mm_ThermalVias" H 4300 5300 50  0001 C CNN
F 3 "https://www.silabs.com/documents/public/data-sheets/Si4464-63-61-60.pdf" H 4000 4000 50  0001 C CNN
F 4 "336-4346-1" H 4300 4100 50  0001 C CNN "Digikey part"
F 5 "Si4463-C2A-GMR" H 4300 4100 50  0001 C CNN "part#"
	1    4300 4100
	1    0    0    -1  
$EndComp
Wire Wire Line
	5250 4000 5250 3950
Wire Wire Line
	5250 3950 5550 3950
Wire Wire Line
	5250 4100 5250 4350
Wire Wire Line
	5250 4350 5550 4350
$Comp
L Device:C_Small C101
U 1 1 5E2F543A
P 4050 3150
F 0 "C101" H 4142 3196 50  0000 L CNN
F 1 "1u" H 4142 3105 50  0000 L CNN
F 2 "Capacitor_SMD:C_0402_1005Metric" H 4050 3150 50  0001 C CNN
F 3 "~" H 4050 3150 50  0001 C CNN
F 4 "*" H 4050 3150 50  0001 C CNN "Tolerance"
F 5 "1276-1235-1" H 4050 3150 50  0001 C CNN "Digikey part"
F 6 "CL05A105MQ5NNNC" H 4050 3150 50  0001 C CNN "part#"
	1    4050 3150
	1    0    0    -1  
$EndComp
$Comp
L Device:C_Small C100
U 1 1 5E2F5CFC
P 3700 3150
F 0 "C100" H 3792 3196 50  0000 L CNN
F 1 "100n" H 3792 3105 50  0000 L CNN
F 2 "Capacitor_SMD:C_0402_1005Metric" H 3700 3150 50  0001 C CNN
F 3 "~" H 3700 3150 50  0001 C CNN
F 4 "*" H 3700 3150 50  0001 C CNN "Tolerance"
F 5 "1276-1004-1" H 3700 3150 50  0001 C CNN "Digikey part"
F 6 "CL05F104ZO5NNNC" H 3700 3150 50  0001 C CNN "part#"
	1    3700 3150
	1    0    0    -1  
$EndComp
$Comp
L Device:C_Small C99
U 1 1 5E2F5F66
P 3400 3150
F 0 "C99" H 3492 3196 50  0000 L CNN
F 1 "1n" H 3492 3105 50  0000 L CNN
F 2 "Capacitor_SMD:C_0402_1005Metric" H 3400 3150 50  0001 C CNN
F 3 "~" H 3400 3150 50  0001 C CNN
F 4 "5%" H 3400 3150 50  0001 C CNN "Tolerance"
F 5 "1276-1032-1" H 3400 3150 50  0001 C CNN "Digikey part"
F 6 "CL05B102KB5NNNC" H 3400 3150 50  0001 C CNN "part#"
	1    3400 3150
	1    0    0    -1  
$EndComp
$Comp
L fpc-iii:GND #PWR0190
U 1 1 5E2F624B
P 4050 3250
F 0 "#PWR0190" H 4050 3000 50  0001 C CNN
F 1 "GND" H 4200 3200 50  0000 C CNN
F 2 "" H 4050 3250 50  0001 C CNN
F 3 "" H 4050 3250 50  0001 C CNN
	1    4050 3250
	1    0    0    -1  
$EndComp
$Comp
L fpc-iii:GND #PWR0189
U 1 1 5E2F64B7
P 3700 3250
F 0 "#PWR0189" H 3700 3000 50  0001 C CNN
F 1 "GND" H 3850 3200 50  0000 C CNN
F 2 "" H 3700 3250 50  0001 C CNN
F 3 "" H 3700 3250 50  0001 C CNN
	1    3700 3250
	1    0    0    -1  
$EndComp
$Comp
L fpc-iii:GND #PWR0188
U 1 1 5E2F65FC
P 3400 3250
F 0 "#PWR0188" H 3400 3000 50  0001 C CNN
F 1 "GND" H 3550 3200 50  0000 C CNN
F 2 "" H 3400 3250 50  0001 C CNN
F 3 "" H 3400 3250 50  0001 C CNN
	1    3400 3250
	1    0    0    -1  
$EndComp
Wire Wire Line
	4350 2950 4350 2850
$Comp
L power:+3V3 #PWR0191
U 1 1 5E2F9A7F
P 4350 2850
F 0 "#PWR0191" H 4350 2700 50  0001 C CNN
F 1 "+3V3" H 4365 3023 50  0000 C CNN
F 2 "" H 4350 2850 50  0001 C CNN
F 3 "" H 4350 2850 50  0001 C CNN
	1    4350 2850
	1    0    0    -1  
$EndComp
Wire Wire Line
	4300 3400 4350 3400
Wire Wire Line
	3400 2950 3700 2950
Wire Wire Line
	3400 3050 3400 2950
Wire Wire Line
	3700 3050 3700 2950
Connection ~ 3700 2950
Wire Wire Line
	3700 2950 4050 2950
Wire Wire Line
	4050 3050 4050 2950
Connection ~ 4050 2950
Wire Wire Line
	4050 2950 4350 2950
Wire Wire Line
	4350 2950 4350 3400
Connection ~ 4350 2950
Connection ~ 4350 3400
Wire Wire Line
	4350 3400 4400 3400
$Comp
L Device:Crystal_Small Y2
U 1 1 5E2FFB48
P 3600 3900
F 0 "Y2" V 3554 3988 50  0000 L CNN
F 1 "30M" V 3645 3988 50  0000 L CNN
F 2 "Crystal:Crystal_SMD_Abracon_ABM8G-4Pin_3.2x2.5mm" H 3600 3900 50  0001 C CNN
F 3 "https://abracon.com/Resonators/abm8.pdf" H 3600 3900 50  0001 C CNN
F 4 "535-10279-1" H 3600 3900 50  0001 C CNN "Digikey part"
F 5 "ABM8G-30.000MHZ-18-D2Y-T" H 3600 3900 50  0001 C CNN "part#"
	1    3600 3900
	0    1    1    0   
$EndComp
Wire Wire Line
	3600 3800 3900 3800
Wire Wire Line
	3900 4000 3600 4000
Text GLabel 3000 3600 0    50   Input ~ 0
RF.SDN
Text GLabel 3800 4200 0    50   Input ~ 0
RF.SCLK
Text GLabel 3800 4300 0    50   Input ~ 0
RF.SDI
Text GLabel 3800 4400 0    50   Output ~ 0
RF.SDO
Text GLabel 3800 4500 0    50   Input ~ 0
RF.SEL
Text GLabel 3800 4600 0    50   Output ~ 0
RF.IRQ
Text GLabel 4750 4300 2    50   BiDi ~ 0
RF.GPIO0
Text GLabel 4750 4400 2    50   BiDi ~ 0
RF.GPIO1
Text GLabel 4750 4500 2    50   BiDi ~ 0
RF.GPIO2
Text GLabel 4750 4600 2    50   BiDi ~ 0
RF.GPIO3
NoConn ~ 4700 3800
Wire Wire Line
	4700 3600 5550 3600
Wire Wire Line
	4700 4000 5250 4000
Wire Wire Line
	4700 4100 5250 4100
Wire Wire Line
	4700 4300 4750 4300
Wire Wire Line
	4750 4400 4700 4400
Wire Wire Line
	4700 4500 4750 4500
Wire Wire Line
	4750 4600 4700 4600
Text Label 4700 3600 0    50   ~ 0
TX
Text Label 4700 4000 0    50   ~ 0
RX+
Text Label 4700 4100 0    50   ~ 0
RX-
Wire Wire Line
	3900 4200 3800 4200
Wire Wire Line
	3800 4300 3900 4300
Wire Wire Line
	3800 4500 3900 4500
Wire Wire Line
	3900 4600 3800 4600
Text Label 8600 3600 0    50   ~ 0
ANT
Wire Wire Line
	6450 3600 6800 3600
Connection ~ 6450 3600
$Comp
L Device:R_Small_US R78
U 1 1 5E2F70A6
P 3100 3400
F 0 "R78" H 3168 3446 50  0000 L CNN
F 1 "10K" H 3168 3355 50  0000 L CNN
F 2 "Resistor_SMD:R_0402_1005Metric" H 3100 3400 50  0001 C CNN
F 3 "~" H 3100 3400 50  0001 C CNN
F 4 "RMCF0402JT10K0CT" H 3100 3400 50  0001 C CNN "Digikey part"
F 5 "RMCF0402JT10K0" H 3100 3400 50  0001 C CNN "part#"
	1    3100 3400
	1    0    0    -1  
$EndComp
$Comp
L power:+3V3 #PWR0187
U 1 1 5E2F73E2
P 3100 3300
F 0 "#PWR0187" H 3100 3150 50  0001 C CNN
F 1 "+3V3" H 3115 3473 50  0000 C CNN
F 2 "" H 3100 3300 50  0001 C CNN
F 3 "" H 3100 3300 50  0001 C CNN
	1    3100 3300
	1    0    0    -1  
$EndComp
Wire Wire Line
	3000 3600 3100 3600
Wire Wire Line
	3100 3500 3100 3600
Connection ~ 3100 3600
Wire Wire Line
	3100 3600 3900 3600
Wire Wire Line
	3800 4400 3900 4400
Text Notes 3350 4900 0    50   ~ 0
Leave pin 18 floating.\nGround exposed pad instead (see data sheet).
$EndSCHEMATC
