EESchema Schematic File Version 4
EELAYER 30 0
EELAYER END
$Descr A4 11693 8268
encoding utf-8
Sheet 6 9
Title "FPC-III"
Date "2020-01-21"
Rev "1.0"
Comp "Gary Wong"
Comment1 "DDR3 SDRAM"
Comment2 ""
Comment3 ""
Comment4 ""
$EndDescr
$Comp
L fpc-iii:IS43TR16256A-125KBL-TR U?
U 1 1 5E16F2CB
P 7700 2500
AR Path="/5E16F2CB" Ref="U?"  Part="1" 
AR Path="/5E16EC9B/5E16F2CB" Ref="U9"  Part="1" 
F 0 "U9" H 7700 4267 50  0000 C CNN
F 1 "IS43TR16256A-125KBL" H 7700 4176 50  0000 C CNN
F 2 "fpc-iii:BGA96C80P9X16_900X1300X120" H 7700 2500 50  0001 L BNN
F 3 "http://www.issi.com/WW/pdf/43-46TR16256A-85120AL.pdf" H 7700 2500 50  0001 L BNN
F 4 "706-1727" H 7700 2500 50  0001 C CNN "Digikey part"
F 5 "IS43TR16256A-125KBL" H 7700 2500 50  0001 C CNN "part#"
	1    7700 2500
	1    0    0    -1  
$EndComp
$Comp
L fpc-iii:GND #PWR0115
U 1 1 5E171FF0
P 8400 4100
F 0 "#PWR0115" H 8400 3850 50  0001 C CNN
F 1 "GND" H 8395 3927 50  0000 C CNN
F 2 "" H 8400 4100 50  0001 C CNN
F 3 "" H 8400 4100 50  0001 C CNN
	1    8400 4100
	1    0    0    -1  
$EndComp
Wire Wire Line
	8400 3900 8400 4000
Connection ~ 8400 4000
Wire Wire Line
	8400 4000 8400 4100
$Comp
L Device:R_Small_US R57
U 1 1 5E14C32C
P 9800 1600
F 0 "R57" H 9868 1646 50  0000 L CNN
F 1 "240" H 9868 1555 50  0000 L CNN
F 2 "Resistor_SMD:R_0402_1005Metric" H 9800 1600 50  0001 C CNN
F 3 "~" H 9800 1600 50  0001 C CNN
F 4 "RMCF0402FT240RCT" H 9800 1600 50  0001 C CNN "Digikey part"
F 5 "1%" H 9800 1600 50  0001 C CNN "Tolerance"
F 6 "RMCF0402FT240R" H 9800 1600 50  0001 C CNN "part#"
	1    9800 1600
	1    0    0    -1  
$EndComp
$Comp
L fpc-iii:GND #PWR0120
U 1 1 5E14CB7C
P 9800 1800
F 0 "#PWR0120" H 9800 1550 50  0001 C CNN
F 1 "GND" H 9795 1627 50  0000 C CNN
F 2 "" H 9800 1800 50  0001 C CNN
F 3 "" H 9800 1800 50  0001 C CNN
	1    9800 1800
	1    0    0    -1  
$EndComp
Wire Wire Line
	9800 1800 9800 1700
$Comp
L power:+1V5 #PWR0116
U 1 1 5E14ECE3
P 8500 750
F 0 "#PWR0116" H 8500 600 50  0001 C CNN
F 1 "+1V5" H 8515 923 50  0000 C CNN
F 2 "" H 8500 750 50  0001 C CNN
F 3 "" H 8500 750 50  0001 C CNN
	1    8500 750 
	1    0    0    -1  
$EndComp
Wire Wire Line
	8400 1000 8500 1000
Wire Wire Line
	8400 1100 8500 1100
Wire Wire Line
	8500 1100 8500 1000
Connection ~ 8500 1000
NoConn ~ 7000 3900
$Comp
L Device:R_Small_US R35
U 1 1 5E1CA6CD
P 6400 1400
F 0 "R35" V 6400 1050 50  0000 C CNN
F 1 "51" V 6400 1200 50  0000 C CNN
F 2 "Resistor_SMD:R_0402_1005Metric" H 6400 1400 50  0001 C CNN
F 3 "~" H 6400 1400 50  0001 C CNN
F 4 "RMCF0402FT51R0CT" H 6400 1400 50  0001 C CNN "Digikey part"
F 5 "1%" H 6400 1400 50  0001 C CNN "Tolerance"
F 6 "RMCF0402FT51R0" H 6400 1400 50  0001 C CNN "part#"
	1    6400 1400
	0    1    1    0   
$EndComp
$Comp
L Device:R_Small_US R36
U 1 1 5E1CB3D4
P 6400 1600
F 0 "R36" V 6400 1250 50  0000 C CNN
F 1 "51" V 6400 1400 50  0000 C CNN
F 2 "Resistor_SMD:R_0402_1005Metric" H 6400 1600 50  0001 C CNN
F 3 "~" H 6400 1600 50  0001 C CNN
F 4 "RMCF0402FT51R0CT" H 6400 1600 50  0001 C CNN "Digikey part"
F 5 "1%" H 6400 1600 50  0001 C CNN "Tolerance"
F 6 "RMCF0402FT51R0" H 6400 1600 50  0001 C CNN "part#"
	1    6400 1600
	0    1    1    0   
$EndComp
$Comp
L Device:R_Small_US R37
U 1 1 5E1CB573
P 6400 1700
F 0 "R37" V 6400 1350 50  0000 C CNN
F 1 "51" V 6400 1500 50  0000 C CNN
F 2 "Resistor_SMD:R_0402_1005Metric" H 6400 1700 50  0001 C CNN
F 3 "~" H 6400 1700 50  0001 C CNN
F 4 "RMCF0402FT51R0CT" H 6400 1700 50  0001 C CNN "Digikey part"
F 5 "1%" H 6400 1700 50  0001 C CNN "Tolerance"
F 6 "RMCF0402FT51R0" H 6400 1700 50  0001 C CNN "part#"
	1    6400 1700
	0    1    1    0   
$EndComp
$Comp
L Device:R_Small_US R38
U 1 1 5E1CB6D0
P 6400 1800
F 0 "R38" V 6400 1450 50  0000 C CNN
F 1 "51" V 6400 1600 50  0000 C CNN
F 2 "Resistor_SMD:R_0402_1005Metric" H 6400 1800 50  0001 C CNN
F 3 "~" H 6400 1800 50  0001 C CNN
F 4 "RMCF0402FT51R0CT" H 6400 1800 50  0001 C CNN "Digikey part"
F 5 "1%" H 6400 1800 50  0001 C CNN "Tolerance"
F 6 "RMCF0402FT51R0" H 6400 1800 50  0001 C CNN "part#"
	1    6400 1800
	0    1    1    0   
$EndComp
$Comp
L Device:R_Small_US R39
U 1 1 5E1CB985
P 6400 2000
F 0 "R39" V 6400 1650 50  0000 C CNN
F 1 "51" V 6400 1800 50  0000 C CNN
F 2 "Resistor_SMD:R_0402_1005Metric" H 6400 2000 50  0001 C CNN
F 3 "~" H 6400 2000 50  0001 C CNN
F 4 "RMCF0402FT51R0CT" H 6400 2000 50  0001 C CNN "Digikey part"
F 5 "1%" H 6400 2000 50  0001 C CNN "Tolerance"
F 6 "RMCF0402FT51R0" H 6400 2000 50  0001 C CNN "part#"
	1    6400 2000
	0    1    1    0   
$EndComp
$Comp
L Device:R_Small_US R40
U 1 1 5E1CBA86
P 6400 2100
F 0 "R40" V 6400 1750 50  0000 C CNN
F 1 "51" V 6400 1900 50  0000 C CNN
F 2 "Resistor_SMD:R_0402_1005Metric" H 6400 2100 50  0001 C CNN
F 3 "~" H 6400 2100 50  0001 C CNN
F 4 "RMCF0402FT51R0CT" H 6400 2100 50  0001 C CNN "Digikey part"
F 5 "1%" H 6400 2100 50  0001 C CNN "Tolerance"
F 6 "RMCF0402FT51R0" H 6400 2100 50  0001 C CNN "part#"
	1    6400 2100
	0    1    1    0   
$EndComp
$Comp
L Device:R_Small_US R41
U 1 1 5E1CBC3F
P 6400 2200
F 0 "R41" V 6400 1850 50  0000 C CNN
F 1 "51" V 6400 2000 50  0000 C CNN
F 2 "Resistor_SMD:R_0402_1005Metric" H 6400 2200 50  0001 C CNN
F 3 "~" H 6400 2200 50  0001 C CNN
F 4 "RMCF0402FT51R0CT" H 6400 2200 50  0001 C CNN "Digikey part"
F 5 "1%" H 6400 2200 50  0001 C CNN "Tolerance"
F 6 "RMCF0402FT51R0" H 6400 2200 50  0001 C CNN "part#"
	1    6400 2200
	0    1    1    0   
$EndComp
$Comp
L Device:R_Small_US R42
U 1 1 5E1CBE09
P 6400 2400
F 0 "R42" V 6400 2050 50  0000 C CNN
F 1 "51" V 6400 2200 50  0000 C CNN
F 2 "Resistor_SMD:R_0402_1005Metric" H 6400 2400 50  0001 C CNN
F 3 "~" H 6400 2400 50  0001 C CNN
F 4 "RMCF0402FT51R0CT" H 6400 2400 50  0001 C CNN "Digikey part"
F 5 "1%" H 6400 2400 50  0001 C CNN "Tolerance"
F 6 "RMCF0402FT51R0" H 6400 2400 50  0001 C CNN "part#"
	1    6400 2400
	0    1    1    0   
$EndComp
$Comp
L Device:R_Small_US R43
U 1 1 5E1CBEE1
P 6400 2500
F 0 "R43" V 6400 2150 50  0000 C CNN
F 1 "51" V 6400 2300 50  0000 C CNN
F 2 "Resistor_SMD:R_0402_1005Metric" H 6400 2500 50  0001 C CNN
F 3 "~" H 6400 2500 50  0001 C CNN
F 4 "RMCF0402FT51R0CT" H 6400 2500 50  0001 C CNN "Digikey part"
F 5 "1%" H 6400 2500 50  0001 C CNN "Tolerance"
F 6 "RMCF0402FT51R0" H 6400 2500 50  0001 C CNN "part#"
	1    6400 2500
	0    1    1    0   
$EndComp
$Comp
L Device:R_Small_US R44
U 1 1 5E1CC08A
P 6400 2600
F 0 "R44" V 6400 2250 50  0000 C CNN
F 1 "51" V 6400 2400 50  0000 C CNN
F 2 "Resistor_SMD:R_0402_1005Metric" H 6400 2600 50  0001 C CNN
F 3 "~" H 6400 2600 50  0001 C CNN
F 4 "RMCF0402FT51R0CT" H 6400 2600 50  0001 C CNN "Digikey part"
F 5 "1%" H 6400 2600 50  0001 C CNN "Tolerance"
F 6 "RMCF0402FT51R0" H 6400 2600 50  0001 C CNN "part#"
	1    6400 2600
	0    1    1    0   
$EndComp
$Comp
L Device:R_Small_US R45
U 1 1 5E1CC1E4
P 6400 2700
F 0 "R45" V 6400 2350 50  0000 C CNN
F 1 "51" V 6400 2500 50  0000 C CNN
F 2 "Resistor_SMD:R_0402_1005Metric" H 6400 2700 50  0001 C CNN
F 3 "~" H 6400 2700 50  0001 C CNN
F 4 "RMCF0402FT51R0CT" H 6400 2700 50  0001 C CNN "Digikey part"
F 5 "1%" H 6400 2700 50  0001 C CNN "Tolerance"
F 6 "RMCF0402FT51R0" H 6400 2700 50  0001 C CNN "part#"
	1    6400 2700
	0    1    1    0   
$EndComp
$Comp
L Device:R_Small_US R46
U 1 1 5E1CC7C8
P 6400 2800
F 0 "R46" V 6400 2450 50  0000 C CNN
F 1 "51" V 6400 2600 50  0000 C CNN
F 2 "Resistor_SMD:R_0402_1005Metric" H 6400 2800 50  0001 C CNN
F 3 "~" H 6400 2800 50  0001 C CNN
F 4 "RMCF0402FT51R0CT" H 6400 2800 50  0001 C CNN "Digikey part"
F 5 "1%" H 6400 2800 50  0001 C CNN "Tolerance"
F 6 "RMCF0402FT51R0" H 6400 2800 50  0001 C CNN "part#"
	1    6400 2800
	0    1    1    0   
$EndComp
$Comp
L Device:R_Small_US R47
U 1 1 5E1CC8C4
P 6400 2900
F 0 "R47" V 6400 2550 50  0000 C CNN
F 1 "51" V 6400 2700 50  0000 C CNN
F 2 "Resistor_SMD:R_0402_1005Metric" H 6400 2900 50  0001 C CNN
F 3 "~" H 6400 2900 50  0001 C CNN
F 4 "RMCF0402FT51R0CT" H 6400 2900 50  0001 C CNN "Digikey part"
F 5 "1%" H 6400 2900 50  0001 C CNN "Tolerance"
F 6 "RMCF0402FT51R0" H 6400 2900 50  0001 C CNN "part#"
	1    6400 2900
	0    1    1    0   
$EndComp
$Comp
L Device:R_Small_US R48
U 1 1 5E1CCFA0
P 6400 3000
F 0 "R48" V 6400 2650 50  0000 C CNN
F 1 "51" V 6400 2800 50  0000 C CNN
F 2 "Resistor_SMD:R_0402_1005Metric" H 6400 3000 50  0001 C CNN
F 3 "~" H 6400 3000 50  0001 C CNN
F 4 "RMCF0402FT51R0CT" H 6400 3000 50  0001 C CNN "Digikey part"
F 5 "1%" H 6400 3000 50  0001 C CNN "Tolerance"
F 6 "RMCF0402FT51R0" H 6400 3000 50  0001 C CNN "part#"
	1    6400 3000
	0    1    1    0   
$EndComp
$Comp
L Device:R_Small_US R49
U 1 1 5E1CCFA6
P 6400 3100
F 0 "R49" V 6400 2750 50  0000 C CNN
F 1 "51" V 6400 2900 50  0000 C CNN
F 2 "Resistor_SMD:R_0402_1005Metric" H 6400 3100 50  0001 C CNN
F 3 "~" H 6400 3100 50  0001 C CNN
F 4 "RMCF0402FT51R0CT" H 6400 3100 50  0001 C CNN "Digikey part"
F 5 "1%" H 6400 3100 50  0001 C CNN "Tolerance"
F 6 "RMCF0402FT51R0" H 6400 3100 50  0001 C CNN "part#"
	1    6400 3100
	0    1    1    0   
$EndComp
$Comp
L Device:R_Small_US R50
U 1 1 5E1CCFAC
P 6400 3200
F 0 "R50" V 6400 2850 50  0000 C CNN
F 1 "51" V 6400 3000 50  0000 C CNN
F 2 "Resistor_SMD:R_0402_1005Metric" H 6400 3200 50  0001 C CNN
F 3 "~" H 6400 3200 50  0001 C CNN
F 4 "RMCF0402FT51R0CT" H 6400 3200 50  0001 C CNN "Digikey part"
F 5 "1%" H 6400 3200 50  0001 C CNN "Tolerance"
F 6 "RMCF0402FT51R0" H 6400 3200 50  0001 C CNN "part#"
	1    6400 3200
	0    1    1    0   
$EndComp
$Comp
L Device:R_Small_US R51
U 1 1 5E1CCFB2
P 6400 3300
F 0 "R51" V 6400 2950 50  0000 C CNN
F 1 "51" V 6400 3100 50  0000 C CNN
F 2 "Resistor_SMD:R_0402_1005Metric" H 6400 3300 50  0001 C CNN
F 3 "~" H 6400 3300 50  0001 C CNN
F 4 "RMCF0402FT51R0CT" H 6400 3300 50  0001 C CNN "Digikey part"
F 5 "1%" H 6400 3300 50  0001 C CNN "Tolerance"
F 6 "RMCF0402FT51R0" H 6400 3300 50  0001 C CNN "part#"
	1    6400 3300
	0    1    1    0   
$EndComp
$Comp
L Device:R_Small_US R52
U 1 1 5E1CCFB8
P 6400 3400
F 0 "R52" V 6400 3050 50  0000 C CNN
F 1 "51" V 6400 3200 50  0000 C CNN
F 2 "Resistor_SMD:R_0402_1005Metric" H 6400 3400 50  0001 C CNN
F 3 "~" H 6400 3400 50  0001 C CNN
F 4 "RMCF0402FT51R0CT" H 6400 3400 50  0001 C CNN "Digikey part"
F 5 "1%" H 6400 3400 50  0001 C CNN "Tolerance"
F 6 "RMCF0402FT51R0" H 6400 3400 50  0001 C CNN "part#"
	1    6400 3400
	0    1    1    0   
$EndComp
$Comp
L Device:R_Small_US R53
U 1 1 5E1CCFBE
P 6400 3500
F 0 "R53" V 6400 3150 50  0000 C CNN
F 1 "51" V 6400 3300 50  0000 C CNN
F 2 "Resistor_SMD:R_0402_1005Metric" H 6400 3500 50  0001 C CNN
F 3 "~" H 6400 3500 50  0001 C CNN
F 4 "RMCF0402FT51R0CT" H 6400 3500 50  0001 C CNN "Digikey part"
F 5 "1%" H 6400 3500 50  0001 C CNN "Tolerance"
F 6 "RMCF0402FT51R0" H 6400 3500 50  0001 C CNN "part#"
	1    6400 3500
	0    1    1    0   
$EndComp
$Comp
L Device:R_Small_US R54
U 1 1 5E1CD5AA
P 6400 3600
F 0 "R54" V 6400 3250 50  0000 C CNN
F 1 "51" V 6400 3400 50  0000 C CNN
F 2 "Resistor_SMD:R_0402_1005Metric" H 6400 3600 50  0001 C CNN
F 3 "~" H 6400 3600 50  0001 C CNN
F 4 "RMCF0402FT51R0CT" H 6400 3600 50  0001 C CNN "Digikey part"
F 5 "1%" H 6400 3600 50  0001 C CNN "Tolerance"
F 6 "RMCF0402FT51R0" H 6400 3600 50  0001 C CNN "part#"
	1    6400 3600
	0    1    1    0   
$EndComp
$Comp
L Device:R_Small_US R55
U 1 1 5E1CD5B0
P 6400 3700
F 0 "R55" V 6400 3350 50  0000 C CNN
F 1 "51" V 6400 3500 50  0000 C CNN
F 2 "Resistor_SMD:R_0402_1005Metric" H 6400 3700 50  0001 C CNN
F 3 "~" H 6400 3700 50  0001 C CNN
F 4 "RMCF0402FT51R0CT" H 6400 3700 50  0001 C CNN "Digikey part"
F 5 "1%" H 6400 3700 50  0001 C CNN "Tolerance"
F 6 "RMCF0402FT51R0" H 6400 3700 50  0001 C CNN "part#"
	1    6400 3700
	0    1    1    0   
$EndComp
$Comp
L Device:R_Small_US R56
U 1 1 5E1CD5B6
P 6400 3800
F 0 "R56" V 6400 3450 50  0000 C CNN
F 1 "51" V 6400 3600 50  0000 C CNN
F 2 "Resistor_SMD:R_0402_1005Metric" H 6400 3800 50  0001 C CNN
F 3 "~" H 6400 3800 50  0001 C CNN
F 4 "RMCF0402FT51R0CT" H 6400 3800 50  0001 C CNN "Digikey part"
F 5 "1%" H 6400 3800 50  0001 C CNN "Tolerance"
F 6 "RMCF0402FT51R0" H 6400 3800 50  0001 C CNN "part#"
	1    6400 3800
	0    1    1    0   
$EndComp
Wire Wire Line
	6300 1200 6300 1300
Connection ~ 6300 1400
Wire Wire Line
	6300 1400 6300 1600
Connection ~ 6300 1600
Wire Wire Line
	6300 1600 6300 1700
Connection ~ 6300 1700
Wire Wire Line
	6300 1700 6300 1800
Connection ~ 6300 1800
Wire Wire Line
	6300 1800 6300 2000
Connection ~ 6300 2000
Wire Wire Line
	6300 2000 6300 2100
Connection ~ 6300 2100
Wire Wire Line
	6300 2100 6300 2200
Connection ~ 6300 2200
Wire Wire Line
	6300 2200 6300 2400
Connection ~ 6300 2400
Wire Wire Line
	6300 2400 6300 2500
Connection ~ 6300 2500
Wire Wire Line
	6300 2500 6300 2600
Connection ~ 6300 2600
Wire Wire Line
	6300 2600 6300 2700
Connection ~ 6300 2700
Wire Wire Line
	6300 2700 6300 2800
Connection ~ 6300 2800
Wire Wire Line
	6300 2800 6300 2900
Connection ~ 6300 2900
Wire Wire Line
	6300 2900 6300 3000
Connection ~ 6300 3000
Wire Wire Line
	6300 3000 6300 3100
Connection ~ 6300 3100
Wire Wire Line
	6300 3100 6300 3200
Connection ~ 6300 3200
Wire Wire Line
	6300 3200 6300 3300
Connection ~ 6300 3300
Wire Wire Line
	6300 3300 6300 3400
Connection ~ 6300 3400
Wire Wire Line
	6300 3400 6300 3500
Connection ~ 6300 3500
Wire Wire Line
	6300 3500 6300 3600
Connection ~ 6300 3600
Wire Wire Line
	6300 3600 6300 3700
Connection ~ 6300 3700
Wire Wire Line
	6300 3700 6300 3800
Text Label 7000 2000 2    50   ~ 0
BA0
Text Label 7000 2100 2    50   ~ 0
BA1
Text Label 7000 2200 2    50   ~ 0
BA2
Text Label 7000 2400 2    50   ~ 0
A0
Text Label 7000 2500 2    50   ~ 0
A1
Text Label 7000 2600 2    50   ~ 0
A2
Text Label 7000 2700 2    50   ~ 0
A3
Text Label 7000 2800 2    50   ~ 0
A4
Text Label 7000 2900 2    50   ~ 0
A5
Text Label 7000 3000 2    50   ~ 0
A6
Text Label 7000 3100 2    50   ~ 0
A7
Text Label 7000 3200 2    50   ~ 0
A8
Text Label 7000 3300 2    50   ~ 0
A9
Text Label 7000 3400 2    50   ~ 0
A10
Text Label 7000 3500 2    50   ~ 0
A11
Text Label 7000 3600 2    50   ~ 0
A12
Text Label 7000 3700 2    50   ~ 0
A13
Text Label 7000 3800 2    50   ~ 0
A14
Entry Wire Line
	8900 2500 9000 2600
Entry Wire Line
	8900 2600 9000 2700
Entry Wire Line
	8900 2700 9000 2800
Entry Wire Line
	8900 2800 9000 2900
Entry Wire Line
	8900 2900 9000 3000
Entry Wire Line
	8900 3000 9000 3100
Entry Wire Line
	8900 3100 9000 3200
Entry Wire Line
	8900 3200 9000 3300
Entry Wire Line
	8900 3600 9000 3700
Entry Wire Line
	8900 3700 9000 3800
Entry Wire Line
	8900 4350 9000 4450
Entry Wire Line
	9400 3400 9500 3500
Entry Wire Line
	9400 3500 9500 3600
Entry Wire Line
	9400 2300 9500 2400
Entry Wire Line
	9400 2200 9500 2300
Entry Wire Line
	9400 2100 9500 2200
Entry Wire Line
	9400 2000 9500 2100
Entry Wire Line
	9400 1900 9500 2000
Entry Wire Line
	9400 1800 9500 1900
Entry Wire Line
	9400 1700 9500 1800
Entry Wire Line
	9400 1600 9500 1700
Wire Wire Line
	8900 3700 8400 3700
Wire Wire Line
	8400 3600 8900 3600
Wire Wire Line
	8900 3200 8400 3200
Wire Wire Line
	8400 3100 8900 3100
Wire Wire Line
	8900 3000 8400 3000
Wire Wire Line
	8400 2900 8900 2900
Wire Wire Line
	8900 2800 8400 2800
Wire Wire Line
	8400 2700 8900 2700
Wire Wire Line
	8900 2600 8400 2600
Wire Wire Line
	8400 2500 8900 2500
Entry Wire Line
	4450 2750 4550 2650
Entry Wire Line
	2000 2650 2100 2750
Wire Wire Line
	4050 2750 4450 2750
Wire Wire Line
	2100 2750 2550 2750
Entry Wire Line
	4450 2450 4550 2350
Entry Wire Line
	4450 2550 4550 2450
Entry Wire Line
	4450 2850 4550 2750
Entry Wire Line
	4450 2950 4550 2850
Entry Wire Line
	4450 3050 4550 2950
Entry Wire Line
	2000 2350 2100 2450
Entry Wire Line
	2000 2450 2100 2550
Entry Wire Line
	2000 2750 2100 2850
Entry Wire Line
	2000 2850 2100 2950
Wire Wire Line
	2100 2450 2550 2450
Wire Wire Line
	2550 2550 2100 2550
Wire Wire Line
	2100 2850 2550 2850
Wire Wire Line
	2550 2950 2100 2950
Wire Wire Line
	4050 2450 4450 2450
Wire Wire Line
	4450 2550 4050 2550
Wire Wire Line
	4050 2850 4450 2850
Wire Wire Line
	4450 2950 4050 2950
Wire Wire Line
	4050 3050 4450 3050
Text Label 8400 3600 0    50   ~ 0
DQSL+
Text Label 8400 3700 0    50   ~ 0
DQSL-
Text Label 2550 2750 2    50   ~ 0
DQSL+
Text Label 4050 2750 0    50   ~ 0
DQSL-
Wire Wire Line
	6800 4350 6800 4100
Wire Wire Line
	6800 4100 7000 4100
Wire Wire Line
	6800 4350 8900 4350
Text Label 7000 4100 2    50   ~ 0
DML
Wire Bus Line
	2000 2050 4550 2050
Wire Wire Line
	8400 1600 9400 1600
Wire Wire Line
	9400 1700 8400 1700
Wire Wire Line
	8400 1800 9400 1800
Wire Wire Line
	9400 1900 8400 1900
Wire Wire Line
	8400 2000 9400 2000
Wire Wire Line
	9400 2100 8400 2100
Wire Wire Line
	8400 2200 9400 2200
Wire Wire Line
	9400 2300 8400 2300
Wire Wire Line
	8400 3400 9400 3400
Wire Wire Line
	9400 3500 8400 3500
Text Label 8400 2500 0    50   ~ 0
DQ0
Text Label 8400 2600 0    50   ~ 0
DQ1
Text Label 8400 2700 0    50   ~ 0
DQ2
Text Label 8400 2800 0    50   ~ 0
DQ3
Text Label 8400 2900 0    50   ~ 0
DQ4
Text Label 8400 3000 0    50   ~ 0
DQ5
Text Label 8400 3100 0    50   ~ 0
DQ6
Text Label 8400 3200 0    50   ~ 0
DQ7
Text Label 4050 2450 0    50   ~ 0
DQ6
Text Label 4050 2550 0    50   ~ 0
DQ4
Text Label 4050 2850 0    50   ~ 0
DQ7
Text Label 4050 2950 0    50   ~ 0
DQ1
Text Label 4050 3050 0    50   ~ 0
DQ3
Text Label 2550 2450 2    50   ~ 0
DQ0
Text Label 2550 2550 2    50   ~ 0
DQ2
Text Label 2550 2850 2    50   ~ 0
DML
Text Label 2550 2950 2    50   ~ 0
DQ5
Text Label 7000 1800 2    50   ~ 0
~WE
Text Label 7000 1700 2    50   ~ 0
~CAS
Text Label 7000 1600 2    50   ~ 0
~RAS
Text Label 7000 1400 2    50   ~ 0
~CS
Text Label 8400 1600 0    50   ~ 0
DQ8
Text Label 8400 1700 0    50   ~ 0
DQ9
Text Label 8400 1800 0    50   ~ 0
DQ10
Text Label 8400 1900 0    50   ~ 0
DQ11
Text Label 8400 2000 0    50   ~ 0
DQ12
Text Label 8400 2100 0    50   ~ 0
DQ13
Text Label 8400 2200 0    50   ~ 0
DQ14
Text Label 8400 2300 0    50   ~ 0
DQ15
Text Label 8400 3400 0    50   ~ 0
DQSU+
Text Label 8400 3500 0    50   ~ 0
DQSU-
Entry Wire Line
	9400 4550 9500 4650
Wire Wire Line
	9400 4550 6750 4550
Wire Wire Line
	6750 4550 6750 1900
Wire Wire Line
	6750 1900 7000 1900
Text Label 7000 1900 2    50   ~ 0
DMU
Wire Bus Line
	9500 5250 4550 5250
$Comp
L Device:C_Small C60
U 1 1 5E2384F7
P 8750 850
F 0 "C60" H 8842 896 50  0000 L CNN
F 1 "100n" H 8842 805 50  0000 L CNN
F 2 "Capacitor_SMD:C_0402_1005Metric" H 8750 850 50  0001 C CNN
F 3 "~" H 8750 850 50  0001 C CNN
F 4 "*" H 8750 850 50  0001 C CNN "Tolerance"
F 5 "1276-1004-1" H 8750 850 50  0001 C CNN "Digikey part"
F 6 "CL05F104ZO5NNNC" H 8750 850 50  0001 C CNN "part#"
	1    8750 850 
	1    0    0    -1  
$EndComp
$Comp
L fpc-iii:GND #PWR0117
U 1 1 5E238FDD
P 8750 950
F 0 "#PWR0117" H 8750 700 50  0001 C CNN
F 1 "GND" H 8745 777 50  0000 C CNN
F 2 "" H 8750 950 50  0001 C CNN
F 3 "" H 8750 950 50  0001 C CNN
	1    8750 950 
	1    0    0    -1  
$EndComp
Wire Wire Line
	8500 750  8750 750 
Wire Wire Line
	8500 750  8500 1000
Connection ~ 8500 750 
Connection ~ 8750 750 
$Comp
L Device:C_Small C61
U 1 1 5E242332
P 9150 850
F 0 "C61" H 9242 896 50  0000 L CNN
F 1 "100n" H 9242 805 50  0000 L CNN
F 2 "Capacitor_SMD:C_0402_1005Metric" H 9150 850 50  0001 C CNN
F 3 "~" H 9150 850 50  0001 C CNN
F 4 "*" H 9150 850 50  0001 C CNN "Tolerance"
F 5 "1276-1004-1" H 9150 850 50  0001 C CNN "Digikey part"
F 6 "CL05F104ZO5NNNC" H 9150 850 50  0001 C CNN "part#"
	1    9150 850 
	1    0    0    -1  
$EndComp
$Comp
L fpc-iii:GND #PWR0118
U 1 1 5E242338
P 9150 950
F 0 "#PWR0118" H 9150 700 50  0001 C CNN
F 1 "GND" H 9145 777 50  0000 C CNN
F 2 "" H 9150 950 50  0001 C CNN
F 3 "" H 9150 950 50  0001 C CNN
	1    9150 950 
	1    0    0    -1  
$EndComp
$Comp
L Device:C_Small C62
U 1 1 5E2450F0
P 9550 850
F 0 "C62" H 9642 896 50  0000 L CNN
F 1 "100n" H 9642 805 50  0000 L CNN
F 2 "Capacitor_SMD:C_0402_1005Metric" H 9550 850 50  0001 C CNN
F 3 "~" H 9550 850 50  0001 C CNN
F 4 "*" H 9550 850 50  0001 C CNN "Tolerance"
F 5 "1276-1004-1" H 9550 850 50  0001 C CNN "Digikey part"
F 6 "CL05F104ZO5NNNC" H 9550 850 50  0001 C CNN "part#"
	1    9550 850 
	1    0    0    -1  
$EndComp
$Comp
L fpc-iii:GND #PWR0119
U 1 1 5E2450F6
P 9550 950
F 0 "#PWR0119" H 9550 700 50  0001 C CNN
F 1 "GND" H 9545 777 50  0000 C CNN
F 2 "" H 9550 950 50  0001 C CNN
F 3 "" H 9550 950 50  0001 C CNN
	1    9550 950 
	1    0    0    -1  
$EndComp
$Comp
L Device:C_Small C63
U 1 1 5E2480D2
P 9950 850
F 0 "C63" H 10042 896 50  0000 L CNN
F 1 "100n" H 10042 805 50  0000 L CNN
F 2 "Capacitor_SMD:C_0402_1005Metric" H 9950 850 50  0001 C CNN
F 3 "~" H 9950 850 50  0001 C CNN
F 4 "*" H 9950 850 50  0001 C CNN "Tolerance"
F 5 "1276-1004-1" H 9950 850 50  0001 C CNN "Digikey part"
F 6 "CL05F104ZO5NNNC" H 9950 850 50  0001 C CNN "part#"
	1    9950 850 
	1    0    0    -1  
$EndComp
$Comp
L fpc-iii:GND #PWR0121
U 1 1 5E2480D8
P 9950 950
F 0 "#PWR0121" H 9950 700 50  0001 C CNN
F 1 "GND" H 9945 777 50  0000 C CNN
F 2 "" H 9950 950 50  0001 C CNN
F 3 "" H 9950 950 50  0001 C CNN
	1    9950 950 
	1    0    0    -1  
$EndComp
Wire Wire Line
	8750 750  9150 750 
Connection ~ 9150 750 
Wire Wire Line
	9150 750  9550 750 
Connection ~ 9550 750 
Wire Wire Line
	9550 750  9950 750 
Text Label 7000 1100 2    50   ~ 0
CK+
Text Label 7000 1200 2    50   ~ 0
CK-
Text Label 7000 1300 2    50   ~ 0
CKE
Wire Wire Line
	8400 1200 8400 1300
Text Label 7000 1000 2    50   ~ 0
~RESET
Text Label 7000 1500 2    50   ~ 0
ODT
Text Label 8400 1300 0    50   ~ 0
VREF
Wire Bus Line
	9000 5150 4550 5150
Text Label 2550 6000 2    50   ~ 0
DQSU+
Text Label 4050 6000 0    50   ~ 0
DQSU-
Entry Wire Line
	4450 6000 4550 5900
Wire Bus Line
	4550 5250 2000 5250
Connection ~ 4550 5250
Entry Wire Line
	2000 5900 2100 6000
Wire Wire Line
	2550 6000 2100 6000
Wire Wire Line
	4050 6000 4450 6000
Text Label 2550 3050 2    50   ~ 0
VREF
Text Label 4050 6600 0    50   ~ 0
VREF
Entry Wire Line
	2000 5800 2100 5900
Entry Wire Line
	2000 5700 2100 5800
Entry Wire Line
	2000 5600 2100 5700
Entry Wire Line
	2000 6200 2100 6300
Entry Wire Line
	2000 6300 2100 6400
Entry Wire Line
	4450 5700 4550 5600
Entry Wire Line
	4450 5800 4550 5700
Entry Wire Line
	4450 5900 4550 5800
Entry Wire Line
	4450 6300 4550 6200
Wire Wire Line
	4050 5700 4450 5700
Wire Wire Line
	4050 5800 4450 5800
Wire Wire Line
	4450 5900 4050 5900
Wire Wire Line
	4050 6300 4450 6300
Wire Wire Line
	2550 6300 2100 6300
Wire Wire Line
	2100 6400 2550 6400
Wire Wire Line
	2100 5900 2550 5900
Wire Wire Line
	2100 5800 2550 5800
Wire Wire Line
	2550 5700 2100 5700
Text Label 4050 5700 0    50   ~ 0
DQ8
Text Label 4050 5900 0    50   ~ 0
DMU
Text Label 2550 5700 2    50   ~ 0
DQ9
Text Label 2550 5900 2    50   ~ 0
DQ15
Text Label 2550 5800 2    50   ~ 0
DQ13
Text Label 4050 5800 0    50   ~ 0
DQ11
Text Label 4050 6300 0    50   ~ 0
DQ10
Text Label 2550 6300 2    50   ~ 0
DQ14
Text Label 2550 6400 2    50   ~ 0
DQ12
Entry Wire Line
	6600 3900 6700 3800
Entry Wire Line
	6600 3800 6700 3700
Entry Wire Line
	6600 3700 6700 3600
Entry Wire Line
	6600 3600 6700 3500
Entry Wire Line
	6600 3500 6700 3400
Entry Wire Line
	6600 3400 6700 3300
Entry Wire Line
	6600 3300 6700 3200
Wire Bus Line
	6600 5050 4750 5050
Wire Bus Line
	4750 1950 1800 1950
Connection ~ 4750 5050
Entry Wire Line
	6600 3200 6700 3100
Entry Wire Line
	6600 3100 6700 3000
Entry Wire Line
	6600 3000 6700 2900
Entry Wire Line
	6600 2900 6700 2800
Entry Wire Line
	6600 2800 6700 2700
Entry Wire Line
	6600 2700 6700 2600
Entry Wire Line
	6600 2600 6700 2500
Entry Wire Line
	6600 2500 6700 2400
Entry Wire Line
	6600 2200 6700 2100
Entry Wire Line
	6600 2100 6700 2000
Entry Wire Line
	6600 1800 6700 1700
Entry Wire Line
	6600 1700 6700 1600
Entry Wire Line
	6600 2300 6700 2200
Entry Wire Line
	6600 1900 6700 1800
Entry Wire Line
	6600 1500 6700 1400
Entry Wire Line
	6600 1200 6700 1100
Entry Wire Line
	6600 1300 6700 1200
Wire Wire Line
	6700 1100 6750 1100
Wire Wire Line
	7000 1200 6800 1200
$Comp
L Device:R_Small_US R32
U 1 1 5E42C07E
P 5900 600
F 0 "R32" V 5900 250 50  0000 C CNN
F 1 "51" V 5900 400 50  0000 C CNN
F 2 "Resistor_SMD:R_0402_1005Metric" H 5900 600 50  0001 C CNN
F 3 "~" H 5900 600 50  0001 C CNN
F 4 "RMCF0402FT51R0CT" H 5900 600 50  0001 C CNN "Digikey part"
F 5 "1%" H 5900 600 50  0001 C CNN "Tolerance"
F 6 "RMCF0402FT51R0" H 5900 600 50  0001 C CNN "part#"
	1    5900 600 
	0    1    1    0   
$EndComp
$Comp
L Device:R_Small_US R33
U 1 1 5E42CCC4
P 5900 700
F 0 "R33" V 5900 350 50  0000 C CNN
F 1 "51" V 5900 500 50  0000 C CNN
F 2 "Resistor_SMD:R_0402_1005Metric" H 5900 700 50  0001 C CNN
F 3 "~" H 5900 700 50  0001 C CNN
F 4 "RMCF0402FT51R0CT" H 5900 700 50  0001 C CNN "Digikey part"
F 5 "1%" H 5900 700 50  0001 C CNN "Tolerance"
F 6 "RMCF0402FT51R0" H 5900 700 50  0001 C CNN "part#"
	1    5900 700 
	0    1    1    0   
$EndComp
Wire Wire Line
	5550 1200 5650 1200
$Comp
L Device:C_Small C59
U 1 1 5E44A717
P 5800 850
F 0 "C59" H 5892 896 50  0000 L CNN
F 1 "100n" H 5892 805 50  0000 L CNN
F 2 "Capacitor_SMD:C_0402_1005Metric" H 5800 850 50  0001 C CNN
F 3 "~" H 5800 850 50  0001 C CNN
F 4 "*" H 5800 850 50  0001 C CNN "Tolerance"
F 5 "1276-1004-1" H 5800 850 50  0001 C CNN "Digikey part"
F 6 "CL05F104ZO5NNNC" H 5800 850 50  0001 C CNN "part#"
	1    5800 850 
	1    0    0    -1  
$EndComp
$Comp
L fpc-iii:GND #PWR0112
U 1 1 5E44B6F6
P 5800 950
F 0 "#PWR0112" H 5800 700 50  0001 C CNN
F 1 "GND" H 5795 777 50  0000 C CNN
F 2 "" H 5800 950 50  0001 C CNN
F 3 "" H 5800 950 50  0001 C CNN
	1    5800 950 
	1    0    0    -1  
$EndComp
Wire Wire Line
	5800 600  5800 700 
Connection ~ 5800 700 
Wire Wire Line
	5800 700  5800 750 
Entry Wire Line
	6600 1100 6700 1000
Entry Wire Line
	6600 1400 6700 1300
Wire Wire Line
	6700 1000 7000 1000
Wire Wire Line
	6000 700  6750 700 
Wire Wire Line
	6750 700  6750 1100
Connection ~ 6750 1100
Wire Wire Line
	6750 1100 7000 1100
Wire Wire Line
	6000 600  6800 600 
Wire Wire Line
	6800 600  6800 1200
Connection ~ 6800 1200
Wire Wire Line
	6800 1200 6700 1200
$Comp
L power:+1V5 #PWR0114
U 1 1 5E48D500
P 6500 1100
F 0 "#PWR0114" H 6500 950 50  0001 C CNN
F 1 "+1V5" H 6515 1273 50  0000 C CNN
F 2 "" H 6500 1100 50  0001 C CNN
F 3 "" H 6500 1100 50  0001 C CNN
	1    6500 1100
	1    0    0    -1  
$EndComp
Connection ~ 8400 1300
Text Label 2550 7200 2    50   ~ 0
~RESET
Text Label 5550 1200 0    50   ~ 0
VTT
Text Label 4050 6700 0    50   ~ 0
~CS
Text Label 4050 6500 0    50   ~ 0
~RAS
Text Label 2550 6500 2    50   ~ 0
~CAS
Text Label 4050 6900 0    50   ~ 0
BA0
Entry Wire Line
	4650 6500 4750 6400
Entry Wire Line
	4650 6700 4750 6600
Entry Wire Line
	4650 6900 4750 6800
Entry Wire Line
	4650 6800 4750 6700
Entry Wire Line
	4650 7000 4750 6900
Wire Wire Line
	4050 6900 4650 6900
Wire Wire Line
	4050 6700 4650 6700
Wire Wire Line
	4050 6500 4650 6500
Wire Wire Line
	4050 6800 4650 6800
Text Label 4050 6800 0    50   ~ 0
~WE
Entry Wire Line
	1800 6400 1900 6500
Entry Wire Line
	1800 6900 1900 7000
Entry Wire Line
	1800 7100 1900 7200
Wire Wire Line
	1900 6500 2550 6500
Wire Wire Line
	1900 7200 2550 7200
Text Label 4050 7000 0    50   ~ 0
BA2
Wire Wire Line
	4050 7000 4650 7000
Text Label 2550 7000 2    50   ~ 0
A3
Wire Wire Line
	2550 7000 1900 7000
Entry Wire Line
	1800 3950 1900 4050
Entry Wire Line
	4650 4050 4750 3950
Wire Wire Line
	1900 4050 2550 4050
Text Label 2550 4050 2    50   ~ 0
CK-
Text Label 4050 4050 0    50   ~ 0
CK+
Wire Wire Line
	4050 4050 4650 4050
Entry Wire Line
	1800 3850 1900 3950
Entry Wire Line
	1800 3650 1900 3750
Entry Wire Line
	1800 3550 1900 3650
Entry Wire Line
	1800 3450 1900 3550
Entry Wire Line
	1800 3350 1900 3450
Entry Wire Line
	1800 3250 1900 3350
Entry Wire Line
	1800 3150 1900 3250
Entry Wire Line
	4650 3250 4750 3150
Entry Wire Line
	4650 3350 4750 3250
Entry Wire Line
	4650 3450 4750 3350
Entry Wire Line
	4650 3550 4750 3450
Entry Wire Line
	4650 3650 4750 3550
Entry Wire Line
	4650 3750 4750 3650
Entry Wire Line
	4650 3850 4750 3750
Entry Wire Line
	4650 3950 4750 3850
Wire Wire Line
	4050 3250 4650 3250
Text Label 4050 3250 0    50   ~ 0
A10
Text Label 2550 3250 2    50   ~ 0
A12
Wire Wire Line
	2550 3250 1900 3250
Wire Wire Line
	1900 3350 2550 3350
Text Label 2550 3350 2    50   ~ 0
BA1
Text Label 4050 3450 0    50   ~ 0
A1
Text Label 4050 3350 0    50   ~ 0
A4
Text Label 4050 3550 0    50   ~ 0
A6
Text Label 2550 3450 2    50   ~ 0
A8
Wire Wire Line
	2550 3450 1900 3450
Wire Wire Line
	4050 3350 4650 3350
Wire Wire Line
	4650 3450 4050 3450
Wire Wire Line
	4050 3550 4650 3550
Text Label 4050 3650 0    50   ~ 0
A11
Text Label 4050 3750 0    50   ~ 0
A5
Text Label 4050 3850 0    50   ~ 0
A13
Text Label 4050 3950 0    50   ~ 0
A9
Text Label 2550 3550 2    50   ~ 0
A14
Text Label 2550 3650 2    50   ~ 0
A0
Text Label 2550 3750 2    50   ~ 0
A2
Text Label 2550 3950 2    50   ~ 0
A7
Wire Wire Line
	1900 3550 2550 3550
Wire Wire Line
	2550 3650 1900 3650
Wire Wire Line
	1900 3750 2550 3750
Wire Wire Line
	2550 3950 1900 3950
Wire Wire Line
	4050 3950 4650 3950
Wire Wire Line
	4650 3850 4050 3850
Wire Wire Line
	4050 3750 4650 3750
Wire Wire Line
	4650 3650 4050 3650
$Comp
L power:+1V5 #PWR099
U 1 1 5E330C90
P 2250 2400
F 0 "#PWR099" H 2250 2250 50  0001 C CNN
F 1 "+1V5" H 2265 2573 50  0000 C CNN
F 2 "" H 2250 2400 50  0001 C CNN
F 3 "" H 2250 2400 50  0001 C CNN
	1    2250 2400
	1    0    0    -1  
$EndComp
Wire Wire Line
	2250 2400 2250 2650
Wire Wire Line
	2250 3850 2550 3850
Wire Wire Line
	2250 3150 2550 3150
Connection ~ 2250 3150
Wire Wire Line
	2250 3150 2250 3850
$Comp
L power:+1V5 #PWR0103
U 1 1 5E36C135
P 4350 2400
F 0 "#PWR0103" H 4350 2250 50  0001 C CNN
F 1 "+1V5" H 4365 2573 50  0000 C CNN
F 2 "" H 4350 2400 50  0001 C CNN
F 3 "" H 4350 2400 50  0001 C CNN
	1    4350 2400
	1    0    0    -1  
$EndComp
Wire Wire Line
	4350 2400 4350 2650
$Comp
L fpc-iii:GND #PWR0106
U 1 1 5E487114
P 4950 2000
F 0 "#PWR0106" H 4950 1750 50  0001 C CNN
F 1 "GND" H 4945 1827 50  0000 C CNN
F 2 "" H 4950 2000 50  0001 C CNN
F 3 "" H 4950 2000 50  0001 C CNN
	1    4950 2000
	1    0    0    -1  
$EndComp
Wire Wire Line
	4950 2000 4950 1900
$Comp
L fpc-iii:TPS51206 U8
U 1 1 5E26DA7E
P 4950 1400
F 0 "U8" H 4550 1800 50  0000 C CNN
F 1 "TPS51206" H 5200 1800 50  0000 C CNN
F 2 "fpc-iii:WSON-10-1EP_2x2mm_P0.4mm_EP0.9x1.5mm" H 4800 1900 50  0001 C CNN
F 3 "http://www.ti.com/lit/ds/symlink/tps51206.pdf" H 4950 2250 50  0001 C CNN
F 4 "296-28767-1" H 4950 1400 50  0001 C CNN "Digikey part"
F 5 "TPS51206DSQR" H 4950 1400 50  0001 C CNN "part#"
	1    4950 1400
	1    0    0    -1  
$EndComp
$Comp
L Device:C_Small C58
U 1 1 5E26ED94
P 5650 1400
F 0 "C58" H 5742 1446 50  0000 L CNN
F 1 "10u" H 5742 1355 50  0000 L CNN
F 2 "Capacitor_SMD:C_0805_2012Metric" H 5650 1400 50  0001 C CNN
F 3 "~" H 5650 1400 50  0001 C CNN
F 4 "1276-6455-1" H 5650 1400 50  0001 C CNN "Digikey part"
F 5 "CL21A106KOQNNNG" H 5650 1400 50  0001 C CNN "part#"
	1    5650 1400
	1    0    0    -1  
$EndComp
Wire Wire Line
	5650 1300 5550 1300
Wire Wire Line
	5650 1300 5650 1200
Connection ~ 5650 1300
Connection ~ 5650 1200
Wire Wire Line
	5650 1200 6300 1200
Wire Wire Line
	5550 1500 5650 1500
$Comp
L fpc-iii:GND #PWR0111
U 1 1 5E2A601B
P 5650 1600
F 0 "#PWR0111" H 5650 1350 50  0001 C CNN
F 1 "GND" H 5645 1427 50  0000 C CNN
F 2 "" H 5650 1600 50  0001 C CNN
F 3 "" H 5650 1600 50  0001 C CNN
	1    5650 1600
	1    0    0    -1  
$EndComp
Wire Wire Line
	5650 1500 5650 1600
Connection ~ 5650 1500
$Comp
L power:+3V3 #PWR0105
U 1 1 5E2B4E5B
P 4950 700
F 0 "#PWR0105" H 4950 550 50  0001 C CNN
F 1 "+3V3" H 4965 873 50  0000 C CNN
F 2 "" H 4950 700 50  0001 C CNN
F 3 "" H 4950 700 50  0001 C CNN
	1    4950 700 
	1    0    0    -1  
$EndComp
$Comp
L Device:C_Small C56
U 1 1 5E2B5E88
P 4350 800
F 0 "C56" H 4442 846 50  0000 L CNN
F 1 "100n" H 4442 755 50  0000 L CNN
F 2 "Capacitor_SMD:C_0402_1005Metric" H 4350 800 50  0001 C CNN
F 3 "~" H 4350 800 50  0001 C CNN
F 4 "*" H 4350 800 50  0001 C CNN "Tolerance"
F 5 "1276-1004-1" H 4350 800 50  0001 C CNN "Digikey part"
F 6 "CL05F104ZO5NNNC" H 4350 800 50  0001 C CNN "part#"
	1    4350 800 
	1    0    0    -1  
$EndComp
$Comp
L fpc-iii:GND #PWR0102
U 1 1 5E2B6F7B
P 4350 900
F 0 "#PWR0102" H 4350 650 50  0001 C CNN
F 1 "GND" H 4345 727 50  0000 C CNN
F 2 "" H 4350 900 50  0001 C CNN
F 3 "" H 4350 900 50  0001 C CNN
	1    4350 900 
	1    0    0    -1  
$EndComp
Wire Wire Line
	4350 700  4950 700 
Wire Wire Line
	4950 700  4950 900 
Connection ~ 4950 700 
$Comp
L power:+1V5 #PWR0100
U 1 1 5E2D5493
P 4050 1200
F 0 "#PWR0100" H 4050 1050 50  0001 C CNN
F 1 "+1V5" H 4065 1373 50  0000 C CNN
F 2 "" H 4050 1200 50  0001 C CNN
F 3 "" H 4050 1200 50  0001 C CNN
	1    4050 1200
	1    0    0    -1  
$EndComp
$Comp
L Device:C_Small C55
U 1 1 5E2D64BB
P 4050 1300
F 0 "C55" H 4142 1346 50  0000 L CNN
F 1 "10u" H 4142 1255 50  0000 L CNN
F 2 "Capacitor_SMD:C_0805_2012Metric" H 4050 1300 50  0001 C CNN
F 3 "~" H 4050 1300 50  0001 C CNN
F 4 "1276-6455-1" H 4050 1300 50  0001 C CNN "Digikey part"
F 5 "CL21A106KOQNNNG" H 4050 1300 50  0001 C CNN "part#"
	1    4050 1300
	1    0    0    -1  
$EndComp
$Comp
L fpc-iii:GND #PWR0101
U 1 1 5E2D7357
P 4050 1400
F 0 "#PWR0101" H 4050 1150 50  0001 C CNN
F 1 "GND" H 4045 1227 50  0000 C CNN
F 2 "" H 4050 1400 50  0001 C CNN
F 3 "" H 4050 1400 50  0001 C CNN
	1    4050 1400
	1    0    0    -1  
$EndComp
Wire Wire Line
	4050 1200 4350 1200
Connection ~ 4050 1200
Wire Wire Line
	4350 1200 4350 1300
Connection ~ 4350 1200
$Comp
L Device:C_Small C57
U 1 1 5E2F44E3
P 5550 2100
F 0 "C57" H 5642 2146 50  0000 L CNN
F 1 "1u" H 5642 2055 50  0000 L CNN
F 2 "Capacitor_SMD:C_0402_1005Metric" H 5550 2100 50  0001 C CNN
F 3 "~" H 5550 2100 50  0001 C CNN
F 4 "*" H 5550 2100 50  0001 C CNN "Tolerance"
F 5 "1276-1235-1" H 5550 2100 50  0001 C CNN "Digikey part"
F 6 "CL05A105MQ5NNNC" H 5550 2100 50  0001 C CNN "part#"
	1    5550 2100
	1    0    0    -1  
$EndComp
$Comp
L fpc-iii:GND #PWR0110
U 1 1 5E2F4A5D
P 5550 2200
F 0 "#PWR0110" H 5550 1950 50  0001 C CNN
F 1 "GND" H 5545 2027 50  0000 C CNN
F 2 "" H 5550 2200 50  0001 C CNN
F 3 "" H 5550 2200 50  0001 C CNN
	1    5550 2200
	1    0    0    -1  
$EndComp
Wire Wire Line
	5550 1600 5550 1900
Connection ~ 5550 1900
Wire Wire Line
	5550 1900 5550 2000
Text Label 5550 1900 2    50   ~ 0
VREF
Entry Wire Line
	4650 6600 4750 6500
Wire Wire Line
	4050 6600 4650 6600
Entry Wire Line
	4750 2700 4850 2600
Entry Wire Line
	1800 2950 1900 3050
Wire Wire Line
	4850 2600 5250 2600
Wire Wire Line
	5250 2600 5250 1900
Wire Wire Line
	5250 1900 5550 1900
Entry Wire Line
	9400 1300 9500 1400
$Comp
L lfe5u-85:LFE5U-85F-6BG381C U?
U 3 1 5E36057A
P 3300 3150
AR Path="/5E36057A" Ref="U?"  Part="3" 
AR Path="/5E16EC9B/5E36057A" Ref="U1"  Part="3" 
F 0 "U1" H 3300 4137 60  0000 C CNN
F 1 "LFE5U-85F-6BG381C" H 3300 4031 60  0000 C CNN
F 2 "Package_BGA:Lattice_caBGA-381_17.0x17.0mm_Layout20x20_P0.8mm_Ball0.4mm_Pad0.4mm_NSMD" H 2250 4100 60  0001 C CNN
F 3 "" H 2250 4100 60  0001 C CNN
F 4 "220-2177" H 3300 3150 50  0001 C CNN "Digikey part"
F 5 "LFE5U-85F-8BG381I" H 3300 3150 50  0001 C CNN "part#"
	3    3300 3150
	1    0    0    -1  
$EndComp
$Comp
L lfe5u-85:LFE5U-85F-6BG381C U?
U 4 1 5E368FB9
P 3300 6400
AR Path="/5E368FB9" Ref="U?"  Part="4" 
AR Path="/5E16EC9B/5E368FB9" Ref="U1"  Part="4" 
F 0 "U1" H 3300 7387 60  0000 C CNN
F 1 "LFE5U-85F-6BG381C" H 3300 7281 60  0000 C CNN
F 2 "Package_BGA:Lattice_caBGA-381_17.0x17.0mm_Layout20x20_P0.8mm_Ball0.4mm_Pad0.4mm_NSMD" H 2250 7350 60  0001 C CNN
F 3 "" H 2250 7350 60  0001 C CNN
F 4 "220-2177" H 3300 6400 50  0001 C CNN "Digikey part"
F 5 "LFE5U-85F-8BG381I" H 3300 6400 50  0001 C CNN "part#"
	4    3300 6400
	1    0    0    -1  
$EndComp
Wire Wire Line
	2550 2650 2250 2650
Connection ~ 2250 2650
Wire Wire Line
	2250 2650 2250 3150
Wire Wire Line
	4050 2650 4350 2650
$Comp
L power:+1V5 #PWR098
U 1 1 5E3D4C36
P 2200 5600
F 0 "#PWR098" H 2200 5450 50  0001 C CNN
F 1 "+1V5" H 2215 5773 50  0000 C CNN
F 2 "" H 2200 5600 50  0001 C CNN
F 3 "" H 2200 5600 50  0001 C CNN
	1    2200 5600
	1    0    0    -1  
$EndComp
Wire Wire Line
	2200 5600 2200 6600
Wire Wire Line
	2200 6900 2550 6900
Wire Wire Line
	2550 7100 2200 7100
Wire Wire Line
	2200 7100 2200 6900
Connection ~ 2200 6900
Wire Wire Line
	2200 7100 2200 7300
Wire Wire Line
	2200 7300 2550 7300
Connection ~ 2200 7100
Wire Wire Line
	2550 6600 2200 6600
Connection ~ 2200 6600
Wire Wire Line
	2200 6600 2200 6700
Wire Wire Line
	2200 6700 2550 6700
Connection ~ 2200 6700
Wire Wire Line
	2200 6700 2200 6900
$Comp
L power:+3V3 #PWR?
U 1 1 5E4B8160
P 1550 5400
AR Path="/5E215A8D/5E4B8160" Ref="#PWR?"  Part="1" 
AR Path="/5E16EC9B/5E4B8160" Ref="#PWR097"  Part="1" 
F 0 "#PWR097" H 1550 5250 50  0001 C CNN
F 1 "+3V3" H 1565 5573 50  0000 C CNN
F 2 "" H 1550 5400 50  0001 C CNN
F 3 "" H 1550 5400 50  0001 C CNN
	1    1550 5400
	1    0    0    -1  
$EndComp
$Comp
L Device:R_Small_US R?
U 1 1 5E4B8166
P 1550 5600
AR Path="/5E215A8D/5E4B8166" Ref="R?"  Part="1" 
AR Path="/5E16EC9B/5E4B8166" Ref="R26"  Part="1" 
F 0 "R26" H 1618 5646 50  0000 L CNN
F 1 "150" H 1618 5555 50  0000 L CNN
F 2 "Resistor_SMD:R_0402_1005Metric" H 1550 5600 50  0001 C CNN
F 3 "~" H 1550 5600 50  0001 C CNN
F 4 "RMCF0402JT150RCT" H 1550 5600 50  0001 C CNN "Digikey part"
F 5 "RMCF0402JT150R" H 1550 5600 50  0001 C CNN "part#"
	1    1550 5600
	1    0    0    -1  
$EndComp
$Comp
L Device:LED_Small D?
U 1 1 5E4B816C
P 1550 5900
AR Path="/5E215A8D/5E4B816C" Ref="D?"  Part="1" 
AR Path="/5E16EC9B/5E4B816C" Ref="D9"  Part="1" 
F 0 "D9" V 1550 5832 50  0000 R CNN
F 1 "LED_Small" V 1505 5832 50  0001 R CNN
F 2 "LED_SMD:LED_0603_1608Metric" V 1550 5900 50  0001 C CNN
F 3 "~" V 1550 5900 50  0001 C CNN
F 4 "150060VS75000" H 1550 5900 50  0001 C CNN "part#"
F 5 "732-4980-1" H 1550 5900 50  0001 C CNN "Digikey part"
	1    1550 5900
	0    -1   -1   0   
$EndComp
Wire Wire Line
	1550 5400 1550 5500
Wire Wire Line
	1550 5700 1550 5800
Wire Wire Line
	1550 6000 1550 6100
$Comp
L power:+3V3 #PWR?
U 1 1 5E4DA6A2
P 1250 5500
AR Path="/5E215A8D/5E4DA6A2" Ref="#PWR?"  Part="1" 
AR Path="/5E16EC9B/5E4DA6A2" Ref="#PWR096"  Part="1" 
F 0 "#PWR096" H 1250 5350 50  0001 C CNN
F 1 "+3V3" H 1265 5673 50  0000 C CNN
F 2 "" H 1250 5500 50  0001 C CNN
F 3 "" H 1250 5500 50  0001 C CNN
	1    1250 5500
	1    0    0    -1  
$EndComp
$Comp
L Device:R_Small_US R?
U 1 1 5E4DA6A8
P 1250 5700
AR Path="/5E215A8D/5E4DA6A8" Ref="R?"  Part="1" 
AR Path="/5E16EC9B/5E4DA6A8" Ref="R25"  Part="1" 
F 0 "R25" H 1318 5746 50  0000 L CNN
F 1 "150" H 1318 5655 50  0000 L CNN
F 2 "Resistor_SMD:R_0402_1005Metric" H 1250 5700 50  0001 C CNN
F 3 "~" H 1250 5700 50  0001 C CNN
F 4 "RMCF0402JT150RCT" H 1250 5700 50  0001 C CNN "Digikey part"
F 5 "RMCF0402JT150R" H 1250 5700 50  0001 C CNN "part#"
	1    1250 5700
	1    0    0    -1  
$EndComp
$Comp
L Device:LED_Small D?
U 1 1 5E4DA6AE
P 1250 6000
AR Path="/5E215A8D/5E4DA6AE" Ref="D?"  Part="1" 
AR Path="/5E16EC9B/5E4DA6AE" Ref="D4"  Part="1" 
F 0 "D4" V 1250 5932 50  0000 R CNN
F 1 "LED_Small" V 1205 5932 50  0001 R CNN
F 2 "LED_SMD:LED_0603_1608Metric" V 1250 6000 50  0001 C CNN
F 3 "~" V 1250 6000 50  0001 C CNN
F 4 "150060RS75000" H 1250 6000 50  0001 C CNN "part#"
F 5 "732-4978-1" H 1250 6000 50  0001 C CNN "Digikey part"
	1    1250 6000
	0    -1   -1   0   
$EndComp
Wire Wire Line
	1250 5500 1250 5600
Wire Wire Line
	1250 5800 1250 5900
Wire Wire Line
	1250 6100 1250 6200
$Comp
L power:+3V3 #PWR?
U 1 1 5E4EB817
P 950 6100
AR Path="/5E215A8D/5E4EB817" Ref="#PWR?"  Part="1" 
AR Path="/5E16EC9B/5E4EB817" Ref="#PWR095"  Part="1" 
F 0 "#PWR095" H 950 5950 50  0001 C CNN
F 1 "+3V3" H 965 6273 50  0000 C CNN
F 2 "" H 950 6100 50  0001 C CNN
F 3 "" H 950 6100 50  0001 C CNN
	1    950  6100
	1    0    0    -1  
$EndComp
$Comp
L Device:R_Small_US R?
U 1 1 5E4EB81D
P 950 6300
AR Path="/5E215A8D/5E4EB81D" Ref="R?"  Part="1" 
AR Path="/5E16EC9B/5E4EB81D" Ref="R24"  Part="1" 
F 0 "R24" H 1018 6346 50  0000 L CNN
F 1 "150" H 1018 6255 50  0000 L CNN
F 2 "Resistor_SMD:R_0402_1005Metric" H 950 6300 50  0001 C CNN
F 3 "~" H 950 6300 50  0001 C CNN
F 4 "RMCF0402JT150RCT" H 950 6300 50  0001 C CNN "Digikey part"
F 5 "RMCF0402JT150R" H 950 6300 50  0001 C CNN "part#"
	1    950  6300
	1    0    0    -1  
$EndComp
$Comp
L Device:LED_Small D?
U 1 1 5E4EB823
P 950 6600
AR Path="/5E215A8D/5E4EB823" Ref="D?"  Part="1" 
AR Path="/5E16EC9B/5E4EB823" Ref="D3"  Part="1" 
F 0 "D3" V 950 6532 50  0000 R CNN
F 1 "LED_Small" V 905 6532 50  0001 R CNN
F 2 "LED_SMD:LED_0603_1608Metric" V 950 6600 50  0001 C CNN
F 3 "~" V 950 6600 50  0001 C CNN
F 4 "150060VS75000" H 950 6600 50  0001 C CNN "part#"
F 5 "732-4980-1" H 950 6600 50  0001 C CNN "Digikey part"
	1    950  6600
	0    -1   -1   0   
$EndComp
Wire Wire Line
	950  6100 950  6200
Wire Wire Line
	950  6400 950  6500
Wire Wire Line
	950  6700 950  6800
Wire Wire Line
	4350 1500 4250 1500
Wire Wire Line
	4250 1500 4250 1600
Wire Wire Line
	4250 1600 4350 1600
$Comp
L Device:R_Small_US R31
U 1 1 5E5113AD
P 5850 6700
F 0 "R31" H 5918 6746 50  0000 L CNN
F 1 "10K" H 5918 6655 50  0000 L CNN
F 2 "Resistor_SMD:R_0402_1005Metric" H 5850 6700 50  0001 C CNN
F 3 "~" H 5850 6700 50  0001 C CNN
F 4 "RMCF0402JT10K0CT" H 5850 6700 50  0001 C CNN "Digikey part"
F 5 "RMCF0402JT10K0" H 5850 6700 50  0001 C CNN "part#"
	1    5850 6700
	1    0    0    -1  
$EndComp
$Comp
L fpc-iii:GND #PWR0113
U 1 1 5E536B46
P 5850 6900
F 0 "#PWR0113" H 5850 6650 50  0001 C CNN
F 1 "GND" H 5845 6727 50  0000 C CNN
F 2 "" H 5850 6900 50  0001 C CNN
F 3 "" H 5850 6900 50  0001 C CNN
	1    5850 6900
	1    0    0    -1  
$EndComp
Wire Wire Line
	5850 6800 5850 6900
Text Label 5850 6400 1    50   ~ 0
RAM_ENABLE
Text Label 4250 1750 2    50   ~ 0
RAM_ENABLE
Wire Wire Line
	4250 1600 4250 1750
Connection ~ 4250 1600
$Comp
L power:+3V3 #PWR?
U 1 1 5E596C36
P 5500 5500
AR Path="/5E215A8D/5E596C36" Ref="#PWR?"  Part="1" 
AR Path="/5E16EC9B/5E596C36" Ref="#PWR0108"  Part="1" 
F 0 "#PWR0108" H 5500 5350 50  0001 C CNN
F 1 "+3V3" H 5515 5673 50  0000 C CNN
F 2 "" H 5500 5500 50  0001 C CNN
F 3 "" H 5500 5500 50  0001 C CNN
	1    5500 5500
	1    0    0    -1  
$EndComp
$Comp
L Device:R_Small_US R?
U 1 1 5E596C3C
P 5500 5700
AR Path="/5E215A8D/5E596C3C" Ref="R?"  Part="1" 
AR Path="/5E16EC9B/5E596C3C" Ref="R29"  Part="1" 
F 0 "R29" H 5568 5746 50  0000 L CNN
F 1 "150" H 5568 5655 50  0000 L CNN
F 2 "Resistor_SMD:R_0402_1005Metric" H 5500 5700 50  0001 C CNN
F 3 "~" H 5500 5700 50  0001 C CNN
F 4 "RMCF0402JT150RCT" H 5500 5700 50  0001 C CNN "Digikey part"
F 5 "RMCF0402JT150R" H 5500 5700 50  0001 C CNN "part#"
	1    5500 5700
	1    0    0    -1  
$EndComp
$Comp
L Device:LED_Small D?
U 1 1 5E596C42
P 5500 6000
AR Path="/5E215A8D/5E596C42" Ref="D?"  Part="1" 
AR Path="/5E16EC9B/5E596C42" Ref="D6"  Part="1" 
F 0 "D6" V 5500 5932 50  0000 R CNN
F 1 "LED_Small" V 5455 5932 50  0001 R CNN
F 2 "LED_SMD:LED_0603_1608Metric" V 5500 6000 50  0001 C CNN
F 3 "~" V 5500 6000 50  0001 C CNN
F 4 "150060YS75000" H 5500 6000 50  0001 C CNN "part#"
F 5 "732-4981-1" H 5500 6000 50  0001 C CNN "Digikey part"
	1    5500 6000
	0    -1   -1   0   
$EndComp
Wire Wire Line
	5500 5500 5500 5600
$Comp
L power:+3V3 #PWR?
U 1 1 5E5A8FFD
P 5200 5500
AR Path="/5E215A8D/5E5A8FFD" Ref="#PWR?"  Part="1" 
AR Path="/5E16EC9B/5E5A8FFD" Ref="#PWR0107"  Part="1" 
F 0 "#PWR0107" H 5200 5350 50  0001 C CNN
F 1 "+3V3" H 5215 5673 50  0000 C CNN
F 2 "" H 5200 5500 50  0001 C CNN
F 3 "" H 5200 5500 50  0001 C CNN
	1    5200 5500
	1    0    0    -1  
$EndComp
$Comp
L Device:R_Small_US R?
U 1 1 5E5A9003
P 5200 5700
AR Path="/5E215A8D/5E5A9003" Ref="R?"  Part="1" 
AR Path="/5E16EC9B/5E5A9003" Ref="R28"  Part="1" 
F 0 "R28" H 5268 5746 50  0000 L CNN
F 1 "150" H 5268 5655 50  0000 L CNN
F 2 "Resistor_SMD:R_0402_1005Metric" H 5200 5700 50  0001 C CNN
F 3 "~" H 5200 5700 50  0001 C CNN
F 4 "RMCF0402JT150RCT" H 5200 5700 50  0001 C CNN "Digikey part"
F 5 "RMCF0402JT150R" H 5200 5700 50  0001 C CNN "part#"
	1    5200 5700
	1    0    0    -1  
$EndComp
$Comp
L Device:LED_Small D?
U 1 1 5E5A9009
P 5200 6000
AR Path="/5E215A8D/5E5A9009" Ref="D?"  Part="1" 
AR Path="/5E16EC9B/5E5A9009" Ref="D5"  Part="1" 
F 0 "D5" V 5200 5932 50  0000 R CNN
F 1 "LED_Small" V 5155 5932 50  0001 R CNN
F 2 "LED_SMD:LED_0603_1608Metric" V 5200 6000 50  0001 C CNN
F 3 "~" V 5200 6000 50  0001 C CNN
F 4 "150060RS75000" H 5200 6000 50  0001 C CNN "part#"
F 5 "732-4978-1" H 5200 6000 50  0001 C CNN "Digikey part"
	1    5200 6000
	0    -1   -1   0   
$EndComp
Wire Wire Line
	5200 5500 5200 5600
Wire Wire Line
	5200 5800 5200 5900
Wire Wire Line
	1550 6100 2550 6100
Wire Wire Line
	950  6800 2550 6800
Wire Wire Line
	5850 6400 5850 6500
Wire Wire Line
	5500 5800 5500 5900
Wire Wire Line
	5200 6100 5200 6200
Wire Wire Line
	4050 6100 4900 6100
Connection ~ 5850 6500
Wire Wire Line
	5850 6500 5850 6600
Wire Wire Line
	5000 6500 5850 6500
$Comp
L power:+3V3 #PWR?
U 1 1 5E73926D
P 5500 6850
AR Path="/5E215A8D/5E73926D" Ref="#PWR?"  Part="1" 
AR Path="/5E16EC9B/5E73926D" Ref="#PWR0109"  Part="1" 
F 0 "#PWR0109" H 5500 6700 50  0001 C CNN
F 1 "+3V3" H 5515 7023 50  0000 C CNN
F 2 "" H 5500 6850 50  0001 C CNN
F 3 "" H 5500 6850 50  0001 C CNN
	1    5500 6850
	1    0    0    -1  
$EndComp
$Comp
L Device:R_Small_US R?
U 1 1 5E739273
P 5500 7050
AR Path="/5E215A8D/5E739273" Ref="R?"  Part="1" 
AR Path="/5E16EC9B/5E739273" Ref="R30"  Part="1" 
F 0 "R30" H 5568 7096 50  0000 L CNN
F 1 "150" H 5568 7005 50  0000 L CNN
F 2 "Resistor_SMD:R_0402_1005Metric" H 5500 7050 50  0001 C CNN
F 3 "~" H 5500 7050 50  0001 C CNN
F 4 "RMCF0402JT150RCT" H 5500 7050 50  0001 C CNN "Digikey part"
F 5 "RMCF0402JT150R" H 5500 7050 50  0001 C CNN "part#"
	1    5500 7050
	1    0    0    -1  
$EndComp
$Comp
L Device:LED_Small D?
U 1 1 5E739279
P 5500 7350
AR Path="/5E215A8D/5E739279" Ref="D?"  Part="1" 
AR Path="/5E16EC9B/5E739279" Ref="D8"  Part="1" 
F 0 "D8" V 5500 7282 50  0000 R CNN
F 1 "LED_Small" V 5455 7282 50  0001 R CNN
F 2 "LED_SMD:LED_0603_1608Metric" V 5500 7350 50  0001 C CNN
F 3 "~" V 5500 7350 50  0001 C CNN
F 4 "150060VS75000" H 5500 7350 50  0001 C CNN "part#"
F 5 "732-4980-1" H 5500 7350 50  0001 C CNN "Digikey part"
	1    5500 7350
	0    -1   -1   0   
$EndComp
Wire Wire Line
	5500 6850 5500 6950
Wire Wire Line
	5500 7150 5500 7250
$Comp
L power:+3V3 #PWR?
U 1 1 5E74D89E
P 4900 5500
AR Path="/5E215A8D/5E74D89E" Ref="#PWR?"  Part="1" 
AR Path="/5E16EC9B/5E74D89E" Ref="#PWR0104"  Part="1" 
F 0 "#PWR0104" H 4900 5350 50  0001 C CNN
F 1 "+3V3" H 4915 5673 50  0000 C CNN
F 2 "" H 4900 5500 50  0001 C CNN
F 3 "" H 4900 5500 50  0001 C CNN
	1    4900 5500
	1    0    0    -1  
$EndComp
$Comp
L Device:R_Small_US R?
U 1 1 5E74D8A4
P 4900 5700
AR Path="/5E215A8D/5E74D8A4" Ref="R?"  Part="1" 
AR Path="/5E16EC9B/5E74D8A4" Ref="R27"  Part="1" 
F 0 "R27" H 4968 5746 50  0000 L CNN
F 1 "150" H 4968 5655 50  0000 L CNN
F 2 "Resistor_SMD:R_0402_1005Metric" H 4900 5700 50  0001 C CNN
F 3 "~" H 4900 5700 50  0001 C CNN
F 4 "RMCF0402JT150RCT" H 4900 5700 50  0001 C CNN "Digikey part"
F 5 "RMCF0402JT150R" H 4900 5700 50  0001 C CNN "part#"
	1    4900 5700
	1    0    0    -1  
$EndComp
$Comp
L Device:LED_Small D?
U 1 1 5E74D8AA
P 4900 6000
AR Path="/5E215A8D/5E74D8AA" Ref="D?"  Part="1" 
AR Path="/5E16EC9B/5E74D8AA" Ref="D7"  Part="1" 
F 0 "D7" V 4900 5932 50  0000 R CNN
F 1 "LED_Small" V 4855 5932 50  0001 R CNN
F 2 "LED_SMD:LED_0603_1608Metric" V 4900 6000 50  0001 C CNN
F 3 "~" V 4900 6000 50  0001 C CNN
F 4 "150060YS75000" H 4900 6000 50  0001 C CNN "part#"
F 5 "732-4981-1" H 4900 6000 50  0001 C CNN "Digikey part"
	1    4900 6000
	0    -1   -1   0   
$EndComp
Wire Wire Line
	4900 5500 4900 5600
Wire Wire Line
	4900 5800 4900 5900
Wire Wire Line
	4050 7100 5000 7100
Wire Wire Line
	4050 7200 4950 7200
Wire Wire Line
	4950 7200 4950 7650
Wire Wire Line
	4950 7650 5500 7650
Wire Wire Line
	5500 7450 5500 7650
$Comp
L Device:R_Small_US R34
U 1 1 5E4DC47F
P 6400 1300
F 0 "R34" V 6400 950 50  0000 C CNN
F 1 "51" V 6400 1100 50  0000 C CNN
F 2 "Resistor_SMD:R_0402_1005Metric" H 6400 1300 50  0001 C CNN
F 3 "~" H 6400 1300 50  0001 C CNN
F 4 "RMCF0402FT51R0CT" H 6400 1300 50  0001 C CNN "Digikey part"
F 5 "1%" H 6400 1300 50  0001 C CNN "Tolerance"
F 6 "RMCF0402FT51R0" H 6400 1300 50  0001 C CNN "part#"
	1    6400 1300
	0    1    1    0   
$EndComp
Connection ~ 6300 1300
Wire Wire Line
	6300 1300 6300 1400
Entry Wire Line
	4650 3150 4750 3050
Text Label 4050 3150 0    50   ~ 0
CKE
Wire Wire Line
	4050 3150 4650 3150
Wire Wire Line
	6500 1100 6500 1500
Wire Wire Line
	5500 6100 5500 6400
Wire Wire Line
	5000 6500 5000 7100
$Comp
L Device:C_Small C66
U 1 1 5E52E5E6
P 10350 1750
F 0 "C66" H 10442 1796 50  0000 L CNN
F 1 "100n" H 10442 1705 50  0000 L CNN
F 2 "Capacitor_SMD:C_0402_1005Metric" H 10350 1750 50  0001 C CNN
F 3 "~" H 10350 1750 50  0001 C CNN
F 4 "*" H 10350 1750 50  0001 C CNN "Tolerance"
F 5 "1276-1004-1" H 10350 1750 50  0001 C CNN "Digikey part"
F 6 "CL05F104ZO5NNNC" H 10350 1750 50  0001 C CNN "part#"
	1    10350 1750
	1    0    0    -1  
$EndComp
$Comp
L Device:C_Small C68
U 1 1 5E52E9AD
P 10700 1750
F 0 "C68" H 10792 1796 50  0000 L CNN
F 1 "100n" H 10792 1705 50  0000 L CNN
F 2 "Capacitor_SMD:C_0402_1005Metric" H 10700 1750 50  0001 C CNN
F 3 "~" H 10700 1750 50  0001 C CNN
F 4 "*" H 10700 1750 50  0001 C CNN "Tolerance"
F 5 "1276-1004-1" H 10700 1750 50  0001 C CNN "Digikey part"
F 6 "CL05F104ZO5NNNC" H 10700 1750 50  0001 C CNN "part#"
	1    10700 1750
	1    0    0    -1  
$EndComp
$Comp
L Device:C_Small C67
U 1 1 5E52EDC2
P 10700 1550
F 0 "C67" H 10792 1596 50  0000 L CNN
F 1 "100n" H 10792 1505 50  0000 L CNN
F 2 "Capacitor_SMD:C_0402_1005Metric" H 10700 1550 50  0001 C CNN
F 3 "~" H 10700 1550 50  0001 C CNN
F 4 "*" H 10700 1550 50  0001 C CNN "Tolerance"
F 5 "1276-1004-1" H 10700 1550 50  0001 C CNN "Digikey part"
F 6 "CL05F104ZO5NNNC" H 10700 1550 50  0001 C CNN "part#"
	1    10700 1550
	1    0    0    -1  
$EndComp
$Comp
L Device:C_Small C65
U 1 1 5E52F089
P 10350 1550
F 0 "C65" H 10442 1596 50  0000 L CNN
F 1 "100n" H 10442 1505 50  0000 L CNN
F 2 "Capacitor_SMD:C_0402_1005Metric" H 10350 1550 50  0001 C CNN
F 3 "~" H 10350 1550 50  0001 C CNN
F 4 "*" H 10350 1550 50  0001 C CNN "Tolerance"
F 5 "1276-1004-1" H 10350 1550 50  0001 C CNN "Digikey part"
F 6 "CL05F104ZO5NNNC" H 10350 1550 50  0001 C CNN "part#"
	1    10350 1550
	1    0    0    -1  
$EndComp
$Comp
L fpc-iii:GND #PWR0124
U 1 1 5E52F2D7
P 10350 1850
F 0 "#PWR0124" H 10350 1600 50  0001 C CNN
F 1 "GND" H 10345 1677 50  0000 C CNN
F 2 "" H 10350 1850 50  0001 C CNN
F 3 "" H 10350 1850 50  0001 C CNN
	1    10350 1850
	1    0    0    -1  
$EndComp
$Comp
L fpc-iii:GND #PWR0126
U 1 1 5E52F539
P 10700 1850
F 0 "#PWR0126" H 10700 1600 50  0001 C CNN
F 1 "GND" H 10695 1677 50  0000 C CNN
F 2 "" H 10700 1850 50  0001 C CNN
F 3 "" H 10700 1850 50  0001 C CNN
	1    10700 1850
	1    0    0    -1  
$EndComp
$Comp
L power:+1V5 #PWR0123
U 1 1 5E52F6A6
P 10350 1450
F 0 "#PWR0123" H 10350 1300 50  0001 C CNN
F 1 "+1V5" H 10365 1623 50  0000 C CNN
F 2 "" H 10350 1450 50  0001 C CNN
F 3 "" H 10350 1450 50  0001 C CNN
	1    10350 1450
	1    0    0    -1  
$EndComp
$Comp
L power:+1V5 #PWR0125
U 1 1 5E52F95F
P 10700 1450
F 0 "#PWR0125" H 10700 1300 50  0001 C CNN
F 1 "+1V5" H 10715 1623 50  0000 C CNN
F 2 "" H 10700 1450 50  0001 C CNN
F 3 "" H 10700 1450 50  0001 C CNN
	1    10700 1450
	1    0    0    -1  
$EndComp
Connection ~ 10700 1650
Connection ~ 10350 1650
Wire Wire Line
	10350 1650 10700 1650
Wire Wire Line
	1900 3050 2550 3050
Wire Wire Line
	9800 1500 9800 1400
Wire Wire Line
	10150 1300 10150 1650
Wire Wire Line
	10150 1650 10350 1650
$Comp
L Device:C_Small C64
U 1 1 5E4B6978
P 10350 850
F 0 "C64" H 10442 896 50  0000 L CNN
F 1 "100n" H 10442 805 50  0000 L CNN
F 2 "Capacitor_SMD:C_0402_1005Metric" H 10350 850 50  0001 C CNN
F 3 "~" H 10350 850 50  0001 C CNN
F 4 "*" H 10350 850 50  0001 C CNN "Tolerance"
F 5 "1276-1004-1" H 10350 850 50  0001 C CNN "Digikey part"
F 6 "CL05F104ZO5NNNC" H 10350 850 50  0001 C CNN "part#"
	1    10350 850 
	1    0    0    -1  
$EndComp
$Comp
L fpc-iii:GND #PWR0122
U 1 1 5E4B697E
P 10350 950
F 0 "#PWR0122" H 10350 700 50  0001 C CNN
F 1 "GND" H 10345 777 50  0000 C CNN
F 2 "" H 10350 950 50  0001 C CNN
F 3 "" H 10350 950 50  0001 C CNN
	1    10350 950 
	1    0    0    -1  
$EndComp
$Comp
L Device:C_Small C69
U 1 1 5E4B6987
P 10750 850
F 0 "C69" H 10842 896 50  0000 L CNN
F 1 "100n" H 10842 805 50  0000 L CNN
F 2 "Capacitor_SMD:C_0402_1005Metric" H 10750 850 50  0001 C CNN
F 3 "~" H 10750 850 50  0001 C CNN
F 4 "*" H 10750 850 50  0001 C CNN "Tolerance"
F 5 "1276-1004-1" H 10750 850 50  0001 C CNN "Digikey part"
F 6 "CL05F104ZO5NNNC" H 10750 850 50  0001 C CNN "part#"
	1    10750 850 
	1    0    0    -1  
$EndComp
$Comp
L fpc-iii:GND #PWR0127
U 1 1 5E4B698D
P 10750 950
F 0 "#PWR0127" H 10750 700 50  0001 C CNN
F 1 "GND" H 10745 777 50  0000 C CNN
F 2 "" H 10750 950 50  0001 C CNN
F 3 "" H 10750 950 50  0001 C CNN
	1    10750 950 
	1    0    0    -1  
$EndComp
Wire Wire Line
	9950 750  10350 750 
Connection ~ 10350 750 
Wire Wire Line
	10350 750  10750 750 
Connection ~ 9950 750 
Wire Wire Line
	6500 2400 7000 2400
Wire Wire Line
	6500 2000 7000 2000
Wire Wire Line
	6500 1600 7000 1600
Wire Wire Line
	8400 1400 9800 1400
Wire Wire Line
	8400 1300 10150 1300
Wire Wire Line
	6500 1500 7000 1500
Wire Wire Line
	1250 6200 2550 6200
Wire Wire Line
	4050 6400 5500 6400
Wire Wire Line
	4050 6200 5200 6200
Wire Wire Line
	6500 3800 7000 3800
Wire Wire Line
	6500 3700 7000 3700
Wire Wire Line
	6500 3600 7000 3600
Wire Wire Line
	6500 3500 7000 3500
Wire Wire Line
	6500 3400 7000 3400
Wire Wire Line
	6500 3300 7000 3300
Wire Wire Line
	6500 3200 7000 3200
Wire Wire Line
	6500 3100 7000 3100
Wire Wire Line
	6500 3000 7000 3000
Wire Wire Line
	6500 2900 7000 2900
Wire Wire Line
	6500 2800 7000 2800
Wire Wire Line
	6500 2700 7000 2700
Wire Wire Line
	6500 2600 7000 2600
Wire Wire Line
	6500 2500 7000 2500
Wire Wire Line
	6500 2100 7000 2100
Wire Wire Line
	6500 1700 7000 1700
Wire Wire Line
	6500 2200 7000 2200
Wire Wire Line
	6500 1800 7000 1800
Wire Wire Line
	6500 1400 7000 1400
Wire Wire Line
	6500 1300 7000 1300
Wire Bus Line
	2000 2050 2000 2850
Wire Bus Line
	4550 2050 4550 5150
Wire Bus Line
	4550 5250 4550 6200
Wire Bus Line
	2000 5250 2000 6300
Wire Bus Line
	4750 5050 4750 6900
Wire Bus Line
	9000 2600 9000 5150
Wire Bus Line
	9500 1400 9500 5250
Wire Bus Line
	1800 1950 1800 7100
Wire Bus Line
	4750 1950 4750 5050
Wire Bus Line
	6600 1100 6600 5050
$EndSCHEMATC
