   0.000000000      -4.698971156    
   0.000000000       9.397942311    
     
  0.8725782702      -4.698971156    
  0.8725782702       9.397942311    
     
   1.745156540      -4.698971156    
   1.745156540       9.397942311    
     
   2.752723139      -4.698971156    
   2.752723139       9.397942311    
     
   3.465180313      -4.698971156    
   3.465180313       9.397942311    
     
   3.968963612      -4.698971156    
   3.968963612       9.397942311    
     
   4.472746911      -4.698971156    
   4.472746911       9.397942311    
     
   5.185204085      -4.698971156    
   5.185204085       9.397942311    
     
   6.419216109      -4.698971156    
   6.419216109       9.397942311    
     
