<?xml version="1.0" encoding="UTF-8" standalone="no"?>
<!-- Created with Inkscape (http://www.inkscape.org/) -->

<svg
   xmlns:dc="http://purl.org/dc/elements/1.1/"
   xmlns:cc="http://creativecommons.org/ns#"
   xmlns:rdf="http://www.w3.org/1999/02/22-rdf-syntax-ns#"
   xmlns:svg="http://www.w3.org/2000/svg"
   xmlns="http://www.w3.org/2000/svg"
   xmlns:xlink="http://www.w3.org/1999/xlink"
   xmlns:sodipodi="http://sodipodi.sourceforge.net/DTD/sodipodi-0.dtd"
   xmlns:inkscape="http://www.inkscape.org/namespaces/inkscape"
   id="svg2"
   version="1.1"
   inkscape:version="0.48.0 r9654"
   width="24"
   height="24"
   sodipodi:docname="nac.svg">
  <metadata
     id="metadata8">
    <rdf:RDF>
      <cc:Work
         rdf:about="">
        <dc:format>image/svg+xml</dc:format>
        <dc:type
           rdf:resource="http://purl.org/dc/dcmitype/StillImage" />
        <dc:title />
      </cc:Work>
    </rdf:RDF>
  </metadata>
  <defs
     id="defs6" />
  <sodipodi:namedview
     pagecolor="#ffffff"
     bordercolor="#666666"
     borderopacity="1"
     objecttolerance="10"
     gridtolerance="10"
     guidetolerance="10"
     inkscape:pageopacity="0"
     inkscape:pageshadow="2"
     inkscape:window-width="1000"
     inkscape:window-height="841"
     id="namedview4"
     showgrid="false"
     inkscape:zoom="10.708333"
     inkscape:cx="12"
     inkscape:cy="13.400778"
     inkscape:window-x="0"
     inkscape:window-y="24"
     inkscape:window-maximized="0"
     inkscape:current-layer="svg2" />
  <image
     width="24"
     height="24"
     xlink:href="data:image/png;base64,iVBORw0KGgoAAAANSUhEUgAAABgAAAAYCAYAAADgdz34AAAABHNCSVQICAgIfAhkiAAAAipJREFU SInVlMtu00AUhj+TsiGgFBQSC5w8APAkPAEIwQYR2gBbZBrYxFBFXISqNCC2IAR7JJ4ECiorJw/A pqBUonNYzCXjeKoEqRuONbI9M/4v55wx/O8R2YfrN659uHjpwpWjAP36Zefju7fvrxYmB0+fyFHF sxcDsbgr8+z706nnSxAFYi5EECWIXgFlVkRA9FytdrqAVyKw4MPRVtD+WqeLiCFEEM3rnuejRKD3 Cne694xCNKADmSn2vLnnhQSRCAoYvRoGHdi4dbNjOXTqxKpbQKCM/e7a3ZlaAFGIWcc6EMG/QlGu ASBKeP1mdLhyr6hFEUukSERBJKy7Yuoa5JOcdtJyc349XIcFBB0rE5jWdOCK8SQny/pGuSCivGIb Nzp/S6TIWLdtl0/GZFm/mAEvPYVWXSZFyn0k5OMx2eO+W7u93qFarRLHMXEzptFsEDdims0G9frZ 5drUdkY+KYIHXZq7cmkrbw0cNF3QLMvC4B6JFaRv/1DkdtLmUe/hQnS/y3QdyhQBAr0xSVr0HvQO hXd6rQPXSsUIpgjTgkkrYSPdYHOwCcBouO0ptX9WXQt3whc5cMfffJAk50nTdJYSf1jHHPIjCjpw fy194ACScwnp/RScO+t1VgtETIsvIFhdPRNUUq83gvPzEUVR4d0R7O7++PRy6/nlpVAWxLed758d oce8UqlUasCJuXHSjCpwCjgO7AN7Zvwy999m7B0c/PkpwhSQv3Wt90yVMEuAAAAAAElFTkSuQmCC  "
     id="image10"
     x="0"
     y="0"
     inkscape:export-filename="/home/philip/big/amor/workspace/emf-modeling-operations/org.modelversioning.operations.ui/icons/nac.png"
     inkscape:export-xdpi="90"
     inkscape:export-ydpi="90" />
  <rect
     style="fill:#d40000;fill-opacity:1;stroke:none"
     id="rect2987"
     width="2.3433881"
     height="14.227714"
     x="-0.10830653"
     y="16.237642"
     transform="matrix(0.70710678,-0.70710678,0.70710678,0.70710678,0,0)"
     inkscape:export-filename="/home/philip/big/amor/workspace/emf-modeling-operations/org.modelversioning.operations.ui/icons/nac.png"
     inkscape:export-xdpi="90"
     inkscape:export-ydpi="90" />
  <rect
     style="fill:#d40000;fill-opacity:1;stroke:none"
     id="rect2987-0"
     width="2.3433881"
     height="14.227714"
     x="22.081173"
     y="-8.2364235"
     transform="matrix(0.70710678,0.70710678,-0.70710678,0.70710678,0,0)"
     inkscape:export-filename="/home/philip/big/amor/workspace/emf-modeling-operations/org.modelversioning.operations.ui/icons/nac.png"
     inkscape:export-xdpi="90"
     inkscape:export-ydpi="90" />
</svg>
