#FIG 3.2
Landscape
Center
Inches
Letter  
100.00
Single
-2
1200 2
6 1941 675 3975 1005
2 1 0 1 0 7 50 0 -1 0.000 0 0 -1 0 0 2
	 3747 675 3940 838
2 3 0 1 0 31 50 0 35 0.000 0 0 -1 0 0 7
	 1941 675 3747 675 3747 838 3940 838 3940 970 1941 970
	 1941 675
2 1 0 0 0 7 51 0 15 0.000 0 0 -1 0 0 7
	 1997 970 1995 1005 3975 1005 3975 883 3939 833 3947 970
	 1997 970
4 0 0 49 0 4 9 0.0000 0 150 1455 2076 895 Monitor stak og data\001
-6
6 1341 6450 3375 6780
2 1 0 1 0 7 50 0 -1 0.000 0 0 -1 0 0 2
	 3147 6450 3340 6613
2 3 0 1 0 31 50 0 35 0.000 0 0 -1 0 0 7
	 1341 6450 3147 6450 3147 6613 3340 6613 3340 6745 1341 6745
	 1341 6450
2 1 0 0 0 7 51 0 15 0.000 0 0 -1 0 0 7
	 1397 6745 1395 6780 3375 6780 3375 6658 3339 6608 3347 6745
	 1397 6745
4 0 0 49 0 4 9 0.0000 0 150 1680 1476 6670 Interrupt vektor tabellen\001
-6
6 2850 6900 4884 7230
2 1 0 1 0 7 50 0 -1 0.000 0 0 -1 0 0 2
	 4656 6900 4849 7063
2 3 0 1 0 31 50 0 35 0.000 0 0 -1 0 0 7
	 2850 6900 4656 6900 4656 7063 4849 7063 4849 7195 2850 7195
	 2850 6900
2 1 0 0 0 7 51 0 15 0.000 0 0 -1 0 0 7
	 2906 7195 2904 7230 4884 7230 4884 7108 4848 7058 4856 7195
	 2906 7195
4 0 0 49 0 4 9 0.0000 0 120 1020 2985 7120 Relokeret PCB\001
-6
6 2700 270 4734 600
2 1 0 1 0 7 50 0 -1 0.000 0 0 -1 0 0 2
	 4506 270 4699 433
2 3 0 1 0 31 50 0 35 0.000 0 0 -1 0 0 7
	 2700 270 4506 270 4506 433 4699 433 4699 565 2700 565
	 2700 270
2 1 0 0 0 7 51 0 15 0.000 0 0 -1 0 0 7
	 2756 565 2754 600 4734 600 4734 478 4698 428 4706 565
	 2756 565
4 0 0 49 0 4 9 0.0000 0 150 1200 2835 490 Applikations-ram\001
-6
1 4 0 1 0 7 50 -1 -1 0.000 1 0.0000 3112 1950 38 38 3075 1950 3150 1950
1 4 0 1 0 7 50 -1 -1 0.000 1 0.0000 3037 5625 38 38 3000 5625 3075 5625
1 4 0 1 0 7 50 -1 -1 0.000 1 0.0000 3712 5175 38 38 3675 5175 3750 5175
1 4 0 1 0 7 50 -1 -1 0.000 1 0.0000 3455 3577 38 38 3418 3577 3493 3577
2 1 0 1 0 7 50 -1 -1 0.000 0 0 -1 0 0 2
	 4050 2100 2250 2100
2 1 0 1 0 7 50 -1 -1 0.000 0 0 -1 0 0 2
	 4050 5400 2250 5400
2 1 0 1 0 7 50 -1 -1 0.000 0 0 -1 0 0 2
	 4050 4875 2250 4875
2 2 0 1 0 7 50 -1 -1 0.000 0 0 -1 0 0 5
	 2250 1500 4050 1500 4050 5925 2250 5925 2250 1500
3 0 2 1 0 7 50 -1 -1 3.000 0 0 0 3
	 2700 975 3300 1350 3150 1950
	 0.000 1.000 0.000
3 0 2 1 0 7 50 -1 -1 3.000 0 0 0 3
	 2925 6450 3225 6075 3075 5625
	 0.000 1.000 0.000
3 0 2 1 0 7 50 -1 -1 3.000 0 0 0 3
	 3750 6900 3975 6150 3750 5175
	 0.000 1.000 0.000
3 0 2 1 0 7 50 -1 -1 3.000 0 0 0 3
	 3606 563 3898 1950 3478 3540
	 0.000 1.000 0.000
4 0 0 50 -1 0 10 0.0000 4 105 495 4200 1575 07FFFh\001
4 0 0 50 -1 0 10 0.0000 4 105 450 4200 6000 00000h\001
4 0 0 50 -1 0 10 0.0000 4 105 450 4200 5400 00400h\001
4 0 0 50 -1 0 10 0.0000 4 105 450 4200 2100 07000h\001
4 0 0 50 -1 0 10 0.0000 4 105 450 4200 4875 00500h\001
