#FIG 3.2
Landscape
Center
Metric
A4      
100.00
Single
-2
1200 2
6 4500 2565 5580 3105
6 4500 2565 5580 2835
# 
2 2 0 1 0 7 50 0 -1 0.000 0 0 -1 0 0 5
	 4500 2565 5580 2565 5580 2835 4500 2835 4500 2565
4 1 0 40 0 2 10 0.0000 4 135 450 5040 2745 Queue\001
-6
2 2 0 1 0 7 50 0 -1 0.000 0 0 -1 0 0 5
	 4500 2835 5580 2835 5580 2970 4500 2970 4500 2835
2 2 0 1 0 7 51 0 -1 0.000 0 0 -1 0 0 5
	 4500 2970 5580 2970 5580 3105 4500 3105 4500 2970
4 0 0 50 -1 0 12 0.0000 4 15 135 4635 2925 ...\001
4 0 0 50 -1 0 12 0.0000 4 15 135 4635 3060 ...\001
-6
6 4185 3465 5850 4275
2 2 0 1 0 7 50 0 -1 4.000 0 0 -1 0 0 5
	 4185 3780 5850 3780 5850 4275 4185 4275 4185 3780
2 2 0 1 0 7 50 0 -1 4.000 0 0 -1 0 0 5
	 4185 3690 5850 3690 5850 3780 4185 3780 4185 3690
2 2 0 1 0 7 50 0 -1 4.000 0 0 -1 0 0 5
	 4185 3465 5850 3465 5850 3690 4185 3690 4185 3465
4 0 0 50 0 0 10 0.0000 4 135 1515 4275 3960 +calculateNextThread()\001
4 0 0 50 0 0 10 0.0000 4 135 705 4275 4155 /push(Item)\001
4 1 0 50 0 2 10 0.0000 4 105 765 5040 3645 ThreadList\001
-6
6 1620 3015 4005 5760
2 1 0 1 0 7 50 0 -1 0.000 0 0 -1 0 0 2
	 1620 3240 4005 3240
2 1 0 1 0 7 50 0 -1 0.000 0 0 -1 0 0 2
	 1620 4050 4005 4050
2 2 0 1 0 7 51 0 20 0.000 0 0 -1 0 0 5
	 1620 3015 4005 3015 4005 5760 1620 5760 1620 3015
4 0 0 50 -1 0 10 0.0000 4 135 1470 1755 3420 -runningThread: Thread\001
4 1 0 50 0 2 10 0.0000 4 105 705 2790 3195 Scheduler\001
4 0 0 50 -1 0 10 0.0000 4 135 1665 1755 3555 -state: _sched_enum_state\001
4 0 0 50 -1 0 10 0.0000 4 105 1020 1755 3690 -iLockLevel: int\001
4 0 0 50 -1 0 10 0.0000 4 105 1140 1755 3825 -bReshedule: bool\001
4 0 0 50 -1 0 10 0.0000 4 135 1200 1755 3960 -bPreemptive: bool\001
4 0 0 50 0 0 10 0.0000 4 135 735 1755 4230 +schedule()\001
4 0 0 50 0 0 10 0.0000 4 135 1230 1755 4365 +addThread(thread)\001
4 0 0 50 0 0 10 0.0000 4 135 1515 1755 4500 +removeThread(Thread)\001
4 0 0 50 -1 0 10 0.0000 4 135 720 1755 4635 +start(bool)\001
4 0 0 50 -1 0 10 0.0000 4 135 2010 1755 4770 -contextSwitch(Thread, Thread)\001
4 0 0 50 -1 0 10 0.0000 4 135 450 1755 4905 +lock()\001
4 0 0 50 -1 0 10 0.0000 4 135 600 1755 5040 +unlock()\001
4 0 0 50 -1 0 10 0.0000 4 135 900 1755 5310 -restartTimer()\001
4 0 0 50 -1 0 10 0.0000 4 135 1815 1755 5175 +getRunningThread():Thread\001
4 0 0 50 -1 0 10 0.0000 4 135 675 1755 5625 -__idle__()\001
4 0 0 50 -1 0 10 0.0000 4 135 1560 1755 5445 -__isr__(): <<interrupt>>\001
-6
6 6660 2160 7470 2430
2 2 0 1 0 7 50 0 -1 4.000 0 0 -1 0 0 5
	 6660 2160 7470 2160 7470 2430 6660 2430 6660 2160
4 1 0 50 0 2 10 0.0000 4 105 315 7065 2340 Item\001
-6
2 1 0 1 0 7 50 0 -1 0.000 0 0 -1 1 0 2
	0 0 1.00 60.00 120.00
	 4005 4635 6210 4635
2 1 1 1 0 7 50 0 -1 4.000 0 0 -1 0 0 2
	 5040 4275 5040 4635
2 1 0 1 0 7 50 0 -1 4.000 0 0 -1 1 0 2
	1 0 1.00 150.00 150.00
	 5040 3465 5040 3105
2 1 0 1 0 7 50 0 -1 0.000 0 0 -1 0 0 2
	 6210 3105 7965 3105
2 1 0 1 0 7 50 0 -1 0.000 0 0 -1 0 0 2
	 6210 4500 7965 4500
2 2 0 1 0 7 51 0 20 0.000 0 0 -1 0 0 5
	 6210 2880 7965 2880 7965 5895 6210 5895 6210 2880
2 1 0 1 0 7 50 0 -1 4.000 0 0 -1 1 0 2
	1 0 1.00 150.00 150.00
	 7065 2880 7065 2430
4 0 0 50 0 0 10 0.0000 4 135 855 5130 4590 +readyQueue\001
4 0 0 50 0 0 10 0.0000 4 105 855 6345 3330 -threadID: int\001
4 0 0 50 -1 0 10 0.0000 4 135 1470 6345 3465 -threadName:  char[40]\001
4 0 0 50 -1 0 10 0.0000 4 135 990 6345 3600 -priority: BYTE\001
4 0 0 50 -1 0 10 0.0000 4 105 1110 6345 3735 -freeStack: UINT\001
4 0 0 50 -1 0 10 0.0000 4 105 915 6345 3870 -stack: *UINT\001
4 0 0 50 -1 0 10 0.0000 4 105 1095 6345 4005 -stacksize: UINT\001
4 0 0 50 -1 0 10 0.0000 4 135 1110 6345 4140 -context: jmp_buf\001
4 0 0 50 -1 0 10 0.0000 4 105 1155 6345 4275 -error: ThreadError\001
4 0 0 50 -1 0 10 0.0000 4 105 1200 6345 4410 -state: ThreadState\001
4 0 0 50 -1 0 10 0.0000 4 135 915 6345 4680 -saveContext()\001
4 0 0 50 -1 0 10 0.0000 4 135 1050 6345 4815 -restoreContext()\001
4 0 0 50 -1 0 10 0.0000 4 135 1410 6345 4995 +Thread() <<create>>\001
4 0 0 50 -1 0 10 0.0000 4 135 375 6345 5130 +run()\001
4 0 0 50 -1 0 10 0.0000 4 135 390 6345 5265 +kill()\001
4 0 0 50 -1 0 10 0.0000 4 135 1560 6345 5400 +getState(): ThreadState\001
4 0 0 50 -1 0 10 0.0000 4 135 960 6345 5535 +getId(): UINT\001
4 0 0 50 -1 0 10 0.0000 4 135 1305 6345 5670 +getPriority(): UINT\001
4 0 0 50 -1 0 10 0.0000 4 135 1200 6345 5805 +getName(): *char\001
4 0 0 50 0 0 12 0.0000 4 75 90 6075 4590 *\001
4 1 0 50 0 2 10 0.0000 4 105 510 7065 3060 Thread\001
