#FIG 3.2
Landscape
Center
Metric
A4      
100.00
Single
-2
1200 2
0 32 #909090
0 33 #e6e4ce
0 34 #9b9b9b
0 35 #ce9100
0 36 #f762aa
0 37 #7070ff
0 38 #5f5f5f
6 7245 4860 8595 5850
6 7245 4860 8595 5850
2 2 0 1 0 7 50 0 -1 0.000 0 0 -1 0 0 5
	 7245 4860 8595 4860 8595 5850 7245 5850 7245 4860
4 0 0 50 0 0 12 0.0000 4 135 615 7605 5535 selector\001
4 0 0 50 0 0 12 0.0000 4 135 855 7515 5265 IO-address\001
-6
-6
6 5130 2610 6570 3780
2 2 0 1 0 7 50 0 -1 0.000 0 0 -1 0 0 5
	 5130 2610 6570 2610 6570 3780 5130 3780 5130 2610
4 0 0 50 0 0 12 0.0000 4 135 915 5400 3240 PICO-Blaze\001
-6
6 9270 2610 10710 3780
2 2 0 1 0 7 50 0 -1 0.000 0 0 -1 0 0 5
	 9270 2610 10710 2610 10710 3780 9270 3780 9270 2610
4 0 0 50 0 0 12 0.0000 4 180 930 9585 3195 Gate keeper\001
-6
6 10755 2745 11565 3645
2 1 1 1 0 7 50 0 -1 4.000 0 0 -1 0 0 2
	 10935 2880 11385 2880
2 1 1 1 0 7 50 0 -1 4.000 0 0 -1 0 0 2
	 10935 3510 11385 3510
2 1 1 1 0 7 50 0 -1 4.000 0 0 -1 0 0 3
	 10980 2745 10755 3195 10980 3645
2 1 1 1 0 7 50 0 -1 4.000 0 0 -1 0 0 3
	 11340 2745 11565 3195 11340 3645
-6
6 11700 3015 12285 3375
4 0 0 50 0 0 12 0.0000 4 180 570 11700 3150 System\001
4 0 0 50 0 0 12 0.0000 4 135 300 11790 3375 Bus\001
-6
2 1 0 1 0 11 50 0 20 0.000 0 0 -1 0 0 10
	 9270 3105 6705 3105 6570 3195 6705 3285 8055 3285 8055 4860
	 8235 4860 8235 3285 9270 3285 9270 3105
2 1 0 1 0 11 50 0 20 0.000 0 0 -1 0 0 10
	 6570 3465 8055 3465 8055 3645 7785 3645 7785 4725 7695 4860
	 7605 4725 7605 3645 6570 3645 6570 3465
2 1 0 1 0 11 50 0 20 4.000 0 0 -1 0 0 6
	 8235 3465 9090 3465 9270 3555 9090 3645 8235 3645 8235 3465
2 1 0 1 0 11 50 0 20 4.000 0 0 -1 0 0 6
	 6570 2700 9090 2700 9270 2790 9090 2880 6570 2880 6570 2700
2 1 1 1 0 7 50 0 -1 4.000 0 0 -1 0 0 2
	 8910 5040 9360 5040
2 1 1 1 0 7 50 0 -1 4.000 0 0 -1 0 0 2
	 8910 5670 9360 5670
2 1 1 1 0 7 50 0 -1 4.000 0 0 -1 0 0 3
	 8955 4905 8730 5355 8955 5805
2 2 0 2 0 7 50 0 -1 0.000 0 0 -1 0 0 5
	 4500 1575 12690 1575 12690 6750 4500 6750 4500 1575
4 0 0 50 0 0 8 0.0000 4 90 315 7515 3240 data in\001
4 0 0 50 0 0 8 0.0000 4 75 600 7245 3600 data-address\001
4 0 0 50 0 0 8 0.0000 4 75 390 7515 2835 data out\001
4 0 0 50 0 0 12 0.0000 4 135 570 9180 5400 IO data\001
