#FIG 3.2
Landscape
Center
Metric
A4      
100.00
Single
-2
1200 2
6 5220 1260 6300 1530
# 
2 2 0 1 0 7 50 0 -1 0.000 0 0 -1 0 0 5
	 5220 1260 6300 1260 6300 1530 5220 1530 5220 1260
4 1 0 40 0 2 10 0.0000 4 135 420 5760 1440 Queue\001
-6
6 5220 1800 6300 2790
2 2 0 1 0 7 51 0 -1 0.000 0 0 -1 0 0 5
	 5220 1800 6300 1800 6300 2790 5220 2790 5220 1800
4 0 0 50 0 0 10 0.0000 4 135 690 5310 2175 +top():Item\001
4 0 0 50 0 0 10 0.0000 4 135 720 5310 2370 +pop():Item\001
4 0 0 50 -1 0 10 0.0000 4 135 885 5310 2550 +remove(Item)\001
4 0 0 50 -1 0 10 0.0000 4 135 615 5310 2730 +size():int\001
4 0 0 50 0 0 10 0.0000 4 135 735 5310 1980 +push(Item)\001
-6
6 7020 1800 7830 2250
2 2 0 1 0 7 50 0 -1 0.000 0 0 -1 0 0 5
	 7020 1800 7830 1800 7830 2070 7020 2070 7020 1800
2 2 0 1 0 7 50 0 -1 0.000 0 0 -1 0 0 5
	 7020 2070 7830 2070 7830 2160 7020 2160 7020 2070
2 2 0 1 0 7 50 0 -1 0.000 0 0 -1 0 0 5
	 7020 2160 7830 2160 7830 2250 7020 2250 7020 2160
4 1 0 40 0 2 10 0.0000 4 150 660 7425 1980 QListItem\001
-6
6 8100 1800 8910 1980
4 0 0 50 -1 0 10 0.0000 4 135 795 8100 1935 containedObj\001
-6
2 2 0 1 0 7 50 0 -1 0.000 0 0 -1 0 0 5
	 5220 1530 6300 1530 6300 1800 5220 1800 5220 1530
2 1 0 1 0 7 50 -1 -1 0.000 0 0 -1 1 0 2
	0 0 1.00 60.00 120.00
	 7830 2025 9135 2025
2 1 0 1 0 7 50 -1 -1 0.000 0 0 -1 1 0 3
	0 0 1.00 60.00 120.00
	 6300 1530 7110 1530 7110 1800
2 1 0 1 0 7 50 -1 -1 0.000 0 0 -1 1 0 3
	0 0 1.00 60.00 120.00
	 6300 2475 7110 2475 7110 2250
2 1 0 1 0 7 50 -1 -1 0.000 0 0 -1 1 0 5
	0 0 1.00 60.00 120.00
	 7695 2250 7695 2385 8010 2385 8010 2160 7830 2160
2 1 0 1 0 7 50 -1 -1 0.000 0 0 -1 1 0 5
	0 0 1.00 60.00 120.00
	 7695 1800 7695 1665 8010 1665 8010 1890 7830 1890
2 2 0 1 0 7 50 -1 -1 0.000 0 0 -1 0 0 5
	 9180 2790 9900 2790 9900 3375 9180 3375 9180 2790
2 1 0 1 0 7 50 -1 -1 0.000 0 0 -1 1 0 2
	1 0 1.00 60.00 120.00
	 9540 2790 9540 2250
2 2 0 1 0 7 50 0 -1 0.000 0 0 -1 0 0 5
	 9135 1800 9945 1800 9945 2070 9135 2070 9135 1800
2 2 0 1 0 7 50 0 -1 0.000 0 0 -1 0 0 5
	 9135 2070 9945 2070 9945 2160 9135 2160 9135 2070
2 2 0 1 0 7 50 0 -1 0.000 0 0 -1 0 0 5
	 9135 2160 9945 2160 9945 2250 9135 2250 9135 2160
4 0 0 50 -1 0 10 0.0000 4 135 720 5355 1710 -m_size:int\001
4 0 0 50 -1 0 10 0.0000 4 135 435 6480 2655 m_first\001
4 0 0 50 -1 0 10 0.0000 4 135 405 6480 1440 m_last\001
4 0 0 50 -1 0 10 0.0000 4 90 255 7695 1620 next\001
4 0 0 50 -1 0 10 0.0000 4 135 510 7695 2565 previous\001
4 0 0 50 -1 0 10 0.0000 4 135 270 9360 3105  Obj\001
4 1 0 40 0 2 10 0.0000 4 105 285 9540 1980 Item\001
