#FIG 3.2
Landscape
Center
Inches
Letter  
100.00
Single
-2
1200 2
5 1 0 1 0 7 50 -1 -1 0.000 0 1 0 0 2700.000 2475.000 2700 2400 2625 2475 2700 2550
6 8250 2850 8550 3225
2 1 0 1 0 0 50 -1 0 0.000 0 0 -1 0 0 2
	 8400 2850 8400 3150
2 1 0 1 0 0 50 -1 0 0.000 0 0 -1 0 0 2
	 8250 3150 8550 3150
2 1 0 1 0 0 50 -1 0 0.000 0 0 -1 0 0 2
	 8475 3225 8325 3225
-6
6 8325 2550 8475 2700
1 3 0 1 0 0 50 -1 20 0.000 1 0.0000 8401 2626 38 38 8401 2626 8401 2664
-6
6 8325 2775 8475 2925
1 3 0 1 0 0 50 -1 20 0.000 1 0.0000 8401 2851 38 38 8401 2851 8401 2889
-6
6 8550 3300 9750 4650
6 8850 3375 9600 4575
6 8925 3375 9525 4575
6 8925 3375 9525 4575
2 1 0 3 0 7 50 -1 -1 0.000 0 0 -1 0 0 2
	 9000 3525 9000 4425
2 1 0 3 0 7 50 -1 -1 0.000 0 0 -1 0 0 2
	 9450 4275 9450 3675
2 1 0 3 0 7 50 -1 -1 0.000 0 0 -1 0 0 2
	 9075 3450 9375 3600
2 1 0 3 0 7 50 -1 -1 0.000 0 0 -1 0 0 2
	 9375 4350 9075 4500
3 2 0 3 0 7 50 -1 -1 0.000 0 0 0 3
	 9090 3459 9025 3457 8997 3535
	 0.000 -1.000 0.000
3 2 0 3 0 7 50 -1 -1 0.000 0 0 0 3
	 9369 3604 9422 3631 9450 3680
	 0.000 -1.000 0.000
3 2 0 3 0 7 50 -1 -1 0.000 0 0 0 3
	 9447 4271 9432 4314 9376 4355
	 0.000 -1.000 0.000
3 2 0 3 0 7 50 -1 -1 0.000 0 0 0 3
	 9085 4499 9025 4492 8999 4423
	 0.000 -1.000 0.000
-6
2 1 0 3 0 0 50 -1 20 0.000 0 0 -1 0 0 2
	 9075 3675 9150 3675
2 1 0 3 0 0 50 -1 20 0.000 0 0 -1 0 0 2
	 9150 3825 9075 3825
2 1 0 3 0 0 50 -1 20 0.000 0 0 -1 0 0 2
	 9150 3975 9075 3975
2 1 0 3 0 0 50 -1 20 0.000 0 0 -1 0 0 2
	 9150 4125 9075 4125
2 1 0 3 0 0 50 -1 20 0.000 0 0 -1 0 0 2
	 9150 4275 9075 4275
2 1 0 3 0 0 50 -1 20 0.000 0 0 -1 0 0 2
	 9300 3750 9375 3750
2 1 0 3 0 0 50 -1 20 0.000 0 0 -1 0 0 2
	 9300 3900 9375 3900
2 1 0 3 0 0 50 -1 20 0.000 0 0 -1 0 0 2
	 9300 4050 9375 4050
2 1 0 3 0 0 50 -1 20 0.000 0 0 -1 0 0 2
	 9300 4200 9375 4200
-6
2 1 0 1 0 0 50 -1 20 0.000 0 0 -1 0 0 2
	 9375 3750 9600 3750
2 1 0 1 0 0 50 -1 20 0.000 0 0 -1 0 0 2
	 9375 3900 9600 3900
2 1 0 1 0 0 50 -1 20 0.000 0 0 -1 0 0 2
	 9375 4050 9600 4050
2 1 0 1 0 0 50 -1 20 0.000 0 0 -1 0 0 2
	 9375 4200 9600 4200
2 1 0 1 0 0 50 -1 20 0.000 0 0 -1 0 0 2
	 8850 4275 9075 4275
2 1 0 1 0 0 50 -1 20 0.000 0 0 -1 0 0 2
	 8850 4125 9075 4125
2 1 0 1 0 0 50 -1 20 0.000 0 0 -1 0 0 2
	 8850 3975 9075 3975
2 1 0 1 0 0 50 -1 20 0.000 0 0 -1 0 0 2
	 8850 3825 9075 3825
2 1 0 1 0 0 50 -1 20 0.000 0 0 -1 0 0 2
	 8850 3675 9075 3675
4 2 0 50 -1 0 6 0.0000 4 60 45 8940 3660 1\001
4 2 0 50 -1 0 6 0.0000 4 60 45 8937 3817 2\001
4 2 0 50 -1 0 6 0.0000 4 60 45 8943 3965 3\001
4 2 0 50 -1 0 6 0.0000 4 60 45 8943 4117 4\001
4 2 0 50 -1 0 6 0.0000 4 60 45 8943 4256 5\001
4 2 0 50 -1 0 6 0.0000 4 60 45 9566 3734 6\001
4 2 0 50 -1 0 6 0.0000 4 60 45 9567 3882 7\001
4 2 0 50 -1 0 6 0.0000 4 60 45 9570 4030 8\001
4 2 0 50 -1 0 6 0.0000 4 60 45 9573 4191 9\001
-6
6 8550 4275 8850 4650
2 1 0 1 0 0 50 -1 0 0.000 0 0 -1 0 0 2
	 8700 4275 8700 4575
2 1 0 1 0 0 50 -1 0 0.000 0 0 -1 0 0 2
	 8550 4575 8850 4575
2 1 0 1 0 0 50 -1 0 0.000 0 0 -1 0 0 2
	 8775 4650 8625 4650
-6
2 1 0 1 0 0 50 -1 -1 0.000 0 0 -1 0 0 2
	 8850 4275 8700 4275
2 1 0 1 0 0 50 -1 -1 0.000 0 0 -1 0 0 6
	 8850 3675 8700 3675 8700 3300 9750 3300 9750 3750 9600 3750
2 1 0 1 0 0 50 -1 -1 0.000 0 0 -1 0 0 3
	 8700 3675 8700 4125 8850 4125
-6
6 8625 3600 8775 3750
1 3 0 1 0 0 50 -1 20 0.000 1 0.0000 8701 3676 38 38 8701 3676 8701 3714
-6
6 9675 3975 9825 4125
1 3 0 1 0 0 50 -1 20 0.000 1 0.0000 9751 4051 38 38 9751 4051 9751 4089
-6
6 4875 2325 5400 2775
2 1 0 1 0 0 50 -1 0 0.000 0 0 -1 0 0 3
	 5400 2775 5025 2775 5025 2625
2 1 0 1 0 0 50 -1 -1 0.000 0 0 -1 0 0 5
	 5400 2475 5325 2475 5325 2325 5025 2325 5025 2400
2 2 0 2 0 0 50 -1 20 0.000 0 0 -1 0 0 5
	 4950 2550 5100 2550 5100 2625 4950 2625 4950 2550
2 2 0 2 0 0 50 -1 0 0.000 0 0 -1 0 0 5
	 4950 2400 5100 2400 5100 2475 4950 2475 4950 2400
-6
6 4875 2925 5400 3375
2 1 0 1 0 0 50 -1 0 0.000 0 0 -1 0 0 3
	 5400 3375 5025 3375 5025 3225
2 1 0 1 0 0 50 -1 -1 0.000 0 0 -1 0 0 5
	 5400 3075 5325 3075 5325 2925 5025 2925 5025 3000
2 2 0 2 0 0 50 -1 20 0.000 0 0 -1 0 0 5
	 4950 3150 5100 3150 5100 3225 4950 3225 4950 3150
2 2 0 2 0 0 50 -1 0 0.000 0 0 -1 0 0 5
	 4950 3000 5100 3000 5100 3075 4950 3075 4950 3000
-6
6 5324 6482 7424 8967
6 6674 7351 6824 7501
1 3 0 1 0 0 50 -1 20 0.000 1 0.0000 6750 7427 38 38 6750 7427 6750 7465
-6
6 6824 7876 6974 8026
1 3 0 1 0 0 50 -1 20 0.000 1 0.0000 6900 7952 38 38 6900 7952 6900 7990
-6
1 3 0 1 0 0 50 -1 -1 0.000 1 0.0000 6374 7501 75 75 6374 7501 6374 7426
1 3 0 1 0 0 50 -1 -1 0.000 1 0.0000 6599 7351 75 75 6599 7351 6524 7351
1 3 0 1 0 0 50 -1 -1 0.000 1 0.0000 6374 8101 75 75 6374 8101 6374 8176
2 1 0 1 0 0 50 -1 -1 0.000 0 0 -1 0 0 4
	 6524 7501 6524 6901 6074 7201 6524 7501
2 1 0 1 0 0 50 -1 -1 0.000 0 0 -1 0 0 4
	 6449 8101 6749 8101 6749 7351 6674 7351
2 1 0 1 0 0 50 -1 -1 0.000 0 0 -1 0 0 4
	 6524 7051 6899 7051 6899 8326 6524 8326
2 1 0 1 0 0 50 -1 -1 0.000 0 0 -1 0 0 2
	 6074 7201 5999 7201
2 1 0 1 0 0 50 -1 -1 0.000 0 0 -1 0 0 4
	 6074 8026 6074 8626 6524 8326 6074 8026
2 1 0 1 0 0 50 -1 -1 0.000 0 0 -1 0 0 3
	 6224 8101 6224 7951 5999 7951
2 1 0 1 0 0 50 -1 -1 0.000 0 0 -1 0 0 2
	 6074 8326 5999 8326
2 1 0 1 0 0 50 -1 -1 0.000 0 0 -1 0 0 2
	 6374 7576 5999 7576
2 2 0 3 0 0 50 -1 -1 0.000 0 0 -1 0 0 5
	 7124 8776 5624 8776 5624 6676 7124 6676 7124 8776
2 1 0 1 0 0 50 -1 -1 0.000 0 0 -1 0 0 2
	 6749 7426 7424 7426
2 1 0 1 0 0 50 -1 -1 0.000 0 0 -1 0 0 2
	 6899 7951 7424 7951
2 1 0 1 0 0 50 -1 -1 0.000 0 0 -1 0 0 2
	 5774 7201 5324 7201
2 1 0 1 0 0 50 -1 -1 0.000 0 0 -1 0 0 2
	 5774 7576 5324 7576
2 1 0 1 0 0 50 -1 -1 0.000 0 0 -1 0 0 2
	 5774 7951 5324 7951
2 1 0 1 0 0 50 -1 -1 0.000 0 0 -1 0 0 2
	 5774 8326 5324 8326
4 0 0 50 -1 0 8 0.0000 4 90 135 5866 8360 DI\001
4 0 0 50 -1 0 8 0.0000 4 90 165 5823 7980 DE\001
4 0 0 50 -1 0 8 0.0000 4 120 180 5841 7608 RE/\001
4 0 0 50 -1 0 8 0.0000 4 90 135 5848 7229 R0\001
4 0 0 50 -1 0 6 0.0000 4 60 45 5483 7147 1\001
4 0 0 50 -1 0 6 0.0000 4 60 45 5491 7533 2\001
4 0 0 50 -1 0 6 0.0000 4 60 45 5491 7910 3\001
4 0 0 50 -1 0 6 0.0000 4 60 45 5499 8271 4\001
4 0 0 50 -1 0 6 0.0000 4 60 45 7230 7916 6\001
4 0 0 50 -1 0 6 0.0000 4 60 45 7238 7365 7\001
4 0 0 50 -1 0 8 0.0000 4 90 465 5676 8967 MAX485\001
4 0 0 50 -1 0 8 0.0000 4 90 180 5668 6572 IC2\001
-6
6 7875 7875 8025 8025
1 3 0 1 0 0 50 -1 20 0.000 1 0.0000 7951 7951 38 38 7951 7951 7951 7989
-6
6 7875 7350 8025 7500
1 3 0 1 0 0 50 -1 20 0.000 1 0.0000 7951 7426 38 38 7951 7426 7951 7464
-6
6 8400 7875 8550 8025
1 3 0 1 0 0 50 -1 20 0.000 1 0.0000 8476 7951 38 38 8476 7951 8476 7989
-6
6 4950 7875 5100 8025
1 3 0 1 0 0 50 -1 20 0.000 1 0.0000 5026 7951 38 38 5026 7951 5026 7989
-6
6 2250 2775 3300 3150
5 1 0 1 0 7 50 -1 -1 0.000 0 1 0 0 2700.000 2925.000 2700 2850 2625 2925 2700 3000
1 4 0 1 0 7 50 -1 -1 0.000 1 0.0000 2400 2925 75 75 2475 2925 2325 2925
2 1 0 1 0 7 50 -1 -1 0.000 0 0 -1 0 0 3
	 2850 2925 3150 2925 3150 3075
2 1 0 1 0 7 50 -1 -1 0.000 0 0 -1 0 0 2
	 3300 3075 3000 3075
2 1 0 1 0 7 50 -1 -1 0.000 0 0 -1 0 0 2
	 3075 3150 3225 3150
2 1 0 3 0 7 50 -1 -1 0.000 0 0 -1 0 0 2
	 2700 2925 2850 2925
2 1 0 1 0 7 50 -1 -1 0.000 0 0 -1 0 0 2
	 2625 2925 2475 2925
-6
6 3000 2100 3300 2475
1 4 0 1 0 7 50 -1 -1 0.000 1 0.0000 3150 2250 75 75 3150 2175 3150 2325
2 1 0 1 0 7 50 -1 -1 0.000 0 0 -1 0 0 2
	 3150 2175 3150 2325
2 1 0 1 0 7 50 -1 -1 0.000 0 0 -1 0 0 2
	 3075 2250 3225 2250
2 1 0 1 0 7 50 -1 -1 0.000 0 0 -1 0 0 2
	 3150 2325 3150 2475
-6
6 7800 6150 8100 6525
1 4 0 1 0 7 50 -1 -1 0.000 1 0.0000 7950 6300 75 75 7950 6225 7950 6375
2 1 0 1 0 7 50 -1 -1 0.000 0 0 -1 0 0 2
	 7950 6225 7950 6375
2 1 0 1 0 7 50 -1 -1 0.000 0 0 -1 0 0 2
	 7875 6300 8025 6300
2 1 0 1 0 7 50 -1 -1 0.000 0 0 -1 0 0 2
	 7950 6375 7950 6525
-6
6 3284 7561 4049 8341
1 4 0 1 0 0 50 -1 -1 0.000 1 0.0000 3449 7726 75 75 3524 7726 3374 7726
1 4 0 1 0 0 50 -1 -1 0.000 1 0.0000 3449 7951 75 75 3524 7951 3374 7951
1 4 0 1 0 0 50 -1 -1 0.000 1 0.0000 3449 8176 75 75 3524 8176 3374 8176
2 2 0 3 0 0 50 -1 -1 0.000 0 0 -1 0 0 5
	 3899 8326 3299 8326 3299 7576 3899 7576 3899 8326
2 1 0 1 0 0 50 -1 -1 0.000 0 0 -1 0 0 2
	 3524 7726 3599 7726
2 1 0 1 0 0 50 -1 -1 0.000 0 0 -1 0 0 2
	 3524 7951 3599 7951
2 1 0 1 0 0 50 -1 -1 0.000 0 0 -1 0 0 2
	 3524 8176 3599 8176
2 1 0 1 0 0 50 -1 -1 0.000 0 0 -1 0 0 2
	 3824 7726 4049 7726
2 1 0 1 0 0 50 -1 -1 0.000 0 0 -1 0 0 2
	 3824 7951 4049 7951
2 1 0 1 0 0 50 -1 -1 0.000 0 0 -1 0 0 2
	 3824 8176 4049 8176
4 0 0 50 -1 0 8 0.0000 4 90 60 3681 7769 3\001
4 0 0 50 -1 0 8 0.0000 4 90 60 3686 7978 2\001
4 0 0 50 -1 0 8 0.0000 4 90 60 3681 8216 1\001
-6
6 8625 7350 8775 7500
1 3 0 1 0 0 50 -1 20 0.000 1 0.0000 8701 7426 38 38 8701 7426 8701 7464
-6
6 9600 8475 9750 8625
1 3 0 1 0 0 50 -1 20 0.000 1 0.0000 9676 8551 38 38 9676 8551 9676 8589
-6
6 8919 5983 9684 6763
1 4 0 1 0 0 50 -1 -1 0.000 1 0.0000 9084 6148 75 75 9159 6148 9009 6148
1 4 0 1 0 0 50 -1 -1 0.000 1 0.0000 9084 6373 75 75 9159 6373 9009 6373
1 4 0 1 0 0 50 -1 -1 0.000 1 0.0000 9084 6598 75 75 9159 6598 9009 6598
2 2 0 3 0 0 50 -1 -1 0.000 0 0 -1 0 0 5
	 9534 6748 8934 6748 8934 5998 9534 5998 9534 6748
2 1 0 1 0 0 50 -1 -1 0.000 0 0 -1 0 0 2
	 9159 6148 9234 6148
2 1 0 1 0 0 50 -1 -1 0.000 0 0 -1 0 0 2
	 9159 6373 9234 6373
2 1 0 1 0 0 50 -1 -1 0.000 0 0 -1 0 0 2
	 9159 6598 9234 6598
2 1 0 1 0 0 50 -1 -1 0.000 0 0 -1 0 0 2
	 9459 6148 9684 6148
2 1 0 1 0 0 50 -1 -1 0.000 0 0 -1 0 0 2
	 9459 6373 9684 6373
2 1 0 1 0 0 50 -1 -1 0.000 0 0 -1 0 0 2
	 9459 6598 9684 6598
4 0 0 50 -1 0 8 0.0000 4 90 60 9316 6191 3\001
4 0 0 50 -1 0 8 0.0000 4 90 60 9321 6400 2\001
4 0 0 50 -1 0 8 0.0000 4 90 60 9316 6638 1\001
-6
6 9825 6075 9975 6225
1 3 0 1 0 0 50 -1 20 0.000 1 0.0000 9901 6151 38 38 9901 6151 9901 6189
-6
6 9900 6075 11700 6375
2 2 0 1 0 7 50 -1 -1 0.000 0 0 -1 0 0 5
	 10725 6075 11175 6075 11175 6225 10725 6225 10725 6075
2 1 0 1 0 7 50 -1 -1 0.000 0 0 -1 0 0 3
	 11175 6150 11550 6150 11550 6300
2 1 0 1 0 7 50 -1 -1 0.000 0 0 -1 0 0 2
	 11700 6300 11400 6300
2 1 0 1 0 7 50 -1 -1 0.000 0 0 -1 0 0 2
	 11475 6375 11625 6375
2 1 0 1 0 7 50 -1 -1 0.000 0 0 -1 0 0 2
	 10725 6150 9900 6150
2 1 0 1 0 7 50 -1 -1 0.000 0 0 -1 0 0 4
	 10200 6075 10200 6225 10350 6150 10200 6075
2 1 0 1 0 7 50 -1 -1 0.000 0 0 -1 0 0 2
	 10350 6225 10350 6075
2 1 0 1 0 7 50 -1 -1 0.000 0 0 -1 0 0 2
	 10275 6300 10350 6375
2 1 0 1 0 7 50 -1 -1 0.000 0 0 -1 0 0 2
	 10350 6300 10425 6375
-6
6 9750 5550 10050 5925
1 4 0 1 0 7 50 -1 -1 0.000 1 0.0000 9900 5700 75 75 9900 5625 9900 5775
2 1 0 1 0 7 50 -1 -1 0.000 0 0 -1 0 0 2
	 9900 5625 9900 5775
2 1 0 1 0 7 50 -1 -1 0.000 0 0 -1 0 0 2
	 9825 5700 9975 5700
2 1 0 1 0 7 50 -1 -1 0.000 0 0 -1 0 0 2
	 9900 5775 9900 5925
-6
1 4 0 1 0 0 50 -1 0 0.000 1 0.0000 8400 2100 75 75 8400 2175 8400 2025
1 4 0 1 0 7 50 -1 -1 0.000 1 0.0000 8475 9225 75 75 8475 9150 8475 9300
1 4 0 1 0 7 50 -1 -1 0.000 1 0.0000 8700 9225 75 75 8700 9150 8700 9300
1 4 0 1 0 7 50 -1 -1 0.000 1 0.0000 3525 2250 75 75 3525 2175 3525 2325
1 4 0 1 0 7 50 -1 -1 0.000 1 0.0000 2400 2475 75 75 2475 2475 2325 2475
2 2 0 2 0 0 50 -1 -1 0.000 0 0 -1 0 0 5
	 7950 2550 8025 2550 8025 2700 7950 2700 7950 2550
2 2 0 2 0 0 50 -1 -1 0.000 0 0 -1 0 0 5
	 8100 2775 8175 2775 8175 2925 8100 2925 8100 2775
2 2 0 2 0 0 50 -1 -1 0.000 0 0 -1 0 0 5
	 8700 2550 8775 2550 8775 2700 8700 2700 8700 2550
2 1 0 1 0 0 50 -1 20 0.000 0 0 -1 0 0 2
	 7950 2850 7275 2850
2 1 0 1 0 0 50 -1 20 0.000 0 0 -1 0 0 2
	 7950 2625 7200 2625
2 1 0 1 0 0 50 -1 20 0.000 0 0 -1 0 0 2
	 8175 2625 8700 2625
2 1 0 1 0 0 50 -1 0 0.000 0 0 -1 0 0 2
	 8400 2625 8400 2175
2 2 0 2 0 0 50 -1 20 0.000 0 0 -1 0 0 5
	 7950 2775 8025 2775 8025 2925 7950 2925 7950 2775
2 2 0 2 0 0 50 -1 20 0.000 0 0 -1 0 0 5
	 8100 2550 8175 2550 8175 2700 8100 2700 8100 2550
2 1 0 1 0 0 50 -1 -1 0.000 0 0 -1 0 0 4
	 8925 2625 9150 2625 9150 2850 8175 2850
2 2 0 2 0 0 50 -1 20 0.000 0 0 -1 0 0 5
	 8850 2550 8925 2550 8925 2700 8850 2700 8850 2550
2 1 0 1 0 0 50 -1 -1 0.000 0 0 -1 0 0 2
	 8850 3825 7275 3825
2 1 0 1 0 0 50 -1 -1 0.000 0 0 -1 0 0 4
	 8850 3975 7500 3975 7500 4125 7200 4125
2 1 0 1 0 0 50 -1 -1 0.000 0 0 -1 0 0 6
	 7275 4275 8175 4275 8175 4950 9750 4950 9750 3900 9600 3900
2 1 0 1 0 0 50 -1 -1 0.000 0 0 -1 0 0 2
	 9600 4050 9750 4050
2 1 0 1 0 7 50 -1 -1 0.000 0 0 -1 0 0 2
	 5325 7950 4050 7950
2 2 0 3 0 7 50 -1 -1 0.000 0 0 -1 0 0 5
	 5625 2250 7050 2250 7050 4425 5625 4425 5625 2250
2 1 0 1 0 7 50 -1 -1 0.000 0 0 -1 0 0 2
	 5400 4275 5625 4275
2 1 0 1 0 7 50 -1 -1 0.000 0 0 -1 0 0 2
	 5400 4125 5625 4125
2 1 0 1 0 7 50 -1 -1 0.000 0 0 -1 0 0 2
	 5400 3975 5625 3975
2 1 0 1 0 7 50 -1 -1 0.000 0 0 -1 0 0 2
	 5400 3825 5625 3825
2 1 0 1 0 7 50 -1 -1 0.000 0 0 -1 0 0 2
	 5400 3375 5625 3375
2 1 0 1 0 7 50 -1 -1 0.000 0 0 -1 0 0 2
	 5625 3075 5400 3075
2 1 0 1 0 7 50 -1 -1 0.000 0 0 -1 0 0 2
	 5625 2775 5400 2775
2 1 0 1 0 7 50 -1 -1 0.000 0 0 -1 0 0 2
	 5625 2475 5400 2475
2 1 0 1 0 7 50 -1 -1 0.000 0 0 -1 0 0 2
	 7050 2625 7275 2625
2 1 0 1 0 7 50 -1 -1 0.000 0 0 -1 0 0 2
	 7050 2850 7275 2850
2 1 0 1 0 7 50 -1 -1 0.000 0 0 -1 0 0 2
	 7050 3825 7275 3825
2 1 0 1 0 7 50 -1 -1 0.000 0 0 -1 0 0 2
	 7050 3975 7275 3975
2 1 0 1 0 7 50 -1 -1 0.000 0 0 -1 0 0 2
	 7050 4125 7275 4125
2 1 0 1 0 7 50 -1 -1 0.000 0 0 -1 0 0 2
	 7050 4275 7275 4275
2 1 0 1 0 7 50 -1 -1 0.000 0 0 -1 0 0 4
	 4050 7725 5025 7725 5025 4275 5400 4275
2 1 0 1 0 7 50 -1 -1 0.000 0 0 -1 0 0 4
	 5325 8325 4875 8325 4875 4125 5400 4125
2 1 0 1 0 7 50 -1 -1 0.000 0 0 -1 0 0 4
	 5400 3825 4725 3825 4725 7200 5325 7200
2 1 0 1 0 7 50 -1 -1 0.000 0 0 -1 0 0 4
	 4050 8175 4350 8175 4350 9075 3675 9075
2 2 0 1 0 7 50 -1 -1 0.000 0 0 -1 0 0 5
	 7875 6825 8025 6825 8025 7275 7875 7275 7875 6825
2 1 0 1 0 7 50 -1 -1 0.000 0 0 -1 0 0 3
	 7425 7425 7950 7425 7950 7275
2 2 0 1 0 7 50 -1 -1 0.000 0 0 -1 0 0 5
	 7875 8100 8025 8100 8025 8550 7875 8550 7875 8100
2 2 0 1 0 7 50 -1 -1 0.000 0 0 -1 0 0 5
	 8400 8100 8550 8100 8550 8550 8400 8550 8400 8100
2 2 0 1 0 7 50 -1 -1 0.000 0 0 -1 0 0 5
	 4950 9075 5100 9075 5100 9525 4950 9525 4950 9075
2 1 0 1 0 7 50 -1 -1 0.000 0 0 -1 0 0 2
	 5025 7950 5025 9075
2 1 0 1 0 7 50 -1 -1 0.000 0 0 -1 0 0 5
	 5325 7575 4650 7575 4650 9750 5025 9750 5025 9525
2 1 0 1 0 7 50 -1 -1 0.000 0 0 -1 0 0 2
	 4950 8925 5100 8925
2 1 0 1 0 7 50 -1 -1 0.000 0 0 -1 0 0 4
	 5025 8925 4950 8775 5100 8775 5025 8925
2 1 0 1 0 7 50 -1 -1 0.000 0 0 -1 0 0 3
	 7425 7950 7950 7950 7950 8100
2 1 0 1 0 7 50 -1 -1 0.000 0 0 -1 0 0 3
	 7875 7950 8475 7950 8475 8100
2 2 0 1 0 7 50 -1 -1 0.000 0 0 -1 0 0 5
	 8850 9375 8325 9375 8325 8925 8850 8925 8850 9375
2 1 0 1 0 7 50 -1 -1 0.000 0 0 -1 0 0 2
	 8475 8550 8475 9150
2 1 0 1 0 7 50 -1 -1 0.000 0 0 -1 0 0 3
	 8700 9150 8700 7425 7950 7425
2 1 0 1 0 7 50 -1 -1 0.000 0 0 -1 0 0 2
	 7950 8550 7950 8925
2 1 0 1 0 7 50 -1 -1 0.000 0 0 -1 0 0 2
	 8100 8925 7800 8925
2 1 0 1 0 7 50 -1 -1 0.000 0 0 -1 0 0 2
	 7875 9000 8025 9000
2 1 0 1 0 7 50 -1 -1 0.000 0 0 -1 0 0 2
	 4650 9750 4650 9975
2 1 0 1 0 7 50 -1 -1 0.000 0 0 -1 0 0 2
	 4800 9975 4500 9975
2 1 0 1 0 7 50 -1 -1 0.000 0 0 -1 0 0 2
	 4725 10050 4575 10050
2 1 0 1 0 7 50 -1 -1 0.000 0 0 -1 0 0 3
	 5400 3975 4350 3975 4350 4200
2 1 0 1 0 7 50 -1 -1 0.000 0 0 -1 0 0 2
	 4500 4200 4200 4200
2 1 0 1 0 7 50 -1 -1 0.000 0 0 -1 0 0 2
	 4425 4275 4275 4275
2 1 0 1 0 7 50 -1 -1 0.000 0 0 -1 0 0 3
	 3525 2325 3525 2475 2850 2475
2 1 0 3 0 7 50 -1 -1 0.000 0 0 -1 0 0 2
	 2700 2475 2850 2475
2 1 0 1 0 7 50 -1 -1 0.000 0 0 -1 0 0 2
	 2625 2475 2475 2475
2 1 0 1 0 7 50 -1 -1 0.000 0 0 -1 0 0 2
	 7950 6825 7950 6450
2 2 0 3 0 7 50 -1 -1 0.000 0 0 -1 0 0 5
	 10950 7200 11700 7200 11700 8100 10950 8100 10950 7200
2 1 0 1 0 7 50 -1 -1 0.000 0 0 -1 0 0 2
	 8700 7425 10725 7425
2 1 0 1 0 7 50 -1 -1 0.000 0 0 -1 0 0 6
	 8475 7950 10275 7950 10275 7050 12150 7050 12150 7425 11925 7425
2 1 0 3 0 7 50 -1 -1 0.000 0 0 -1 0 0 2
	 11100 7425 11250 7425
2 1 0 3 0 7 50 -1 -1 0.000 0 0 -1 0 0 2
	 11400 7425 11550 7425
2 1 0 3 0 7 50 -1 -1 0.000 0 0 -1 0 0 2
	 11400 7650 11550 7650
2 1 0 3 0 7 50 -1 -1 0.000 0 0 -1 0 0 2
	 11400 7875 11550 7875
2 1 0 3 0 7 50 -1 -1 0.000 0 0 -1 0 0 2
	 11100 7875 11250 7875
2 1 0 3 0 7 50 -1 -1 0.000 0 0 -1 0 0 2
	 11100 7650 11250 7650
2 1 0 1 0 7 50 -1 -1 0.000 0 0 -1 0 0 2
	 11100 7650 10725 7650
2 1 0 1 0 7 50 -1 -1 0.000 0 0 -1 0 0 2
	 11100 7875 10725 7875
2 1 0 1 0 7 50 -1 -1 0.000 0 0 -1 0 0 2
	 11925 7425 11550 7425
2 1 0 1 0 7 50 -1 -1 0.000 0 0 -1 0 0 2
	 11925 7650 11550 7650
2 1 0 1 0 7 50 -1 -1 0.000 0 0 -1 0 0 2
	 11925 7875 11550 7875
2 1 0 1 0 7 50 -1 -1 0.000 0 0 -1 0 0 2
	 11100 7425 10725 7425
2 1 0 1 0 7 50 -1 -1 0.000 0 0 -1 0 0 4
	 9675 6375 9900 6375 9900 7875 10725 7875
2 1 0 1 0 7 50 -1 -1 0.000 0 0 -1 0 0 2
	 9675 6600 9675 8925
2 1 0 1 0 7 50 -1 -1 0.000 0 0 -1 0 0 2
	 9525 8925 9825 8925
2 1 0 1 0 7 50 -1 -1 0.000 0 0 -1 0 0 2
	 9600 9000 9750 9000
2 1 0 1 0 7 50 -1 -1 0.000 0 0 -1 0 0 4
	 9675 8550 12150 8550 12150 7875 11850 7875
2 1 0 1 0 7 50 -1 -1 0.000 0 0 -1 0 0 3
	 9675 6150 9900 6150 9900 5925
2 1 0 1 0 7 50 -1 -1 0.000 0 0 -1 0 0 2
	 5137 8887 5212 8962
2 1 0 1 0 7 50 -1 -1 0.000 0 0 -1 0 0 2
	 5147 8808 5222 8883
2 1 0 3 0 7 50 -1 -1 0.000 0 0 -1 0 0 2
	 3450 9075 3675 9075
2 1 0 1 0 7 50 -1 -1 0.000 0 0 -1 0 0 2
	 8400 2025 8400 2175
2 1 0 1 0 7 50 -1 -1 0.000 0 0 -1 0 0 2
	 8325 2100 8475 2100
4 0 0 50 -1 0 8 0.0000 4 90 465 5663 4600 MAX232\001
4 0 0 50 -1 0 8 0.0000 4 90 210 5700 2475 C1+\001
4 0 0 50 -1 0 8 0.0000 4 90 210 5700 2775 C1-\001
4 0 0 50 -1 0 8 0.0000 4 90 210 5700 3075 C2+\001
4 0 0 50 -1 0 8 0.0000 4 90 210 5700 3375 C2-\001
4 0 0 50 -1 0 8 0.0000 4 90 270 5700 3825 T1IN\001
4 0 0 50 -1 0 8 0.0000 4 90 270 5700 3975 T2IN\001
4 0 0 50 -1 0 8 0.0000 4 90 390 5700 4125 R1OUT\001
4 0 0 50 -1 0 8 0.0000 4 90 390 5700 4275 R2OUT\001
4 2 0 50 -1 0 8 0.0000 4 90 165 6975 2625 V+\001
4 2 0 50 -1 0 8 0.0000 4 90 165 6975 2850 V-\001
4 2 0 50 -1 0 8 0.0000 4 90 390 6975 3825 T1OUT\001
4 2 0 50 -1 0 8 0.0000 4 90 390 6975 3975 T2OUT\001
4 2 0 50 -1 0 8 0.0000 4 90 270 6975 4125 R1IN\001
4 2 0 50 -1 0 8 0.0000 4 90 270 6975 4275 R2IN\001
4 2 0 50 -1 0 6 0.0000 4 60 90 5553 3797 11\001
4 2 0 50 -1 0 6 0.0000 4 60 90 5550 3950 10\001
4 2 0 50 -1 0 6 0.0000 4 60 90 5550 4101 12\001
4 2 0 50 -1 0 6 0.0000 4 60 45 5536 4254 9\001
4 2 0 50 -1 0 6 0.0000 4 60 45 5529 3350 5\001
4 2 0 50 -1 0 6 0.0000 4 60 45 5528 3047 4\001
4 2 0 50 -1 0 6 0.0000 4 60 45 5539 2750 3\001
4 2 0 50 -1 0 6 0.0000 4 60 45 5540 2454 1\001
4 2 0 50 -1 0 6 0.0000 4 60 45 7197 2593 2\001
4 2 0 50 -1 0 6 0.0000 4 60 45 7200 2815 6\001
4 2 0 50 -1 0 6 0.0000 4 60 90 7215 3800 14\001
4 2 0 50 -1 0 6 0.0000 4 60 45 7196 3968 7\001
4 2 0 50 -1 0 6 0.0000 4 60 90 7214 4097 13\001
4 2 0 50 -1 0 6 0.0000 4 60 45 7200 4254 8\001
4 2 0 50 -1 0 8 0.0000 4 90 180 5775 2175 IC1\001
4 0 0 50 -1 0 12 0.0000 4 135 375 3375 2100 VCC\001
4 0 0 50 -1 0 12 0.0000 4 180 990 2250 1800 Power supply\001
4 0 0 50 -1 0 12 0.0000 4 135 330 2925 2100 +5V\001
4 0 0 50 -1 0 6 0.0000 4 60 45 10812 7402 1\001
4 0 0 50 -1 0 6 0.0000 4 60 45 10811 7631 3\001
4 0 0 50 -1 0 6 0.0000 4 60 45 10800 7852 5\001
4 0 0 50 -1 0 6 0.0000 4 60 45 11808 7393 2\001
4 0 0 50 -1 0 6 0.0000 4 60 45 11808 7620 4\001
4 0 0 50 -1 0 6 0.0000 4 60 45 11812 7841 6\001
4 0 0 50 -1 0 6 1.5708 4 60 45 8445 9123 2\001
4 0 0 50 -1 0 6 1.5708 4 60 45 8670 9133 1\001
4 0 0 50 -1 0 10 0.0000 4 105 270 11325 8250 SV1\001
4 0 0 50 -1 0 10 0.0000 4 105 480 12075 7650 Databus\001
4 0 0 50 -1 0 10 1.5708 4 105 225 9000 9300 JP1\001
4 0 0 50 -1 0 10 1.5708 4 105 195 8325 8550 RT\001
4 0 0 50 -1 0 10 1.5708 4 105 210 7800 8550 RA\001
4 0 0 50 -1 0 10 1.5708 4 105 210 7800 7200 RB\001
4 0 0 50 -1 0 10 0.0000 4 105 270 7800 6150 +5V\001
4 0 0 50 -1 0 10 0.0000 4 105 270 9750 5100 +5V\001
4 0 0 50 -1 0 10 0.0000 4 135 750 9150 3225 RS232/DB9\001
4 0 0 50 -1 0 10 0.0000 4 105 270 8250 1950 +5V\001
4 0 0 50 -1 0 10 1.5708 4 105 195 5325 9000 DE\001
4 0 0 50 -1 0 10 1.5708 4 105 180 4875 9600 R2\001
4 0 0 50 -1 0 10 0.0000 4 105 690 3225 7425 Select RTS\001
4 0 0 50 -1 0 10 0.0000 4 105 315 4125 4500 GND\001
4 0 0 50 -1 0 10 0.0000 4 105 315 7800 9225 GND\001
4 0 0 50 -1 0 10 0.0000 4 105 315 9525 9150 GND\001
4 0 0 50 -1 0 10 0.0000 4 105 315 8550 4875 GND\001
4 0 0 50 -1 0 10 0.0000 4 105 315 8175 3375 GND\001
4 0 0 50 -1 0 10 0.0000 4 105 315 3000 3300 GND\001
4 0 0 50 -1 0 10 0.0000 4 75 90 4800 3000 +\001
4 0 0 50 -1 0 10 0.0000 4 105 600 8325 9600 Terminate\001
4 0 0 50 -1 0 10 0.0000 4 105 225 9300 6975 JP3\001
4 0 0 50 -1 0 10 0.0000 4 105 225 3675 8550 JP2\001
4 0 0 50 -1 0 10 0.0000 4 105 180 4650 3225 C2\001
4 0 0 50 -1 0 10 0.0000 4 105 180 4650 2625 C1\001
4 0 0 50 -1 0 10 0.0000 4 75 90 4800 2400 +\001
4 0 0 50 -1 0 10 0.0000 4 75 90 8250 3000 +\001
4 0 0 50 -1 0 10 0.0000 4 75 90 7800 2775 +\001
4 0 0 50 -1 0 10 1.5708 4 105 180 7875 3075 C4\001
4 0 0 50 -1 0 10 1.5708 4 105 180 7875 2550 C3\001
4 0 0 50 -1 0 10 1.5708 4 105 180 8625 2550 C5\001
4 0 0 50 -1 0 10 0.0000 4 75 90 8550 2775 +\001
4 0 0 50 -1 0 8 0.0000 4 90 75 6975 7350 B\001
4 0 0 50 -1 0 8 0.0000 4 90 90 6975 7875 A\001
4 0 0 50 -1 0 8 0.0000 4 90 255 10200 6000 PWR\001
4 0 0 50 -1 0 8 0.0000 4 90 135 10950 6000 R1\001
4 0 0 50 -1 0 10 0.0000 4 105 825 3225 9300 RTS from uP\001
4 0 0 50 -1 0 10 0.0000 4 135 1260 8400 5850 Enable power supply\001
