%!PS-Adobe-2.0 EPSF-2.0
%%Title: classes.fig
%%Creator: fig2dev Version 3.2 Patchlevel 4
%%CreationDate: Sat Oct 28 23:10:37 2006
%%For: tobibobi@valdemar (Tobias Nielsen,,,)
%%BoundingBox: 0 0 303 137
%%Magnification: 1.0000
%%EndComments
/$F2psDict 200 dict def
$F2psDict begin
$F2psDict /mtrx matrix put
/col-1 {0 setgray} bind def
/col0 {0.000 0.000 0.000 srgb} bind def
/col1 {0.000 0.000 1.000 srgb} bind def
/col2 {0.000 1.000 0.000 srgb} bind def
/col3 {0.000 1.000 1.000 srgb} bind def
/col4 {1.000 0.000 0.000 srgb} bind def
/col5 {1.000 0.000 1.000 srgb} bind def
/col6 {1.000 1.000 0.000 srgb} bind def
/col7 {1.000 1.000 1.000 srgb} bind def
/col8 {0.000 0.000 0.560 srgb} bind def
/col9 {0.000 0.000 0.690 srgb} bind def
/col10 {0.000 0.000 0.820 srgb} bind def
/col11 {0.530 0.810 1.000 srgb} bind def
/col12 {0.000 0.560 0.000 srgb} bind def
/col13 {0.000 0.690 0.000 srgb} bind def
/col14 {0.000 0.820 0.000 srgb} bind def
/col15 {0.000 0.560 0.560 srgb} bind def
/col16 {0.000 0.690 0.690 srgb} bind def
/col17 {0.000 0.820 0.820 srgb} bind def
/col18 {0.560 0.000 0.000 srgb} bind def
/col19 {0.690 0.000 0.000 srgb} bind def
/col20 {0.820 0.000 0.000 srgb} bind def
/col21 {0.560 0.000 0.560 srgb} bind def
/col22 {0.690 0.000 0.690 srgb} bind def
/col23 {0.820 0.000 0.820 srgb} bind def
/col24 {0.500 0.190 0.000 srgb} bind def
/col25 {0.630 0.250 0.000 srgb} bind def
/col26 {0.750 0.380 0.000 srgb} bind def
/col27 {1.000 0.500 0.500 srgb} bind def
/col28 {1.000 0.630 0.630 srgb} bind def
/col29 {1.000 0.750 0.750 srgb} bind def
/col30 {1.000 0.880 0.880 srgb} bind def
/col31 {1.000 0.840 0.000 srgb} bind def

end
save
newpath 0 137 moveto 0 0 lineto 303 0 lineto 303 137 lineto closepath clip newpath
-26.3 257.2 translate
1 -1 scale

/cp {closepath} bind def
/ef {eofill} bind def
/gr {grestore} bind def
/gs {gsave} bind def
/sa {save} bind def
/rs {restore} bind def
/l {lineto} bind def
/m {moveto} bind def
/rm {rmoveto} bind def
/n {newpath} bind def
/s {stroke} bind def
/sh {show} bind def
/slc {setlinecap} bind def
/slj {setlinejoin} bind def
/slw {setlinewidth} bind def
/srgb {setrgbcolor} bind def
/rot {rotate} bind def
/sc {scale} bind def
/sd {setdash} bind def
/ff {findfont} bind def
/sf {setfont} bind def
/scf {scalefont} bind def
/sw {stringwidth} bind def
/tr {translate} bind def
/tnt {dup dup currentrgbcolor
  4 -2 roll dup 1 exch sub 3 -1 roll mul add
  4 -2 roll dup 1 exch sub 3 -1 roll mul add
  4 -2 roll dup 1 exch sub 3 -1 roll mul add srgb}
  bind def
/shd {dup dup currentrgbcolor 4 -2 roll mul 4 -2 roll mul
  4 -2 roll mul srgb} bind def
/$F2psBegin {$F2psDict begin /$F2psEnteredState save def} def
/$F2psEnd {$F2psEnteredState restore end} def

$F2psBegin
10 setmiterlimit
0 slj 0 slc
 0.06000 0.06000 sc
%
% Fig objects follow
%
% 
% here starts figure with depth 50
% Polyline
7.500 slw
n 2550 3600 m 3825 3600 l 3825 4050 l 2550 4050 l
 cp gs col0 s gr 
/Times-Bold ff 180.00 scf sf
2625 3900 m
gs 1 -1 sc (JewelProblem) col0 sh gr
% Polyline
n 4350 3600 m 5475 3600 l 5475 4050 l 4350 4050 l
 cp gs col0 s gr 
/Times-Bold ff 180.00 scf sf
4425 3900 m
gs 1 -1 sc (ManProblem) col0 sh gr
% Polyline
n 825 3600 m 1950 3600 l 1950 4050 l 825 4050 l
 cp gs col0 s gr 
/Times-Bold ff 180.00 scf sf
975 3900 m
gs 1 -1 sc (Node) col0 sh gr
% Polyline
n 450 2475 m 2325 2475 l 2325 2850 l 450 2850 l
 cp gs col0 s gr 
% Polyline
 [60] 0 sd
gs  clippath
3465 2280 m 3465 2220 l 3313 2220 l 3433 2250 l 3313 2280 l cp
eoclip
n 2325 2250 m
 3450 2250 l gs col0 s gr gr
 [] 0 sd
% arrowhead
n 3313 2280 m 3433 2250 l 3313 2220 l  col0 s
% Polyline
n 450 2025 m 2325 2025 l 2325 2475 l 450 2475 l
 cp gs col0 s gr 
% Polyline
n 3450 2475 m
 4950 2475 l gs col0 s gr 
% Polyline
n 3450 2025 m 4950 2025 l 4950 3000 l 3450 3000 l
 cp gs col0 s gr 
/Times-Roman ff 180.00 scf sf
2475 2175 m
gs 1 -1 sc (solves a) col0 sh gr
/Times-Roman ff 180.00 scf sf
525 2700 m
gs 1 -1 sc (AStar\(:Problem\):Node) col0 sh gr
/Times-Bold ff 180.00 scf sf
1050 2325 m
gs 1 -1 sc (Algorithm) col0 sh gr
/Times-Italic ff 180.00 scf sf
3600 2700 m
gs 1 -1 sc (successor\(:Node\)) col0 sh gr
/Times-Italic ff 180.00 scf sf
3600 2925 m
gs 1 -1 sc (goalTest\(:Node\)) col0 sh gr
/Times-Italic ff 195.00 scf sf
3825 2325 m
gs 1 -1 sc (problem) col0 sh gr
% Polyline
gs  clippath
3660 3013 m 3553 2959 l 3432 3201 l 3593 3014 l 3539 3255 l cp
eoclip
n 3300 3600 m
 3600 3000 l gs col0 s gr gr

% arrowhead
n 3539 3255 m 3593 3014 l 3432 3201 l 3539 3255 l  cp gs col7 1.00 shd ef gr  col0 s
% Polyline
gs  clippath
4625 2964 m 4513 3007 l 4609 3260 l 4581 3015 l 4721 3218 l cp
eoclip
n 4800 3600 m
 4575 3000 l gs col0 s gr gr

% arrowhead
n 4721 3218 m 4581 3015 l 4609 3260 l 4721 3218 l  cp gs col7 1.00 shd ef gr  col0 s
% Polyline
 [60] 0 sd
gs  clippath
1935 3720 m 1935 3780 l 2087 3780 l 1967 3750 l 2087 3720 l cp
eoclip
n 2550 3750 m
 1950 3750 l gs col0 s gr gr
 [] 0 sd
% arrowhead
n 2087 3720 m 1967 3750 l 2087 3780 l  col0 s
% Polyline
 [60] 0 sd
gs  clippath
1935 3945 m 1935 4005 l 2087 4005 l 1967 3975 l 2087 3945 l cp
eoclip
n 4350 3900 m 4125 3900 l 4125 4275 l 2325 4275 l 2325 3975 l
 1950 3975 l gs col0 s gr gr
 [] 0 sd
% arrowhead
n 2087 3945 m 1967 3975 l 2087 4005 l  col0 s
% Polyline
gs  clippath
840 3960 m 840 3840 l 568 3840 l 808 3900 l 568 3960 l cp
eoclip
n 1125 3600 m 1125 3300 l 450 3300 l 450 3900 l
 825 3900 l gs col0 s gr gr

% arrowhead
n 568 3960 m 808 3900 l 568 3840 l  col0 s
/Times-Roman ff 180.00 scf sf
450 3225 m
gs 1 -1 sc (parentNode) col0 sh gr
% here ends figure;
$F2psEnd
rs
showpage
