#FIG 3.2
Landscape
Center
Inches
Letter  
100.00
Single
-2
1200 2
5 1 0 1 0 7 50 -1 -1 0.000 0 0 0 0 1500.000 1875.000 1425 1875 1500 1800 1575 1875
5 1 0 1 0 7 50 -1 -1 0.000 0 0 0 0 1650.000 1875.000 1575 1875 1650 1800 1725 1875
5 1 0 1 0 7 50 -1 -1 0.000 0 0 0 0 1800.000 1875.000 1725 1875 1800 1800 1875 1875
6 975 2175 1650 2550
4 0 0 51 -1 0 10 0.0000 4 135 675 975 2325 Forsynings\001
4 0 0 51 -1 0 10 0.0000 4 135 585 975 2505 sp\346nding\001
-6
6 2773 2400 3000 2509
4 0 0 51 -1 0 10 0.0000 4 75 75 2773 2475 e\001
4 0 0 51 -1 0 5 0.0000 4 45 150 2850 2509 mod\001
-6
6 1050 1050 1650 1425
4 0 0 51 -1 0 10 0.0000 4 105 435 1050 1200 Anker \001
4 0 0 51 -1 0 10 0.0000 4 105 600 1050 1380 Induktans\001
-6
6 2775 1125 3375 1425
4 0 0 51 -1 0 10 0.0000 4 105 390 2850 1275 Anker\001
4 0 0 51 -1 0 10 0.0000 4 105 600 2775 1425 Resistans\001
-6
1 3 0 1 0 7 50 -1 -1 0.000 1 0.0000 3300 2475 150 150 3300 2475 3300 2325
1 1 0 1 0 7 52 -1 -1 0.000 1 0.0000 4046 2479 75 225 4046 2479 4121 2479
1 1 0 1 0 7 50 -1 20 0.000 1 0.0000 3900 2475 75 225 3900 2475 3975 2475
1 1 0 1 0 7 53 -1 20 0.000 1 0.0000 4050 2475 150 300 4050 2475 4200 2475
1 1 0 1 0 7 60 -1 20 0.000 1 0.0000 4421 2471 75 225 4421 2471 4496 2471
1 1 0 1 0 7 55 -1 20 0.000 1 0.0000 4275 2475 150 300 4275 2475 4425 2475
2 1 0 1 0 7 50 -1 -1 0.000 0 0 -1 0 0 2
	 825 1875 1425 1875
2 1 0 1 0 7 50 -1 -1 0.000 0 0 -1 0 0 2
	 1875 1875 2400 1875
2 2 0 1 0 7 50 -1 -1 0.000 0 0 -1 0 0 5
	 2400 1800 2850 1800 2850 1950 2400 1950 2400 1800
2 1 0 1 0 7 50 -1 -1 0.000 0 0 -1 0 0 3
	 2850 1875 3300 1875 3300 2325
2 1 0 1 0 7 50 -1 -1 0.000 0 0 -1 0 0 3
	 3300 2625 3300 2925 825 2925
2 1 0 1 0 7 50 -1 -1 0.000 0 0 -1 1 0 2
	0 0 1.00 60.00 120.00
	 900 2850 900 1950
2 1 0 1 0 7 50 -1 -1 0.000 0 0 -1 0 0 2
	 3075 2325 3075 2625
2 1 0 2 0 7 50 -1 -1 0.000 0 0 -1 0 0 2
	 3300 2475 3900 2475
2 2 0 0 0 7 51 -1 20 0.000 0 0 -1 0 0 5
	 3900 2250 4050 2250 4050 2700 3900 2700 3900 2250
2 1 0 1 0 7 51 -1 -1 0.000 0 0 -1 0 0 2
	 3900 2250 4050 2250
2 1 0 1 0 7 51 -1 -1 0.000 0 0 -1 0 0 2
	 3900 2700 4050 2700
2 2 0 0 0 7 54 -1 20 0.000 0 0 -1 0 0 5
	 4050 2175 4275 2175 4275 2775 4050 2775 4050 2175
2 1 0 1 0 7 51 -1 -1 0.000 0 0 -1 0 0 2
	 4050 2175 4275 2175
2 1 0 1 0 7 51 -1 -1 0.000 0 0 -1 0 0 2
	 4050 2775 4275 2775
2 2 0 0 0 7 59 -1 20 0.000 0 0 -1 0 0 5
	 4425 2250 4275 2250 4275 2700 4425 2700 4425 2250
2 1 0 1 0 7 59 -1 -1 0.000 0 0 -1 0 0 2
	 4425 2250 4350 2250
2 1 0 1 0 7 58 -1 -1 0.000 0 0 -1 0 0 2
	 4425 2700 4350 2700
2 1 0 1 0 7 51 -1 -1 0.000 0 0 -1 0 0 2
	 4500 2475 4800 2475
3 2 0 1 0 7 51 -1 -1 0.000 0 0 0 3
	 2775 1275 2625 1425 2550 1575
	 0.000 -1.000 0.000
3 2 0 1 0 7 51 -1 -1 0.000 0 0 0 3
	 3675 2325 3525 2550 3675 2550
	 0.000 -1.000 0.000
3 2 0 1 0 7 51 -1 -1 0.000 0 0 0 3
	 1500 1200 1800 1425 1800 1650
	 0.000 -1.000 0.000
4 0 0 51 -1 0 10 0.0000 4 135 210 600 2400 u(t)\001
4 0 0 51 -1 0 10 0.0000 4 105 105 2550 1725 R\001
4 0 0 51 -1 0 10 0.0000 4 105 90 1650 1725 L\001
4 0 0 51 -1 0 10 0.0000 4 105 60 4275 2550 J\001
4 0 0 51 -1 0 10 0.0000 4 135 255 3525 2250 w(t)\001
4 0 0 51 -1 0 10 0.0000 4 135 225 4650 2400 T(t)\001
