#FIG 3.2
Portrait
Center
Metric
A4      
100.00
Single
-2
1200 2
0 32 #ffffff
6 2475 13050 4425 14100
2 1 0 1 0 7 50 -1 -1 0.000 0 0 -1 0 0 2
	 2610 13365 3150 13365
2 1 0 1 0 7 50 -1 -1 0.000 0 0 -1 0 0 2
	 3690 13365 4320 13365
2 2 0 1 0 7 50 -1 -1 0.000 0 0 -1 0 0 5
	 3600 13410 4410 13410 4410 13140 3600 13140 3600 13410
2 2 0 1 0 7 50 -1 -1 0.000 0 0 -1 0 0 5
	 2520 13140 3240 13140 3240 13410 2520 13410 2520 13140
2 2 0 1 0 7 50 -1 -1 0.000 0 0 -1 0 0 5
	 2835 13635 2925 13635 2925 13770 2835 13770 2835 13635
2 1 1 1 0 7 50 -1 -1 3.000 0 0 -1 0 0 2
	 2880 13635 2880 13410
2 1 1 1 0 7 50 -1 -1 4.000 0 0 -1 0 0 2
	 4005 13860 4005 13410
2 2 0 1 0 7 50 -1 -1 0.000 0 0 -1 0 0 5
	 3960 13860 4050 13860 4050 13950 3960 13950 3960 13860
2 1 1 1 0 7 50 -1 -1 4.000 0 0 -1 0 0 2
	 2880 13770 2880 14040
2 1 1 1 0 7 50 -1 -1 4.000 0 0 -1 0 0 2
	 4005 13950 4005 14040
2 1 0 1 0 7 50 -1 -1 0.000 0 0 -1 0 0 5
	 2565 13140 2565 13095 3285 13095 3285 13365 3240 13365
4 0 0 50 -1 0 12 0.0000 4 180 660 3690 13320 p:Person\001
4 0 0 50 -1 0 12 0.0000 4 135 570 2610 13320 :Person\001
-6
2 1 0 1 0 7 50 -1 -1 0.000 0 0 -1 0 0 2
	 855 13365 1980 13365
2 2 0 1 0 7 50 -1 -1 0.000 0 0 -1 0 0 5
	 765 13410 2070 13410 2070 13140 765 13140 765 13410
2 1 0 1 0 7 50 -1 -1 0.000 0 0 -1 1 0 2
	1 1 1.00 60.00 120.00
	 585 13590 1350 13590
2 1 0 1 0 7 50 -1 -1 0.000 0 0 -1 1 0 2
	1 1 1.00 60.00 120.00
	 1440 13860 3960 13860
2 1 1 1 0 7 50 -1 -1 4.000 0 0 -1 0 0 2
	 1395 13410 1395 13590
2 2 0 1 0 7 50 -1 -1 0.000 0 0 -1 0 0 5
	 1350 13590 1440 13590 1440 13950 1350 13950 1350 13590
2 1 1 1 0 7 50 -1 -1 4.000 0 0 -1 0 0 2
	 1395 13950 1395 14040
2 1 0 1 0 7 50 -1 -1 0.000 0 0 -1 1 0 2
	1 1 1.00 60.00 120.00
	 1440 13635 2835 13635
4 0 0 50 -1 0 12 0.0000 4 135 1170 855 13320 :LocateHandler\001
4 0 0 50 -1 0 10 0.0000 4 135 690 585 13590 locate(pid)\001
4 0 0 50 -1 0 10 0.0000 4 135 1200 1485 13635 p:=findPerson(pid)\001
4 0 0 50 -1 0 10 0.0000 4 135 1320 1485 13860 room:=getLocation()\001
