#FIG 3.2
Landscape
Center
Inches
Letter  
100.00
Single
-2
1200 2
# OP-amp (operational amplifier)
6 5325 4125 6525 5025
2 3 0 1 -1 7 0 0 20 0.000 0 0 -1 0 0 4
	 5475 4125 6375 4575 5475 5025 5475 4125
2 1 0 1 -1 -1 0 0 -1 0.000 0 0 -1 0 0 2
	 6375 4575 6525 4575
2 1 0 1 -1 -1 0 0 -1 0.000 0 0 -1 0 0 2
	 5325 4725 5475 4725
2 1 0 1 -1 -1 0 0 -1 0.000 0 0 -1 0 0 2
	 5325 4425 5475 4425
4 0 -1 0 0 0 8 0.0000 0 75 75 5550 4764 +\001
4 0 -1 0 0 0 8 0.0000 0 15 45 5550 4464 -\001
-6
# Resistor
6 6750 4950 6900 5625
2 1 0 1 0 7 100 0 -1 0.000 0 0 -1 0 0 12
	 6825 4950 6825 5095 6750 5119 6900 5167 6750 5215 6900 5263
	 6750 5311 6900 5359 6750 5407 6900 5455 6825 5479 6825 5625
-6
# Ground
6 6675 5625 6975 5925
2 1 0 1 -1 -1 0 0 -1 0.000 0 0 -1 0 0 2
	 6825 5625 6825 5775
2 1 0 1 -1 -1 0 0 -1 0.000 0 0 -1 0 0 2
	 6675 5775 6975 5775
2 1 0 1 -1 -1 0 0 -1 0.000 0 0 -1 0 0 2
	 6750 5850 6900 5850
2 1 0 1 -1 -1 0 0 -1 0.000 0 0 -1 0 0 2
	 6795 5925 6870 5925
-6
# Ground
6 3825 5100 4125 5400
2 1 0 1 -1 -1 0 0 -1 0.000 0 0 -1 0 0 2
	 3975 5100 3975 5250
2 1 0 1 -1 -1 0 0 -1 0.000 0 0 -1 0 0 2
	 3825 5250 4125 5250
2 1 0 1 -1 -1 0 0 -1 0.000 0 0 -1 0 0 2
	 3900 5325 4050 5325
2 1 0 1 -1 -1 0 0 -1 0.000 0 0 -1 0 0 2
	 3945 5400 4020 5400
-6
# Resistor
6 5550 3600 6225 3750
2 1 0 1 0 7 100 0 -1 0.000 0 0 -1 0 0 12
	 5550 3675 5695 3675 5719 3750 5767 3600 5815 3750 5863 3600
	 5911 3750 5959 3600 6007 3750 6055 3600 6079 3675 6225 3675
-6
# Resistor
6 4125 4350 4800 4500
2 1 0 1 0 7 100 0 -1 0.000 0 0 -1 0 0 12
	 4125 4425 4270 4425 4294 4500 4342 4350 4390 4500 4438 4350
	 4486 4500 4534 4350 4582 4500 4630 4350 4654 4425 4800 4425
-6
# Ground
6 4875 5400 5175 5700
2 1 0 1 -1 -1 0 0 -1 0.000 0 0 -1 0 0 2
	 5025 5400 5025 5550
2 1 0 1 -1 -1 0 0 -1 0.000 0 0 -1 0 0 2
	 4875 5550 5175 5550
2 1 0 1 -1 -1 0 0 -1 0.000 0 0 -1 0 0 2
	 4950 5625 5100 5625
2 1 0 1 -1 -1 0 0 -1 0.000 0 0 -1 0 0 2
	 4995 5700 5070 5700
-6
1 3 0 1 0 7 50 -1 -1 0.000 1 0.0000 5025 5250 150 150 5025 5250 5025 5400
2 1 0 1 0 7 50 -1 -1 0.000 0 0 -1 0 0 3
	 5325 4725 5025 4725 5025 5100
2 1 0 1 0 7 50 -1 -1 0.000 0 0 -1 0 0 2
	 4800 4425 5325 4425
2 1 0 1 0 7 50 -1 -1 0.000 0 0 -1 0 0 3
	 5025 4425 5025 3675 5550 3675
2 1 0 1 0 7 50 -1 -1 0.000 0 0 -1 0 0 3
	 6225 3675 6825 3675 6825 4950
2 1 0 1 0 7 50 -1 -1 0.000 0 0 -1 0 0 2
	 6825 4575 6525 4575
2 1 0 1 0 7 50 -1 -1 0.000 0 0 -1 0 0 2
	 4125 4425 3975 4425
2 1 0 1 0 7 50 -1 -1 0.000 0 0 -1 0 0 2
	 3975 4425 3975 5100
2 1 0 1 0 7 50 -1 -1 0.000 0 0 -1 0 0 2
	 5025 5100 5025 5250
2 1 0 1 0 7 50 -1 -1 0.000 0 0 -1 0 0 2
	 4950 5175 5100 5175
2 1 0 1 0 7 50 -1 -1 0.000 0 0 -1 0 0 2
	 4950 5325 5100 5325
4 1 0 50 -1 0 12 0.0000 2 135 270 4425 4275 10k\001
4 1 0 50 -1 0 12 0.0000 2 135 360 6450 5400 100k\001
4 1 0 50 -1 0 12 0.0000 2 75 105 6975 5025 +\001
4 1 0 50 -1 0 12 0.0000 2 15 60 6975 5700 -\001
4 1 0 50 -1 0 12 0.0000 2 195 780 7125 5325 $v_{out}$\001
4 1 0 50 -1 0 12 0.0000 2 195 1035 5925 3525 50k$\\Omega$\001
4 1 0 50 -1 0 12 0.0000 2 195 720 5325 5325 $v_{os}$\001
4 1 0 50 -1 0 12 0.0000 2 135 360 5700 4050 ideel\001
