#FIG 3.2
Landscape
Center
Inches
Letter  
100.00
Single
-2
1200 2
2 1 0 1 0 7 50 -1 -1 0.000 0 0 -1 0 0 2
	 3075 4275 2400 4275
2 1 0 1 0 7 50 -1 -1 0.000 0 0 -1 0 0 6
	 3225 4050 3225 4125 3075 4200 3075 4350 3225 4425 3225 4500
2 1 0 1 0 7 50 -1 -1 0.000 0 0 -1 1 0 2
	1 1 1.00 60.00 60.00
	 3075 4350 3225 4425
2 1 0 3 0 7 50 -1 -1 0.000 0 0 -1 0 0 2
	 3075 4125 3075 4425
4 0 0 50 -1 0 8 0.0000 4 75 75 2850 4500 B\001
4 0 0 50 -1 0 8 0.0000 4 75 75 3300 4575 E\001
4 0 0 50 -1 0 8 0.0000 4 75 90 3300 4050 C\001
