<?xml version="1.0" encoding="UTF-8" standalone="no"?>
<!-- Created with Inkscape (http://www.inkscape.org/) -->
<svg
   xmlns:dc="http://purl.org/dc/elements/1.1/"
   xmlns:cc="http://web.resource.org/cc/"
   xmlns:rdf="http://www.w3.org/1999/02/22-rdf-syntax-ns#"
   xmlns:svg="http://www.w3.org/2000/svg"
   xmlns="http://www.w3.org/2000/svg"
   xmlns:sodipodi="http://sodipodi.sourceforge.net/DTD/sodipodi-0.dtd"
   xmlns:inkscape="http://www.inkscape.org/namespaces/inkscape"
   width="744.09448819"
   height="1052.3622047"
   id="svg2"
   sodipodi:version="0.32"
   inkscape:version="0.45.1"
   sodipodi:docbase="/home/tobibobi/fag/speciale/report/ink"
   sodipodi:docname="maintainance.svg"
   inkscape:output_extension="org.inkscape.output.svg.inkscape">
  <defs
     id="defs4" />
  <sodipodi:namedview
     id="base"
     pagecolor="#ffffff"
     bordercolor="#666666"
     borderopacity="1.0"
     gridtolerance="10000"
     guidetolerance="10"
     objecttolerance="10"
     inkscape:pageopacity="0.0"
     inkscape:pageshadow="2"
     inkscape:zoom="1.4"
     inkscape:cx="292.47547"
     inkscape:cy="487.14893"
     inkscape:document-units="px"
     inkscape:current-layer="layer1"
     inkscape:window-width="1280"
     inkscape:window-height="956"
     inkscape:window-x="0"
     inkscape:window-y="25" />
  <metadata
     id="metadata7">
    <rdf:RDF>
      <cc:Work
         rdf:about="">
        <dc:format>image/svg+xml</dc:format>
        <dc:type
           rdf:resource="http://purl.org/dc/dcmitype/StillImage" />
      </cc:Work>
    </rdf:RDF>
  </metadata>
  <g
     inkscape:label="Layer 1"
     inkscape:groupmode="layer"
     id="layer1">
    <path
       style="fill:none;fill-rule:evenodd;stroke:#000000;stroke-width:1px;stroke-linecap:butt;stroke-linejoin:miter;stroke-opacity:1"
       d="M 517.70318,613.95598 C 517.70318,613.95598 456.08388,614.33479 376.7869,613.95598 C 300.94545,613.59368 245.06095,548.80684 244.96199,481.12092 C 244.83572,394.75288 312.26153,343.2351 380.32243,343.2351 C 465.04897,343.2351 518.23951,414.30145 517.1981,479.10061 C 516.06168,549.81129 460.62956,589.71232 460.62956,589.71232 L 518.20826,590.21739"
       id="path3134"
       sodipodi:nodetypes="csssscc" />
    <path
       style="fill:none;fill-rule:evenodd;stroke:#000000;stroke-width:1px;stroke-linecap:butt;stroke-linejoin:miter;stroke-opacity:1"
       d="M 217.97248,631.63365 L 608.11183,631.63365"
       id="path5074"
       sodipodi:nodetypes="cc" />
    <path
       style="fill:none;fill-rule:evenodd;stroke:#000000;stroke-width:1px;stroke-linecap:butt;stroke-linejoin:miter;stroke-opacity:1"
       d="M 477.80215,573.54988 L 485.3783,589.71232"
       id="path5082" />
    <path
       style="fill:none;fill-rule:evenodd;stroke:#000000;stroke-width:1px;stroke-linecap:butt;stroke-linejoin:miter;stroke-opacity:1"
       d="M 494.97475,613.95598 L 503.56104,631.63365"
       id="path5084" />
    <path
       style="fill:none;fill-rule:evenodd;stroke:#000000;stroke-width:1px;stroke-linecap:butt;stroke-linejoin:miter;stroke-opacity:1"
       d="M 486.89353,613.95598 L 494.97475,631.63365"
       id="path5086" />
    <path
       style="fill:none;fill-rule:evenodd;stroke:#000000;stroke-width:1px;stroke-linecap:butt;stroke-linejoin:miter;stroke-opacity:1"
       d="M 472.24632,579.61079 L 476.79201,589.20724"
       id="path5088" />
    <path
       style="fill:none;fill-rule:evenodd;stroke:#000000;stroke-width:1px;stroke-linecap:butt;stroke-linejoin:miter;stroke-opacity:1"
       d="M 287.89348,577.59049 L 252.53814,631.63365"
       id="path5090" />
    <path
       style="fill:none;fill-rule:evenodd;stroke:#000000;stroke-width:1px;stroke-linecap:butt;stroke-linejoin:miter;stroke-opacity:1"
       d="M 242.94169,631.12857 L 281.83256,571.52957"
       id="path5092" />
    <g
       id="g6073"
       transform="translate(2.6785714,1.4285714)">
      <path
         transform="matrix(1.7423624,0,0,1.7423624,-308.92429,-270.64865)"
         d="M 418.70823 360.15515 A 6.3134532 6.3134532 0 1 1  406.08132,360.15515 A 6.3134532 6.3134532 0 1 1  418.70823 360.15515 z"
         sodipodi:ry="6.3134532"
         sodipodi:rx="6.3134532"
         sodipodi:cy="360.15515"
         sodipodi:cx="412.39478"
         id="path5094"
         style="opacity:1;color:#000000;fill:none;fill-opacity:1;fill-rule:evenodd;stroke:#000000;stroke-width:0.57393342;stroke-linecap:butt;stroke-linejoin:miter;marker:none;marker-start:none;marker-mid:none;marker-end:none;stroke-miterlimit:4;stroke-dasharray:none;stroke-dashoffset:0;stroke-opacity:1;visibility:visible;display:inline;overflow:visible;enable-background:accumulate"
         sodipodi:type="arc" />
      <path
         id="path5098"
         d="M 401.03056,363.43815 L 418.20315,350.81124"
         style="fill:none;fill-rule:evenodd;stroke:#000000;stroke-width:1px;stroke-linecap:butt;stroke-linejoin:miter;stroke-opacity:1" />
      <path
         id="path5100"
         d="M 400.52548,350.30616 L 418.70823,362.42799"
         style="fill:none;fill-rule:evenodd;stroke:#000000;stroke-width:1px;stroke-linecap:butt;stroke-linejoin:miter;stroke-opacity:1" />
      <path
         id="path5102"
         d="M 410.12193,345.76048 L 410.12193,366.97368"
         style="fill:none;fill-rule:evenodd;stroke:#000000;stroke-width:1px;stroke-linecap:butt;stroke-linejoin:miter;stroke-opacity:1" />
    </g>
    <g
       id="g6079"
       transform="translate(-67.680224,240.47199)">
      <path
         transform="matrix(1.7423624,0,0,1.7423624,-308.92429,-270.64865)"
         d="M 418.70823 360.15515 A 6.3134532 6.3134532 0 1 1  406.08132,360.15515 A 6.3134532 6.3134532 0 1 1  418.70823 360.15515 z"
         sodipodi:ry="6.3134532"
         sodipodi:rx="6.3134532"
         sodipodi:cy="360.15515"
         sodipodi:cx="412.39478"
         id="path6081"
         style="opacity:1;color:#000000;fill:none;fill-opacity:1;fill-rule:evenodd;stroke:#000000;stroke-width:0.57393342;stroke-linecap:butt;stroke-linejoin:miter;marker:none;marker-start:none;marker-mid:none;marker-end:none;stroke-miterlimit:4;stroke-dasharray:none;stroke-dashoffset:0;stroke-opacity:1;visibility:visible;display:inline;overflow:visible;enable-background:accumulate"
         sodipodi:type="arc" />
      <path
         id="path6083"
         d="M 401.03056,363.43815 L 418.20315,350.81124"
         style="fill:none;fill-rule:evenodd;stroke:#000000;stroke-width:1px;stroke-linecap:butt;stroke-linejoin:miter;stroke-opacity:1" />
      <path
         id="path6085"
         d="M 400.52548,350.30616 L 418.70823,362.42799"
         style="fill:none;fill-rule:evenodd;stroke:#000000;stroke-width:1px;stroke-linecap:butt;stroke-linejoin:miter;stroke-opacity:1" />
      <path
         id="path6087"
         d="M 410.12193,345.76048 L 410.12193,366.97368"
         style="fill:none;fill-rule:evenodd;stroke:#000000;stroke-width:1px;stroke-linecap:butt;stroke-linejoin:miter;stroke-opacity:1" />
    </g>
    <path
       style="fill:none;fill-rule:evenodd;stroke:#000000;stroke-width:1.03505957px;stroke-linecap:butt;stroke-linejoin:miter;stroke-opacity:1"
       d="M 337.21008,543.27846 L 325.47089,566.86991 L 334.73779,571.50484 L 346.04592,548.52357"
       id="path6091"
       sodipodi:nodetypes="cccc" />
    <path
       style="fill:none;fill-rule:evenodd;stroke:#000000;stroke-width:1.03505957px;stroke-linecap:butt;stroke-linejoin:miter;stroke-opacity:1"
       d="M 331.40533,565.44372 L 346.26974,537.4284"
       id="path6093"
       sodipodi:nodetypes="cc" />
    <path
       style="fill:none;fill-rule:evenodd;stroke:#000000;stroke-width:1.03505957px;stroke-linecap:butt;stroke-linejoin:miter;stroke-opacity:1"
       d="M 351.06679,539.03877 L 341.79989,534.40385"
       id="path6120" />
    <g
       id="g6471">
      <path
         sodipodi:nodetypes="cc"
         id="path6101"
         d="M 354.94906,519.75336 L 358.85377,512.48259"
         style="fill:none;fill-rule:evenodd;stroke:#000000;stroke-width:1.03505957px;stroke-linecap:butt;stroke-linejoin:miter;stroke-opacity:1" />
      <g
         transform="matrix(0.990558,-0.1468755,0.1370941,1.0612326,-79.648974,16.170234)"
         id="g6131">
        <path
           style="fill:none;fill-rule:evenodd;stroke:#000000;stroke-width:1px;stroke-linecap:butt;stroke-linejoin:miter;stroke-opacity:1"
           d="M 362.39222,530.11332 L 368.83195,531.12347 L 365.29641,525.6939 L 358.60415,523.79986 L 362.39222,530.11332 z "
           id="path6105" />
        <path
           style="fill:none;fill-rule:evenodd;stroke:#000000;stroke-width:1px;stroke-linecap:butt;stroke-linejoin:miter;stroke-opacity:1"
           d="M 358.35161,523.67359 L 369.33702,531.62854"
           id="path6107" />
      </g>
      <path
         sodipodi:nodetypes="cc"
         id="path6116"
         d="M 351.40619,525.87796 L 348.05374,533.47656"
         style="fill:none;fill-rule:evenodd;stroke:#000000;stroke-width:1.03505957px;stroke-linecap:butt;stroke-linejoin:miter;stroke-opacity:1" />
      <path
         id="path6118"
         d="M 342.97581,530.67874 L 351.79433,535.78984"
         style="fill:none;fill-rule:evenodd;stroke:#000000;stroke-width:1.03505957px;stroke-linecap:butt;stroke-linejoin:miter;stroke-opacity:1" />
      <path
         id="path6135"
         d="M 355.346,509.9982 L 362.61166,514.92986"
         style="fill:none;fill-rule:evenodd;stroke:#000000;stroke-width:1.03505957px;stroke-linecap:butt;stroke-linejoin:miter;stroke-opacity:1" />
    </g>
    <g
       id="g6446">
      <g
         transform="matrix(0.990558,-0.1468755,0.1370941,1.0612326,-74.683968,7.5570466)"
         id="g6127">
        <path
           sodipodi:type="arc"
           style="color:#000000;fill:none;fill-opacity:1;fill-rule:evenodd;stroke:#000000;stroke-width:1;stroke-linecap:butt;stroke-linejoin:miter;marker:none;marker-start:none;marker-mid:none;marker-end:none;stroke-miterlimit:4;stroke-dasharray:none;stroke-dashoffset:0;stroke-opacity:1;visibility:visible;display:inline;overflow:visible;enable-background:accumulate"
           id="path6099"
           sodipodi:cx="371.48361"
           sodipodi:cy="525.82019"
           sodipodi:rx="6.3134532"
           sodipodi:ry="6.3134532"
           d="M 377.79707 525.82019 A 6.3134532 6.3134532 0 1 1  365.17016,525.82019 A 6.3134532 6.3134532 0 1 1  377.79707 525.82019 z"
           transform="translate(5.6821081,-15.657364)" />
        <path
           style="fill:none;fill-rule:evenodd;stroke:#000000;stroke-width:1px;stroke-linecap:butt;stroke-linejoin:miter;stroke-opacity:1"
           d="M 378.17586,505.99592 C 378.17586,505.99592 372.82993,505.77958 372.99883,510.66787 C 373.16773,515.4299 381.03171,515.18397 381.08005,510.92041"
           id="path6103"
           sodipodi:nodetypes="czc" />
      </g>
      <path
         id="path6137"
         d="M 364.8016,512.14693 L 356.31979,507.66874"
         style="fill:none;fill-rule:evenodd;stroke:#000000;stroke-width:1.03505957px;stroke-linecap:butt;stroke-linejoin:miter;stroke-opacity:1" />
      <path
         id="path6139"
         d="M 360.09892,509.29346 L 365.46041,499.48503"
         style="fill:none;fill-rule:evenodd;stroke:#000000;stroke-width:1.03505957px;stroke-linecap:butt;stroke-linejoin:miter;stroke-opacity:1" />
      <path
         id="path6141"
         d="M 371.76106,487.07911 L 376.14875,479.60015"
         style="fill:none;fill-rule:evenodd;stroke:#000000;stroke-width:1.03505957px;stroke-linecap:butt;stroke-linejoin:miter;stroke-opacity:1" />
      <path
         id="path6143"
         d="M 372.83531,477.63324 L 379.42757,481.29907"
         style="fill:none;fill-rule:evenodd;stroke:#000000;stroke-width:1.03505957px;stroke-linecap:butt;stroke-linejoin:miter;stroke-opacity:1" />
    </g>
    <path
       style="fill:none;fill-rule:evenodd;stroke:#000000;stroke-width:1.03505957px;stroke-linecap:butt;stroke-linejoin:miter;stroke-opacity:1"
       d="M 381.33274,478.28521 L 374.24018,474.69358"
       id="path6145" />
    <path
       style="fill:none;fill-rule:evenodd;stroke:#000000;stroke-width:1.03505957px;stroke-linecap:butt;stroke-linejoin:miter;stroke-opacity:1"
       d="M 377.73453,476.08739 L 390.44752,450.16647"
       id="path6147"
       sodipodi:nodetypes="cc" />
    <path
       style="fill:none;fill-rule:evenodd;stroke:#000000;stroke-width:1.03505957px;stroke-linecap:butt;stroke-linejoin:miter;stroke-opacity:1"
       d="M 397.10803,472.12224 L 370.20408,457.2651"
       id="path6149" />
    <path
       style="fill:none;fill-rule:evenodd;stroke:#000000;stroke-width:1.03505957px;stroke-linecap:butt;stroke-linejoin:miter;stroke-opacity:1"
       d="M 398.51289,469.18258 L 395.81483,473.9528"
       id="path6151" />
    <path
       style="fill:none;fill-rule:evenodd;stroke:#000000;stroke-width:1.03505957px;stroke-linecap:butt;stroke-linejoin:miter;stroke-opacity:1"
       d="M 387.70363,448.66137 L 393.22603,451.93956"
       id="path6153" />
    <path
       style="fill:none;fill-rule:evenodd;stroke:#000000;stroke-width:1.03505957px;stroke-linecap:butt;stroke-linejoin:miter;stroke-opacity:1"
       d="M 372.04001,453.71526 L 368.98013,459.63166"
       id="path6155" />
    <path
       style="fill:none;fill-rule:evenodd;stroke:#000000;stroke-width:1.03505957px;stroke-linecap:butt;stroke-linejoin:miter;stroke-opacity:1"
       d="M 401.47231,470.38258 L 399.05903,475.38371"
       id="path6157" />
    <path
       style="fill:none;fill-rule:evenodd;stroke:#000000;stroke-width:1.03505957px;stroke-linecap:butt;stroke-linejoin:miter;stroke-opacity:1"
       d="M 368.83044,452.55234 L 366.02072,458.43167"
       id="path6159" />
    <g
       id="g6167"
       transform="matrix(0.990558,-0.1468755,0.1370941,1.0612326,-94.325854,-41.197047)">
      <path
         transform="translate(5.6821081,-15.657364)"
         d="M 377.79707 525.82019 A 6.3134532 6.3134532 0 1 1  365.17016,525.82019 A 6.3134532 6.3134532 0 1 1  377.79707 525.82019 z"
         sodipodi:ry="6.3134532"
         sodipodi:rx="6.3134532"
         sodipodi:cy="525.82019"
         sodipodi:cx="371.48361"
         id="path6169"
         style="color:#000000;fill:none;fill-opacity:1;fill-rule:evenodd;stroke:#000000;stroke-width:1;stroke-linecap:butt;stroke-linejoin:miter;marker:none;marker-start:none;marker-mid:none;marker-end:none;stroke-miterlimit:4;stroke-dasharray:none;stroke-dashoffset:0;stroke-opacity:1;visibility:visible;display:inline;overflow:visible;enable-background:accumulate"
         sodipodi:type="arc" />
      <path
         sodipodi:nodetypes="czc"
         id="path6171"
         d="M 378.17586,505.99592 C 378.17586,505.99592 372.82993,505.77958 372.99883,510.66787 C 373.16773,515.4299 381.03171,515.18397 381.08005,510.92041"
         style="fill:none;fill-rule:evenodd;stroke:#000000;stroke-width:1px;stroke-linecap:butt;stroke-linejoin:miter;stroke-opacity:1" />
    </g>
    <g
       id="g6173"
       transform="matrix(0.990558,-0.1468755,0.1370941,1.0612326,-27.868391,-4.3449386)">
      <path
         transform="translate(5.6821081,-15.657364)"
         d="M 377.79707 525.82019 A 6.3134532 6.3134532 0 1 1  365.17016,525.82019 A 6.3134532 6.3134532 0 1 1  377.79707 525.82019 z"
         sodipodi:ry="6.3134532"
         sodipodi:rx="6.3134532"
         sodipodi:cy="525.82019"
         sodipodi:cx="371.48361"
         id="path6175"
         style="color:#000000;fill:none;fill-opacity:1;fill-rule:evenodd;stroke:#000000;stroke-width:1;stroke-linecap:butt;stroke-linejoin:miter;marker:none;marker-start:none;marker-mid:none;marker-end:none;stroke-miterlimit:4;stroke-dasharray:none;stroke-dashoffset:0;stroke-opacity:1;visibility:visible;display:inline;overflow:visible;enable-background:accumulate"
         sodipodi:type="arc" />
      <path
         sodipodi:nodetypes="czc"
         id="path6177"
         d="M 378.17586,505.99592 C 378.17586,505.99592 372.82993,505.77958 372.99883,510.66787 C 373.16773,515.4299 381.03171,515.18397 381.08005,510.92041"
         style="fill:none;fill-rule:evenodd;stroke:#000000;stroke-width:1px;stroke-linecap:butt;stroke-linejoin:miter;stroke-opacity:1" />
    </g>
    <g
       id="g6179"
       transform="matrix(0.990558,-0.1468755,0.1370941,1.0612326,3.1672565,-30.524447)">
      <path
         transform="translate(5.6821081,-15.657364)"
         d="M 377.79707 525.82019 A 6.3134532 6.3134532 0 1 1  365.17016,525.82019 A 6.3134532 6.3134532 0 1 1  377.79707 525.82019 z"
         sodipodi:ry="6.3134532"
         sodipodi:rx="6.3134532"
         sodipodi:cy="525.82019"
         sodipodi:cx="371.48361"
         id="path6181"
         style="color:#000000;fill:none;fill-opacity:1;fill-rule:evenodd;stroke:#000000;stroke-width:1;stroke-linecap:butt;stroke-linejoin:miter;marker:none;marker-start:none;marker-mid:none;marker-end:none;stroke-miterlimit:4;stroke-dasharray:none;stroke-dashoffset:0;stroke-opacity:1;visibility:visible;display:inline;overflow:visible;enable-background:accumulate"
         sodipodi:type="arc" />
      <path
         sodipodi:nodetypes="czc"
         id="path6183"
         d="M 378.17586,505.99592 C 378.17586,505.99592 372.82993,505.77958 372.99883,510.66787 C 373.16773,515.4299 381.03171,515.18397 381.08005,510.92041"
         style="fill:none;fill-rule:evenodd;stroke:#000000;stroke-width:1px;stroke-linecap:butt;stroke-linejoin:miter;stroke-opacity:1" />
    </g>
    <g
       id="g6185"
       transform="matrix(0.990558,-0.1468755,0.1370941,1.0612326,-112.55591,-76.334507)">
      <path
         transform="translate(5.6821081,-15.657364)"
         d="M 377.79707 525.82019 A 6.3134532 6.3134532 0 1 1  365.17016,525.82019 A 6.3134532 6.3134532 0 1 1  377.79707 525.82019 z"
         sodipodi:ry="6.3134532"
         sodipodi:rx="6.3134532"
         sodipodi:cy="525.82019"
         sodipodi:cx="371.48361"
         id="path6187"
         style="color:#000000;fill:none;fill-opacity:1;fill-rule:evenodd;stroke:#000000;stroke-width:1;stroke-linecap:butt;stroke-linejoin:miter;marker:none;marker-start:none;marker-mid:none;marker-end:none;stroke-miterlimit:4;stroke-dasharray:none;stroke-dashoffset:0;stroke-opacity:1;visibility:visible;display:inline;overflow:visible;enable-background:accumulate"
         sodipodi:type="arc" />
      <path
         sodipodi:nodetypes="czc"
         id="path6189"
         d="M 378.17586,505.99592 C 378.17586,505.99592 372.82993,505.77958 372.99883,510.66787 C 373.16773,515.4299 381.03171,515.18397 381.08005,510.92041"
         style="fill:none;fill-rule:evenodd;stroke:#000000;stroke-width:1px;stroke-linecap:butt;stroke-linejoin:miter;stroke-opacity:1" />
    </g>
    <path
       style="fill:none;fill-rule:evenodd;stroke:#000000;stroke-width:1.03505957px;stroke-linecap:butt;stroke-linejoin:miter;stroke-opacity:1"
       d="M 366.70974,455.87128 L 354.94911,449.69418"
       id="path6191" />
    <g
       id="g6440"
       inkscape:transform-center-x="8.5158183"
       inkscape:transform-center-y="-16.864922"
       transform="matrix(0.9911945,0.1324142,-0.1324142,0.9911945,62.062046,-42.298478)">
      <path
         id="path6193"
         d="M 344.55871,440.30941 L 339.34335,431.80259"
         style="fill:none;fill-rule:evenodd;stroke:#000000;stroke-width:1.03505957px;stroke-linecap:butt;stroke-linejoin:miter;stroke-opacity:1"
         sodipodi:nodetypes="cc" />
      <path
         sodipodi:nodetypes="cc"
         id="path6195"
         d="M 342.95402,428.9843 L 335.11518,434.12339"
         style="fill:none;fill-rule:evenodd;stroke:#000000;stroke-width:1.03505957px;stroke-linecap:butt;stroke-linejoin:miter;stroke-opacity:1" />
      <path
         sodipodi:nodetypes="cc"
         id="path6197"
         d="M 341.7924,426.78969 L 333.88278,431.59348"
         style="fill:none;fill-rule:evenodd;stroke:#000000;stroke-width:1.03505957px;stroke-linecap:butt;stroke-linejoin:miter;stroke-opacity:1" />
      <path
         id="path6199"
         d="M 337.78214,429.29625 L 330.48438,417.91062"
         style="fill:none;fill-rule:evenodd;stroke:#000000;stroke-width:1.03505957px;stroke-linecap:butt;stroke-linejoin:miter;stroke-opacity:1"
         sodipodi:nodetypes="cc" />
    </g>
    <path
       style="fill:none;fill-rule:evenodd;stroke:#000000;stroke-width:1.03505957px;stroke-linecap:butt;stroke-linejoin:miter;stroke-opacity:1"
       d="M 331.98301,403.08292 L 334.67919,394.12852"
       id="path6201"
       sodipodi:nodetypes="cc" />
    <g
       id="g6203"
       transform="matrix(0.9549852,-0.3012986,0.3027887,1.0263179,-171.57817,-40.857674)">
      <path
         id="path6205"
         d="M 362.39222,530.11332 L 368.83195,531.12347 L 365.29641,525.6939 L 358.60415,523.79986 L 362.39222,530.11332 z "
         style="fill:none;fill-rule:evenodd;stroke:#000000;stroke-width:1px;stroke-linecap:butt;stroke-linejoin:miter;stroke-opacity:1" />
      <path
         id="path6207"
         d="M 358.35161,523.67359 L 369.33702,531.62854"
         style="fill:none;fill-rule:evenodd;stroke:#000000;stroke-width:1px;stroke-linecap:butt;stroke-linejoin:miter;stroke-opacity:1" />
    </g>
    <g
       id="g6212"
       transform="matrix(0.990558,-0.1468755,0.1370941,1.0612326,-32.911873,-72.495444)">
      <path
         id="path6214"
         d="M 362.39222,530.11332 L 368.83195,531.12347 L 365.29641,525.6939 L 358.60415,523.79986 L 362.39222,530.11332 z "
         style="fill:none;fill-rule:evenodd;stroke:#000000;stroke-width:1px;stroke-linecap:butt;stroke-linejoin:miter;stroke-opacity:1" />
      <path
         id="path6216"
         d="M 358.35161,523.67359 L 369.33702,531.62854"
         style="fill:none;fill-rule:evenodd;stroke:#000000;stroke-width:1px;stroke-linecap:butt;stroke-linejoin:miter;stroke-opacity:1" />
    </g>
    <path
       style="fill:none;fill-rule:evenodd;stroke:#000000;stroke-width:1.03505957px;stroke-linecap:butt;stroke-linejoin:miter;stroke-opacity:1"
       d="M 390.14373,445.84135 L 394.56165,448.4639"
       id="path6218" />
    <path
       style="fill:none;fill-rule:evenodd;stroke:#000000;stroke-width:1.03505957px;stroke-linecap:butt;stroke-linejoin:miter;stroke-opacity:1"
       d="M 392.56822,446.84754 L 398.17986,437.002"
       id="path6220" />
    <path
       style="fill:none;fill-rule:evenodd;stroke:#000000;stroke-width:1.03505957px;stroke-linecap:butt;stroke-linejoin:miter;stroke-opacity:1"
       d="M 401.45527,430.7805 L 406.92842,419.86296"
       id="path6222" />
    <path
       style="fill:none;fill-rule:evenodd;stroke:#000000;stroke-width:1.03505957px;stroke-linecap:butt;stroke-linejoin:miter;stroke-opacity:1"
       d="M 402.79528,417.47132 L 411.1308,422.79061"
       id="path6224" />
    <path
       style="fill:none;fill-rule:evenodd;stroke:#000000;stroke-width:1.03505957px;stroke-linecap:butt;stroke-linejoin:miter;stroke-opacity:1"
       d="M 404.66582,414.18948 L 413.2515,419.47167"
       id="path6226" />
    <path
       style="fill:none;fill-rule:evenodd;stroke:#000000;stroke-width:1.03505957px;stroke-linecap:butt;stroke-linejoin:miter;stroke-opacity:1"
       d="M 409.23003,415.97093 L 420.63422,395.70678"
       id="path6228" />
    <path
       style="fill:none;fill-rule:evenodd;stroke:#000000;stroke-width:1.03505957px;stroke-linecap:butt;stroke-linejoin:miter;stroke-opacity:1"
       d="M 408.8726,407.2836 L 418.617,389.41693 L 427.70299,394.62494 L 417.09646,413.71199"
       id="path6230"
       sodipodi:nodetypes="cccc" />
    <path
       style="fill:none;fill-rule:evenodd;stroke:#000000;stroke-width:1.03505957px;stroke-linecap:butt;stroke-linejoin:miter;stroke-opacity:1"
       d="M 331.76177,591.88498 L 322.74503,587.21297 L 325.33922,581.63875"
       id="path6232" />
    <path
       style="fill:none;fill-rule:evenodd;stroke:#000000;stroke-width:1.03505957px;stroke-linecap:butt;stroke-linejoin:miter;stroke-opacity:1"
       d="M 321.70638,579.17292 L 328.83356,583.03256"
       id="path6234" />
    <path
       style="fill:none;fill-rule:evenodd;stroke:#000000;stroke-width:1.03505957px;stroke-linecap:butt;stroke-linejoin:miter;stroke-opacity:1"
       d="M 323.8617,576.12199 L 330.73874,580.01872"
       id="path6236" />
    <path
       style="fill:none;fill-rule:evenodd;stroke:#000000;stroke-width:1.03505957px;stroke-linecap:butt;stroke-linejoin:miter;stroke-opacity:1"
       d="M 327.03666,577.0169 L 330.57002,568.8452"
       id="path6238" />
    <path
       style="fill:none;fill-rule:evenodd;stroke:#000000;stroke-width:1.03505957px;stroke-linecap:butt;stroke-linejoin:miter;stroke-opacity:1"
       d="M 400.85252,473.47897 L 409.5845,477.92007"
       id="path6240" />
    <path
       style="fill:none;fill-rule:evenodd;stroke:#000000;stroke-width:1.03505957px;stroke-linecap:butt;stroke-linejoin:miter;stroke-opacity:1"
       d="M 420.09096,476.36222 L 428.90437,469.5927"
       id="path6242" />
    <path
       style="fill:none;fill-rule:evenodd;stroke:#000000;stroke-width:1.03505957px;stroke-linecap:butt;stroke-linejoin:miter;stroke-opacity:1"
       d="M 425.56411,465.44468 L 431.92522,473.24181"
       id="path6244" />
    <path
       style="fill:none;fill-rule:evenodd;stroke:#000000;stroke-width:1.03505957px;stroke-linecap:butt;stroke-linejoin:miter;stroke-opacity:1"
       d="M 429.50512,462.4021 L 435.47372,470.29527"
       id="path6246"
       sodipodi:nodetypes="cc" />
    <path
       style="fill:none;fill-rule:evenodd;stroke:#000000;stroke-width:1.03505957px;stroke-linecap:butt;stroke-linejoin:miter;stroke-opacity:1"
       d="M 432.77613,466.01413 L 441.37402,459.5497"
       id="path6248" />
    <path
       style="fill:none;fill-rule:evenodd;stroke:#000000;stroke-width:1.03505957px;stroke-linecap:butt;stroke-linejoin:miter;stroke-opacity:1"
       d="M 453.397,453.9431 L 465.22346,452.73578"
       id="path6252" />
    <path
       style="fill:none;fill-rule:evenodd;stroke:#000000;stroke-width:1.03505957px;stroke-linecap:butt;stroke-linejoin:miter;stroke-opacity:1"
       d="M 465.02354,449.21468 L 465.75059,454.84271"
       id="path6254" />
    <path
       style="fill:none;fill-rule:evenodd;stroke:#000000;stroke-width:1.03505957px;stroke-linecap:butt;stroke-linejoin:miter;stroke-opacity:1"
       d="M 469.49168,448.27902 L 470.14481,454.16011"
       id="path6256"
       sodipodi:nodetypes="cc" />
    <path
       style="fill:none;fill-rule:evenodd;stroke:#000000;stroke-width:1.03505957px;stroke-linecap:butt;stroke-linejoin:miter;stroke-opacity:1"
       d="M 470.40745,451.42086 L 476.12636,450.29975 L 479.39737,453.91177 L 486.54016,453.9452"
       id="path6258" />
    <path
       style="fill:none;fill-rule:evenodd;stroke:#000000;stroke-width:1.03505957px;stroke-linecap:butt;stroke-linejoin:miter;stroke-opacity:1"
       d="M 475.34128,450.14302 L 478.60888,445.83463 L 483.689,443.71569"
       id="path6260" />
    <path
       style="fill:none;fill-rule:evenodd;stroke:#000000;stroke-width:1.03505957px;stroke-linecap:butt;stroke-linejoin:miter;stroke-opacity:1"
       d="M 336.59373,388.27822 L 340.23875,378.47008"
       id="path6262"
       sodipodi:nodetypes="cc" />
    <path
       style="fill:none;fill-rule:evenodd;stroke:#000000;stroke-width:1.03505957px;stroke-linecap:butt;stroke-linejoin:miter;stroke-opacity:1"
       d="M 336.8191,376.45081 L 343.90778,379.20913"
       id="path6264"
       sodipodi:nodetypes="cc" />
    <path
       style="fill:none;fill-rule:evenodd;stroke:#000000;stroke-width:1.03505957px;stroke-linecap:butt;stroke-linejoin:miter;stroke-opacity:1"
       d="M 338.29321,374.04716 L 345.16869,376.18031"
       id="path6266"
       sodipodi:nodetypes="cc" />
    <path
       style="fill:none;fill-rule:evenodd;stroke:#000000;stroke-width:1.03505957px;stroke-linecap:butt;stroke-linejoin:miter;stroke-opacity:1"
       d="M 341.39346,374.85321 L 343.4488,369.68876"
       id="path6268"
       sodipodi:nodetypes="cc" />
    <path
       style="fill:none;fill-rule:evenodd;stroke:#000000;stroke-width:1.03505957px;stroke-linecap:butt;stroke-linejoin:miter;stroke-opacity:1"
       d="M 343.95428,355.30989 L 340.75358,364.12024 L 343.09244,369.85209 L 348.38186,366.64046 L 352.40382,356.79577"
       id="path6270"
       sodipodi:nodetypes="ccccc" />
    <path
       style="fill:none;fill-rule:evenodd;stroke:#000000;stroke-width:1.03505957px;stroke-linecap:butt;stroke-linejoin:miter;stroke-opacity:1"
       d="M 422.93505,391.82999 L 427.89697,382.59522"
       id="path6272"
       sodipodi:nodetypes="cc" />
    <path
       style="fill:none;fill-rule:evenodd;stroke:#000000;stroke-width:1.03505957px;stroke-linecap:butt;stroke-linejoin:miter;stroke-opacity:1"
       d="M 423.34212,379.77138 L 432.35184,384.73412"
       id="path6274"
       sodipodi:nodetypes="cc" />
    <path
       style="fill:none;fill-rule:evenodd;stroke:#000000;stroke-width:1.03505957px;stroke-linecap:butt;stroke-linejoin:miter;stroke-opacity:1"
       d="M 425.89309,376.03608 L 433.79521,380.39579"
       id="path6276"
       sodipodi:nodetypes="cc" />
    <path
       style="fill:none;fill-rule:evenodd;stroke:#000000;stroke-width:1.03505957px;stroke-linecap:butt;stroke-linejoin:miter;stroke-opacity:1"
       d="M 429.6831,377.75976 L 434.78263,368.72364 L 419.63585,362.45602"
       id="path6278"
       sodipodi:nodetypes="ccc" />
    <g
       id="g6455"
       transform="matrix(0.885477,0.4646832,-0.4646832,0.885477,457.08055,-23.367752)"
       inkscape:transform-center-y="9.5964492"
       inkscape:transform-center-x="6.0609153">
      <g
         transform="matrix(0.990558,-0.1468755,0.1370941,1.0612326,-74.683968,7.5570466)"
         id="g6457">
        <path
           sodipodi:type="arc"
           style="color:#000000;fill:none;fill-opacity:1;fill-rule:evenodd;stroke:#000000;stroke-width:1;stroke-linecap:butt;stroke-linejoin:miter;marker:none;marker-start:none;marker-mid:none;marker-end:none;stroke-miterlimit:4;stroke-dasharray:none;stroke-dashoffset:0;stroke-opacity:1;visibility:visible;display:inline;overflow:visible;enable-background:accumulate"
           id="path6459"
           sodipodi:cx="371.48361"
           sodipodi:cy="525.82019"
           sodipodi:rx="6.3134532"
           sodipodi:ry="6.3134532"
           d="M 377.79707 525.82019 A 6.3134532 6.3134532 0 1 1  365.17016,525.82019 A 6.3134532 6.3134532 0 1 1  377.79707 525.82019 z"
           transform="translate(5.6821081,-15.657364)" />
        <path
           style="fill:none;fill-rule:evenodd;stroke:#000000;stroke-width:1px;stroke-linecap:butt;stroke-linejoin:miter;stroke-opacity:1"
           d="M 378.17586,505.99592 C 378.17586,505.99592 372.82993,505.77958 372.99883,510.66787 C 373.16773,515.4299 381.03171,515.18397 381.08005,510.92041"
           id="path6461"
           sodipodi:nodetypes="czc" />
      </g>
      <path
         id="path6463"
         d="M 364.8016,512.14693 L 356.31979,507.66874"
         style="fill:none;fill-rule:evenodd;stroke:#000000;stroke-width:1.03505957px;stroke-linecap:butt;stroke-linejoin:miter;stroke-opacity:1" />
      <path
         id="path6465"
         d="M 360.09892,509.29346 L 365.46041,499.48503"
         style="fill:none;fill-rule:evenodd;stroke:#000000;stroke-width:1.03505957px;stroke-linecap:butt;stroke-linejoin:miter;stroke-opacity:1" />
      <path
         id="path6467"
         d="M 371.76106,487.07911 L 376.14875,479.60015"
         style="fill:none;fill-rule:evenodd;stroke:#000000;stroke-width:1.03505957px;stroke-linecap:butt;stroke-linejoin:miter;stroke-opacity:1" />
      <path
         id="path6469"
         d="M 372.83531,477.63324 L 379.42757,481.29907"
         style="fill:none;fill-rule:evenodd;stroke:#000000;stroke-width:1.03505957px;stroke-linecap:butt;stroke-linejoin:miter;stroke-opacity:1" />
    </g>
    <g
       id="g6480"
       transform="matrix(0.5128243,0.8584936,-0.8584936,0.5128243,834.67556,25.759475)">
      <g
         id="g6502"
         transform="translate(4.4438731,4.5378082)">
        <g
           id="g6484"
           transform="matrix(0.990558,-0.1468755,0.1370941,1.0612326,-79.648974,16.170234)">
          <path
             id="path6486"
             d="M 362.39222,530.11332 L 368.83195,531.12347 L 365.29641,525.6939 L 358.60415,523.79986 L 362.39222,530.11332 z "
             style="fill:none;fill-rule:evenodd;stroke:#000000;stroke-width:1px;stroke-linecap:butt;stroke-linejoin:miter;stroke-opacity:1" />
          <path
             id="path6488"
             d="M 358.35161,523.67359 L 369.33702,531.62854"
             style="fill:none;fill-rule:evenodd;stroke:#000000;stroke-width:1px;stroke-linecap:butt;stroke-linejoin:miter;stroke-opacity:1" />
        </g>
        <g
           id="g6496">
          <path
             sodipodi:nodetypes="cc"
             id="path6482"
             d="M 354.94906,519.75336 L 358.85377,512.48259"
             style="fill:none;fill-rule:evenodd;stroke:#000000;stroke-width:1.03505957px;stroke-linecap:butt;stroke-linejoin:miter;stroke-opacity:1" />
          <path
             sodipodi:nodetypes="cc"
             id="path6490"
             d="M 351.40619,525.87796 L 348.05374,533.47656"
             style="fill:none;fill-rule:evenodd;stroke:#000000;stroke-width:1.03505957px;stroke-linecap:butt;stroke-linejoin:miter;stroke-opacity:1" />
          <path
             id="path6492"
             d="M 342.97581,530.67874 L 351.79433,535.78984"
             style="fill:none;fill-rule:evenodd;stroke:#000000;stroke-width:1.03505957px;stroke-linecap:butt;stroke-linejoin:miter;stroke-opacity:1" />
          <path
             id="path6494"
             d="M 355.346,509.9982 L 362.61166,514.92986"
             style="fill:none;fill-rule:evenodd;stroke:#000000;stroke-width:1.03505957px;stroke-linecap:butt;stroke-linejoin:miter;stroke-opacity:1" />
        </g>
      </g>
      <path
         style="fill:#000000;fill-rule:evenodd;stroke:#000000;stroke-width:1px;stroke-linecap:butt;stroke-linejoin:miter;stroke-opacity:1;fill-opacity:1"
         d="M 527.80471,596.27831 L 507.09658,599.81384 L 513.66255,593.75291 L 497.50011,603.34936 L 513.15748,609.41028 L 507.09656,603.85444 L 528.30976,600.82398 L 527.80471,596.27831 z "
         id="path6512"
         transform="matrix(0.5128243,-0.8584936,0.8584936,0.5128243,-450.15624,703.35352)" />
    </g>
    <path
       style="fill:none;fill-rule:evenodd;stroke:#000000;stroke-width:1px;stroke-linecap:butt;stroke-linejoin:miter;stroke-opacity:1"
       d="M 217.85714,636.6479 L 226.42857,650.93361"
       id="path7483" />
    <path
       style="fill:none;fill-rule:evenodd;stroke:#000000;stroke-width:1px;stroke-linecap:butt;stroke-linejoin:miter;stroke-opacity:1"
       d="M 225.71429,631.6479 L 238.57143,650.93361"
       id="path7485" />
    <path
       style="fill:none;fill-rule:evenodd;stroke:#000000;stroke-width:1px;stroke-linecap:butt;stroke-linejoin:miter;stroke-opacity:1"
       d="M 241.14286,632.57647 L 254,651.86218"
       id="path7489" />
    <path
       style="fill:none;fill-rule:evenodd;stroke:#000000;stroke-width:1px;stroke-linecap:butt;stroke-linejoin:miter;stroke-opacity:1"
       d="M 254.71429,632.00504 L 267.57143,651.29075"
       id="path7491" />
    <path
       style="fill:none;fill-rule:evenodd;stroke:#000000;stroke-width:1px;stroke-linecap:butt;stroke-linejoin:miter;stroke-opacity:1"
       d="M 269.71429,632.57647 L 282.57143,651.86218"
       id="path7493" />
    <path
       style="fill:none;fill-rule:evenodd;stroke:#000000;stroke-width:1px;stroke-linecap:butt;stroke-linejoin:miter;stroke-opacity:1"
       d="M 284.14286,632.57647 L 297,651.86218"
       id="path7495" />
    <path
       style="fill:none;fill-rule:evenodd;stroke:#000000;stroke-width:1px;stroke-linecap:butt;stroke-linejoin:miter;stroke-opacity:1"
       d="M 297.71429,632.00504 L 310.57143,651.29075"
       id="path7497" />
    <path
       style="fill:none;fill-rule:evenodd;stroke:#000000;stroke-width:1px;stroke-linecap:butt;stroke-linejoin:miter;stroke-opacity:1"
       d="M 313,631.29076 L 325.85714,650.57647"
       id="path7499" />
    <path
       style="fill:none;fill-rule:evenodd;stroke:#000000;stroke-width:1px;stroke-linecap:butt;stroke-linejoin:miter;stroke-opacity:1"
       d="M 329.42857,631.29076 L 342.28571,650.57647"
       id="path7501" />
    <path
       style="fill:none;fill-rule:evenodd;stroke:#000000;stroke-width:1px;stroke-linecap:butt;stroke-linejoin:miter;stroke-opacity:1"
       d="M 345,631.29076 L 357.85714,650.57647"
       id="path7503" />
    <path
       style="fill:none;fill-rule:evenodd;stroke:#000000;stroke-width:1px;stroke-linecap:butt;stroke-linejoin:miter;stroke-opacity:1"
       d="M 361.42857,631.29076 L 374.28571,650.57647"
       id="path7505" />
    <path
       style="fill:none;fill-rule:evenodd;stroke:#000000;stroke-width:1px;stroke-linecap:butt;stroke-linejoin:miter;stroke-opacity:1"
       d="M 376.42857,632.00504 L 389.28571,651.29075"
       id="path7507" />
    <path
       style="fill:none;fill-rule:evenodd;stroke:#000000;stroke-width:1px;stroke-linecap:butt;stroke-linejoin:miter;stroke-opacity:1"
       d="M 391.28572,632.00504 L 404.14286,651.29075"
       id="path7509" />
    <path
       style="fill:none;fill-rule:evenodd;stroke:#000000;stroke-width:1px;stroke-linecap:butt;stroke-linejoin:miter;stroke-opacity:1"
       d="M 405,632.57647 L 417.85714,651.86218"
       id="path7511" />
    <path
       style="fill:none;fill-rule:evenodd;stroke:#000000;stroke-width:1px;stroke-linecap:butt;stroke-linejoin:miter;stroke-opacity:1"
       d="M 421.71429,632.57647 L 434.57143,651.86218"
       id="path7513" />
    <path
       style="fill:none;fill-rule:evenodd;stroke:#000000;stroke-width:1px;stroke-linecap:butt;stroke-linejoin:miter;stroke-opacity:1"
       d="M 435.42857,631.29076 L 448.28571,650.57647"
       id="path7515" />
    <path
       style="fill:none;fill-rule:evenodd;stroke:#000000;stroke-width:1px;stroke-linecap:butt;stroke-linejoin:miter;stroke-opacity:1"
       d="M 448.42857,631.43361 L 461.28571,650.71932"
       id="path7517" />
    <path
       style="fill:none;fill-rule:evenodd;stroke:#000000;stroke-width:1px;stroke-linecap:butt;stroke-linejoin:miter;stroke-opacity:1"
       d="M 463.85714,632.1479 L 476.71428,651.43361"
       id="path7519" />
    <path
       style="fill:none;fill-rule:evenodd;stroke:#000000;stroke-width:1px;stroke-linecap:butt;stroke-linejoin:miter;stroke-opacity:1"
       d="M 478.28572,632.00504 L 491.14286,651.29075"
       id="path7521" />
    <path
       style="fill:none;fill-rule:evenodd;stroke:#000000;stroke-width:1px;stroke-linecap:butt;stroke-linejoin:miter;stroke-opacity:1"
       d="M 493.14286,632.71933 L 506,652.00504"
       id="path7523" />
    <path
       style="fill:none;fill-rule:evenodd;stroke:#000000;stroke-width:1px;stroke-linecap:butt;stroke-linejoin:miter;stroke-opacity:1"
       d="M 507.14286,632.71933 L 520,652.00504"
       id="path7525" />
    <path
       style="fill:none;fill-rule:evenodd;stroke:#000000;stroke-width:1px;stroke-linecap:butt;stroke-linejoin:miter;stroke-opacity:1"
       d="M 520.28572,631.43361 L 533.14286,650.71932"
       id="path7527" />
    <path
       style="fill:none;fill-rule:evenodd;stroke:#000000;stroke-width:1px;stroke-linecap:butt;stroke-linejoin:miter;stroke-opacity:1"
       d="M 533.85714,631.57647 L 546.71428,650.86218"
       id="path7529" />
    <path
       style="fill:none;fill-rule:evenodd;stroke:#000000;stroke-width:1px;stroke-linecap:butt;stroke-linejoin:miter;stroke-opacity:1"
       d="M 548,632.86218 L 560.85714,652.14789"
       id="path7531" />
    <path
       style="fill:none;fill-rule:evenodd;stroke:#000000;stroke-width:1px;stroke-linecap:butt;stroke-linejoin:miter;stroke-opacity:1"
       d="M 561.42857,632.86218 L 574.28571,652.14789"
       id="path7533" />
    <path
       style="fill:none;fill-rule:evenodd;stroke:#000000;stroke-width:1px;stroke-linecap:butt;stroke-linejoin:miter;stroke-opacity:1"
       d="M 575.71429,632.86218 L 588.57143,652.14789"
       id="path7535" />
    <path
       style="fill:none;fill-rule:evenodd;stroke:#000000;stroke-width:1px;stroke-linecap:butt;stroke-linejoin:miter;stroke-opacity:1"
       d="M 590.71429,632.86218 L 603.57143,652.14789"
       id="path7537" />
    <path
       style="fill:none;fill-rule:evenodd;stroke:#000000;stroke-width:1px;stroke-linecap:butt;stroke-linejoin:miter;stroke-opacity:1"
       d="M 604,632.86218 L 616.85714,652.14789"
       id="path7539" />
  </g>
</svg>
