#FIG 3.2
Landscape
Center
Inches
Letter  
100.00
Single
-2
1200 2
0 32 #414541
0 33 #c0c0c0
0 34 #e7e7e7
0 35 #717571
0 36 #868286
0 37 #c7c3c7
0 38 #e7e3e7
0 39 #808080
0 40 #e0e0e0
0 41 #8e8e8e
0 42 #8e8f8e
0 43 #444444
0 44 #868686
0 45 #c7c7c7
0 46 #f7f7f7
0 47 #9e9e9e
0 48 #757575
0 49 #414141
0 50 #effbff
0 51 #404040
0 52 #f3f3f3
0 53 #aaaaaa
0 54 #555555
0 55 #d7d3d7
0 56 #aeaaae
0 57 #c2c2c2
0 58 #303030
0 59 #515551
0 60 #f7f3f7
0 61 #666666
0 62 #717171
0 63 #dd9d93
0 64 #f1ece0
0 65 #c3c3c3
0 66 #e2c8a8
0 67 #e1e1e1
0 68 #d2d2d2
0 69 #ededed
0 70 #da7a1a
0 71 #f1e41a
0 72 #887dc2
0 73 #d6d6d6
0 74 #8c8ca5
0 75 #4a4a4a
0 76 #8c6b6b
0 77 #5a5a5a
0 78 #636363
0 79 #b79b73
0 80 #4193ff
0 81 #bf703b
0 82 #db7700
0 83 #dab800
0 84 #006400
0 85 #5a6b3b
0 86 #d3d3d3
0 87 #8e8ea4
0 88 #f3b95d
0 89 #89996b
0 90 #646464
0 91 #b7e6ff
0 92 #86c0ec
0 93 #bdbdbd
0 94 #d39552
0 95 #98d2fe
0 96 #8c9c6b
0 97 #f76b00
0 98 #5a6b39
0 99 #8c9c6b
0 100 #8c9c7b
0 101 #184a18
0 102 #adadad
0 103 #f7bd5a
0 104 #636b9c
0 105 #de0000
0 106 #adadad
0 107 #f7bd5a
0 108 #adadad
0 109 #f7bd5a
0 110 #636b9c
0 111 #526b29
0 112 #949494
0 113 #006300
0 114 #00634a
0 115 #7b844a
0 116 #e7bd7b
0 117 #a5b5c6
0 118 #6b6b94
0 119 #846b6b
0 120 #529c4a
0 121 #d6e7e7
0 122 #526363
0 123 #186b4a
0 124 #9ca5b5
0 125 #ff9400
0 126 #ff9400
0 127 #00634a
0 128 #7b844a
0 129 #63737b
0 130 #e7bd7b
0 131 #184a18
0 132 #f7bd5a
0 133 #dedede
0 134 #f3eed3
0 135 #f5ae5d
0 136 #95ce99
0 137 #b5157d
0 138 #eeeeee
0 139 #848484
0 140 #7b7b7b
0 141 #005a00
0 142 #e77373
0 143 #ffcb31
0 144 #29794a
0 145 #de2821
0 146 #2159c6
0 147 #f8f8f8
0 148 #e6e6e6
0 149 #21845a
0 150 #9c0000
0 151 #8c8c8c
0 152 #424242
0 153 #8c8c8c
0 154 #424242
0 155 #8c8c8c
0 156 #424242
0 157 #8c8c8c
0 158 #424242
0 159 #8c8c8c
0 160 #424242
0 161 #8c8c8c
0 162 #424242
1 3 0 2 0 0 50 -1 43 0.000 1 0.0000 6675 4275 27 27 6675 4275 6702 4275
1 3 0 2 0 0 50 -1 43 0.000 1 0.0000 4950 4800 27 27 4950 4800 4977 4800
1 3 0 2 0 0 50 -1 43 0.000 1 0.0000 4950 3450 27 27 4950 3450 4977 3450
1 3 0 2 0 0 50 -1 43 0.000 1 0.0000 6675 4800 27 27 6675 4800 6702 4800
2 2 0 2 0 7 50 -1 -1 0.000 0 0 -1 0 0 5
	 4350 3750 5550 3750 5550 4500 4350 4500 4350 3750
2 1 0 2 0 7 50 -1 -1 0.000 0 0 -1 0 0 2
	 4950 3750 4950 3450
2 1 0 2 0 7 50 -1 -1 0.000 0 0 -1 0 0 2
	 4950 4500 4950 4800
2 1 0 2 0 7 50 -1 -1 0.000 0 0 -1 0 0 2
	 5250 3750 4650 4500
2 1 0 2 0 7 50 -1 -1 0.000 0 0 -1 0 0 2
	 6000 3750 6450 3750
2 1 0 2 0 7 50 -1 -1 0.000 0 0 -1 0 0 2
	 6900 3750 7350 3750
2 1 0 2 0 0 50 -1 -1 0.000 0 0 -1 0 0 2
	 4950 3450 4950 3150
2 1 0 2 0 0 50 -1 -1 0.000 0 0 -1 0 0 2
	 3975 4050 3975 3450
2 1 0 2 0 0 50 -1 -1 0.000 0 0 -1 0 0 2
	 3975 3450 4950 3450
2 1 0 2 0 0 50 -1 -1 0.000 0 0 -1 0 0 2
	 3900 4050 4050 4050
2 1 0 2 0 0 50 -1 -1 0.000 0 0 -1 0 0 2
	 4800 5100 4800 5400
2 1 0 2 0 0 50 -1 -1 0.000 0 0 -1 0 0 4
	 4875 5700 5025 5700 4950 5850 4875 5700
2 1 0 2 0 0 50 -1 -1 0.000 0 0 -1 0 0 2
	 4800 5250 4500 5250
2 1 0 2 0 0 50 -1 -1 0.000 0 0 -1 0 0 3
	 4950 4800 4950 5100 4800 5175
2 1 0 2 0 0 50 -1 -1 0.000 0 0 -1 0 0 3
	 3975 4200 3975 4800 4950 4800
2 1 0 2 0 0 50 -1 -1 0.000 0 0 -1 0 0 4
	 6900 4650 6900 4275 6450 4275 6450 4650
2 1 0 2 0 0 50 -1 -1 0.000 0 0 -1 0 0 4
	 3900 4200 4050 4200 3975 4050 3900 4200
2 1 0 2 0 0 50 -1 -1 0.000 0 0 -1 0 0 2
	 4200 5250 4500 5250
2 2 0 2 0 0 50 -1 -1 0.000 0 0 -1 0 0 5
	 3900 5175 4200 5175 4200 5325 3900 5325 3900 5175
2 1 0 2 0 0 50 -1 -1 0.000 0 0 -1 0 0 2
	 3900 5250 3600 5250
2 1 0 2 0 0 50 -1 0 0.000 0 0 -1 0 0 6
	 3185 5197 3407 5197 3518 5253 3407 5308 3185 5308 3185 5197
2 1 0 2 0 0 50 -1 -1 0.000 0 0 -1 0 0 2
	 4860 3142 5043 3145
2 1 0 2 0 0 50 -1 -1 0.000 0 0 -1 0 0 2
	 4950 5700 4950 5400
2 1 0 2 0 0 50 -1 -1 0.000 0 0 -1 1 0 2
	1 1 2.00 30.00 30.00
	 4800 5325 4950 5400
2 1 0 2 0 0 50 -1 -1 0.000 0 0 -1 0 0 4
	 6450 4650 6450 4800 6900 4800 6900 4650
2 1 0 2 0 0 50 -1 -1 0.000 0 0 -1 0 0 2
	 6675 4800 6675 5100
2 1 0 2 0 0 50 -1 -1 0.000 0 0 -1 0 0 3
	 6675 5100 6675 5250 7350 5250
2 1 0 2 0 0 50 -1 0 0.000 0 0 -1 0 0 6
	 7436 5191 7658 5191 7769 5247 7658 5302 7436 5302 7436 5191
2 1 0 2 0 0 50 -1 -1 0.000 0 0 -1 0 0 3
	 7350 3750 7500 3750 7500 3300
2 1 0 2 0 0 50 -1 -1 0.000 0 0 -1 0 0 4
	 7575 3300 7425 3300 7500 3150 7575 3300
2 1 0 2 0 0 50 -1 -1 0.000 0 0 -1 0 0 2
	 6675 4275 6825 3600
4 0 0 45 -1 16 10 0.0000 4 105 495 2656 5313 START\001
4 0 0 45 -1 16 12 0.0000 4 135 405 4800 6075 GND\001
4 0 0 45 -1 16 12 0.0000 4 135 570 4998 5313 BC548\001
4 0 0 45 -1 16 12 0.0000 4 135 300 3905 5130 24k\001
4 0 0 45 -1 16 12 1.5708 4 135 660 3813 4422 1N4148\001
4 0 0 45 -1 16 12 0.0000 4 135 105 5025 4725 9\001
4 0 0 45 -1 16 12 0.0000 4 135 105 5025 3600 2\001
4 0 0 45 -1 16 12 0.0000 4 135 330 4800 3075 +5V\001
4 0 0 45 -1 16 12 0.0000 4 135 465 5775 4200 G5V1\001
4 0 0 45 -1 16 12 0.0000 4 135 210 6000 3675 10\001
4 0 0 45 -1 16 12 0.0000 4 135 105 6300 4650 6\001
4 0 0 45 -1 16 12 0.0000 4 135 105 6750 4650 5\001
4 0 0 45 -1 16 12 0.0000 4 135 105 7275 3675 1\001
4 0 0 45 -1 16 12 0.0000 4 135 405 7350 3075 GND\001
4 0 0 45 -1 16 12 0.0000 4 135 675 7855 5301 PWRUP\001
