#FIG 3.2
Landscape
Center
Metric
A4      
100.00
Single
-2
1200 2
2 5 0 1 0 -1 50 0 -1 0.000 0 0 -1 0 0 5
	0 /home/tobibobi/home/msdocs//boardet.jpg
	 1350 1170 11880 1170 11880 8640 1350 8640 1350 1170
2 2 0 1 0 7 50 0 -1 0.000 0 0 -1 0 0 5
	 1305 1125 11970 1125 11970 8730 1305 8730 1305 1125
