#FIG 3.2
Landscape
Center
Inches
Letter  
100.00
Single
-2
1200 2
6 4275 2625 5025 3600
6 4275 2625 5025 3375
6 4500 2700 4800 3300
2 1 0 1 0 7 50 -1 -1 0.000 0 0 -1 0 0 10
	 4500 2970 4560 2970 4620 2850 4620 3300 4680 3300 4680 2850
	 4740 2970 4800 2970 4650 2700 4500 2970
-6
2 2 0 1 0 7 50 -1 -1 0.000 0 0 -1 0 0 5
	 4275 2625 5025 2625 5025 3375 4275 3375 4275 2625
-6
4 0 0 50 -1 0 12 0.0000 4 135 315 4500 3600 dias\001
-6
6 8850 3375 9300 4500
2 1 0 1 0 7 50 -1 -1 0.000 0 0 -1 0 0 4
	 8971 4463 9269 4437 9179 3392 8879 3417
3 0 0 1 0 7 50 -1 -1 0.000 0 0 0 4
	 8879 3417 9061 3777 9087 4075 8971 4463
	 0.000 1.000 1.000 0.000
-6
6 6525 2775 7275 3525
6 6750 2850 7050 3450
2 1 0 1 0 7 50 -1 -1 0.000 0 0 -1 0 0 10
	 6750 3180 6810 3180 6870 3300 6870 2850 6930 2850 6930 3300
	 6990 3180 7050 3180 6900 3450 6750 3180
-6
2 2 0 1 0 7 50 -1 -1 0.000 0 0 -1 0 0 5
	 6525 3525 7275 3525 7275 2775 6525 2775 6525 3525
-6
2 2 0 1 0 7 50 -1 -1 0.000 0 0 -1 0 0 5
	 2325 4125 3900 4125 3900 4575 2325 4575 2325 4125
2 1 2 1 0 7 50 -1 -1 3.000 0 0 -1 0 0 3
	 3900 4350 9000 3675 6075 4575
2 1 0 1 0 7 50 -1 -1 3.000 0 0 -1 1 0 2
	0 0 1.00 60.00 120.00
	 4425 3525 4200 3900
2 2 0 1 0 7 50 -1 -1 0.000 0 0 -1 0 0 5
	 4050 3900 4125 3900 4125 4800 4050 4800 4050 3900
2 2 0 1 0 7 50 -1 -1 0.000 0 0 -1 0 0 5
	 6000 4425 6075 4425 6075 5175 6000 5175 6000 4425
2 1 0 1 0 7 50 -1 -1 3.000 0 0 -1 1 0 2
	0 0 1.00 60.00 120.00
	 6525 3600 6150 4275
2 1 0 1 0 7 50 -1 -1 0.000 0 0 -1 0 0 2
	 4125 6150 4125 6300
2 1 0 1 0 7 50 -1 -1 0.000 0 0 -1 0 0 2
	 9000 5625 9000 6300
2 1 0 1 0 7 50 -1 -1 0.000 0 0 -1 0 0 2
	 6075 5625 6075 5775
2 1 0 1 0 7 50 -1 -1 0.000 0 0 -1 1 1 2
	0 0 1.00 60.00 120.00
	0 0 1.00 60.00 120.00
	 4125 6225 9000 6225
2 1 0 1 0 7 50 -1 -1 0.000 0 0 -1 1 1 2
	0 0 1.00 60.00 120.00
	0 0 1.00 60.00 120.00
	 9000 5700 6075 5700
2 1 0 1 0 7 50 -1 -1 0.000 0 0 -1 0 0 2
	 7500 5775 7500 5850
4 0 0 50 -1 0 12 0.0000 4 180 225 2775 4425 lys\001
4 0 0 50 -1 0 12 0.0000 4 90 90 7425 5925 s\001
4 0 0 50 -1 0 12 0.0000 4 90 90 6375 6375 s\001
