#FIG 3.2
Landscape
Center
Inches
Letter  
100.00
Single
-2
1200 2
6 2550 3600 3825 4050
2 2 0 1 0 7 50 -1 -1 0.000 0 0 -1 0 0 5
	 2550 3600 3825 3600 3825 4050 2550 4050 2550 3600
4 0 0 50 -1 2 12 0.0000 2 150 1170 2625 3900 JewelProblem\001
-6
6 4350 3600 5475 4050
2 2 0 1 0 7 50 -1 -1 0.000 0 0 -1 0 0 5
	 4350 3600 5475 3600 5475 4050 4350 4050 4350 3600
4 0 0 50 -1 2 12 0.0000 2 135 1035 4425 3900 ManProblem\001
-6
6 825 3600 1950 4050
2 2 0 1 0 7 50 -1 -1 0.000 0 0 -1 0 0 5
	 825 3600 1950 3600 1950 4050 825 4050 825 3600
4 0 0 50 -1 2 12 0.0000 2 135 435 975 3900 Node\001
-6
6 450 2025 4950 3000
2 2 0 1 0 7 50 -1 -1 0.000 0 0 -1 0 0 5
	 450 2475 2325 2475 2325 2850 450 2850 450 2475
2 1 1 1 0 7 50 -1 -1 4.000 0 0 -1 1 0 2
	0 0 1.00 60.00 120.00
	 2325 2250 3450 2250
2 2 0 1 0 7 50 -1 -1 0.000 0 0 -1 0 0 5
	 450 2025 2325 2025 2325 2475 450 2475 450 2025
2 1 0 1 0 7 50 -1 -1 4.000 0 0 -1 0 0 2
	 3450 2475 4950 2475
2 2 0 1 0 7 50 -1 -1 0.000 0 0 -1 0 0 5
	 3450 2025 4950 2025 4950 3000 3450 3000 3450 2025
4 0 0 50 -1 0 12 0.0000 2 135 630 2475 2175 solves a\001
4 0 0 50 -1 0 12 0.0000 2 180 1710 525 2700 AStar(:Problem):Node\001
4 0 0 50 -1 2 12 0.0000 2 180 780 1050 2325 Algorithm\001
4 0 0 50 -1 3 12 0.0000 2 180 1290 3600 2700 successor(:Node)\001
4 0 0 50 -1 3 12 0.0000 2 180 1215 3600 2925 goalTest(:Node)\001
4 0 0 50 -1 3 13 0.0000 2 165 630 3825 2325 problem\001
-6
2 1 0 1 0 7 50 -1 -1 0.000 0 0 -1 1 0 2
	1 0 1.00 120.00 240.00
	 3300 3600 3600 3000
2 1 0 1 0 7 50 -1 -1 0.000 0 0 -1 1 0 2
	1 0 1.00 120.00 240.00
	 4800 3600 4575 3000
2 1 1 1 0 7 50 -1 -1 4.000 0 0 -1 1 0 2
	0 0 1.00 60.00 120.00
	 2550 3750 1950 3750
2 1 1 1 0 7 50 -1 -1 4.000 0 0 -1 1 0 6
	0 0 1.00 60.00 120.00
	 4350 3900 4125 3900 4125 4275 2325 4275 2325 3975 1950 3975
2 1 0 1 0 7 50 -1 -1 0.000 0 0 -1 1 0 5
	0 0 1.00 120.00 240.00
	 1125 3600 1125 3300 450 3300 450 3900 825 3900
4 0 0 50 -1 0 12 0.0000 2 180 885 450 3225 parentNode\001
