%!PS-Adobe-3.0 EPSF-3.0
%%Creator: inkscape 0.45.1
%%Pages: 1
%%Orientation: Portrait
%%BoundingBox: 173 319 494 568
%%HiResBoundingBox: 173.88571 319.77143 493.88571 567.70167
%%EndComments
%%Page: 1 1
0 842 translate
0.8 -0.8 scale
0 0 0 setrgbcolor
[] 0 setdash
1 setlinewidth
0 setlinejoin
0 setlinecap
gsave [1 0 0 1 0 0] concat
0 0 0 setrgbcolor
[] 0 setdash
1 setlinewidth
0 setlinejoin
0 setlinecap
newpath
517.70318 613.95598 moveto
517.70318 613.95598 456.08388 614.33479 376.7869 613.95598 curveto
300.94545 613.59368 245.06095 548.80684 244.96199 481.12092 curveto
244.83572 394.75288 312.26153 343.2351 380.32243 343.2351 curveto
465.04897 343.2351 518.23951 414.30145 517.1981 479.10061 curveto
516.06168 549.81129 460.62956 589.71232 460.62956 589.71232 curveto
518.20826 590.21739 lineto
stroke
0 0 0 setrgbcolor
[] 0 setdash
1 setlinewidth
0 setlinejoin
0 setlinecap
newpath
217.97248 631.63365 moveto
608.11183 631.63365 lineto
stroke
0 0 0 setrgbcolor
[] 0 setdash
1 setlinewidth
0 setlinejoin
0 setlinecap
newpath
477.80215 573.54988 moveto
485.3783 589.71232 lineto
stroke
0 0 0 setrgbcolor
[] 0 setdash
1 setlinewidth
0 setlinejoin
0 setlinecap
newpath
494.97475 613.95598 moveto
503.56104 631.63365 lineto
stroke
0 0 0 setrgbcolor
[] 0 setdash
1 setlinewidth
0 setlinejoin
0 setlinecap
newpath
486.89353 613.95598 moveto
494.97475 631.63365 lineto
stroke
0 0 0 setrgbcolor
[] 0 setdash
1 setlinewidth
0 setlinejoin
0 setlinecap
newpath
472.24632 579.61079 moveto
476.79201 589.20724 lineto
stroke
0 0 0 setrgbcolor
[] 0 setdash
1 setlinewidth
0 setlinejoin
0 setlinecap
newpath
287.89348 577.59049 moveto
252.53814 631.63365 lineto
stroke
0 0 0 setrgbcolor
[] 0 setdash
1 setlinewidth
0 setlinejoin
0 setlinecap
newpath
242.94169 631.12857 moveto
281.83256 571.52957 lineto
stroke
gsave [1 0 0 1 2.6785714 1.4285714] concat
gsave [1.7423624 0 0 1.7423624 -308.92429 -270.64865] concat
0 0 0 setrgbcolor
[] 0 setdash
0.57393342 setlinewidth
0 setlinejoin
0 setlinecap
newpath
418.70823 360.15515 moveto
418.70823 363.64018 415.8798 366.4686 412.39478 366.4686 curveto
408.90975 366.4686 406.08132 363.64018 406.08132 360.15515 curveto
406.08132 356.67013 408.90975 353.8417 412.39478 353.8417 curveto
415.8798 353.8417 418.70823 356.67013 418.70823 360.15515 curveto
closepath
stroke
grestore
0 0 0 setrgbcolor
[] 0 setdash
1 setlinewidth
0 setlinejoin
0 setlinecap
newpath
401.03056 363.43815 moveto
418.20315 350.81124 lineto
stroke
0 0 0 setrgbcolor
[] 0 setdash
1 setlinewidth
0 setlinejoin
0 setlinecap
newpath
400.52548 350.30616 moveto
418.70823 362.42799 lineto
stroke
0 0 0 setrgbcolor
[] 0 setdash
1 setlinewidth
0 setlinejoin
0 setlinecap
newpath
410.12193 345.76048 moveto
410.12193 366.97368 lineto
stroke
grestore
gsave [1 0 0 1 -67.680224 240.47199] concat
gsave [1.7423624 0 0 1.7423624 -308.92429 -270.64865] concat
0 0 0 setrgbcolor
[] 0 setdash
0.57393342 setlinewidth
0 setlinejoin
0 setlinecap
newpath
418.70823 360.15515 moveto
418.70823 363.64018 415.8798 366.4686 412.39478 366.4686 curveto
408.90975 366.4686 406.08132 363.64018 406.08132 360.15515 curveto
406.08132 356.67013 408.90975 353.8417 412.39478 353.8417 curveto
415.8798 353.8417 418.70823 356.67013 418.70823 360.15515 curveto
closepath
stroke
grestore
0 0 0 setrgbcolor
[] 0 setdash
1 setlinewidth
0 setlinejoin
0 setlinecap
newpath
401.03056 363.43815 moveto
418.20315 350.81124 lineto
stroke
0 0 0 setrgbcolor
[] 0 setdash
1 setlinewidth
0 setlinejoin
0 setlinecap
newpath
400.52548 350.30616 moveto
418.70823 362.42799 lineto
stroke
0 0 0 setrgbcolor
[] 0 setdash
1 setlinewidth
0 setlinejoin
0 setlinecap
newpath
410.12193 345.76048 moveto
410.12193 366.97368 lineto
stroke
grestore
0 0 0 setrgbcolor
[] 0 setdash
1.0350596 setlinewidth
0 setlinejoin
0 setlinecap
newpath
337.21008 543.27846 moveto
325.47089 566.86991 lineto
334.73779 571.50484 lineto
346.04592 548.52357 lineto
stroke
0 0 0 setrgbcolor
[] 0 setdash
1.0350596 setlinewidth
0 setlinejoin
0 setlinecap
newpath
331.40533 565.44372 moveto
346.26974 537.4284 lineto
stroke
0 0 0 setrgbcolor
[] 0 setdash
1.0350596 setlinewidth
0 setlinejoin
0 setlinecap
newpath
351.06679 539.03877 moveto
341.79989 534.40385 lineto
stroke
0 0 0 setrgbcolor
[] 0 setdash
1.0350596 setlinewidth
0 setlinejoin
0 setlinecap
newpath
354.94906 519.75336 moveto
358.85377 512.48259 lineto
stroke
gsave [0.990558 -0.1468755 0.1370941 1.0612326 -79.648974 16.170234] concat
0 0 0 setrgbcolor
[] 0 setdash
1 setlinewidth
0 setlinejoin
0 setlinecap
newpath
362.39222 530.11332 moveto
368.83195 531.12347 lineto
365.29641 525.6939 lineto
358.60415 523.79986 lineto
362.39222 530.11332 lineto
closepath
stroke
0 0 0 setrgbcolor
[] 0 setdash
1 setlinewidth
0 setlinejoin
0 setlinecap
newpath
358.35161 523.67359 moveto
369.33702 531.62854 lineto
stroke
grestore
0 0 0 setrgbcolor
[] 0 setdash
1.0350596 setlinewidth
0 setlinejoin
0 setlinecap
newpath
351.40619 525.87796 moveto
348.05374 533.47656 lineto
stroke
0 0 0 setrgbcolor
[] 0 setdash
1.0350596 setlinewidth
0 setlinejoin
0 setlinecap
newpath
342.97581 530.67874 moveto
351.79433 535.78984 lineto
stroke
0 0 0 setrgbcolor
[] 0 setdash
1.0350596 setlinewidth
0 setlinejoin
0 setlinecap
newpath
355.346 509.9982 moveto
362.61166 514.92986 lineto
stroke
gsave [0.990558 -0.1468755 0.1370941 1.0612326 -74.683968 7.5570466] concat
gsave [1 0 0 1 5.6821081 -15.657364] concat
0 0 0 setrgbcolor
[] 0 setdash
1 setlinewidth
0 setlinejoin
0 setlinecap
newpath
377.79707 525.82019 moveto
377.79707 529.30522 374.96864 532.13364 371.48361 532.13364 curveto
367.99859 532.13364 365.17016 529.30522 365.17016 525.82019 curveto
365.17016 522.33516 367.99859 519.50674 371.48361 519.50674 curveto
374.96864 519.50674 377.79707 522.33516 377.79707 525.82019 curveto
closepath
stroke
grestore
0 0 0 setrgbcolor
[] 0 setdash
1 setlinewidth
0 setlinejoin
0 setlinecap
newpath
378.17586 505.99592 moveto
378.17586 505.99592 372.82993 505.77958 372.99883 510.66787 curveto
373.16773 515.4299 381.03171 515.18397 381.08005 510.92041 curveto
stroke
grestore
0 0 0 setrgbcolor
[] 0 setdash
1.0350596 setlinewidth
0 setlinejoin
0 setlinecap
newpath
364.8016 512.14693 moveto
356.31979 507.66874 lineto
stroke
0 0 0 setrgbcolor
[] 0 setdash
1.0350596 setlinewidth
0 setlinejoin
0 setlinecap
newpath
360.09892 509.29346 moveto
365.46041 499.48503 lineto
stroke
0 0 0 setrgbcolor
[] 0 setdash
1.0350596 setlinewidth
0 setlinejoin
0 setlinecap
newpath
371.76106 487.07911 moveto
376.14875 479.60015 lineto
stroke
0 0 0 setrgbcolor
[] 0 setdash
1.0350596 setlinewidth
0 setlinejoin
0 setlinecap
newpath
372.83531 477.63324 moveto
379.42757 481.29907 lineto
stroke
0 0 0 setrgbcolor
[] 0 setdash
1.0350596 setlinewidth
0 setlinejoin
0 setlinecap
newpath
381.33274 478.28521 moveto
374.24018 474.69358 lineto
stroke
0 0 0 setrgbcolor
[] 0 setdash
1.0350596 setlinewidth
0 setlinejoin
0 setlinecap
newpath
377.73453 476.08739 moveto
390.44752 450.16647 lineto
stroke
0 0 0 setrgbcolor
[] 0 setdash
1.0350596 setlinewidth
0 setlinejoin
0 setlinecap
newpath
397.10803 472.12224 moveto
370.20408 457.2651 lineto
stroke
0 0 0 setrgbcolor
[] 0 setdash
1.0350596 setlinewidth
0 setlinejoin
0 setlinecap
newpath
398.51289 469.18258 moveto
395.81483 473.9528 lineto
stroke
0 0 0 setrgbcolor
[] 0 setdash
1.0350596 setlinewidth
0 setlinejoin
0 setlinecap
newpath
387.70363 448.66137 moveto
393.22603 451.93956 lineto
stroke
0 0 0 setrgbcolor
[] 0 setdash
1.0350596 setlinewidth
0 setlinejoin
0 setlinecap
newpath
372.04001 453.71526 moveto
368.98013 459.63166 lineto
stroke
0 0 0 setrgbcolor
[] 0 setdash
1.0350596 setlinewidth
0 setlinejoin
0 setlinecap
newpath
401.47231 470.38258 moveto
399.05903 475.38371 lineto
stroke
0 0 0 setrgbcolor
[] 0 setdash
1.0350596 setlinewidth
0 setlinejoin
0 setlinecap
newpath
368.83044 452.55234 moveto
366.02072 458.43167 lineto
stroke
gsave [0.990558 -0.1468755 0.1370941 1.0612326 -94.325854 -41.197047] concat
gsave [1 0 0 1 5.6821081 -15.657364] concat
0 0 0 setrgbcolor
[] 0 setdash
1 setlinewidth
0 setlinejoin
0 setlinecap
newpath
377.79707 525.82019 moveto
377.79707 529.30522 374.96864 532.13364 371.48361 532.13364 curveto
367.99859 532.13364 365.17016 529.30522 365.17016 525.82019 curveto
365.17016 522.33516 367.99859 519.50674 371.48361 519.50674 curveto
374.96864 519.50674 377.79707 522.33516 377.79707 525.82019 curveto
closepath
stroke
grestore
0 0 0 setrgbcolor
[] 0 setdash
1 setlinewidth
0 setlinejoin
0 setlinecap
newpath
378.17586 505.99592 moveto
378.17586 505.99592 372.82993 505.77958 372.99883 510.66787 curveto
373.16773 515.4299 381.03171 515.18397 381.08005 510.92041 curveto
stroke
grestore
gsave [0.990558 -0.1468755 0.1370941 1.0612326 -27.868391 -4.3449386] concat
gsave [1 0 0 1 5.6821081 -15.657364] concat
0 0 0 setrgbcolor
[] 0 setdash
1 setlinewidth
0 setlinejoin
0 setlinecap
newpath
377.79707 525.82019 moveto
377.79707 529.30522 374.96864 532.13364 371.48361 532.13364 curveto
367.99859 532.13364 365.17016 529.30522 365.17016 525.82019 curveto
365.17016 522.33516 367.99859 519.50674 371.48361 519.50674 curveto
374.96864 519.50674 377.79707 522.33516 377.79707 525.82019 curveto
closepath
stroke
grestore
0 0 0 setrgbcolor
[] 0 setdash
1 setlinewidth
0 setlinejoin
0 setlinecap
newpath
378.17586 505.99592 moveto
378.17586 505.99592 372.82993 505.77958 372.99883 510.66787 curveto
373.16773 515.4299 381.03171 515.18397 381.08005 510.92041 curveto
stroke
grestore
gsave [0.990558 -0.1468755 0.1370941 1.0612326 3.1672565 -30.524447] concat
gsave [1 0 0 1 5.6821081 -15.657364] concat
0 0 0 setrgbcolor
[] 0 setdash
1 setlinewidth
0 setlinejoin
0 setlinecap
newpath
377.79707 525.82019 moveto
377.79707 529.30522 374.96864 532.13364 371.48361 532.13364 curveto
367.99859 532.13364 365.17016 529.30522 365.17016 525.82019 curveto
365.17016 522.33516 367.99859 519.50674 371.48361 519.50674 curveto
374.96864 519.50674 377.79707 522.33516 377.79707 525.82019 curveto
closepath
stroke
grestore
0 0 0 setrgbcolor
[] 0 setdash
1 setlinewidth
0 setlinejoin
0 setlinecap
newpath
378.17586 505.99592 moveto
378.17586 505.99592 372.82993 505.77958 372.99883 510.66787 curveto
373.16773 515.4299 381.03171 515.18397 381.08005 510.92041 curveto
stroke
grestore
gsave [0.990558 -0.1468755 0.1370941 1.0612326 -112.55591 -76.334507] concat
gsave [1 0 0 1 5.6821081 -15.657364] concat
0 0 0 setrgbcolor
[] 0 setdash
1 setlinewidth
0 setlinejoin
0 setlinecap
newpath
377.79707 525.82019 moveto
377.79707 529.30522 374.96864 532.13364 371.48361 532.13364 curveto
367.99859 532.13364 365.17016 529.30522 365.17016 525.82019 curveto
365.17016 522.33516 367.99859 519.50674 371.48361 519.50674 curveto
374.96864 519.50674 377.79707 522.33516 377.79707 525.82019 curveto
closepath
stroke
grestore
0 0 0 setrgbcolor
[] 0 setdash
1 setlinewidth
0 setlinejoin
0 setlinecap
newpath
378.17586 505.99592 moveto
378.17586 505.99592 372.82993 505.77958 372.99883 510.66787 curveto
373.16773 515.4299 381.03171 515.18397 381.08005 510.92041 curveto
stroke
grestore
0 0 0 setrgbcolor
[] 0 setdash
1.0350596 setlinewidth
0 setlinejoin
0 setlinecap
newpath
366.70974 455.87128 moveto
354.94911 449.69418 lineto
stroke
gsave [0.9911945 0.1324142 -0.1324142 0.9911945 62.062046 -42.298478] concat
0 0 0 setrgbcolor
[] 0 setdash
1.0350596 setlinewidth
0 setlinejoin
0 setlinecap
newpath
344.55871 440.30941 moveto
339.34335 431.80259 lineto
stroke
0 0 0 setrgbcolor
[] 0 setdash
1.0350596 setlinewidth
0 setlinejoin
0 setlinecap
newpath
342.95402 428.9843 moveto
335.11518 434.12339 lineto
stroke
0 0 0 setrgbcolor
[] 0 setdash
1.0350596 setlinewidth
0 setlinejoin
0 setlinecap
newpath
341.7924 426.78969 moveto
333.88278 431.59348 lineto
stroke
0 0 0 setrgbcolor
[] 0 setdash
1.0350596 setlinewidth
0 setlinejoin
0 setlinecap
newpath
337.78214 429.29625 moveto
330.48438 417.91062 lineto
stroke
grestore
0 0 0 setrgbcolor
[] 0 setdash
1.0350596 setlinewidth
0 setlinejoin
0 setlinecap
newpath
331.98301 403.08292 moveto
334.67919 394.12852 lineto
stroke
gsave [0.9549852 -0.3012986 0.3027887 1.0263179 -171.57817 -40.857674] concat
0 0 0 setrgbcolor
[] 0 setdash
1 setlinewidth
0 setlinejoin
0 setlinecap
newpath
362.39222 530.11332 moveto
368.83195 531.12347 lineto
365.29641 525.6939 lineto
358.60415 523.79986 lineto
362.39222 530.11332 lineto
closepath
stroke
0 0 0 setrgbcolor
[] 0 setdash
1 setlinewidth
0 setlinejoin
0 setlinecap
newpath
358.35161 523.67359 moveto
369.33702 531.62854 lineto
stroke
grestore
gsave [0.990558 -0.1468755 0.1370941 1.0612326 -32.911873 -72.495444] concat
0 0 0 setrgbcolor
[] 0 setdash
1 setlinewidth
0 setlinejoin
0 setlinecap
newpath
362.39222 530.11332 moveto
368.83195 531.12347 lineto
365.29641 525.6939 lineto
358.60415 523.79986 lineto
362.39222 530.11332 lineto
closepath
stroke
0 0 0 setrgbcolor
[] 0 setdash
1 setlinewidth
0 setlinejoin
0 setlinecap
newpath
358.35161 523.67359 moveto
369.33702 531.62854 lineto
stroke
grestore
0 0 0 setrgbcolor
[] 0 setdash
1.0350596 setlinewidth
0 setlinejoin
0 setlinecap
newpath
390.14373 445.84135 moveto
394.56165 448.4639 lineto
stroke
0 0 0 setrgbcolor
[] 0 setdash
1.0350596 setlinewidth
0 setlinejoin
0 setlinecap
newpath
392.56822 446.84754 moveto
398.17986 437.002 lineto
stroke
0 0 0 setrgbcolor
[] 0 setdash
1.0350596 setlinewidth
0 setlinejoin
0 setlinecap
newpath
401.45527 430.7805 moveto
406.92842 419.86296 lineto
stroke
0 0 0 setrgbcolor
[] 0 setdash
1.0350596 setlinewidth
0 setlinejoin
0 setlinecap
newpath
402.79528 417.47132 moveto
411.1308 422.79061 lineto
stroke
0 0 0 setrgbcolor
[] 0 setdash
1.0350596 setlinewidth
0 setlinejoin
0 setlinecap
newpath
404.66582 414.18948 moveto
413.2515 419.47167 lineto
stroke
0 0 0 setrgbcolor
[] 0 setdash
1.0350596 setlinewidth
0 setlinejoin
0 setlinecap
newpath
409.23003 415.97093 moveto
420.63422 395.70678 lineto
stroke
0 0 0 setrgbcolor
[] 0 setdash
1.0350596 setlinewidth
0 setlinejoin
0 setlinecap
newpath
408.8726 407.2836 moveto
418.617 389.41693 lineto
427.70299 394.62494 lineto
417.09646 413.71199 lineto
stroke
0 0 0 setrgbcolor
[] 0 setdash
1.0350596 setlinewidth
0 setlinejoin
0 setlinecap
newpath
331.76177 591.88498 moveto
322.74503 587.21297 lineto
325.33922 581.63875 lineto
stroke
0 0 0 setrgbcolor
[] 0 setdash
1.0350596 setlinewidth
0 setlinejoin
0 setlinecap
newpath
321.70638 579.17292 moveto
328.83356 583.03256 lineto
stroke
0 0 0 setrgbcolor
[] 0 setdash
1.0350596 setlinewidth
0 setlinejoin
0 setlinecap
newpath
323.8617 576.12199 moveto
330.73874 580.01872 lineto
stroke
0 0 0 setrgbcolor
[] 0 setdash
1.0350596 setlinewidth
0 setlinejoin
0 setlinecap
newpath
327.03666 577.0169 moveto
330.57002 568.8452 lineto
stroke
0 0 0 setrgbcolor
[] 0 setdash
1.0350596 setlinewidth
0 setlinejoin
0 setlinecap
newpath
400.85252 473.47897 moveto
409.5845 477.92007 lineto
stroke
0 0 0 setrgbcolor
[] 0 setdash
1.0350596 setlinewidth
0 setlinejoin
0 setlinecap
newpath
420.09096 476.36222 moveto
428.90437 469.5927 lineto
stroke
0 0 0 setrgbcolor
[] 0 setdash
1.0350596 setlinewidth
0 setlinejoin
0 setlinecap
newpath
425.56411 465.44468 moveto
431.92522 473.24181 lineto
stroke
0 0 0 setrgbcolor
[] 0 setdash
1.0350596 setlinewidth
0 setlinejoin
0 setlinecap
newpath
429.50512 462.4021 moveto
435.47372 470.29527 lineto
stroke
0 0 0 setrgbcolor
[] 0 setdash
1.0350596 setlinewidth
0 setlinejoin
0 setlinecap
newpath
432.77613 466.01413 moveto
441.37402 459.5497 lineto
stroke
0 0 0 setrgbcolor
[] 0 setdash
1.0350596 setlinewidth
0 setlinejoin
0 setlinecap
newpath
453.397 453.9431 moveto
465.22346 452.73578 lineto
stroke
0 0 0 setrgbcolor
[] 0 setdash
1.0350596 setlinewidth
0 setlinejoin
0 setlinecap
newpath
465.02354 449.21468 moveto
465.75059 454.84271 lineto
stroke
0 0 0 setrgbcolor
[] 0 setdash
1.0350596 setlinewidth
0 setlinejoin
0 setlinecap
newpath
469.49168 448.27902 moveto
470.14481 454.16011 lineto
stroke
0 0 0 setrgbcolor
[] 0 setdash
1.0350596 setlinewidth
0 setlinejoin
0 setlinecap
newpath
470.40745 451.42086 moveto
476.12636 450.29975 lineto
479.39737 453.91177 lineto
486.54016 453.9452 lineto
stroke
0 0 0 setrgbcolor
[] 0 setdash
1.0350596 setlinewidth
0 setlinejoin
0 setlinecap
newpath
475.34128 450.14302 moveto
478.60888 445.83463 lineto
483.689 443.71569 lineto
stroke
0 0 0 setrgbcolor
[] 0 setdash
1.0350596 setlinewidth
0 setlinejoin
0 setlinecap
newpath
336.59373 388.27822 moveto
340.23875 378.47008 lineto
stroke
0 0 0 setrgbcolor
[] 0 setdash
1.0350596 setlinewidth
0 setlinejoin
0 setlinecap
newpath
336.8191 376.45081 moveto
343.90778 379.20913 lineto
stroke
0 0 0 setrgbcolor
[] 0 setdash
1.0350596 setlinewidth
0 setlinejoin
0 setlinecap
newpath
338.29321 374.04716 moveto
345.16869 376.18031 lineto
stroke
0 0 0 setrgbcolor
[] 0 setdash
1.0350596 setlinewidth
0 setlinejoin
0 setlinecap
newpath
341.39346 374.85321 moveto
343.4488 369.68876 lineto
stroke
0 0 0 setrgbcolor
[] 0 setdash
1.0350596 setlinewidth
0 setlinejoin
0 setlinecap
newpath
343.95428 355.30989 moveto
340.75358 364.12024 lineto
343.09244 369.85209 lineto
348.38186 366.64046 lineto
352.40382 356.79577 lineto
stroke
0 0 0 setrgbcolor
[] 0 setdash
1.0350596 setlinewidth
0 setlinejoin
0 setlinecap
newpath
422.93505 391.82999 moveto
427.89697 382.59522 lineto
stroke
0 0 0 setrgbcolor
[] 0 setdash
1.0350596 setlinewidth
0 setlinejoin
0 setlinecap
newpath
423.34212 379.77138 moveto
432.35184 384.73412 lineto
stroke
0 0 0 setrgbcolor
[] 0 setdash
1.0350596 setlinewidth
0 setlinejoin
0 setlinecap
newpath
425.89309 376.03608 moveto
433.79521 380.39579 lineto
stroke
0 0 0 setrgbcolor
[] 0 setdash
1.0350596 setlinewidth
0 setlinejoin
0 setlinecap
newpath
429.6831 377.75976 moveto
434.78263 368.72364 lineto
419.63585 362.45602 lineto
stroke
gsave [0.885477 0.4646832 -0.4646832 0.885477 457.08055 -23.367752] concat
gsave [0.990558 -0.1468755 0.1370941 1.0612326 -74.683968 7.5570466] concat
gsave [1 0 0 1 5.6821081 -15.657364] concat
0 0 0 setrgbcolor
[] 0 setdash
1 setlinewidth
0 setlinejoin
0 setlinecap
newpath
377.79707 525.82019 moveto
377.79707 529.30522 374.96864 532.13364 371.48361 532.13364 curveto
367.99859 532.13364 365.17016 529.30522 365.17016 525.82019 curveto
365.17016 522.33516 367.99859 519.50674 371.48361 519.50674 curveto
374.96864 519.50674 377.79707 522.33516 377.79707 525.82019 curveto
closepath
stroke
grestore
0 0 0 setrgbcolor
[] 0 setdash
1 setlinewidth
0 setlinejoin
0 setlinecap
newpath
378.17586 505.99592 moveto
378.17586 505.99592 372.82993 505.77958 372.99883 510.66787 curveto
373.16773 515.4299 381.03171 515.18397 381.08005 510.92041 curveto
stroke
grestore
0 0 0 setrgbcolor
[] 0 setdash
1.0350596 setlinewidth
0 setlinejoin
0 setlinecap
newpath
364.8016 512.14693 moveto
356.31979 507.66874 lineto
stroke
0 0 0 setrgbcolor
[] 0 setdash
1.0350596 setlinewidth
0 setlinejoin
0 setlinecap
newpath
360.09892 509.29346 moveto
365.46041 499.48503 lineto
stroke
0 0 0 setrgbcolor
[] 0 setdash
1.0350596 setlinewidth
0 setlinejoin
0 setlinecap
newpath
371.76106 487.07911 moveto
376.14875 479.60015 lineto
stroke
0 0 0 setrgbcolor
[] 0 setdash
1.0350596 setlinewidth
0 setlinejoin
0 setlinecap
newpath
372.83531 477.63324 moveto
379.42757 481.29907 lineto
stroke
grestore
gsave [0.5128243 0.8584936 -0.8584936 0.5128243 834.67556 25.759475] concat
gsave [1 0 0 1 4.4438731 4.5378082] concat
gsave [0.990558 -0.1468755 0.1370941 1.0612326 -79.648974 16.170234] concat
0 0 0 setrgbcolor
[] 0 setdash
1 setlinewidth
0 setlinejoin
0 setlinecap
newpath
362.39222 530.11332 moveto
368.83195 531.12347 lineto
365.29641 525.6939 lineto
358.60415 523.79986 lineto
362.39222 530.11332 lineto
closepath
stroke
0 0 0 setrgbcolor
[] 0 setdash
1 setlinewidth
0 setlinejoin
0 setlinecap
newpath
358.35161 523.67359 moveto
369.33702 531.62854 lineto
stroke
grestore
0 0 0 setrgbcolor
[] 0 setdash
1.0350596 setlinewidth
0 setlinejoin
0 setlinecap
newpath
354.94906 519.75336 moveto
358.85377 512.48259 lineto
stroke
0 0 0 setrgbcolor
[] 0 setdash
1.0350596 setlinewidth
0 setlinejoin
0 setlinecap
newpath
351.40619 525.87796 moveto
348.05374 533.47656 lineto
stroke
0 0 0 setrgbcolor
[] 0 setdash
1.0350596 setlinewidth
0 setlinejoin
0 setlinecap
newpath
342.97581 530.67874 moveto
351.79433 535.78984 lineto
stroke
0 0 0 setrgbcolor
[] 0 setdash
1.0350596 setlinewidth
0 setlinejoin
0 setlinecap
newpath
355.346 509.9982 moveto
362.61166 514.92986 lineto
stroke
grestore
gsave [0.5128243 -0.8584936 0.8584936 0.5128243 -450.15624 703.35352] concat
gsave
0 0 0 setrgbcolor
newpath
527.80471 596.27831 moveto
507.09658 599.81384 lineto
513.66255 593.75291 lineto
497.50011 603.34936 lineto
513.15748 609.41028 lineto
507.09656 603.85444 lineto
528.30976 600.82398 lineto
527.80471 596.27831 lineto
closepath
eofill
grestore
0 0 0 setrgbcolor
[] 0 setdash
1 setlinewidth
0 setlinejoin
0 setlinecap
newpath
527.80471 596.27831 moveto
507.09658 599.81384 lineto
513.66255 593.75291 lineto
497.50011 603.34936 lineto
513.15748 609.41028 lineto
507.09656 603.85444 lineto
528.30976 600.82398 lineto
527.80471 596.27831 lineto
closepath
stroke
grestore
grestore
0 0 0 setrgbcolor
[] 0 setdash
1 setlinewidth
0 setlinejoin
0 setlinecap
newpath
217.85714 636.6479 moveto
226.42857 650.93361 lineto
stroke
0 0 0 setrgbcolor
[] 0 setdash
1 setlinewidth
0 setlinejoin
0 setlinecap
newpath
225.71429 631.6479 moveto
238.57143 650.93361 lineto
stroke
0 0 0 setrgbcolor
[] 0 setdash
1 setlinewidth
0 setlinejoin
0 setlinecap
newpath
241.14286 632.57647 moveto
254 651.86218 lineto
stroke
0 0 0 setrgbcolor
[] 0 setdash
1 setlinewidth
0 setlinejoin
0 setlinecap
newpath
254.71429 632.00504 moveto
267.57143 651.29075 lineto
stroke
0 0 0 setrgbcolor
[] 0 setdash
1 setlinewidth
0 setlinejoin
0 setlinecap
newpath
269.71429 632.57647 moveto
282.57143 651.86218 lineto
stroke
0 0 0 setrgbcolor
[] 0 setdash
1 setlinewidth
0 setlinejoin
0 setlinecap
newpath
284.14286 632.57647 moveto
297 651.86218 lineto
stroke
0 0 0 setrgbcolor
[] 0 setdash
1 setlinewidth
0 setlinejoin
0 setlinecap
newpath
297.71429 632.00504 moveto
310.57143 651.29075 lineto
stroke
0 0 0 setrgbcolor
[] 0 setdash
1 setlinewidth
0 setlinejoin
0 setlinecap
newpath
313 631.29076 moveto
325.85714 650.57647 lineto
stroke
0 0 0 setrgbcolor
[] 0 setdash
1 setlinewidth
0 setlinejoin
0 setlinecap
newpath
329.42857 631.29076 moveto
342.28571 650.57647 lineto
stroke
0 0 0 setrgbcolor
[] 0 setdash
1 setlinewidth
0 setlinejoin
0 setlinecap
newpath
345 631.29076 moveto
357.85714 650.57647 lineto
stroke
0 0 0 setrgbcolor
[] 0 setdash
1 setlinewidth
0 setlinejoin
0 setlinecap
newpath
361.42857 631.29076 moveto
374.28571 650.57647 lineto
stroke
0 0 0 setrgbcolor
[] 0 setdash
1 setlinewidth
0 setlinejoin
0 setlinecap
newpath
376.42857 632.00504 moveto
389.28571 651.29075 lineto
stroke
0 0 0 setrgbcolor
[] 0 setdash
1 setlinewidth
0 setlinejoin
0 setlinecap
newpath
391.28572 632.00504 moveto
404.14286 651.29075 lineto
stroke
0 0 0 setrgbcolor
[] 0 setdash
1 setlinewidth
0 setlinejoin
0 setlinecap
newpath
405 632.57647 moveto
417.85714 651.86218 lineto
stroke
0 0 0 setrgbcolor
[] 0 setdash
1 setlinewidth
0 setlinejoin
0 setlinecap
newpath
421.71429 632.57647 moveto
434.57143 651.86218 lineto
stroke
0 0 0 setrgbcolor
[] 0 setdash
1 setlinewidth
0 setlinejoin
0 setlinecap
newpath
435.42857 631.29076 moveto
448.28571 650.57647 lineto
stroke
0 0 0 setrgbcolor
[] 0 setdash
1 setlinewidth
0 setlinejoin
0 setlinecap
newpath
448.42857 631.43361 moveto
461.28571 650.71932 lineto
stroke
0 0 0 setrgbcolor
[] 0 setdash
1 setlinewidth
0 setlinejoin
0 setlinecap
newpath
463.85714 632.1479 moveto
476.71428 651.43361 lineto
stroke
0 0 0 setrgbcolor
[] 0 setdash
1 setlinewidth
0 setlinejoin
0 setlinecap
newpath
478.28572 632.00504 moveto
491.14286 651.29075 lineto
stroke
0 0 0 setrgbcolor
[] 0 setdash
1 setlinewidth
0 setlinejoin
0 setlinecap
newpath
493.14286 632.71933 moveto
506 652.00504 lineto
stroke
0 0 0 setrgbcolor
[] 0 setdash
1 setlinewidth
0 setlinejoin
0 setlinecap
newpath
507.14286 632.71933 moveto
520 652.00504 lineto
stroke
0 0 0 setrgbcolor
[] 0 setdash
1 setlinewidth
0 setlinejoin
0 setlinecap
newpath
520.28572 631.43361 moveto
533.14286 650.71932 lineto
stroke
0 0 0 setrgbcolor
[] 0 setdash
1 setlinewidth
0 setlinejoin
0 setlinecap
newpath
533.85714 631.57647 moveto
546.71428 650.86218 lineto
stroke
0 0 0 setrgbcolor
[] 0 setdash
1 setlinewidth
0 setlinejoin
0 setlinecap
newpath
548 632.86218 moveto
560.85714 652.14789 lineto
stroke
0 0 0 setrgbcolor
[] 0 setdash
1 setlinewidth
0 setlinejoin
0 setlinecap
newpath
561.42857 632.86218 moveto
574.28571 652.14789 lineto
stroke
0 0 0 setrgbcolor
[] 0 setdash
1 setlinewidth
0 setlinejoin
0 setlinecap
newpath
575.71429 632.86218 moveto
588.57143 652.14789 lineto
stroke
0 0 0 setrgbcolor
[] 0 setdash
1 setlinewidth
0 setlinejoin
0 setlinecap
newpath
590.71429 632.86218 moveto
603.57143 652.14789 lineto
stroke
0 0 0 setrgbcolor
[] 0 setdash
1 setlinewidth
0 setlinejoin
0 setlinecap
newpath
604 632.86218 moveto
616.85714 652.14789 lineto
stroke
grestore
showpage
%%EOF
