#FIG 3.2
Landscape
Center
Inches
Letter  
100.00
Single
-2
1200 2
1 1 0 1 0 7 50 -1 -1 0.000 1 0.0000 5134 2904 462 217 5134 2904 5596 3121
1 1 0 1 0 7 50 -1 -1 0.000 1 0.0000 2717 1572 462 272 2717 1572 3178 1844
2 1 0 1 0 7 50 -1 -1 0.000 0 0 -1 1 1 2
	1 1 1.00 21.73 43.46
	1 1 1.00 21.73 43.46
	 2717 1925 2717 2578
2 2 0 1 0 7 50 -1 -1 0.000 0 0 -1 0 0 5
	 4754 1382 5569 1382 5569 1844 4754 1844 4754 1382
2 1 0 1 0 7 50 -1 -1 0.000 0 0 -1 1 1 2
	1 1 1.00 21.73 43.46
	1 1 1.00 21.73 43.46
	 5134 1925 5134 2578
2 2 0 1 0 7 50 -1 -1 0.000 0 0 -1 0 0 5
	 4319 975 5976 975 5976 3501 4319 3501 4319 975
2 2 0 1 0 7 50 -1 -1 0.000 0 0 -1 0 0 5
	 1875 975 3532 975 3532 3501 1875 3501 1875 975
2 2 0 1 0 7 50 -1 -1 0.000 0 0 -1 0 0 5
	 2309 2659 3124 2659 3124 3121 2309 3121 2309 2659
3 2 1 1 0 7 50 -1 -1 4.000 0 1 1 4
	1 1 1.00 21.73 43.46
	1 1 1.00 21.73 43.46
	 3206 2876 3804 2632 4102 1682 4645 1572
	 0.000 -1.000 -1.000 0.000
4 0 0 50 -1 0 7 0.0000 4 75 585 2798 2034 Kalde/modtage\001
4 0 0 50 -1 0 7 0.0000 4 60 240 2588 1599 Klient\001
4 0 0 50 -1 0 7 0.0000 4 60 405 2507 1159 Maskine A\001
4 0 0 50 -1 0 7 0.0000 4 60 360 4959 1641 RMI-skel\001
4 0 0 50 -1 0 7 0.0000 4 75 495 4883 2951 ServerObjekt\001
4 0 0 50 -1 0 7 0.0000 4 60 360 2495 2925 RMI-stub\001
4 0 0 50 -1 0 7 0.0000 4 60 405 4925 1172 Maskine B\001
4 0 0 50 -1 0 7 0.0000 4 75 585 5195 2014 Kalde/modtage\001
