\relax 
\catcode`"\active
\select@language{danish}
\@writefile{toc}{\select@language{danish}}
\@writefile{lof}{\select@language{danish}}
\@writefile{lot}{\select@language{danish}}
\select@language{danish}
\@writefile{toc}{\select@language{danish}}
\@writefile{lof}{\select@language{danish}}
\@writefile{lot}{\select@language{danish}}
\@writefile{toc}{\contentsline {section}{\numberline {1}Sektion 3.2 - Logaritmiske funktioner}{1}}
\@writefile{toc}{\contentsline {subsection}{\numberline {1.1}Opgave 29}{1}}
\@writefile{toc}{\contentsline {subsection}{\numberline {1.2}Opgave 30}{1}}
