#FIG 3.2
Landscape
Center
Inches
Letter  
100.00
Single
-2
1200 2
6 7425 3525 8325 5025
2 2 0 1 0 7 50 -1 20 0.000 0 0 -1 0 0 5
	 7425 3900 8325 3900 8325 4125 7425 4125 7425 3900
2 2 0 1 0 7 50 -1 20 0.000 0 0 -1 0 0 5
	 7425 4800 8325 4800 8325 5025 7425 5025 7425 4800
2 1 0 1 0 7 50 -1 -1 0.000 0 0 -1 1 0 2
	0 0 1.00 75.00 75.00
	 7875 4800 7875 4575
2 1 0 1 0 7 50 -1 -1 0.000 0 0 -1 1 0 2
	0 0 1.00 75.00 75.00
	 7875 4125 7875 4350
2 2 0 1 0 7 50 -1 20 0.000 0 0 -1 0 0 5
	 7425 4350 8325 4350 8325 4575 7425 4575 7425 4350
2 2 0 1 0 7 50 -1 20 0.000 0 0 -1 0 0 5
	 7425 3525 8325 3525 8325 3750 7425 3750 7425 3525
4 1 0 49 -1 0 10 0.0000 0 105 405 7875 4500 CBlob\001
4 1 0 49 -1 0 10 0.0000 0 105 465 7875 4050 CBlobs\001
4 1 0 49 -1 0 10 0.0000 0 105 735 7875 4950 CBlobMass\001
4 1 0 49 -1 0 10 0.0000 0 135 780 7875 3675 CHistogram\001
-6
6 5925 2775 7425 3075
2 2 0 1 0 7 50 -1 20 0.000 0 0 -1 0 0 5
	 5925 2775 6675 2775 6675 3000 5925 3000 5925 2775
2 1 0 1 0 7 50 -1 -1 0.000 0 0 -1 1 0 2
	1 0 1.00 180.00 150.00
	 6900 2925 6675 2925
2 1 0 1 0 7 50 -1 -1 0.000 0 0 -1 0 0 2
	 6975 2925 7125 2925
2 1 0 1 0 7 50 -1 -1 0.000 0 0 -1 0 0 2
	 7200 2925 7275 2925
2 1 0 1 0 7 50 -1 -1 0.000 0 0 -1 0 0 2
	 7350 2925 7425 2925
4 1 0 49 -1 3 10 0.0000 0 105 540 6300 2925 ILocator\001
-6
2 1 0 1 0 7 50 -1 -1 0.000 0 0 -1 1 0 4
	0 0 1.00 75.00 75.00
	 7125 4125 7275 4125 7275 4425 7425 4425
2 1 0 1 0 7 50 -1 -1 0.000 0 0 -1 1 0 4
	0 0 1.00 75.00 75.00
	 7125 4125 7275 4125 7275 4875 7425 4875
2 3 0 0 0 11 51 -1 10 0.000 0 0 -1 0 0 7
	 8400 3150 8475 3225 8475 5175 6750 5175 6675 5100 8400 5100
	 8400 3150
2 1 0 1 0 7 50 -1 -1 0.000 0 0 -1 1 0 3
	0 0 1.00 75.00 75.00
	 6975 4050 6975 3600 7425 3600
2 1 0 1 0 7 50 -1 -1 0.000 0 0 -1 1 0 4
	0 0 1.00 75.00 75.00
	 7125 4125 7275 4125 7275 3975 7425 3975
2 2 0 1 0 7 49 -1 20 0.000 0 0 -1 0 0 5
	 5925 4050 7125 4050 7125 4275 5925 4275 5925 4050
2 2 0 0 0 11 51 -1 30 0.000 0 0 -1 0 0 5
	 6675 3150 8400 3150 8400 5100 6675 5100 6675 3150
2 1 0 1 0 7 50 -1 -1 0.000 0 0 -1 1 0 2
	1 0 1.00 180.00 150.00
	 6225 4050 6225 3000
4 1 0 50 -1 2 10 0.0000 0 165 705 7575 3375 tob_vision\001
4 1 0 49 -1 0 10 0.0000 0 105 1095 6525 4200 LandmarkLocator\001
4 0 0 50 -1 1 12 0.0000 4 135 1140 7125 2850 Andre Locaters\001
