#FIG 3.2
Portrait
Center
Inches
A4      
100.00
Single
-2
1200 2
6 1875 8775 3975 11775
6 1875 9975 3975 10500
4 0 0 50 -1 22 15 0.0000 4 165 2040 1875 10200 Thomas Ebert Hansen\001
4 0 0 50 -1 22 15 0.0000 4 165 630 1875 10470 050683\001
-6
6 1875 8775 2775 9300
4 0 0 50 -1 22 15 0.0000 4 165 885 1875 9000 Leo Zhou\001
4 0 0 50 -1 22 15 0.0000 4 165 630 1875 9270 020382\001
-6
6 1875 11325 3300 11775
4 0 0 50 -1 22 15 0.0000 4 165 1380 1875 11505 Tobias Nielsen\001
4 0 0 50 -1 22 15 0.0000 4 165 630 1875 11775 200975\001
-6
2 1 0 1 0 7 50 -1 -1 0.000 0 0 -1 0 0 2
	 1875 8775 3900 8775
2 1 0 1 0 7 50 -1 -1 0.000 0 0 -1 0 0 2
	 1875 9975 3900 9975
2 1 0 1 0 7 50 -1 -1 0.000 0 0 -1 0 0 2
	 1875 11250 3900 11250
-6
6 5250 7350 8550 12900
2 3 0 1 0 0 50 -1 20 0.000 0 0 -1 0 0 21
	 8115 7455 7290 12105 7365 12405 7590 12480 8415 12480 8340 12780
	 6840 12705 5265 12705 5340 12480 5940 12480 6165 12405 6315 12105
	 6990 8130 5640 8805 5565 8730 5640 8130 6390 7980 7215 7755
	 7965 7380 8115 7455 8115 7455
2 3 0 0 0 11 49 -1 20 0.000 0 0 -1 0 0 21
	 8250 7575 7425 12225 7500 12525 7725 12600 8550 12600 8475 12900
	 6975 12825 5400 12825 5475 12600 6075 12600 6300 12525 6450 12225
	 7125 8250 5775 8925 5700 8850 5775 8250 6525 8100 7350 7875
	 8100 7500 8250 7575 8250 7575
-6
2 1 0 1 0 7 50 -1 -1 0.000 0 0 -1 0 0 2
	 1650 3225 8625 3225
2 1 0 1 0 7 50 -1 -1 0.000 0 0 -1 0 0 2
	 1650 4725 8625 4725
2 1 0 1 7 7 50 -1 -1 0.000 0 0 -1 0 0 2
	 300 2550 300 12300
2 1 0 1 7 7 50 -1 -1 0.000 0 0 -1 0 0 2
	 9375 2775 9375 12975
4 0 0 50 -1 16 15 0.0000 4 225 3840 3375 2025 Ingen\370rh\370jskolen Odense Teknikum\001
4 0 0 50 -1 16 15 0.0000 4 240 2310 3975 2700 Projekt C - For\345r 2004\001
4 0 0 50 -1 17 15 0.0000 4 225 3030 3525 5550 Vejleder: Marius Vestergaard\001
4 1 0 50 -1 31 45 0.0000 4 510 1725 5175 3900 LeOS\001
4 1 0 50 -1 31 30 0.0000 4 465 5460 5175 4500 Lightweight embedded OS\001
4 0 0 48 -1 31 28 0.0000 4 300 1320 7275 12375 HOLD\001
