#FIG 3.2
Landscape
Center
Inches
Letter  
100.00
Single
-2
1200 2
0 32 #c6b797
0 33 #eff8ff
0 34 #dccba6
0 35 #404040
0 36 #808080
0 37 #c0c0c0
0 38 #e0e0e0
0 39 #8e8f8e
0 40 #aaaaaa
0 41 #555555
0 42 #8e8e8e
0 43 #d7d7d7
0 44 #aeaeae
0 45 #bebebe
0 46 #515151
0 47 #e7e3e7
0 48 #000049
0 49 #797979
0 50 #303430
0 51 #414141
0 52 #c7b696
0 53 #414541
0 54 #c2c2c2
0 55 #6e6e6e
0 56 #444444
0 57 #717171
0 58 #333333
0 59 #949395
0 60 #747075
0 61 #b3b3b3
0 62 #c3c3c3
0 63 #6d6d6d
0 64 #454545
0 65 #868286
0 66 #c7c3c7
0 67 #868686
0 68 #c7c7c7
0 69 #e7e7e7
0 70 #f7f7f7
0 71 #9e9e9e
0 72 #717571
0 73 #757575
0 74 #effbff
0 75 #f3f3f3
0 76 #d7d3d7
0 77 #aeaaae
0 78 #303030
0 79 #515551
0 80 #f7f3f7
0 81 #666666
6 2175 750 4692 3450
# Minerva MPEG CODEC
# drawn by W. Chimiak
6 4268 841 4692 1048
5 1 0 1 8 9 57 0 20 0.000 0 0 0 0 4604.000 1540.000 4335 1043 4521 981 4687 981
5 1 0 1 8 1 53 0 20 0.000 0 1 0 0 4430.190 394.702 4325 924 4506 929 4682 872
2 3 0 1 9 1 57 0 20 0.000 0 0 -1 0 0 5
	 4273 934 4325 1033 4314 914 4268 867 4273 934
2 3 0 1 8 10 57 0 44 0.000 0 0 -1 0 0 5
	 4273 872 4278 945 4283 955 4278 878 4273 872
2 3 0 1 8 10 57 0 20 0.000 0 0 -1 0 0 5
	 4268 867 4314 914 4661 867 4485 841 4268 867
2 3 0 1 8 9 57 0 20 0.000 1 0 -1 0 0 5
	 4314 914 4325 1033 4335 1043 4325 924 4314 914
2 3 0 1 0 0 57 0 20 0.000 0 0 -1 0 0 5
	 4465 976 4459 945 4563 929 4568 955 4465 976
2 1 0 3 2 0 50 0 20 0.000 0 0 -1 0 0 2
	 4485 898 4485 908
2 1 0 3 2 0 50 0 20 0.000 0 0 -1 0 0 2
	 4526 893 4526 904
2 1 0 3 2 0 50 0 20 0.000 0 0 -1 0 0 2
	 4506 895 4506 906
2 1 0 3 4 0 50 0 20 0.000 1 0 -1 0 0 2
	 4545 889 4545 900
2 3 0 1 8 1 53 0 20 0.000 0 0 -1 0 0 5
	 4314 914 4325 924 4682 872 4661 867 4314 914
2 3 0 3 8 1 65 0 43 0.000 0 0 -1 0 0 5
	 4325 924 4335 1043 4687 981 4682 872 4325 924
4 1 7 50 0 18 1 0.1745 4 30 375 4511 1002 Minerva Networks\001
4 1 7 50 0 18 1 0.1745 4 30 90 4511 955 VNP\001
-6
# Laptop computer
6 2175 750 2582 1084
6 2303 921 2491 965
1 1 0 1 -1 39 0 0 40 0.000 1 0.0000 2314 927 11 6 2314 927 2325 932
1 1 0 1 -1 39 0 0 40 0.000 1 0.0000 2358 936 11 6 2358 936 2369 941
1 1 0 1 -1 39 0 0 40 0.000 1 0.0000 2337 931 11 6 2337 931 2347 936
1 1 0 1 -1 39 0 0 40 0.000 1 0.0000 2379 940 11 6 2379 940 2389 945
1 1 0 1 -1 39 0 0 40 0.000 1 0.0000 2398 944 11 6 2398 944 2409 949
1 1 0 1 -1 39 0 0 40 0.000 1 0.0000 2419 948 11 6 2419 948 2430 954
1 1 0 1 -1 39 0 0 40 0.000 1 0.0000 2440 951 11 6 2440 951 2451 957
1 1 0 1 -1 39 0 0 40 0.000 1 0.0000 2461 956 11 6 2461 956 2472 961
1 1 0 1 -1 39 0 0 40 0.000 1 0.0000 2481 960 11 6 2481 960 2491 965
-6
6 2273 940 2461 984
1 1 0 1 -1 39 0 0 40 0.000 1 0.0000 2284 946 11 6 2284 946 2294 951
1 1 0 1 -1 39 0 0 40 0.000 1 0.0000 2328 954 11 6 2328 954 2339 959
1 1 0 1 -1 39 0 0 40 0.000 1 0.0000 2307 950 11 6 2307 950 2317 955
1 1 0 1 -1 39 0 0 40 0.000 1 0.0000 2348 958 11 6 2348 958 2359 963
1 1 0 1 -1 39 0 0 40 0.000 1 0.0000 2368 963 11 6 2368 963 2379 968
1 1 0 1 -1 39 0 0 40 0.000 1 0.0000 2389 967 11 6 2389 967 2400 972
1 1 0 1 -1 39 0 0 40 0.000 1 0.0000 2410 970 11 6 2410 970 2420 975
1 1 0 1 -1 39 0 0 40 0.000 1 0.0000 2431 974 11 6 2431 974 2442 980
1 1 0 1 -1 39 0 0 40 0.000 1 0.0000 2451 978 11 6 2451 978 2461 984
-6
6 2288 931 2477 974
1 1 0 1 -1 39 0 0 40 0.000 1 0.0000 2299 936 11 6 2299 936 2310 941
1 1 0 1 -1 39 0 0 40 0.000 1 0.0000 2344 944 11 6 2344 944 2354 950
1 1 0 1 -1 39 0 0 40 0.000 1 0.0000 2322 940 11 6 2322 940 2332 946
1 1 0 1 -1 39 0 0 40 0.000 1 0.0000 2364 949 11 6 2364 949 2375 954
1 1 0 1 -1 39 0 0 40 0.000 1 0.0000 2383 953 11 6 2383 953 2394 958
1 1 0 1 -1 39 0 0 40 0.000 1 0.0000 2405 957 11 6 2405 957 2415 963
1 1 0 1 -1 39 0 0 40 0.000 1 0.0000 2425 961 11 6 2425 961 2436 966
1 1 0 1 -1 39 0 0 40 0.000 1 0.0000 2446 965 11 6 2446 965 2457 970
1 1 0 1 -1 39 0 0 40 0.000 1 0.0000 2466 969 11 6 2466 969 2477 974
-6
6 2257 948 2445 993
1 1 0 1 -1 39 0 0 40 0.000 1 0.0000 2268 954 11 6 2268 954 2278 959
1 1 0 1 -1 39 0 0 40 0.000 1 0.0000 2312 963 11 6 2312 963 2323 968
1 1 0 1 -1 39 0 0 40 0.000 1 0.0000 2290 958 11 6 2290 958 2301 963
1 1 0 1 -1 39 0 0 40 0.000 1 0.0000 2332 967 11 6 2332 967 2343 972
1 1 0 1 -1 39 0 0 40 0.000 1 0.0000 2352 971 11 6 2352 971 2363 976
1 1 0 1 -1 39 0 0 40 0.000 1 0.0000 2373 975 11 6 2373 975 2384 981
1 1 0 1 -1 39 0 0 40 0.000 1 0.0000 2394 978 11 6 2394 978 2404 984
1 1 0 1 -1 39 0 0 40 0.000 1 0.0000 2415 983 11 6 2415 983 2425 988
1 1 0 1 -1 39 0 0 40 0.000 1 0.0000 2434 987 11 6 2434 987 2445 993
-6
1 1 0 1 -1 7 0 0 10 0.000 1 0.0000 2309 1018 7 8 2309 1018 2316 1025
1 1 0 1 -1 7 0 0 10 0.000 1 0.0000 2292 1012 7 8 2292 1012 2300 1020
2 1 0 3 -1 7 0 0 -1 0.000 0 0 -1 0 0 3
	 2357 873 2389 777 2539 788
2 3 0 1 -1 7 0 0 20 0.000 0 0 -1 0 0 5
	 2539 788 2512 895 2357 873 2389 777 2539 788
2 3 0 1 -1 7 1 0 20 0.000 0 0 -1 0 0 7
	 2373 761 2325 889 2528 916 2555 831 2550 815 2560 772
	 2373 761
2 1 0 1 -1 7 1 0 -1 0.000 0 0 -1 0 0 2
	 2533 921 2576 766
2 1 0 1 -1 7 1 0 -1 0.000 0 0 -1 0 0 2
	 2555 825 2571 761
2 3 0 1 -1 7 2 0 10 0.000 0 0 -1 0 0 8
	 2565 756 2550 815 2555 831 2528 916 2539 927 2582 772
	 2576 761 2565 756
2 3 0 1 -1 7 1 0 20 0.000 0 0 -1 0 0 5
	 2367 756 2367 750 2449 752 2444 759 2367 756
2 3 0 1 -1 7 1 0 20 0.000 0 0 -1 0 0 5
	 2564 757 2476 753 2476 760 2563 764 2564 757
2 3 0 1 -1 7 1 0 0 0.000 0 0 -1 0 0 6
	 2451 751 2444 758 2445 765 2474 768 2476 754 2451 751
2 3 0 1 -1 7 3 0 10 0.000 0 0 -1 0 0 5
	 2373 761 2367 756 2565 761 2560 772 2373 761
2 3 0 1 -1 7 2 0 10 0.000 0 0 -1 0 0 6
	 2373 761 2367 756 2351 793 2357 804 2325 884 2373 761
2 3 0 1 -1 7 0 0 10 0.000 0 0 -1 0 0 5
	 2292 1002 2325 1012 2341 997 2309 986 2292 1002
2 3 0 1 -1 7 3 0 20 0.000 0 0 -1 0 0 5
	 2234 969 2442 1018 2400 1055 2186 997 2234 969
2 3 0 1 -1 7 1 0 10 0.000 0 0 -1 0 0 5
	 2229 969 2234 959 2448 1007 2442 1018 2229 969
2 3 0 1 -1 7 1 0 10 0.000 0 0 -1 0 0 5
	 2319 916 2319 921 2501 954 2501 948 2319 916
2 3 0 1 -1 7 1 0 10 0.000 0 0 -1 0 0 4
	 2442 997 2496 959 2442 1002 2442 997
2 3 0 1 -1 7 1 0 10 0.000 0 0 -1 0 0 5
	 2400 1066 2400 1082 2175 1018 2175 1002 2400 1066
2 3 0 1 -1 7 1 0 10 0.000 0 0 -1 0 0 5
	 2186 997 2186 1002 2400 1061 2400 1055 2186 997
2 3 0 1 -1 7 3 0 20 0.000 0 0 -1 0 0 6
	 2234 969 2229 969 2175 997 2175 1002 2186 1002 2234 969
2 3 0 1 -1 -1 0 0 20 0.000 0 0 -1 0 0 5
	 2448 1018 2507 969 2507 975 2448 1023 2448 1018
2 3 0 1 -1 -1 1 0 20 0.000 0 0 -1 0 0 5
	 2400 1066 2400 1061 2186 1002 2175 1002 2400 1066
2 3 0 1 -1 7 1 0 10 0.000 0 0 -1 0 0 5
	 2400 1055 2400 1082 2512 980 2512 959 2400 1055
2 3 0 1 -1 7 1 0 10 0.000 0 0 -1 0 0 5
	 2244 954 2244 959 2442 1002 2442 997 2244 954
2 3 0 1 -1 39 3 0 20 0.000 0 0 -1 0 0 6
	 2245 952 2312 921 2499 955 2443 996 2246 953 2245 952
2 3 0 1 -1 7 4 0 20 0.000 0 0 -1 0 0 6
	 2234 959 2314 921 2512 954 2512 959 2442 1018 2234 959
2 3 0 1 -1 7 1 0 20 0.000 0 0 -1 0 0 7
	 2346 895 2341 900 2512 927 2517 921 2512 916 2346 889
	 2346 895
2 3 0 1 -1 7 3 0 10 0.000 0 0 -1 0 0 5
	 2325 889 2341 895 2539 927 2528 916 2325 889
2 1 0 1 -1 7 1 0 -1 0.000 0 0 -1 0 0 2
	 2335 911 2491 932
2 1 0 1 -1 7 1 0 -1 0.000 0 0 -1 0 0 3
	 2491 932 2507 932 2512 932
2 1 0 1 -1 7 1 0 -1 0.000 0 0 -1 0 0 2
	 2335 916 2491 938
2 1 0 1 -1 7 1 0 -1 0.000 0 0 -1 0 0 4
	 2437 932 2432 932 2485 943 2496 938
2 3 0 1 -1 7 3 0 20 0.000 0 0 -1 0 0 8
	 2341 900 2335 911 2319 916 2501 948 2523 932 2512 932
	 2512 927 2341 900
2 3 0 1 -1 7 4 0 10 0.000 0 0 -1 0 0 7
	 2501 954 2501 943 2523 932 2533 938 2533 969 2512 975
	 2501 954
3 0 0 1 -1 7 3 0 -1 0.000 0 0 0 4
	 2367 906 2362 906 2362 911 2362 916
	 0.000 1.000 1.000 0.000
3 0 0 1 -1 7 3 0 -1 0.000 0 0 0 3
	 2341 900 2335 906 2335 916
	 0.000 1.000 0.000
3 0 0 1 -1 7 3 0 -1 0.000 0 0 0 4
	 2394 911 2389 911 2389 916 2389 921
	 0.000 1.000 1.000 0.000
3 0 0 1 -1 7 3 0 -1 0.000 0 0 0 4
	 2437 916 2432 916 2432 921 2432 927
	 0.000 1.000 1.000 0.000
-6
6 3540 1691 3722 1873
2 1 0 2 0 7 50 -1 -1 0.000 0 0 -1 0 0 2
	 3570 1721 3691 1842
2 1 0 2 0 7 50 -1 -1 0.000 0 0 -1 0 0 2
	 3570 1842 3691 1721
-6
2 1 1 1 0 7 50 -1 -1 4.000 0 0 -1 1 0 2
	0 0 1.00 24.26 48.53
	 2448 1145 4419 1387
2 1 1 1 0 7 50 -1 -1 4.000 0 0 -1 1 0 2
	0 0 1.00 24.26 48.53
	 4419 1418 2448 1600
2 1 1 1 0 7 50 -1 -1 4.000 0 0 -1 1 0 2
	0 0 1.00 24.26 48.53
	 2448 1842 4419 2115
2 1 1 1 0 7 50 -1 -1 4.000 0 0 -1 1 0 2
	0 0 1.00 24.26 48.53
	 2448 1630 3600 1782
2 1 1 1 0 7 50 -1 -1 4.000 0 0 -1 1 0 2
	0 0 1.00 24.26 48.53
	 2449 2435 4421 2708
2 1 1 1 0 7 50 -1 -1 4.000 0 0 -1 1 0 2
	0 0 1.00 24.26 48.53
	 2450 2769 4421 3042
2 2 0 1 0 7 50 -1 -1 0.000 0 0 -1 0 0 5
	 2326 1114 2448 1114 2448 3450 2326 3450 2326 1114
2 2 0 1 0 7 50 -1 -1 0.000 0 0 -1 0 0 5
	 4419 1114 4571 1114 4571 3450 4419 3450 4419 1114
2 1 1 1 0 7 50 -1 -1 4.000 0 0 -1 1 0 2
	0 0 1.00 24.26 48.53
	 4416 2153 2445 2401
2 1 1 1 0 7 50 -1 -1 4.000 0 0 -1 1 0 2
	0 0 1.00 24.26 48.53
	 4418 3078 2447 3326
4 0 0 50 -1 0 5 0.0000 4 52 457 3904 1478 IDENT ACK 0\001
4 0 0 50 -1 0 5 0.0000 4 52 217 2508 1205 IDENT\001
4 0 0 50 -1 0 5 0.0000 4 52 262 2599 1691 DATA 1\001
4 0 0 50 -1 0 5 0.0000 4 52 262 2599 1903 DATA 2\001
4 0 0 50 -1 0 5 0.0000 4 52 217 4116 2206 ACK 0\001
4 0 0 50 -1 0 5 0.0000 4 52 262 2599 2813 DATA 2\001
4 0 0 50 -1 0 5 0.0000 4 52 262 2599 2510 DATA 1\001
4 0 0 50 -1 0 5 0.0000 4 52 217 4086 3117 ACK 2\001
-6
