#FIG 3.2
Landscape
Center
Inches
Letter  
100.00
Single
-2
1200 2
6 5100 5025 7200 5625
2 2 0 1 0 7 50 -1 -1 4.000 0 0 -1 0 0 5
	 5100 5025 7200 5025 7200 5625 5100 5625 5100 5025
4 0 0 50 -1 0 12 0.0000 4 135 765 5700 5400 Kalibrerer\001
-6
6 5100 3675 7200 4275
2 2 0 1 0 7 50 -1 -1 4.000 0 0 -1 0 0 5
	 5100 3675 7200 3675 7200 4275 5100 4275 5100 3675
4 0 0 50 -1 0 12 0.0000 4 180 1410 5400 3900 Find alle 2D og 3D\001
4 0 0 50 -1 0 12 0.0000 4 180 555 5775 4125 punkter\001
-6
6 5175 2250 7050 2925
2 4 0 1 0 7 50 -1 -1 4.000 0 0 7 0 0 5
	 7050 2925 7050 2250 5175 2250 5175 2925 7050 2925
4 0 0 50 -1 0 12 0.0000 4 135 600 5775 2475 START\001
4 0 0 50 -1 0 12 0.0000 4 180 840 5625 2775 Kalibrering\001
-6
2 4 0 1 0 7 50 -1 -1 4.000 0 0 7 0 0 5
	 7050 6900 7050 6225 5175 6225 5175 6900 7050 6900
2 1 0 1 0 7 50 -1 -1 4.000 0 0 -1 1 0 2
	1 1 1.00 60.00 120.00
	 6075 3000 6075 3600
2 1 0 1 0 7 50 -1 -1 4.000 0 0 -1 1 0 2
	1 1 1.00 60.00 120.00
	 6075 4350 6075 5025
2 1 0 1 0 7 50 -1 -1 4.000 0 0 -1 1 0 2
	1 1 1.00 60.00 120.00
	 6075 5700 6075 6225
4 0 0 50 -1 0 12 0.0000 4 135 480 5775 6600 SLUT\001
