#FIG 3.2
Portrait
Center
Inches
Letter  
100.00
Single
-2
1200 2
6 3750 2700 8325 5611
6 5466 2700 6245 3428
1 4 0 1 0 7 50 -1 -1 4.000 1 0.0000 5855 3080 339 339 5518 3064 6194 3095
4 0 0 55 -1 2 9 0.0000 4 110 189 5726 3115 CS\001
-6
2 4 0 1 0 7 50 -1 -1 4.000 0 0 5 0 0 5
	 6557 4728 6557 4000 5154 4000 5154 4728 6557 4728
2 1 0 1 0 7 50 -1 -1 0.000 0 0 -1 1 0 2
	2 1 1.00 41.59 83.18
	 5830 3896 5830 3479
2 1 1 1 0 7 50 -1 -1 4.000 0 0 -1 0 0 3
	 6609 4364 5830 4364 5830 3947
2 1 0 1 0 7 50 -1 -1 0.000 0 0 -1 1 0 3
	2 1 1.00 41.59 83.18
	 7806 5039 7806 4364 6713 4364
3 2 0 1 0 7 50 -1 -1 4.000 0 0 0 4
	 3854 5143 3958 5299 3802 5455 3906 5611
	 0.000 -1.000 -1.000 0.000
3 2 0 1 0 7 50 -1 -1 4.000 0 0 0 4
	 7806 5143 7701 5299 7857 5455 7753 5611
	 0.000 -1.000 -1.000 0.000
4 0 0 50 -1 0 8 0.0000 4 125 944 5985 3792 Adgangs rettighed\001
4 0 0 50 -1 0 8 0.0000 4 94 346 4062 5507 Tr\345d 1\001
4 0 0 50 -1 0 8 0.0000 4 94 346 7961 5507 Tr\345d 2\001
4 0 0 50 -1 0 9 0.0000 4 141 960 5362 4623 Mutex_variable\001
-6
