#FIG 3.2
Portrait
Center
Inches
Letter  
100.00
Single
-2
1200 2
6 3503 1800 8100 4725
6 5227 1800 6010 2532
1 4 0 1 0 7 50 -1 -1 4.000 1 0.0000 5619 2181 341 341 5280 2166 5959 2197
4 0 0 55 -1 2 10 0.0000 4 101 201 5488 2218 CS\001
-6
2 4 0 1 0 7 50 -1 -1 4.000 0 0 5 0 0 5
	 6323 3837 6323 3105 4914 3105 4914 3837 6323 3837
2 1 0 1 0 7 50 -1 -1 0.000 0 0 -1 1 0 2
	2 1 1.00 41.79 83.57
	 5593 3001 5593 2583
2 1 0 1 0 7 50 -1 -1 0.000 0 0 -1 1 0 3
	2 1 1.00 41.79 83.57
	 3607 4150 3607 3471 4705 3471
2 1 0 1 0 7 50 -1 -1 0.000 0 0 -1 0 0 3
	 7578 4150 7578 3471 6481 3471
2 1 0 2 0 7 50 -1 -1 6.000 0 0 -1 0 0 2
	 6481 3367 6481 3576
2 1 1 1 0 7 50 -1 -1 4.000 0 0 -1 0 0 3
	 4809 3471 5593 3471 5593 3054
3 2 0 1 0 7 50 -1 -1 4.000 0 0 0 4
	 3607 4255 3712 4412 3556 4568 3660 4725
	 0.000 -1.000 -1.000 0.000
3 2 0 1 0 7 50 -1 -1 4.000 0 0 0 4
	 7578 4255 7473 4412 7630 4568 7525 4725
	 0.000 -1.000 -1.000 0.000
4 0 0 50 -1 0 9 0.0000 4 130 1034 5749 2897 Adgangs rettighed\001
4 0 0 50 -1 0 9 0.0000 4 144 359 3816 4621 Tr\345d 1\001
4 0 0 50 -1 0 9 0.0000 4 144 359 7734 4621 Tr\345d 2\001
4 0 0 50 -1 0 10 0.0000 4 130 948 5122 3733 Mutex_variable\001
4 0 0 50 -1 0 9 0.0000 4 101 474 6638 3680 Blokeret\001
-6
