#FIG 3.2
Landscape
Center
Metric
A4      
100.00
Single
-2
1200 2
2 1 0 1 0 7 50 0 -1 0.000 0 0 -1 0 0 2
	 1350 1215 4086 1215
2 1 0 1 0 7 50 0 -1 0.000 0 0 -1 0 0 2
	 1350 1440 4086 1440
2 2 0 1 0 7 51 0 20 0.000 0 0 -1 0 0 5
	 1350 990 4095 990 4095 1665 1350 1665 1350 990
4 0 0 50 0 2 10 0.0000 4 105 660 1493 1170 Am186ER\001
4 0 0 50 -1 0 10 0.0000 4 135 2640 1398 1350 +PCB: PeripheralControlBlock <<static>>\001
4 0 0 50 -1 0 10 0.0000 4 135 1560 1398 1575 +Am186ER() <<create>>\001
