#FIG 3.2
Landscape
Center
Inches
Letter  
100.00
Single
-2
1200 2
0 32 #8e8e8e
6 5550 1275 8025 2925
2 1 0 1 0 7 100 0 -1 0.000 0 0 -1 0 0 2
	 5550 1650 8025 1650
2 1 0 1 0 7 100 0 -1 0.000 0 0 -1 0 0 2
	 5550 1725 8025 1725
2 2 0 1 0 7 101 0 20 4.000 0 0 7 0 0 5
	 5550 1326 8025 1326 8025 2925 5550 2925 5550 1326
4 0 0 100 0 18 12 0.0000 4 135 420 6525 1575 Main\001
4 0 0 100 -1 16 12 0.0000 4 180 1500 5625 1950 +main(args) : void\001
4 0 0 100 -1 16 12 0.0000 4 180 1425 5625 2175 +suite():TestSuite\001
4 0 0 100 -1 16 12 0.0000 4 180 1620 5625 2400 -ReadData():Vector\001
4 0 0 100 -1 16 12 0.0000 4 180 1740 5625 2625 -GetFile(file):TextFile\001
-6
6 8325 2025 10725 2550
2 1 0 1 0 0 100 -1 20 0.000 0 0 -1 0 0 3
	 10500 2025 10500 2250 10725 2250
2 3 0 1 0 7 50 -1 -1 0.000 0 0 -1 0 0 6
	 10500 2025 8325 2025 8325 2550 10725 2550 10725 2250 10500 2025
4 0 0 100 0 16 12 0.0000 4 135 1920 8475 2325 Alle funktioner er static\001
-6
6 7575 6375 10275 7725
2 1 0 1 0 7 50 -1 -1 0.000 0 0 -1 0 0 2
	 7575 6675 10275 6675
2 1 0 1 0 7 50 -1 -1 0.000 0 0 -1 0 0 2
	 7575 6750 10275 6750
2 2 0 1 0 7 50 -1 -1 0.000 0 0 -1 0 0 5
	 7575 6375 10275 6375 10275 7725 7575 7725 7575 6375
4 0 0 50 -1 16 12 0.0000 4 180 1095 7650 6975 +setUp():void\001
4 0 0 50 -1 16 12 0.0000 4 180 2370 7650 7200 +testFailureToOpenFile:void\001
4 0 0 50 -1 16 12 0.0000 4 180 2565 7650 7425 +testSuccesfullOpenFile():void\001
4 0 0 50 -1 18 12 0.0000 4 135 810 8550 6600 TextTest\001
-6
6 4125 6600 6525 8550
6 4200 7275 5625 8400
4 0 0 50 -1 16 12 0.0000 4 180 1095 4200 7425 +setUp():void\001
4 0 0 50 -1 16 12 0.0000 4 180 1275 4200 7650 +testSize():void\001
4 0 0 50 -1 16 12 0.0000 4 180 1395 4200 7875 +testMean():void\001
4 0 0 50 -1 16 12 0.0000 4 180 1275 4200 8100 +testMax():void\001
4 0 0 50 -1 16 12 0.0000 4 180 1230 4200 8325 +testMin():void\001
-6
2 1 0 1 0 7 50 -1 -1 0.000 0 0 -1 0 0 2
	 4125 6900 6525 6900
2 2 0 1 0 7 50 -1 -1 0.000 0 0 -1 0 0 5
	 4125 6600 6525 6600 6525 8550 4125 8550 4125 6600
2 1 0 1 0 7 50 -1 -1 0.000 0 0 -1 0 0 2
	 4125 7200 6525 7200
4 0 0 50 -1 18 12 0.0000 4 135 855 4875 6825 MathTest\001
4 0 0 50 -1 16 12 0.0000 4 135 1005 4200 7125 -mt:MathList\001
-6
1 3 0 1 0 7 100 -1 20 0.000 1 0.0000 7575 1500 75 75 7575 1500 7650 1500
2 1 1 1 0 7 101 -1 -1 8.000 0 0 -1 1 0 2
	0 0 1.00 60.00 120.00
	 7875 2925 7875 3750
2 1 1 1 0 7 101 -1 -1 8.000 0 0 -1 1 0 2
	0 0 1.00 60.00 120.00
	 5775 2925 5775 3825
2 1 0 1 0 7 100 0 -1 0.000 0 0 -1 0 0 2
	 7575 4050 9975 4050
2 1 0 1 0 7 100 0 -1 0.000 0 0 -1 0 0 2
	 7575 4650 9975 4650
2 1 1 1 0 7 50 -1 -1 8.000 0 0 -1 1 0 2
	0 0 1.00 60.00 120.00
	 8700 6375 8700 5700
2 1 0 1 0 7 100 0 -1 0.000 0 0 -1 0 0 2
	 4125 4125 6525 4125
2 1 0 1 0 7 100 0 -1 0.000 0 0 -1 0 0 2
	 4125 4500 6525 4500
2 2 0 1 0 7 101 0 20 0.000 0 0 7 0 0 5
	 4125 3825 6525 3825 6525 6000 4125 6000 4125 3825
2 1 1 1 0 7 50 -1 -1 8.000 0 0 -1 1 0 2
	0 0 1.00 60.00 120.00
	 5325 6600 5325 6000
2 2 0 1 0 7 101 0 20 4.000 0 0 7 0 0 5
	 7575 3750 9975 3750 9975 5700 7575 5700 7575 3750
3 2 0 1 0 7 101 -1 -1 0.000 0 0 0 3
	 7575 1500 8700 1575 9600 2025
	 0.000 -1.000 0.000
4 0 0 100 0 18 12 0.0000 4 135 705 8400 3975 TextFile\001
4 0 0 100 -1 16 12 0.0000 4 180 2055 7650 4275 -stToken:StringTokenizer\001
4 0 0 100 -1 16 12 0.0000 4 135 1890 7650 4500 -brFile:BufferedReader\001
4 0 0 100 -1 16 12 0.0000 4 180 1125 7650 4875 +TextFile(file)\001
4 0 0 100 -1 16 12 0.0000 4 180 1845 7650 5100 +readDouble():Double\001
4 0 0 100 0 18 12 0.0000 4 135 780 4950 4050 MathList\001
4 0 0 100 -1 16 12 0.0000 4 165 1620 4200 4350 -m_numbers:Vector\001
4 0 0 100 -1 16 12 0.0000 4 180 1860 4200 4725 +MathList(list:double[])\001
4 0 0 100 -1 16 12 0.0000 4 180 1755 4200 4950 +MathList(list:Vector)\001
4 0 0 100 -1 16 12 0.0000 4 180 1125 4200 5175 +min():double\001
4 0 0 100 -1 16 12 0.0000 4 180 1170 4200 5400 +max():double\001
4 0 0 100 -1 16 12 0.0000 4 180 1290 4200 5625 +mean():double\001
4 0 0 100 -1 16 12 0.0000 4 180 795 4200 5850 +size():int\001
4 0 0 100 -1 16 12 0.0000 4 180 1335 7650 5325 +EOF():boolean\001
4 0 0 100 -1 16 12 0.0000 4 180 1170 7650 5550 -refresh():void\001
