#FIG 3.2
Landscape
Center
Inches
A4      
100.00
Single
-2
1200 2
6 525 675 7650 9600
2 2 0 1 0 7 50 -1 -1 4.000 0 0 -1 0 0 5
	 525 675 7650 675 7650 9600 525 9600 525 675
4 0 0 50 -1 0 13 0.0000 4 180 1556 3146 993 Maskine A (Server)\001
-6
6 8400 675 12150 9600
2 2 0 1 0 7 52 -1 -1 0.000 0 0 -1 0 0 5
	 8400 675 12150 675 12150 9600 8400 9600 8400 675
4 1 0 52 -1 0 12 0.0000 4 159 1327 10275 1016 Maskine B (Klient)\001
-6
6 675 1125 7200 6525
6 675 4800 2100 5625
2 1 0 1 0 7 50 -1 -1 0.000 0 0 -1 0 0 2
	 675 5325 2100 5325
2 2 0 1 0 7 50 -1 -1 4.000 0 0 -1 0 0 5
	 675 4800 2100 4800 2100 5625 675 5625 675 4800
4 1 0 50 0 2 10 0.0000 4 120 900 1350 5025 <<interface>>\001
4 1 0 50 0 2 10 0.0000 4 105 465 1350 5250 ServerI\001
-6
6 2850 3750 4800 6525
6 3075 4350 4575 6375
4 0 0 50 -1 0 10 0.0000 4 135 1050 3075 4500 +getTtemp() : Int\001
4 0 0 50 -1 0 10 0.0000 4 135 1230 3075 4725 +getTempMax(): Int\001
4 0 0 50 -1 0 10 0.0000 4 135 1215 3075 4950 +getTempMin(): Int\001
4 0 0 50 -1 0 10 0.0000 4 135 1170 3075 5175 +getWinState(): Int\001
4 0 0 50 -1 0 10 0.0000 4 135 1200 3075 5400 +getAutomata(): Int\001
4 0 0 50 -1 0 10 0.0000 4 135 1050 3075 5625 +setTemp(): void\001
4 0 0 50 -1 0 10 0.0000 4 135 1260 3075 5850 +setWinState(): void\001
4 0 0 50 -1 0 10 0.0000 4 135 1290 3075 6075 +setAutomata(): void\001
4 0 0 50 -1 0 10 0.0000 4 135 1455 3075 6300 +receiveMessage(): void\001
-6
2 1 0 1 0 7 50 0 -1 0.000 0 0 -1 0 0 2
	 2865 3975 4800 3975
2 1 0 1 0 7 50 0 -1 0.000 0 0 -1 0 0 2
	 2850 4275 4800 4275
2 2 0 1 0 7 51 0 20 0.000 0 0 -1 0 0 5
	 2865 3750 4800 3750 4800 6525 2865 6525 2865 3750
4 1 0 50 0 2 10 0.0000 4 150 720 3825 3900 ServerImpl\001
-6
6 5850 1350 7200 2325
2 1 0 1 0 7 50 0 -1 0.000 0 0 -1 0 0 2
	 5865 1575 7200 1575
2 1 0 1 0 7 50 0 -1 0.000 0 0 -1 0 0 2
	 5850 1875 7200 1875
2 2 0 1 0 7 51 0 20 0.000 0 0 -1 0 0 5
	 5850 1350 7200 1350 7200 2325 5850 2325 5850 1350
4 1 0 50 0 2 10 0.0000 4 105 630 6525 1500 MPServer\001
-6
6 675 1125 2100 1950
2 1 0 1 0 7 50 -1 -1 0.000 0 0 -1 0 0 2
	 675 1650 2100 1650
2 2 0 1 0 7 50 -1 -1 4.000 0 0 -1 0 0 5
	 675 1125 2100 1125 2100 1950 675 1950 675 1125
4 1 0 50 0 2 10 0.0000 4 120 900 1350 1350 <<interface>>\001
4 1 0 50 0 2 10 0.0000 4 120 810 1350 1575 HeadServerI\001
-6
6 2925 1275 4800 2700
2 1 0 1 0 7 50 0 -1 0.000 0 0 -1 0 0 2
	 2940 1500 4800 1500
2 1 0 1 0 7 50 0 -1 0.000 0 0 -1 0 0 2
	 2925 1800 4800 1800
2 2 0 1 0 7 51 0 20 0.000 0 0 -1 0 0 5
	 2940 1275 4800 1275 4800 2700 2940 2700 2940 1275
4 1 0 50 0 2 10 0.0000 4 120 750 3825 1425 HeadServer\001
4 0 0 50 -1 0 10 0.0000 4 135 1065 3150 2025 +GHCount() : Int\001
4 0 0 50 -1 0 10 0.0000 4 135 1230 3150 2250 +getIDList(): Vector\001
4 0 0 50 -1 0 10 0.0000 4 135 1455 3150 2475 +receiveMessage(): void\001
-6
6 1350 5625 2850 6300
2 1 0 1 0 7 52 -1 -1 0.000 0 0 -1 0 0 3
	 1350 5625 1350 6075 2850 6075
4 1 0 52 -1 0 12 0.0000 4 135 90 1425 5850 1\001
4 1 0 52 -1 0 12 0.0000 4 135 90 2700 6300 1\001
-6
6 1350 1950 2925 2550
2 1 0 1 0 7 52 -1 -1 4.000 0 0 -1 0 0 3
	 1350 1950 1350 2325 2925 2325
4 1 0 52 -1 0 12 0.0000 4 135 90 1425 2175 1\001
4 1 0 52 -1 0 12 0.0000 4 135 90 2775 2550 1\001
-6
6 4800 1725 5850 2175
2 1 0 1 0 7 52 -1 -1 4.000 0 0 -1 0 0 2
	 4800 1950 5850 1950
4 1 0 52 -1 0 12 0.0000 4 135 90 4875 1875 1\001
4 1 0 52 -1 0 12 0.0000 4 135 90 5700 2175 1\001
-6
6 3600 2700 3975 3750
2 1 0 1 0 7 52 -1 -1 0.000 0 0 -1 0 0 2
	 3825 2700 3825 3750
4 1 0 52 -1 0 12 0.0000 4 135 90 3900 2925 1\001
4 1 0 52 -1 0 12 0.0000 4 75 90 3675 3675 *\001
-6
-6
6 750 5625 7200 9450
6 2925 8475 4800 9450
2 1 0 1 0 7 50 0 -1 0.000 0 0 -1 0 0 2
	 2940 8700 4800 8700
2 1 0 1 0 7 50 0 -1 0.000 0 0 -1 0 0 2
	 2925 9000 4800 9000
2 2 0 1 0 7 51 0 20 0.000 0 0 -1 0 0 5
	 2925 8475 4800 8475 4800 9450 2925 9450 2925 8475
4 1 0 50 0 2 10 0.0000 4 120 1020 3825 8625 MultWebServer\001
-6
6 5550 5625 7200 8400
6 5625 6225 7050 8250
4 0 0 50 -1 0 10 0.0000 4 135 1140 5625 6375 +printText() : void\001
4 0 0 50 -1 0 10 0.0000 4 135 1365 5625 6600 +BindServer(): ServerI\001
4 0 0 50 -1 0 10 0.0000 4 135 1290 5625 7275 -SetWinState(): void\001
4 0 0 50 -1 0 10 0.0000 4 135 1410 5625 7050 -UpdateGHList(): void\001
4 0 0 50 -1 0 10 0.0000 4 135 1425 5625 6825 -SetTempLimit(): void\001
4 0 0 50 -1 0 10 0.0000 4 135 1305 5625 7500 -GetWinState(): void\001
4 0 0 50 -1 0 10 0.0000 4 135 1080 5625 7725 -SetTemp(): void\001
4 0 0 50 -1 0 10 0.0000 4 135 1095 5625 7950 -GetTemp(): void\001
4 0 0 50 -1 0 10 0.0000 4 135 1035 5625 8175 -SetAuto(): void\001
-6
2 1 0 1 0 7 50 0 -1 0.000 0 0 -1 0 0 2
	 5563 5850 7200 5850
2 1 0 1 0 7 50 0 -1 0.000 0 0 -1 0 0 2
	 5550 6150 7200 6150
2 2 0 1 0 7 51 0 20 0.000 0 0 -1 0 0 5
	 5563 5625 7200 5625 7200 8400 5563 8400 5563 5625
4 1 0 50 0 2 10 0.0000 4 150 825 6375 5775 ClientApplet\001
-6
6 2175 7350 5550 7950
2 1 0 1 0 7 52 -1 -1 4.000 0 0 -1 0 0 2
	 2175 7650 5550 7650
4 1 0 52 -1 0 12 0.0000 4 135 90 2250 7500 1\001
4 1 0 52 -1 0 12 0.0000 4 135 90 5400 7950 1\001
-6
6 1425 8025 2925 9300
2 1 0 1 0 7 52 -1 -1 4.000 0 0 -1 0 0 3
	 1425 8025 1425 9075 2925 9075
4 1 0 52 -1 0 12 0.0000 4 135 90 2775 9300 1\001
4 1 0 52 -1 0 12 0.0000 4 75 90 1500 8250 *\001
-6
6 750 7050 2175 8025
2 1 0 1 0 7 50 0 -1 0.000 0 0 -1 0 0 2
	 765 7275 2175 7275
2 1 0 1 0 7 50 0 -1 0.000 0 0 -1 0 0 2
	 750 7575 2175 7575
2 2 0 1 0 7 51 0 20 0.000 0 0 -1 0 0 5
	 750 7050 2175 7050 2175 8025 750 8025 750 7050
4 1 0 50 0 2 10 0.0000 4 135 810 1500 7200 HttpRequest\001
-6
-6
6 4800 1425 11175 9150
6 9225 1500 11175 4350
6 9450 2250 10875 4275
4 0 0 50 -1 0 10 0.0000 4 135 1140 9450 2400 +printText() : void\001
4 0 0 50 -1 0 10 0.0000 4 135 1365 9450 2625 +BindServer(): ServerI\001
4 0 0 50 -1 0 10 0.0000 4 135 1290 9450 3300 -SetWinState(): void\001
4 0 0 50 -1 0 10 0.0000 4 135 1410 9450 3075 -UpdateGHList(): void\001
4 0 0 50 -1 0 10 0.0000 4 135 1425 9450 2850 -SetTempLimit(): void\001
4 0 0 50 -1 0 10 0.0000 4 135 1305 9450 3525 -GetWinState(): void\001
4 0 0 50 -1 0 10 0.0000 4 135 1080 9450 3750 -SetTemp(): void\001
4 0 0 50 -1 0 10 0.0000 4 135 1095 9450 3975 -GetTemp(): void\001
4 0 0 50 -1 0 10 0.0000 4 135 1035 9450 4200 -SetAuto(): void\001
-6
6 9225 1500 11175 4350
2 2 1 1 0 7 52 -1 -1 4.000 0 0 -1 0 0 5
	 9225 1500 11175 1500 11175 4350 9225 4350 9225 1500
2 1 1 1 0 7 52 -1 -1 4.000 0 0 -1 0 0 2
	 9225 1800 11175 1800
2 1 1 1 0 7 52 -1 -1 4.000 0 0 -1 0 0 2
	 9225 2100 11175 2100
4 1 0 50 0 2 10 0.0000 4 150 825 10200 1650 ClientApplet\001
-6
-6
6 9225 6600 11100 7350
2 2 0 1 0 7 52 -1 -1 4.000 0 0 -1 0 0 5
	 9225 6600 11100 6600 11100 7350 9225 7350 9225 6600
2 1 0 1 0 7 52 -1 -1 0.000 0 0 -1 0 0 2
	 9225 6900 11100 6900
4 1 0 50 0 2 10 0.0000 4 120 1290 10125 6825 HTTP WebBrowser\001
-6
6 7200 1425 9225 3825
3 2 1 1 0 7 52 -1 -1 4.000 0 1 1 4
	2 1 1.00 60.00 120.00
	2 1 1.00 60.00 120.00
	 7200 1725 8100 2100 8175 3150 9225 3600
	 0.000 -1.000 -1.000 0.000
4 1 0 52 -1 0 12 0.0000 4 135 90 7350 1575 1\001
4 1 0 52 -1 0 12 0.0000 4 75 90 9000 3825 *\001
-6
6 10200 4350 10350 6600
2 1 0 1 0 7 52 -1 -1 0.000 0 0 -1 0 0 2
	 10200 6600 10200 4350
4 1 0 52 -1 0 12 0.0000 4 135 90 10275 4575 1\001
-6
2 1 0 1 0 7 52 -1 -1 0.000 0 0 -1 1 0 3
	1 1 1.00 60.00 120.00
	 10200 7350 10200 9075 4800 9075
2 1 1 1 0 7 52 -1 -1 4.000 0 0 -1 1 0 2
	2 0 1.00 60.00 120.00
	 7200 7050 9225 7050
-6
4 1 0 52 -1 0 12 0.0000 4 135 90 10050 6525 1\001
4 1 0 52 -1 0 12 0.0000 4 135 345 7950 1800 RMI\001
4 1 0 52 -1 0 12 0.0000 4 135 450 8025 9300 HTTP\001
