#FIG 3.2
Landscape
Center
Inches
Letter  
100.00
Single
-2
1200 2
0 32 #d8d9d8
6 1950 450 3675 7500
6 1950 450 3675 900
2 2 0 1 0 7 50 -1 20 0.000 0 0 -1 0 0 5
	 1950 450 3675 450 3675 900 1950 900 1950 450
2 1 0 1 0 7 49 -1 -1 0.000 0 0 -1 0 0 2
	 2025 795 3615 795
4 1 0 49 -1 20 12 0.0000 4 180 1530 2850 750 :InviteMeetingHandler\001
-6
2 1 1 1 0 7 49 -1 -1 5.000 0 0 -1 0 0 2
	 2850 900 2850 7500
2 2 0 1 0 7 49 -1 20 0.000 0 0 -1 0 0 5
	 2775 1500 2925 1500 2925 3675 2775 3675 2775 1500
2 2 0 1 0 7 49 -1 20 0.000 0 0 -1 0 0 5
	 2775 4425 2925 4425 2925 5775 2775 5775 2775 4425
2 2 0 1 0 7 49 -1 20 0.000 0 0 -1 0 0 5
	 2775 6600 2925 6600 2925 7350 2775 7350 2775 6600
-6
6 9900 3075 11625 7575
2 2 0 1 0 7 49 -1 20 0.000 0 0 -1 0 0 5
	 10650 7125 10800 7125 10800 7350 10650 7350 10650 7125
2 2 0 1 0 7 49 -1 20 0.000 0 0 -1 0 0 5
	 10650 5400 10800 5400 10800 5625 10650 5625 10650 5400
2 1 1 1 0 7 50 -1 -1 5.000 0 0 -1 0 0 2
	 10725 3600 10725 7575
2 2 0 1 0 7 50 -1 20 0.000 0 0 -1 0 0 5
	 9900 3150 11550 3150 11550 3600 9900 3600 9900 3150
2 1 0 1 0 7 49 -1 -1 0.000 0 0 -1 0 0 2
	 9998 3450 11426 3450
2 2 0 1 0 7 51 -1 20 0.000 0 0 -1 0 0 5
	 9975 3075 11625 3075 11625 3525 9975 3525 9975 3075
4 1 0 49 -1 20 12 0.0000 4 180 1380 10725 3375 participants: Person\001
-6
6 7875 2100 9525 7650
6 7875 2100 9525 2625
2 2 0 1 0 7 50 -1 20 0.000 0 0 -1 0 0 5
	 7883 2163 9458 2163 9458 2613 7883 2613 7883 2163
2 1 0 1 0 7 49 -1 -1 0.000 0 0 -1 0 0 2
	 8033 2487 9317 2487
4 1 0 49 -1 20 12 0.0000 4 180 1230 8625 2400 meeting: Meeting\001
-6
6 8625 2625 8775 7650
6 8625 3150 8775 7275
2 2 0 1 0 7 49 -1 20 0.000 0 0 -1 0 0 5
	 8625 5100 8775 5100 8775 5550 8625 5550 8625 5100
2 2 0 1 0 7 49 -1 20 0.000 0 0 -1 0 0 5
	 8625 6900 8775 6900 8775 7275 8625 7275 8625 6900
2 2 0 1 0 7 49 -1 20 0.000 0 0 -1 0 0 5
	 8625 3150 8775 3150 8775 3450 8625 3450 8625 3150
-6
2 1 1 1 0 7 50 -1 -1 5.000 0 0 -1 0 0 2
	 8700 2625 8700 7650
-6
-6
2 1 0 1 0 7 50 -1 20 0.000 0 0 -1 1 0 2
	1 1 1.00 60.00 120.00
	 2850 1800 4725 1800
2 1 0 1 0 7 50 -1 -1 0.000 0 0 -1 1 0 2
	1 1 1.00 60.00 120.00
	 2850 4725 4725 4725
2 1 0 1 0 7 50 -1 -1 0.000 0 0 -1 1 0 2
	1 1 1.00 60.00 120.00
	 600 4425 2850 4425
2 1 0 1 0 7 50 -1 -1 0.000 0 0 -1 1 0 2
	1 1 1.00 60.00 120.00
	 8775 5400 10650 5400
2 1 0 1 0 7 50 -1 -1 4.000 0 0 -1 1 0 2
	1 1 1.00 60.00 120.00
	 2850 6900 8625 6900
2 1 0 1 0 7 50 -1 -1 4.000 0 0 -1 1 0 2
	1 1 1.00 60.00 120.00
	 8775 7125 10725 7125
2 1 0 1 0 7 50 -1 -1 0.000 0 0 -1 1 0 2
	1 1 1.00 60.00 120.00
	 8775 3300 9900 3300
2 1 0 1 0 7 50 -1 -1 0.000 0 0 -1 1 0 2
	1 1 1.00 60.00 120.00
	 2850 5100 8625 5100
2 1 0 1 0 7 50 -1 -1 0.000 0 0 -1 1 0 2
	1 1 1.00 60.00 120.00
	 2925 2250 6450 2250
2 1 0 1 0 7 50 -1 20 0.000 0 0 -1 1 0 2
	1 1 1.00 60.00 120.00
	 6525 2400 7875 2400
2 2 0 2 0 7 52 -1 -1 0.000 0 0 -1 0 0 5
	 450 3975 11550 3975 11550 6075 450 6075 450 3975
2 1 0 1 0 7 50 -1 20 0.000 0 0 -1 1 0 2
	1 1 1.00 60.00 120.00
	 600 1500 2850 1500
2 2 0 1 0 7 50 -1 20 0.000 0 0 7 0 0 5
	 4275 450 5175 450 5175 900 4275 900 4275 450
2 2 0 1 0 7 51 -1 20 0.000 0 0 7 0 0 5
	 4350 375 5250 375 5250 825 4350 825 4350 375
2 1 1 1 0 7 50 -1 -1 5.000 0 0 -1 0 0 2
	 4725 900 4725 7500
2 2 0 1 0 7 49 -1 20 0.000 0 0 -1 0 0 5
	 4650 1800 4800 1800 4800 2025 4650 2025 4650 1800
2 2 0 1 0 7 49 -1 20 0.000 0 0 -1 0 0 5
	 4650 4725 4800 4725 4800 4950 4650 4950 4650 4725
2 1 0 1 0 7 46 -1 -1 0.000 0 0 -1 0 0 2
	 4367 785 4973 785
2 1 1 1 0 7 50 -1 -1 5.000 0 0 -1 0 0 2
	 6450 900 6450 7650
2 2 0 1 0 7 49 -1 20 0.000 0 0 -1 0 0 5
	 6375 2250 6525 2250 6525 3600 6375 3600 6375 2250
2 1 0 1 0 7 49 -1 -1 0.000 0 0 -1 0 0 2
	 5466 770 7326 770
2 2 0 1 0 7 50 -1 20 0.000 0 0 -1 0 0 5
	 5400 450 7500 450 7500 900 5400 900 5400 450
3 2 0 1 0 7 50 -1 -1 4.000 0 1 0 2
	1 1 1.00 60.00 120.00
	 600 6600 2850 6600
	 0.000 0.000
4 0 0 50 -1 20 12 0.0000 4 180 585 3300 6900 publish()\001
4 0 0 50 -1 20 12 0.0000 4 180 1395 3075 5100 addParticipant(pers)\001
4 0 0 50 -1 20 12 0.0000 4 180 1485 3075 4725 pers := findPerson(id)\001
4 0 0 50 -1 20 12 0.0000 4 180 3270 3075 2250 meeting := makeMeeting(owner,time, duration)\001
4 0 0 50 -1 20 12 0.0000 4 180 1695 3000 1800 owner := findPerson(pid)\001
4 0 0 50 -1 20 12 0.0000 4 180 585 900 6600 publish()\001
4 0 0 50 -1 20 12 0.0000 4 180 1215 900 4425 addParticipant(id)\001
4 0 0 50 -1 20 12 0.0000 4 180 1350 3075 6000 *[more participants]\001
4 0 0 50 -1 20 12 0.0000 4 180 525 9225 3300 create()\001
4 0 0 50 -1 20 12 0.0000 4 180 1455 9075 7050 *: sendInvitation(this)\001
4 0 0 50 -1 20 12 0.0000 4 180 660 9150 5325 add(pers)\001
4 0 0 50 -1 20 12 0.0000 4 180 945 6675 2400 create(owner)\001
4 0 0 50 -1 20 12 0.0000 4 180 2220 450 1500 makeMeeting(pid,time,duration)\001
4 1 0 49 -1 20 12 0.0000 4 135 540 4650 750 :Person\001
4 1 0 40 -1 20 12 0.0000 4 135 1785 6450 750 owner.calendar: Calendar\001
