#FIG 3.2
Landscape
Center
Metric
A4      
100.00
Single
-2
1200 2
2 1 0 1 0 7 51 -1 20 0.000 0 0 -1 1 0 2
	0 0 1.00 60.00 120.00
	 8055 4275 8055 4995
2 2 0 1 0 7 50 -1 -1 0.000 0 0 -1 0 0 5
	 6795 1980 9405 1980 9405 2250 6795 2250 6795 1980
2 2 0 1 0 7 51 -1 -1 0.000 0 0 -1 0 0 5
	 6795 2250 9405 2250 9405 3105 6795 3105 6795 2250
2 2 0 1 0 7 51 -1 -1 0.000 0 0 -1 0 0 5
	 6795 3105 9405 3105 9405 4275 6795 4275 6795 3105
2 2 0 1 0 7 50 0 -1 0.000 0 0 -1 0 0 5
	 7650 4995 8460 4995 8460 5265 7650 5265 7650 4995
2 2 0 1 0 7 50 0 -1 0.000 0 0 -1 0 0 5
	 7650 5265 8460 5265 8460 5400 7650 5400 7650 5265
2 2 0 1 0 7 50 0 -1 0.000 0 0 -1 0 0 5
	 7650 5400 8460 5400 8460 5535 7650 5535 7650 5400
2 1 0 1 0 7 50 0 -1 4.000 0 0 -1 1 0 2
	1 0 1.00 150.00 150.00
	 8100 1980 8100 1530
2 1 1 1 0 7 50 0 -1 4.000 0 0 -1 0 0 2
	 5715 2520 5715 2880
2 1 0 1 0 7 50 0 -1 0.000 0 0 -1 1 0 2
	0 0 1.00 60.00 120.00
	 4680 2880 6795 2880
2 1 0 1 0 7 50 0 -1 4.000 0 0 -1 1 0 2
	1 0 1.00 150.00 150.00
	 5715 1935 5715 1575
2 2 0 1 0 7 50 0 -1 4.000 0 0 -1 0 0 5
	 5175 1935 6255 1935 6255 2160 5175 2160 5175 1935
2 2 0 1 0 7 50 0 -1 4.000 0 0 -1 0 0 5
	 5175 2160 6255 2160 6255 2250 5175 2250 5175 2160
2 2 0 1 0 7 50 0 -1 4.000 0 0 -1 0 0 5
	 5175 2250 6255 2250 6255 2520 5175 2520 5175 2250
2 2 0 1 0 7 51 0 -1 0.000 0 0 -1 0 0 5
	 5175 1440 6255 1440 6255 1575 5175 1575 5175 1440
2 2 0 1 0 7 50 0 -1 0.000 0 0 -1 0 0 5
	 5175 1305 6255 1305 6255 1440 5175 1440 5175 1305
# 
2 2 0 1 0 7 50 0 -1 0.000 0 0 -1 0 0 5
	 5175 1035 6255 1035 6255 1305 5175 1305 5175 1035
2 2 0 1 0 7 50 -1 -1 0.000 0 0 -1 0 0 5
	 2790 1980 4635 1980 4635 2250 2790 2250 2790 1980
2 2 0 1 0 7 50 -1 -1 0.000 0 0 -1 0 0 5
	 2790 2250 4635 2250 4635 2340 2790 2340 2790 2250
2 2 0 1 0 7 50 -1 -1 0.000 0 0 -1 0 0 5
	 2790 2340 4635 2340 4635 3375 2790 3375 2790 2340
2 2 0 1 0 7 50 0 -1 0.000 0 0 -1 0 0 5
	 7695 1260 8505 1260 8505 1530 7695 1530 7695 1260
4 0 0 51 -1 0 10 0.0000 4 105 630 8145 4590 -condition\001
4 1 0 50 0 2 10 0.0000 4 105 675 8055 5175 Condition\001
4 0 0 50 -1 0 12 0.0000 4 15 135 7740 5355 ...\001
4 0 0 50 -1 0 12 0.0000 4 15 135 7740 5490 ...\001
4 0 0 50 -1 2 10 0.0000 4 105 435 7875 2160 Timer\001
4 1 0 50 0 2 10 0.0000 4 105 690 5715 2115 TimerList\001
4 1 0 40 0 2 10 0.0000 4 135 450 5670 1215 Queue\001
4 0 0 50 -1 0 12 0.0000 4 15 135 5310 1395 ...\001
4 0 0 50 -1 0 12 0.0000 4 15 135 5310 1530 ...\001
4 0 0 50 -1 2 10 0.0000 4 105 900 3330 2160 TimerDriver\001
4 1 0 40 0 2 10 0.0000 4 105 315 8100 1440 Item\001
4 0 0 50 -1 0 10 0.0000 0 135 990 6930 4110 +isDone(): bool\001
4 0 0 50 -1 0 10 0.0000 0 135 600 6930 3915 +cancel()\001
4 0 0 50 -1 0 10 0.0000 0 135 630 6930 3720 +waitfor()\001
4 0 0 50 -1 0 10 0.0000 0 135 2310 6930 3525 +start(unsigned long, TimerType):int\001
4 0 0 50 -1 0 10 0.0000 0 135 660 6930 3330 +start():int\001
4 0 0 50 -1 0 10 0.0000 0 135 1305 6885 3015 -count:unsigned long\001
4 0 0 50 -1 0 10 0.0000 0 135 1350 6885 2820 -length:unsigned long\001
4 0 0 50 -1 0 10 0.0000 0 135 1050 6885 2625 -type:TimerType\001
4 0 0 50 -1 0 10 0.0000 0 105 1095 6885 2430 -state:TimerState\001
4 0 0 50 -1 0 10 0.0000 0 135 1785 2880 3240 -__isr__() <<static>> <<i>>\001
4 0 0 50 -1 0 10 0.0000 0 135 375 2880 3060 -tick()\001
4 0 0 50 -1 0 10 0.0000 0 135 1710 2880 2880 -TimerDriver() <<create>>\001
4 0 0 50 -1 0 10 0.0000 0 135 1515 2880 2700 +removeTimer(Timer *)\001
4 0 0 50 -1 0 10 0.0000 0 135 1275 2880 2520 +addTimer(Timer *)\001
4 0 0 50 0 0 10 0.0000 0 135 840 5265 2430 /push(it:Item)\001
4 0 0 50 -1 0 10 0.0000 0 135 840 4815 2835 +timerQueue\001
