%!PS-Adobe-2.0 EPSF-2.0
%%Title: /home/rimen05/Engineering/Master/3rdSemester/AI00/CVS/fag/AI00/rapport/FrancosPictures/CsharpPlannerClassDiagram
%%Creator: Dia v0.95
%%CreationDate: Sun Oct 29 10:26:12 2006
%%For: rimen05
%%Orientation: Portrait
%%Magnification: 1.0000
%%BoundingBox: 0 0 1064 620
%%BeginSetup
%%EndSetup
%%EndComments
%%BeginProlog
[ /.notdef /.notdef /.notdef /.notdef /.notdef /.notdef /.notdef /.notdef /.notdef /.notdef
/.notdef /.notdef /.notdef /.notdef /.notdef /.notdef /.notdef /.notdef /.notdef /.notdef
/.notdef /.notdef /.notdef /.notdef /.notdef /.notdef /.notdef /.notdef /.notdef /.notdef
/.notdef /.notdef /space /exclam /quotedbl /numbersign /dollar /percent /ampersand /quoteright
/parenleft /parenright /asterisk /plus /comma /hyphen /period /slash /zero /one
/two /three /four /five /six /seven /eight /nine /colon /semicolon
/less /equal /greater /question /at /A /B /C /D /E
/F /G /H /I /J /K /L /M /N /O
/P /Q /R /S /T /U /V /W /X /Y
/Z /bracketleft /backslash /bracketright /asciicircum /underscore /quoteleft /a /b /c
/d /e /f /g /h /i /j /k /l /m
/n /o /p /q /r /s /t /u /v /w
/x /y /z /braceleft /bar /braceright /asciitilde /.notdef /.notdef /.notdef
/.notdef /.notdef /.notdef /.notdef /.notdef /.notdef /.notdef /.notdef /.notdef /.notdef
/.notdef /.notdef /.notdef /.notdef /.notdef /.notdef /.notdef /.notdef /.notdef /.notdef
/.notdef /.notdef /.notdef /.notdef /.notdef /.notdef /.notdef /.notdef /.notdef /.notdef
/space /exclamdown /cent /sterling /currency /yen /brokenbar /section /dieresis /copyright
/ordfeminine /guillemotleft /logicalnot /hyphen /registered /macron /degree /plusminus /twosuperior /threesuperior
/acute /mu /paragraph /periodcentered /cedilla /onesuperior /ordmasculine /guillemotright /onequarter /onehalf
/threequarters /questiondown /Agrave /Aacute /Acircumflex /Atilde /Adieresis /Aring /AE /Ccedilla
/Egrave /Eacute /Ecircumflex /Edieresis /Igrave /Iacute /Icircumflex /Idieresis /Eth /Ntilde
/Ograve /Oacute /Ocircumflex /Otilde /Odieresis /multiply /Oslash /Ugrave /Uacute /Ucircumflex
/Udieresis /Yacute /Thorn /germandbls /agrave /aacute /acircumflex /atilde /adieresis /aring
/ae /ccedilla /egrave /eacute /ecircumflex /edieresis /igrave /iacute /icircumflex /idieresis
/eth /ntilde /ograve /oacute /ocircumflex /otilde /odieresis /divide /oslash /ugrave
/uacute /ucircumflex /udieresis /yacute /thorn /ydieresis] /isolatin1encoding exch def
/cp {closepath} bind def
/c {curveto} bind def
/f {fill} bind def
/a {arc} bind def
/ef {eofill} bind def
/ex {exch} bind def
/gr {grestore} bind def
/gs {gsave} bind def
/sa {save} bind def
/rs {restore} bind def
/l {lineto} bind def
/m {moveto} bind def
/rm {rmoveto} bind def
/n {newpath} bind def
/s {stroke} bind def
/sh {show} bind def
/slc {setlinecap} bind def
/slj {setlinejoin} bind def
/slw {setlinewidth} bind def
/srgb {setrgbcolor} bind def
/rot {rotate} bind def
/sc {scale} bind def
/sd {setdash} bind def
/ff {findfont} bind def
/sf {setfont} bind def
/scf {scalefont} bind def
/sw {stringwidth pop} bind def
/tr {translate} bind def

/ellipsedict 8 dict def
ellipsedict /mtrx matrix put
/ellipse
{ ellipsedict begin
   /endangle exch def
   /startangle exch def
   /yrad exch def
   /xrad exch def
   /y exch def
   /x exch def   /savematrix mtrx currentmatrix def
   x y tr xrad yrad sc
   0 0 1 startangle endangle arc
   savematrix setmatrix
   end
} def

/mergeprocs {
dup length
3 -1 roll
dup
length
dup
5 1 roll
3 -1 roll
add
array cvx
dup
3 -1 roll
0 exch
putinterval
dup
4 2 roll
putinterval
} bind def
/Times-Roman-latin1
    /Times-Roman findfont
    dup length dict begin
	{1 index /FID ne {def} {pop pop} ifelse} forall
	/Encoding isolatin1encoding def
    currentdict end
definefont pop
/Times-Italic-latin1
    /Times-Italic findfont
    dup length dict begin
	{1 index /FID ne {def} {pop pop} ifelse} forall
	/Encoding isolatin1encoding def
    currentdict end
definefont pop
/Times-Bold-latin1
    /Times-Bold findfont
    dup length dict begin
	{1 index /FID ne {def} {pop pop} ifelse} forall
	/Encoding isolatin1encoding def
    currentdict end
definefont pop
/Times-BoldItalic-latin1
    /Times-BoldItalic findfont
    dup length dict begin
	{1 index /FID ne {def} {pop pop} ifelse} forall
	/Encoding isolatin1encoding def
    currentdict end
definefont pop
/AvantGarde-Book-latin1
    /AvantGarde-Book findfont
    dup length dict begin
	{1 index /FID ne {def} {pop pop} ifelse} forall
	/Encoding isolatin1encoding def
    currentdict end
definefont pop
/AvantGarde-BookOblique-latin1
    /AvantGarde-BookOblique findfont
    dup length dict begin
	{1 index /FID ne {def} {pop pop} ifelse} forall
	/Encoding isolatin1encoding def
    currentdict end
definefont pop
/AvantGarde-Demi-latin1
    /AvantGarde-Demi findfont
    dup length dict begin
	{1 index /FID ne {def} {pop pop} ifelse} forall
	/Encoding isolatin1encoding def
    currentdict end
definefont pop
/AvantGarde-DemiOblique-latin1
    /AvantGarde-DemiOblique findfont
    dup length dict begin
	{1 index /FID ne {def} {pop pop} ifelse} forall
	/Encoding isolatin1encoding def
    currentdict end
definefont pop
/Bookman-Light-latin1
    /Bookman-Light findfont
    dup length dict begin
	{1 index /FID ne {def} {pop pop} ifelse} forall
	/Encoding isolatin1encoding def
    currentdict end
definefont pop
/Bookman-LightItalic-latin1
    /Bookman-LightItalic findfont
    dup length dict begin
	{1 index /FID ne {def} {pop pop} ifelse} forall
	/Encoding isolatin1encoding def
    currentdict end
definefont pop
/Bookman-Demi-latin1
    /Bookman-Demi findfont
    dup length dict begin
	{1 index /FID ne {def} {pop pop} ifelse} forall
	/Encoding isolatin1encoding def
    currentdict end
definefont pop
/Bookman-DemiItalic-latin1
    /Bookman-DemiItalic findfont
    dup length dict begin
	{1 index /FID ne {def} {pop pop} ifelse} forall
	/Encoding isolatin1encoding def
    currentdict end
definefont pop
/Courier-latin1
    /Courier findfont
    dup length dict begin
	{1 index /FID ne {def} {pop pop} ifelse} forall
	/Encoding isolatin1encoding def
    currentdict end
definefont pop
/Courier-Oblique-latin1
    /Courier-Oblique findfont
    dup length dict begin
	{1 index /FID ne {def} {pop pop} ifelse} forall
	/Encoding isolatin1encoding def
    currentdict end
definefont pop
/Courier-Bold-latin1
    /Courier-Bold findfont
    dup length dict begin
	{1 index /FID ne {def} {pop pop} ifelse} forall
	/Encoding isolatin1encoding def
    currentdict end
definefont pop
/Courier-BoldOblique-latin1
    /Courier-BoldOblique findfont
    dup length dict begin
	{1 index /FID ne {def} {pop pop} ifelse} forall
	/Encoding isolatin1encoding def
    currentdict end
definefont pop
/Helvetica-latin1
    /Helvetica findfont
    dup length dict begin
	{1 index /FID ne {def} {pop pop} ifelse} forall
	/Encoding isolatin1encoding def
    currentdict end
definefont pop
/Helvetica-Oblique-latin1
    /Helvetica-Oblique findfont
    dup length dict begin
	{1 index /FID ne {def} {pop pop} ifelse} forall
	/Encoding isolatin1encoding def
    currentdict end
definefont pop
/Helvetica-Bold-latin1
    /Helvetica-Bold findfont
    dup length dict begin
	{1 index /FID ne {def} {pop pop} ifelse} forall
	/Encoding isolatin1encoding def
    currentdict end
definefont pop
/Helvetica-BoldOblique-latin1
    /Helvetica-BoldOblique findfont
    dup length dict begin
	{1 index /FID ne {def} {pop pop} ifelse} forall
	/Encoding isolatin1encoding def
    currentdict end
definefont pop
/Helvetica-Narrow-latin1
    /Helvetica-Narrow findfont
    dup length dict begin
	{1 index /FID ne {def} {pop pop} ifelse} forall
	/Encoding isolatin1encoding def
    currentdict end
definefont pop
/Helvetica-Narrow-Oblique-latin1
    /Helvetica-Narrow-Oblique findfont
    dup length dict begin
	{1 index /FID ne {def} {pop pop} ifelse} forall
	/Encoding isolatin1encoding def
    currentdict end
definefont pop
/Helvetica-Narrow-Bold-latin1
    /Helvetica-Narrow-Bold findfont
    dup length dict begin
	{1 index /FID ne {def} {pop pop} ifelse} forall
	/Encoding isolatin1encoding def
    currentdict end
definefont pop
/Helvetica-Narrow-BoldOblique-latin1
    /Helvetica-Narrow-BoldOblique findfont
    dup length dict begin
	{1 index /FID ne {def} {pop pop} ifelse} forall
	/Encoding isolatin1encoding def
    currentdict end
definefont pop
/NewCenturySchoolbook-Roman-latin1
    /NewCenturySchoolbook-Roman findfont
    dup length dict begin
	{1 index /FID ne {def} {pop pop} ifelse} forall
	/Encoding isolatin1encoding def
    currentdict end
definefont pop
/NewCenturySchoolbook-Italic-latin1
    /NewCenturySchoolbook-Italic findfont
    dup length dict begin
	{1 index /FID ne {def} {pop pop} ifelse} forall
	/Encoding isolatin1encoding def
    currentdict end
definefont pop
/NewCenturySchoolbook-Bold-latin1
    /NewCenturySchoolbook-Bold findfont
    dup length dict begin
	{1 index /FID ne {def} {pop pop} ifelse} forall
	/Encoding isolatin1encoding def
    currentdict end
definefont pop
/NewCenturySchoolbook-BoldItalic-latin1
    /NewCenturySchoolbook-BoldItalic findfont
    dup length dict begin
	{1 index /FID ne {def} {pop pop} ifelse} forall
	/Encoding isolatin1encoding def
    currentdict end
definefont pop
/Palatino-Roman-latin1
    /Palatino-Roman findfont
    dup length dict begin
	{1 index /FID ne {def} {pop pop} ifelse} forall
	/Encoding isolatin1encoding def
    currentdict end
definefont pop
/Palatino-Italic-latin1
    /Palatino-Italic findfont
    dup length dict begin
	{1 index /FID ne {def} {pop pop} ifelse} forall
	/Encoding isolatin1encoding def
    currentdict end
definefont pop
/Palatino-Bold-latin1
    /Palatino-Bold findfont
    dup length dict begin
	{1 index /FID ne {def} {pop pop} ifelse} forall
	/Encoding isolatin1encoding def
    currentdict end
definefont pop
/Palatino-BoldItalic-latin1
    /Palatino-BoldItalic findfont
    dup length dict begin
	{1 index /FID ne {def} {pop pop} ifelse} forall
	/Encoding isolatin1encoding def
    currentdict end
definefont pop
/Symbol-latin1
    /Symbol findfont
definefont pop
/ZapfChancery-MediumItalic-latin1
    /ZapfChancery-MediumItalic findfont
    dup length dict begin
	{1 index /FID ne {def} {pop pop} ifelse} forall
	/Encoding isolatin1encoding def
    currentdict end
definefont pop
/ZapfDingbats-latin1
    /ZapfDingbats findfont
    dup length dict begin
	{1 index /FID ne {def} {pop pop} ifelse} forall
	/Encoding isolatin1encoding def
    currentdict end
definefont pop
28.346000 -28.346000 scale
12.660293 -22.804411 translate
%%EndProlog


1.000000 1.000000 1.000000 srgb
n -12.610293 0.989706 m -12.610293 22.754411 l 24.792647 22.754411 l 24.792647 0.989706 l f
0.100000 slw
[] 0 sd
[] 0 sd
0 slj
0.000000 0.000000 0.000000 srgb
n -12.610293 0.989706 m -12.610293 22.754411 l 24.792647 22.754411 l 24.792647 0.989706 l cp s
0.100000 slw
[] 0 sd
1.000000 1.000000 1.000000 srgb
n 5.788235 4.705882 m 5.788235 6.105882 l 8.538235 6.105882 l 8.538235 4.705882 l f
0.000000 0.000000 0.000000 srgb
n 5.788235 4.705882 m 5.788235 6.105882 l 8.538235 6.105882 l 8.538235 4.705882 l cp s
/Helvetica-Bold-latin1 ff 0.700000 scf sf
(Solver) dup sw 2 div 7.163235 ex sub 5.705882 m gs 1 -1 sc sh gr
0.100000 slw
[] 0 sd
1.000000 1.000000 1.000000 srgb
n 7.967941 7.858824 m 7.967941 9.258824 l 10.317941 9.258824 l 10.317941 7.858824 l f
0.000000 0.000000 0.000000 srgb
n 7.967941 7.858824 m 7.967941 9.258824 l 10.317941 9.258824 l 10.317941 7.858824 l cp s
/Helvetica-BoldOblique-latin1 ff 0.700000 scf sf
(Node) dup sw 2 div 9.142941 ex sub 8.858824 m gs 1 -1 sc sh gr
0.100000 slw
[] 0 sd
1.000000 1.000000 1.000000 srgb
n 4.220883 1.785294 m 4.220883 3.185294 l 6.720883 3.185294 l 6.720883 1.785294 l f
0.000000 0.000000 0.000000 srgb
n 4.220883 1.785294 m 4.220883 3.185294 l 6.720883 3.185294 l 6.720883 1.785294 l cp s
/Helvetica-Bold-latin1 ff 0.700000 scf sf
(Game) dup sw 2 div 5.470883 ex sub 2.785294 m gs 1 -1 sc sh gr
0.100000 slw
[] 0 sd
0 slj
0 slc
n 5.470883 3.185294 m 5.470883 3.945588 l 7.163235 3.945588 l 7.163235 4.705882 l s
/Courier-latin1 ff 0.560000 scf sf
(Uses) dup sw 2 div 6.317059 ex sub 3.795588 m gs 1 -1 sc sh gr
0.100000 slw
[] 0 sd
1.000000 1.000000 1.000000 srgb
n 0.776765 7.858824 m 0.776765 9.258824 l 6.126765 9.258824 l 6.126765 7.858824 l f
0.000000 0.000000 0.000000 srgb
n 0.776765 7.858824 m 0.776765 9.258824 l 6.126765 9.258824 l 6.126765 7.858824 l cp s
/Helvetica-BoldOblique-latin1 ff 0.700000 scf sf
(PriorityQueue) dup sw 2 div 3.451765 ex sub 8.858824 m gs 1 -1 sc sh gr
0.100000 slw
[] 0 sd
1.000000 1.000000 1.000000 srgb
n 17.136765 7.858824 m 17.136765 9.258824 l 19.436765 9.258824 l 19.436765 7.858824 l f
0.000000 0.000000 0.000000 srgb
n 17.136765 7.858824 m 17.136765 9.258824 l 19.436765 9.258824 l 19.436765 7.858824 l cp s
/Helvetica-BoldOblique-latin1 ff 0.700000 scf sf
(State) dup sw 2 div 18.286765 ex sub 8.858824 m gs 1 -1 sc sh gr
0.100000 slw
[] 0 sd
1.000000 1.000000 1.000000 srgb
n -4.898529 19.004411 m -4.898529 20.404411 l 2.451471 20.404411 l 2.451471 19.004411 l f
0.000000 0.000000 0.000000 srgb
n -4.898529 19.004411 m -4.898529 20.404411 l 2.451471 20.404411 l 2.451471 19.004411 l cp s
/Helvetica-Bold-latin1 ff 0.700000 scf sf
(PriorityQueueAStar) dup sw 2 div -1.223529 ex sub 20.004411 m gs 1 -1 sc sh gr
0.100000 slw
[] 0 sd
1.000000 1.000000 1.000000 srgb
n -6.298529 11.122059 m -6.298529 12.522059 l 2.451471 12.522059 l 2.451471 11.122059 l f
0.000000 0.000000 0.000000 srgb
n -6.298529 11.122059 m -6.298529 12.522059 l 2.451471 12.522059 l 2.451471 11.122059 l cp s
/Helvetica-Bold-latin1 ff 0.700000 scf sf
(PriorityQueueDeepFirst) dup sw 2 div -1.923529 ex sub 12.122059 m gs 1 -1 sc sh gr
0.100000 slw
[] 0 sd
1.000000 1.000000 1.000000 srgb
n -11.686764 14.416176 m -11.686764 15.816176 l -0.136764 15.816176 l -0.136764 14.416176 l f
0.000000 0.000000 0.000000 srgb
n -11.686764 14.416176 m -11.686764 15.816176 l -0.136764 15.816176 l -0.136764 14.416176 l cp s
/Helvetica-Bold-latin1 ff 0.700000 scf sf
(PriorityQueueIterativeDeepFirst) dup sw 2 div -5.911764 ex sub 15.416176 m gs 1 -1 sc sh gr
0.100000 slw
[] 0 sd
1.000000 1.000000 1.000000 srgb
n -8.598529 16.651470 m -8.598529 18.051470 l 2.451471 18.051470 l 2.451471 16.651470 l f
0.000000 0.000000 0.000000 srgb
n -8.598529 16.651470 m -8.598529 18.051470 l 2.451471 18.051470 l 2.451471 16.651470 l cp s
/Helvetica-Bold-latin1 ff 0.700000 scf sf
(PriorityQueueGreedyBestFirst) dup sw 2 div -3.073529 ex sub 17.651470 m gs 1 -1 sc sh gr
0.100000 slw
[] 0 sd
0 slj
0 slc
n 7.163235 6.105882 m 7.163235 7.225000 l 9.142941 7.225000 l 9.142941 7.858824 l s
/Courier-latin1 ff 0.560000 scf sf
(Uses) dup sw 2 div 8.153088 ex sub 7.075000 m gs 1 -1 sc sh gr
0.100000 slw
[] 0 sd
1.000000 1.000000 1.000000 srgb
n 6.242747 11.122059 m 6.242747 12.522059 l 11.892747 12.522059 l 11.892747 11.122059 l f
0.000000 0.000000 0.000000 srgb
n 6.242747 11.122059 m 6.242747 12.522059 l 11.892747 12.522059 l 11.892747 11.122059 l cp s
/Helvetica-Bold-latin1 ff 0.700000 scf sf
(Sokoban.Node) dup sw 2 div 9.067747 ex sub 12.122059 m gs 1 -1 sc sh gr
0.100000 slw
[] 0 sd
1.000000 1.000000 1.000000 srgb
n 6.242747 13.063235 m 6.242747 14.463235 l 13.192747 14.463235 l 13.192747 13.063235 l f
0.000000 0.000000 0.000000 srgb
n 6.242747 13.063235 m 6.242747 14.463235 l 13.192747 14.463235 l 13.192747 13.063235 l cp s
/Helvetica-Bold-latin1 ff 0.700000 scf sf
(Connectivity.Node) dup sw 2 div 9.717747 ex sub 14.063235 m gs 1 -1 sc sh gr
0.100000 slw
[] 0 sd
1.000000 1.000000 1.000000 srgb
n 7.654612 15.152941 m 7.654612 16.552941 l 10.454612 16.552941 l 10.454612 15.152941 l f
0.000000 0.000000 0.000000 srgb
n 7.654612 15.152941 m 7.654612 16.552941 l 10.454612 16.552941 l 10.454612 15.152941 l cp s
/Helvetica-BoldOblique-latin1 ff 0.700000 scf sf
(Action) dup sw 2 div 9.054612 ex sub 16.152941 m gs 1 -1 sc sh gr
0.100000 slw
[] 0 sd
1.000000 1.000000 1.000000 srgb
n 8.495988 18.486764 m 8.495988 19.886764 l 14.595988 19.886764 l 14.595988 18.486764 l f
0.000000 0.000000 0.000000 srgb
n 8.495988 18.486764 m 8.495988 19.886764 l 14.595988 19.886764 l 14.595988 18.486764 l cp s
/Helvetica-Bold-latin1 ff 0.700000 scf sf
(Sokoban.Action) dup sw 2 div 11.545988 ex sub 19.486764 m gs 1 -1 sc sh gr
0.100000 slw
[] 0 sd
1.000000 1.000000 1.000000 srgb
n 8.495988 20.369117 m 8.495988 21.769117 l 15.895988 21.769117 l 15.895988 20.369117 l f
0.000000 0.000000 0.000000 srgb
n 8.495988 20.369117 m 8.495988 21.769117 l 15.895988 21.769117 l 15.895988 20.369117 l cp s
/Helvetica-Bold-latin1 ff 0.700000 scf sf
(Connectivity.Action) dup sw 2 div 12.195988 ex sub 21.369117 m gs 1 -1 sc sh gr
0.100000 slw
[] 0 sd
1.000000 1.000000 1.000000 srgb
n 17.025400 11.122059 m 17.025400 12.522059 l 22.625400 12.522059 l 22.625400 11.122059 l f
0.000000 0.000000 0.000000 srgb
n 17.025400 11.122059 m 17.025400 12.522059 l 22.625400 12.522059 l 22.625400 11.122059 l cp s
/Helvetica-Bold-latin1 ff 0.700000 scf sf
(Sokoban.State) dup sw 2 div 19.825400 ex sub 12.122059 m gs 1 -1 sc sh gr
0.100000 slw
[] 0 sd
1.000000 1.000000 1.000000 srgb
n 17.025400 13.063235 m 17.025400 14.463235 l 23.925400 14.463235 l 23.925400 13.063235 l f
0.000000 0.000000 0.000000 srgb
n 17.025400 13.063235 m 17.025400 14.463235 l 23.925400 14.463235 l 23.925400 13.063235 l cp s
/Helvetica-Bold-latin1 ff 0.700000 scf sf
(Connectivity.State) dup sw 2 div 20.475400 ex sub 14.063235 m gs 1 -1 sc sh gr
0.100000 slw
[] 0 sd
0 slj
0 slc
n 7.163235 6.105882 m 7.163235 7.225000 l 3.451765 7.225000 l 3.451765 7.858824 l s
/Courier-latin1 ff 0.560000 scf sf
(Uses) dup sw 2 div 5.307500 ex sub 7.075000 m gs 1 -1 sc sh gr
0.100000 slw
[] 0 sd
0 slj
0 slc
n -1.923529 13.433862 m -1.923529 13.872059 l -5.911764 13.872059 l -5.911764 14.416176 l s
0 slj
1.000000 1.000000 1.000000 srgb
n -1.523529 13.433862 m -1.923529 12.633862 l -2.323529 13.433862 l ef
0.100000 slw
[] 0 sd
0 slj
0.000000 0.000000 0.000000 srgb
n -1.523529 13.433862 m -1.923529 12.633862 l -2.323529 13.433862 l cp s
/Courier-latin1 ff 0.560000 scf sf
0.100000 slw
[] 0 sd
0 slj
0 slc
n 3.451765 10.170627 m 3.451765 11.822059 l 2.451471 11.822059 l s
0 slj
1.000000 1.000000 1.000000 srgb
n 3.851765 10.170627 m 3.451765 9.370627 l 3.051765 10.170627 l ef
0.100000 slw
[] 0 sd
0 slj
0.000000 0.000000 0.000000 srgb
n 3.851765 10.170627 m 3.451765 9.370627 l 3.051765 10.170627 l cp s
/Courier-latin1 ff 0.560000 scf sf
0.100000 slw
[] 0 sd
0 slj
0 slc
n 3.451765 10.170627 m 3.451765 17.351470 l 2.451471 17.351470 l s
0 slj
1.000000 1.000000 1.000000 srgb
n 3.851765 10.170627 m 3.451765 9.370627 l 3.051765 10.170627 l ef
0.100000 slw
[] 0 sd
0 slj
0.000000 0.000000 0.000000 srgb
n 3.851765 10.170627 m 3.451765 9.370627 l 3.051765 10.170627 l cp s
/Courier-latin1 ff 0.560000 scf sf
0.100000 slw
[] 0 sd
0 slj
0 slc
n 3.451765 10.170627 m 3.451765 19.704411 l 2.451471 19.704411 l s
0 slj
1.000000 1.000000 1.000000 srgb
n 3.851765 10.170627 m 3.451765 9.370627 l 3.051765 10.170627 l ef
0.100000 slw
[] 0 sd
0 slj
0.000000 0.000000 0.000000 srgb
n 3.851765 10.170627 m 3.451765 9.370627 l 3.051765 10.170627 l cp s
/Courier-latin1 ff 0.560000 scf sf
0.100000 slw
[] 0 sd
0 slj
0 slc
n 9.142941 10.170627 m 9.142941 10.577941 l 5.242747 10.577941 l 5.242747 11.822059 l 6.242747 11.822059 l s
0 slj
1.000000 1.000000 1.000000 srgb
n 9.542941 10.170627 m 9.142941 9.370627 l 8.742941 10.170627 l ef
0.100000 slw
[] 0 sd
0 slj
0.000000 0.000000 0.000000 srgb
n 9.542941 10.170627 m 9.142941 9.370627 l 8.742941 10.170627 l cp s
/Courier-latin1 ff 0.560000 scf sf
0.100000 slw
[] 0 sd
0 slj
0 slc
n 9.142941 10.170627 m 9.142941 10.577941 l 5.242747 10.577941 l 5.242747 13.763235 l 6.242747 13.763235 l s
0 slj
1.000000 1.000000 1.000000 srgb
n 9.542941 10.170627 m 9.142941 9.370627 l 8.742941 10.170627 l ef
0.100000 slw
[] 0 sd
0 slj
0.000000 0.000000 0.000000 srgb
n 9.542941 10.170627 m 9.142941 9.370627 l 8.742941 10.170627 l cp s
/Courier-latin1 ff 0.560000 scf sf
0.100000 slw
[] 0 sd
0 slj
0 slc
n 9.054612 17.464744 m 9.054612 17.872059 l 7.495988 17.872059 l 7.495988 19.186764 l 8.495988 19.186764 l s
0 slj
1.000000 1.000000 1.000000 srgb
n 9.454612 17.464744 m 9.054612 16.664744 l 8.654612 17.464744 l ef
0.100000 slw
[] 0 sd
0 slj
0.000000 0.000000 0.000000 srgb
n 9.454612 17.464744 m 9.054612 16.664744 l 8.654612 17.464744 l cp s
/Courier-latin1 ff 0.560000 scf sf
0.100000 slw
[] 0 sd
0 slj
0 slc
n 9.054612 17.464744 m 9.054612 17.872059 l 7.495988 17.872059 l 7.495988 21.069117 l 8.495988 21.069117 l s
0 slj
1.000000 1.000000 1.000000 srgb
n 9.454612 17.464744 m 9.054612 16.664744 l 8.654612 17.464744 l ef
0.100000 slw
[] 0 sd
0 slj
0.000000 0.000000 0.000000 srgb
n 9.454612 17.464744 m 9.054612 16.664744 l 8.654612 17.464744 l cp s
/Courier-latin1 ff 0.560000 scf sf
0.100000 slw
[] 0 sd
0 slj
0 slc
n 7.163235 6.105882 m 7.163235 7.225000 l 18.286765 7.225000 l 18.286765 7.858824 l s
/Courier-latin1 ff 0.560000 scf sf
(Uses) dup sw 2 div 12.725000 ex sub 7.075000 m gs 1 -1 sc sh gr
0.100000 slw
[] 0 sd
0 slj
0 slc
n 10.317941 8.558824 m 14.151971 8.558824 l 14.151971 15.852941 l 10.454612 15.852941 l s
/Courier-latin1 ff 0.560000 scf sf
(Has) 14.251971 12.055882 m gs 1 -1 sc sh gr
0.100000 slw
[] 0 sd
0 slj
0 slc
n 18.286765 10.170627 m 18.286765 10.695588 l 16.025400 10.695588 l 16.025400 11.822059 l 17.025400 11.822059 l s
0 slj
1.000000 1.000000 1.000000 srgb
n 18.686765 10.170627 m 18.286765 9.370627 l 17.886765 10.170627 l ef
0.100000 slw
[] 0 sd
0 slj
0.000000 0.000000 0.000000 srgb
n 18.686765 10.170627 m 18.286765 9.370627 l 17.886765 10.170627 l cp s
/Courier-latin1 ff 0.560000 scf sf
0.100000 slw
[] 0 sd
0 slj
0 slc
n 18.286765 10.170627 m 18.286765 10.695588 l 16.025400 10.695588 l 16.025400 13.763235 l 17.025400 13.763235 l s
0 slj
1.000000 1.000000 1.000000 srgb
n 18.686765 10.170627 m 18.286765 9.370627 l 17.886765 10.170627 l ef
0.100000 slw
[] 0 sd
0 slj
0.000000 0.000000 0.000000 srgb
n 18.686765 10.170627 m 18.286765 9.370627 l 17.886765 10.170627 l cp s
/Courier-latin1 ff 0.560000 scf sf
showpage
