\relax 
\catcode`"\active
\select@language{danish}
\@writefile{toc}{\select@language{danish}}
\@writefile{lof}{\select@language{danish}}
\@writefile{lot}{\select@language{danish}}
\select@language{danish}
\@writefile{toc}{\select@language{danish}}
\@writefile{lof}{\select@language{danish}}
\@writefile{lot}{\select@language{danish}}
\@writefile{toc}{\contentsline {section}{\numberline {1}Opgave 1 - d}{1}}
\@writefile{toc}{\contentsline {subsection}{\numberline {1.1}l\IeC {\o }sningsforslag - del 1}{1}}
\@writefile{toc}{\contentsline {subsection}{\numberline {1.2}L\IeC {\o }sningsforslag - del 2}{1}}
\@writefile{toc}{\contentsline {section}{\numberline {2}Opgave 3.1 - 20}{2}}
