#FIG 3.2
Landscape
Center
Inches
Letter  
100.00
Single
-2
1200 2
5 1 0 3 0 7 50 -1 -1 0.000 0 0 0 0 10276.326 4901.229 9285 4964 9450 4350 9997 3948
6 6225 3225 8400 5400
1 3 0 1 11 7 50 -1 -1 0.000 1 0.0000 6675 4950 75 75 6675 4950 6750 4950
2 1 0 2 0 7 50 -1 -1 0.000 0 0 -1 1 1 3
	1 1 2.00 120.00 225.00
	1 1 2.00 120.00 240.00
	 8325 5325 6300 5325 6300 3300
2 1 0 0 -1 11 51 -1 20 0.000 0 0 -1 0 0 4
	 7050 4575 7050 4800 6825 4575 7050 4575
2 1 0 0 -1 11 51 -1 20 0.000 0 0 -1 0 0 4
	 7425 4200 7425 4425 7200 4200 7425 4200
2 1 0 3 0 7 50 -1 -1 0.000 0 0 -1 0 0 2
	 6675 4950 7650 3975
-6
1 3 0 1 11 7 50 -1 -1 0.000 1 0.0000 9300 4950 75 75 9300 4950 9375 4950
2 1 0 2 0 7 50 -1 -1 0.000 0 0 -1 1 1 3
	1 1 2.00 120.00 225.00
	1 1 2.00 120.00 240.00
	 10950 5325 8925 5325 8925 3300
2 1 0 0 -1 11 51 -1 20 0.000 0 0 -1 0 0 4
	 9375 4425 9422 4658 9180 4538 9375 4425
2 1 0 0 -1 11 51 -1 20 0.000 0 0 -1 0 0 4
	 9675 4125 9657 4337 9463 4107 9675 4125
2 1 0 1 0 7 50 -1 -1 0.000 0 0 -1 1 0 2
	1 1 1.00 60.00 120.00
	 10125 4950 9535 4422
4 0 0 50 -1 0 9 0.0000 2 135 540 9975 4725 radius\001
4 0 0 50 -1 0 9 0.0000 2 150 1260 9375 5100 start position\001
4 0 0 50 -1 0 9 0.0000 2 150 1260 6750 5100 start position\001
