   1               		.file	"route.c"
   2               		.arch atmega128
   3               	__SREG__ = 0x3f
   4               	__SP_H__ = 0x3e
   5               	__SP_L__ = 0x3d
   6               	__tmp_reg__ = 0
   7               	__zero_reg__ = 1
   8               		.global __do_copy_data
   9               		.global __do_clear_bss
  17               	.Ltext0:
  18               		.weak	_ZTV5route
  19               		.data
  22               	_ZTV5route:
  23 0000 0000      		.word	0
  24 0002 0000      		.word	0
  25 0004 0000      		.word	pm(_ZN5route7executeEv)
  26               		.text
  27               	.global	_ZN5routeC2Eiiiiii
  29               	_ZN5routeC2Eiiiiii:
  30               	.LFB12:
  31               	.LM1:
  32               	/* prologue: frame size=0 */
  33 0000 2F92      		push r2
  34 0002 3F92      		push r3
  35 0004 4F92      		push r4
  36 0006 5F92      		push r5
  37 0008 6F92      		push r6
  38 000a 7F92      		push r7
  39 000c 8F92      		push r8
  40 000e 9F92      		push r9
  41 0010 AF92      		push r10
  42 0012 BF92      		push r11
  43 0014 CF92      		push r12
  44 0016 DF92      		push r13
  45 0018 EF92      		push r14
  46 001a FF92      		push r15
  47 001c 0F93      		push r16
  48 001e 1F93      		push r17
  49               	/* prologue end (size=16) */
  50 0020 5C01      		movw r10,r24
  51 0022 4B01      		movw r8,r22
  52 0024 3A01      		movw r6,r20
  53 0026 2901      		movw r4,r18
  54 0028 1801      		movw r2,r16
  55 002a 8701      		movw r16,r14
  56               	.LBB2:
  57 002c 62E0      		ldi r22,lo8(2)
  58 002e 70E0      		ldi r23,hi8(2)
  59 0030 0E94 0000 		call _ZN10TimerClassC2Ei
  60 0034 80E0      		ldi r24,lo8(_ZTV5route+4)
  61 0036 90E0      		ldi r25,hi8(_ZTV5route+4)
  62 0038 F501      		movw r30,r10
  63 003a 8083      		st Z,r24
  64 003c 9183      		std Z+1,r25
  65               	.LM2:
  66 003e 8386      		std Z+11,r8
  67 0040 9486      		std Z+12,r9
  68               	.LM3:
  69 0042 6586      		std Z+13,r6
  70 0044 7686      		std Z+14,r7
  71               	.LM4:
  72 0046 4786      		std Z+15,r4
  73 0048 508A      		std Z+16,r5
  74               	.LM5:
  75 004a 018B      		std Z+17,r16
  76 004c 128B      		std Z+18,r17
  77               	.LM6:
  78 004e C58A      		std Z+21,r12
  79 0050 D68A      		std Z+22,r13
  80               	.LM7:
  81 0052 1086      		std Z+8,__zero_reg__
  82 0054 1186      		std Z+9,__zero_reg__
  83               	.LM8:
  84 0056 4FEF      		ldi r20,lo8(255)
  85 0058 50E0      		ldi r21,hi8(255)
  86 005a BA01      		movw r22,r20
  87 005c 80E0      		ldi r24,lo8(uP+107)
  88 005e 90E0      		ldi r25,hi8(uP+107)
  89 0060 0E94 0000 		call _ZN5Motor13regulatePowerEii
  90               	.LM9:
  91 0064 C101      		movw r24,r2
  92 0066 AA27      		clr r26
  93 0068 97FD      		sbrc r25,7
  94 006a A095      		com r26
  95 006c BA2F      		mov r27,r26
  96 006e BC01      		movw r22,r24
  97 0070 CD01      		movw r24,r26
  98 0072 0E94 0000 		call _Z4ventl
  99               	.LM10:
 100 0076 81E0      		ldi r24,lo8(1)
 101 0078 F501      		movw r30,r10
 102 007a 8287      		std Z+10,r24
 103               	.LBE2:
 104               	/* epilogue: frame size=0 */
 105 007c 1F91      		pop r17
 106 007e 0F91      		pop r16
 107 0080 FF90      		pop r15
 108 0082 EF90      		pop r14
 109 0084 DF90      		pop r13
 110 0086 CF90      		pop r12
 111 0088 BF90      		pop r11
 112 008a AF90      		pop r10
 113 008c 9F90      		pop r9
 114 008e 8F90      		pop r8
 115 0090 7F90      		pop r7
 116 0092 6F90      		pop r6
 117 0094 5F90      		pop r5
 118 0096 4F90      		pop r4
 119 0098 3F90      		pop r3
 120 009a 2F90      		pop r2
 121 009c 0895      		ret
 122               	/* epilogue end (size=17) */
 123               	/* function route::route(int, int, int, int, int, int) size 79 (46) */
 124               	.LFE12:
 126               	.global	_ZN5routeC1Eiiiiii
 128               	_ZN5routeC1Eiiiiii:
 129               	.LFB13:
 130               	.LM11:
 131               	/* prologue: frame size=0 */
 132 009e 2F92      		push r2
 133 00a0 3F92      		push r3
 134 00a2 4F92      		push r4
 135 00a4 5F92      		push r5
 136 00a6 6F92      		push r6
 137 00a8 7F92      		push r7
 138 00aa 8F92      		push r8
 139 00ac 9F92      		push r9
 140 00ae AF92      		push r10
 141 00b0 BF92      		push r11
 142 00b2 CF92      		push r12
 143 00b4 DF92      		push r13
 144 00b6 EF92      		push r14
 145 00b8 FF92      		push r15
 146 00ba 0F93      		push r16
 147 00bc 1F93      		push r17
 148               	/* prologue end (size=16) */
 149 00be 5C01      		movw r10,r24
 150 00c0 4B01      		movw r8,r22
 151 00c2 3A01      		movw r6,r20
 152 00c4 2901      		movw r4,r18
 153 00c6 1801      		movw r2,r16
 154 00c8 8701      		movw r16,r14
 155               	.LBB3:
 156 00ca 62E0      		ldi r22,lo8(2)
 157 00cc 70E0      		ldi r23,hi8(2)
 158 00ce 0E94 0000 		call _ZN10TimerClassC2Ei
 159 00d2 80E0      		ldi r24,lo8(_ZTV5route+4)
 160 00d4 90E0      		ldi r25,hi8(_ZTV5route+4)
 161 00d6 F501      		movw r30,r10
 162 00d8 8083      		st Z,r24
 163 00da 9183      		std Z+1,r25
 164               	.LM12:
 165 00dc 8386      		std Z+11,r8
 166 00de 9486      		std Z+12,r9
 167               	.LM13:
 168 00e0 6586      		std Z+13,r6
 169 00e2 7686      		std Z+14,r7
 170               	.LM14:
 171 00e4 4786      		std Z+15,r4
 172 00e6 508A      		std Z+16,r5
 173               	.LM15:
 174 00e8 018B      		std Z+17,r16
 175 00ea 128B      		std Z+18,r17
 176               	.LM16:
 177 00ec C58A      		std Z+21,r12
 178 00ee D68A      		std Z+22,r13
 179               	.LM17:
 180 00f0 1086      		std Z+8,__zero_reg__
 181 00f2 1186      		std Z+9,__zero_reg__
 182               	.LM18:
 183 00f4 4FEF      		ldi r20,lo8(255)
 184 00f6 50E0      		ldi r21,hi8(255)
 185 00f8 BA01      		movw r22,r20
 186 00fa 80E0      		ldi r24,lo8(uP+107)
 187 00fc 90E0      		ldi r25,hi8(uP+107)
 188 00fe 0E94 0000 		call _ZN5Motor13regulatePowerEii
 189               	.LM19:
 190 0102 C101      		movw r24,r2
 191 0104 AA27      		clr r26
 192 0106 97FD      		sbrc r25,7
 193 0108 A095      		com r26
 194 010a BA2F      		mov r27,r26
 195 010c BC01      		movw r22,r24
 196 010e CD01      		movw r24,r26
 197 0110 0E94 0000 		call _Z4ventl
 198               	.LM20:
 199 0114 81E0      		ldi r24,lo8(1)
 200 0116 F501      		movw r30,r10
 201 0118 8287      		std Z+10,r24
 202               	.LBE3:
 203               	/* epilogue: frame size=0 */
 204 011a 1F91      		pop r17
 205 011c 0F91      		pop r16
 206 011e FF90      		pop r15
 207 0120 EF90      		pop r14
 208 0122 DF90      		pop r13
 209 0124 CF90      		pop r12
 210 0126 BF90      		pop r11
 211 0128 AF90      		pop r10
 212 012a 9F90      		pop r9
 213 012c 8F90      		pop r8
 214 012e 7F90      		pop r7
 215 0130 6F90      		pop r6
 216 0132 5F90      		pop r5
 217 0134 4F90      		pop r4
 218 0136 3F90      		pop r3
 219 0138 2F90      		pop r2
 220 013a 0895      		ret
 221               	/* epilogue end (size=17) */
 222               	/* function route::route(int, int, int, int, int, int) size 79 (46) */
 223               	.LFE13:
 225               	.global	_ZN5route12seekLineBackEv
 227               	_ZN5route12seekLineBackEv:
 228               	.LFB15:
 229               	.LM21:
 230               	/* prologue: frame size=0 */
 231 013c EF92      		push r14
 232 013e FF92      		push r15
 233 0140 0F93      		push r16
 234 0142 1F93      		push r17
 235 0144 CF93      		push r28
 236 0146 DF93      		push r29
 237               	/* prologue end (size=6) */
 238 0148 8C01      		movw r16,r24
 239               	.LBB4:
 240               	.LBB5:
 241               	.LM22:
 242 014a C0E0      		ldi r28,lo8(0)
 243 014c D0E0      		ldi r29,hi8(0)
 244               	.LM23:
 245 014e AE01      		movw r20,r28
 246 0150 BE01      		movw r22,r28
 247 0152 80E0      		ldi r24,lo8(uP+107)
 248 0154 90E0      		ldi r25,hi8(uP+107)
 249 0156 0E94 0000 		call _ZN5Motor13regulatePowerEii
 250               	.LM24:
 251 015a 68EE      		ldi r22,lo8(1000)
 252 015c 73E0      		ldi r23,hi8(1000)
 253 015e 80E0      		ldi r24,hlo8(1000)
 254 0160 90E0      		ldi r25,hhi8(1000)
 255 0162 0E94 0000 		call _Z4ventl
 256               	.LBB6:
 257               	.LM25:
 258 0166 7E01      		movw r14,r28
 259               	.L10:
 260               	.LM26:
 261 0168 F801      		movw r30,r16
 262 016a 8385      		ldd r24,Z+11
 263 016c 9485      		ldd r25,Z+12
 264 016e 8C17      		cp r24,r28
 265 0170 9D07      		cpc r25,r29
 266 0172 ECF0      		brlt .L5
 267               	.LM27:
 268 0174 80E0      		ldi r24,lo8(uP+7)
 269 0176 90E0      		ldi r25,hi8(uP+7)
 270 0178 0E94 0000 		call _ZN11ADConverter8findLineEv
 271               	.LM28:
 272 017c C091 0000 		lds r28,uP+29
 273 0180 D091 0000 		lds r29,(uP+29)+1
 274               	.LM29:
 275 0184 4CEE      		ldi r20,lo8(-20)
 276 0186 5FEF      		ldi r21,hi8(-20)
 277 0188 BA01      		movw r22,r20
 278 018a 80E0      		ldi r24,lo8(uP+107)
 279 018c 90E0      		ldi r25,hi8(uP+107)
 280 018e 0E94 0000 		call _ZN5Motor13regulatePowerEii
 281               	.LM30:
 282 0192 61E0      		ldi r22,lo8(1)
 283 0194 70E0      		ldi r23,hi8(1)
 284 0196 80E0      		ldi r24,hlo8(1)
 285 0198 90E0      		ldi r25,hhi8(1)
 286 019a 0E94 0000 		call _Z4ventl
 287               	.LM31:
 288 019e 0894      		sec
 289 01a0 E11C      		adc r14,__zero_reg__
 290 01a2 F11C      		adc r15,__zero_reg__
 291 01a4 F0EA      		ldi r31,lo8(4000)
 292 01a6 EF16      		cp r14,r31
 293 01a8 FFE0      		ldi r31,hi8(4000)
 294 01aa FF06      		cpc r15,r31
 295 01ac ECF2      		brlt .L10
 296               	.L5:
 297               	.LBE6:
 298               	.LM32:
 299 01ae 40E0      		ldi r20,lo8(0)
 300 01b0 50E0      		ldi r21,hi8(0)
 301 01b2 BA01      		movw r22,r20
 302 01b4 80E0      		ldi r24,lo8(uP+107)
 303 01b6 90E0      		ldi r25,hi8(uP+107)
 304 01b8 0E94 0000 		call _ZN5Motor13regulatePowerEii
 305               	.LM33:
 306 01bc 68EE      		ldi r22,lo8(1000)
 307 01be 73E0      		ldi r23,hi8(1000)
 308 01c0 80E0      		ldi r24,hlo8(1000)
 309 01c2 90E0      		ldi r25,hhi8(1000)
 310 01c4 0E94 0000 		call _Z4ventl
 311               	.LM34:
 312 01c8 40E0      		ldi r20,lo8(0)
 313 01ca 50E0      		ldi r21,hi8(0)
 314 01cc BA01      		movw r22,r20
 315 01ce 80E0      		ldi r24,lo8(uP+107)
 316 01d0 90E0      		ldi r25,hi8(uP+107)
 317 01d2 0E94 0000 		call _ZN5Motor13regulatePowerEii
 318               	.LM35:
 319 01d6 20E0      		ldi r18,lo8(0)
 320 01d8 30E0      		ldi r19,hi8(0)
 321 01da F801      		movw r30,r16
 322 01dc 8385      		ldd r24,Z+11
 323 01de 9485      		ldd r25,Z+12
 324 01e0 8C17      		cp r24,r28
 325 01e2 9D07      		cpc r25,r29
 326 01e4 14F4      		brge .L8
 327 01e6 21E0      		ldi r18,lo8(1)
 328 01e8 30E0      		ldi r19,hi8(1)
 329               	.L8:
 330               	.LBE5:
 331               	.LBE4:
 332               	.LM36:
 333 01ea C901      		movw r24,r18
 334               	/* epilogue: frame size=0 */
 335 01ec DF91      		pop r29
 336 01ee CF91      		pop r28
 337 01f0 1F91      		pop r17
 338 01f2 0F91      		pop r16
 339 01f4 FF90      		pop r15
 340 01f6 EF90      		pop r14
 341 01f8 0895      		ret
 342               	/* epilogue end (size=7) */
 343               	/* function bool route::seekLineBack() size 95 (82) */
 344               	.LFE15:
 346               	.global	_ZN5route12seekLineLeftEi
 348               	_ZN5route12seekLineLeftEi:
 349               	.LFB18:
 350               	.LM37:
 351               	/* prologue: frame size=0 */
 352 01fa 0F93      		push r16
 353 01fc 1F93      		push r17
 354               	/* prologue end (size=2) */
 355 01fe 8C01      		movw r16,r24
 356 0200 CB01      		movw r24,r22
 357               	.LBB7:
 358               	.LBB8:
 359               	.LM38:
 360 0202 65E0      		ldi r22,lo8(5)
 361 0204 70E0      		ldi r23,hi8(5)
 362 0206 0E94 0000 		call __divmodhi4
 363 020a 8EE1      		ldi r24,lo8(30)
 364 020c 90E0      		ldi r25,hi8(30)
 365 020e 861B      		sub r24,r22
 366 0210 970B      		sbc r25,r23
 367 0212 AC01      		movw r20,r24
 368 0214 68EC      		ldi r22,lo8(200)
 369 0216 70E0      		ldi r23,hi8(200)
 370 0218 80E0      		ldi r24,lo8(uP+107)
 371 021a 90E0      		ldi r25,hi8(uP+107)
 372 021c 0E94 0000 		call _ZN5Motor13regulatePowerEii
 373               	.LM39:
 374 0220 80E0      		ldi r24,lo8(uP+7)
 375 0222 90E0      		ldi r25,hi8(uP+7)
 376 0224 0E94 0000 		call _ZN11ADConverter8findLineEv
 377               	.LM40:
 378 0228 2091 0000 		lds r18,uP+29
 379 022c 3091 0000 		lds r19,(uP+29)+1
 380               	.LM41:
 381 0230 40E0      		ldi r20,lo8(0)
 382 0232 50E0      		ldi r21,hi8(0)
 383 0234 F801      		movw r30,r16
 384 0236 8385      		ldd r24,Z+11
 385 0238 9485      		ldd r25,Z+12
 386 023a 8217      		cp r24,r18
 387 023c 9307      		cpc r25,r19
 388 023e 14F4      		brge .L12
 389               	.LM42:
 390 0240 41E0      		ldi r20,lo8(1)
 391 0242 50E0      		ldi r21,hi8(1)
 392               	.L12:
 393               	.LBE8:
 394               	.LBE7:
 395               	.LM43:
 396 0244 CA01      		movw r24,r20
 397               	/* epilogue: frame size=0 */
 398 0246 1F91      		pop r17
 399 0248 0F91      		pop r16
 400 024a 0895      		ret
 401               	/* epilogue end (size=3) */
 402               	/* function bool route::seekLineLeft(int) size 41 (36) */
 403               	.LFE18:
 405               	.global	_ZN5route13seekLineRightEi
 407               	_ZN5route13seekLineRightEi:
 408               	.LFB19:
 409               	.LM44:
 410               	/* prologue: frame size=0 */
 411 024c 0F93      		push r16
 412 024e 1F93      		push r17
 413               	/* prologue end (size=2) */
 414 0250 8C01      		movw r16,r24
 415 0252 CB01      		movw r24,r22
 416               	.LBB9:
 417               	.LBB10:
 418               	.LM45:
 419 0254 65E0      		ldi r22,lo8(5)
 420 0256 70E0      		ldi r23,hi8(5)
 421 0258 0E94 0000 		call __divmodhi4
 422 025c 8EE1      		ldi r24,lo8(30)
 423 025e 90E0      		ldi r25,hi8(30)
 424 0260 861B      		sub r24,r22
 425 0262 970B      		sbc r25,r23
 426 0264 48EC      		ldi r20,lo8(200)
 427 0266 50E0      		ldi r21,hi8(200)
 428 0268 BC01      		movw r22,r24
 429 026a 80E0      		ldi r24,lo8(uP+107)
 430 026c 90E0      		ldi r25,hi8(uP+107)
 431 026e 0E94 0000 		call _ZN5Motor13regulatePowerEii
 432               	.LM46:
 433 0272 80E0      		ldi r24,lo8(uP+7)
 434 0274 90E0      		ldi r25,hi8(uP+7)
 435 0276 0E94 0000 		call _ZN11ADConverter8findLineEv
 436               	.LM47:
 437 027a 2091 0000 		lds r18,uP+29
 438 027e 3091 0000 		lds r19,(uP+29)+1
 439               	.LM48:
 440 0282 40E0      		ldi r20,lo8(0)
 441 0284 50E0      		ldi r21,hi8(0)
 442 0286 F801      		movw r30,r16
 443 0288 8385      		ldd r24,Z+11
 444 028a 9485      		ldd r25,Z+12
 445 028c 8217      		cp r24,r18
 446 028e 9307      		cpc r25,r19
 447 0290 14F4      		brge .L14
 448               	.LM49:
 449 0292 41E0      		ldi r20,lo8(1)
 450 0294 50E0      		ldi r21,hi8(1)
 451               	.L14:
 452               	.LBE10:
 453               	.LBE9:
 454               	.LM50:
 455 0296 CA01      		movw r24,r20
 456               	/* epilogue: frame size=0 */
 457 0298 1F91      		pop r17
 458 029a 0F91      		pop r16
 459 029c 0895      		ret
 460               	/* epilogue end (size=3) */
 461               	/* function bool route::seekLineRight(int) size 41 (36) */
 462               	.LFE19:
 464               	.global	_ZN5route11waitForLineEv
 466               	_ZN5route11waitForLineEv:
 467               	.LFB16:
 468               	.LM51:
 469               	/* prologue: frame size=0 */
 470 029e 0F93      		push r16
 471 02a0 1F93      		push r17
 472 02a2 CF93      		push r28
 473 02a4 DF93      		push r29
 474               	/* prologue end (size=4) */
 475 02a6 8C01      		movw r16,r24
 476               	.LBB11:
 477               	.LBB12:
 478               	.LM52:
 479 02a8 80E0      		ldi r24,lo8(uP+7)
 480 02aa 90E0      		ldi r25,hi8(uP+7)
 481 02ac 0E94 0000 		call _ZN11ADConverter8findLineEv
 482               	.LM53:
 483 02b0 C091 0000 		lds r28,uP+29
 484 02b4 D091 0000 		lds r29,(uP+29)+1
 485               	.LM54:
 486 02b8 40E0      		ldi r20,lo8(0)
 487 02ba 50E0      		ldi r21,hi8(0)
 488 02bc BA01      		movw r22,r20
 489 02be 80E0      		ldi r24,lo8(uP+107)
 490 02c0 90E0      		ldi r25,hi8(uP+107)
 491 02c2 0E94 0000 		call _ZN5Motor13regulatePowerEii
 492               	.LM55:
 493 02c6 F801      		movw r30,r16
 494 02c8 8385      		ldd r24,Z+11
 495 02ca 9485      		ldd r25,Z+12
 496 02cc C817      		cp r28,r24
 497 02ce D907      		cpc r29,r25
 498 02d0 74F4      		brge .L20
 499               	.L18:
 500               	.LM56:
 501 02d2 80E0      		ldi r24,lo8(uP+7)
 502 02d4 90E0      		ldi r25,hi8(uP+7)
 503 02d6 0E94 0000 		call _ZN11ADConverter8findLineEv
 504               	.LM57:
 505 02da C091 0000 		lds r28,uP+29
 506 02de D091 0000 		lds r29,(uP+29)+1
 507 02e2 F801      		movw r30,r16
 508 02e4 8385      		ldd r24,Z+11
 509 02e6 9485      		ldd r25,Z+12
 510 02e8 C817      		cp r28,r24
 511 02ea D907      		cpc r29,r25
 512 02ec 94F3      		brlt .L18
 513               	.L20:
 514               	.LBE12:
 515               	.LBE11:
 516               	/* epilogue: frame size=0 */
 517 02ee DF91      		pop r29
 518 02f0 CF91      		pop r28
 519 02f2 1F91      		pop r17
 520 02f4 0F91      		pop r16
 521 02f6 0895      		ret
 522               	/* epilogue end (size=5) */
 523               	/* function void route::waitForLine() size 45 (36) */
 524               	.LFE16:
 526               		.lcomm _ZZN5route11driveOnLineEiiE12tickToCorner,4
 527               		.lcomm _ZZN5route11driveOnLineEiiE12lastDistance,4
 528               		.lcomm _ZZN5route11driveOnLineEiiE8lastLine,4
 529               		.lcomm _ZZN5route11driveOnLineEiiE6dState,4
 530               	.global	_ZN5route11driveOnLineEii
 532               	_ZN5route11driveOnLineEii:
 533               	.LFB17:
 534               	.LM58:
 535               	/* prologue: frame size=0 */
 536 02f8 2F92      		push r2
 537 02fa 3F92      		push r3
 538 02fc 4F92      		push r4
 539 02fe 5F92      		push r5
 540 0300 6F92      		push r6
 541 0302 7F92      		push r7
 542 0304 8F92      		push r8
 543 0306 9F92      		push r9
 544 0308 AF92      		push r10
 545 030a BF92      		push r11
 546 030c CF92      		push r12
 547 030e DF92      		push r13
 548 0310 EF92      		push r14
 549 0312 FF92      		push r15
 550 0314 0F93      		push r16
 551 0316 1F93      		push r17
 552 0318 CF93      		push r28
 553 031a DF93      		push r29
 554               	/* prologue end (size=18) */
 555 031c 3C01      		movw r6,r24
 556 031e 2A01      		movw r4,r20
 557               	.LBB13:
 558               	.LBB14:
 559               	.LM59:
 560 0320 8091 0000 		lds r24,_ZZN5route11driveOnLineEiiE12tickToCorner
 561 0324 9091 0000 		lds r25,(_ZZN5route11driveOnLineEiiE12tickToCorner)+1
 562 0328 A091 0000 		lds r26,(_ZZN5route11driveOnLineEiiE12tickToCorner)+2
 563 032c B091 0000 		lds r27,(_ZZN5route11driveOnLineEiiE12tickToCorner)+3
 564 0330 0196      		adiw r24,1
 565 0332 A11D      		adc r26,__zero_reg__
 566 0334 B11D      		adc r27,__zero_reg__
 567 0336 8093 0000 		sts _ZZN5route11driveOnLineEiiE12tickToCorner,r24
 568 033a 9093 0000 		sts (_ZZN5route11driveOnLineEiiE12tickToCorner)+1,r25
 569 033e A093 0000 		sts (_ZZN5route11driveOnLineEiiE12tickToCorner)+2,r26
 570 0342 B093 0000 		sts (_ZZN5route11driveOnLineEiiE12tickToCorner)+3,r27
 571               	.LM60:
 572 0346 5A01      		movw r10,r20
 573 0348 CC24      		clr r12
 574 034a B7FC      		sbrc r11,7
 575 034c C094      		com r12
 576 034e DC2C      		mov r13,r12
 577 0350 8091 0000 		lds r24,_ZZN5route11driveOnLineEiiE8lastLine
 578 0354 9091 0000 		lds r25,(_ZZN5route11driveOnLineEiiE8lastLine)+1
 579 0358 A091 0000 		lds r26,(_ZZN5route11driveOnLineEiiE8lastLine)+2
 580 035c B091 0000 		lds r27,(_ZZN5route11driveOnLineEiiE8lastLine)+3
 581 0360 8A19      		sub r24,r10
 582 0362 9B09      		sbc r25,r11
 583 0364 AC09      		sbc r26,r12
 584 0366 BD09      		sbc r27,r13
 585 0368 F301      		movw r30,r6
 586 036a 2189      		ldd r18,Z+17
 587 036c 3289      		ldd r19,Z+18
 588 036e 4427      		clr r20
 589 0370 37FD      		sbrc r19,7
 590 0372 4095      		com r20
 591 0374 542F      		mov r21,r20
 592 0376 BC01      		movw r22,r24
 593 0378 CD01      		movw r24,r26
 594 037a 0E94 0000 		call __mulsi3
 595 037e 9B01      		movw r18,r22
 596 0380 AC01      		movw r20,r24
 597 0382 8091 0000 		lds r24,_ZZN5route11driveOnLineEiiE6dState
 598 0386 9091 0000 		lds r25,(_ZZN5route11driveOnLineEiiE6dState)+1
 599 038a A091 0000 		lds r26,(_ZZN5route11driveOnLineEiiE6dState)+2
 600 038e B091 0000 		lds r27,(_ZZN5route11driveOnLineEiiE6dState)+3
 601 0392 820F      		add r24,r18
 602 0394 931F      		adc r25,r19
 603 0396 A41F      		adc r26,r20
 604 0398 B51F      		adc r27,r21
 605 039a 8093 0000 		sts _ZZN5route11driveOnLineEiiE6dState,r24
 606 039e 9093 0000 		sts (_ZZN5route11driveOnLineEiiE6dState)+1,r25
 607 03a2 A093 0000 		sts (_ZZN5route11driveOnLineEiiE6dState)+2,r26
 608 03a6 B093 0000 		sts (_ZZN5route11driveOnLineEiiE6dState)+3,r27
 609               	.LM61:
 610 03aa B7FF      		sbrs r27,7
 611 03ac 03C0      		rjmp .L22
 612               	.LM62:
 613 03ae 0196      		adiw r24,1
 614 03b0 A11D      		adc r26,__zero_reg__
 615 03b2 B11D      		adc r27,__zero_reg__
 616               	.L22:
 617 03b4 B595      		asr r27
 618 03b6 A795      		ror r26
 619 03b8 9795      		ror r25
 620 03ba 8795      		ror r24
 621 03bc 8093 0000 		sts _ZZN5route11driveOnLineEiiE6dState,r24
 622 03c0 9093 0000 		sts (_ZZN5route11driveOnLineEiiE6dState)+1,r25
 623 03c4 A093 0000 		sts (_ZZN5route11driveOnLineEiiE6dState)+2,r26
 624 03c8 B093 0000 		sts (_ZZN5route11driveOnLineEiiE6dState)+3,r27
 625               	.LM63:
 626 03cc 80E0      		ldi r24,lo8(uP+69)
 627 03ce 90E0      		ldi r25,hi8(uP+69)
 628 03d0 0E94 0000 		call _ZN15SpeedCalculator8getSpeedEv
 629 03d4 7B01      		movw r14,r22
 630 03d6 8C01      		movw r16,r24
 631 03d8 80E0      		ldi r24,lo8(uP+31)
 632 03da 90E0      		ldi r25,hi8(uP+31)
 633 03dc 0E94 0000 		call _ZN15SpeedCalculator8getSpeedEv
 634 03e0 6E0D      		add r22,r14
 635 03e2 7F1D      		adc r23,r15
 636 03e4 801F      		adc r24,r16
 637 03e6 911F      		adc r25,r17
 638 03e8 97FF      		sbrs r25,7
 639 03ea 04C0      		rjmp .L23
 640 03ec 6F5F      		subi r22,lo8(-(1))
 641 03ee 7F4F      		sbci r23,hi8(-(1))
 642 03f0 8F4F      		sbci r24,hlo8(-(1))
 643 03f2 9F4F      		sbci r25,hhi8(-(1))
 644               	.L23:
 645 03f4 9595      		asr r25
 646 03f6 8795      		ror r24
 647 03f8 7795      		ror r23
 648 03fa 6795      		ror r22
 649 03fc 1B01      		movw r2,r22
 650               	.LM64:
 651 03fe A092 0000 		sts _ZZN5route11driveOnLineEiiE8lastLine,r10
 652 0402 B092 0000 		sts (_ZZN5route11driveOnLineEiiE8lastLine)+1,r11
 653 0406 C092 0000 		sts (_ZZN5route11driveOnLineEiiE8lastLine)+2,r12
 654 040a D092 0000 		sts (_ZZN5route11driveOnLineEiiE8lastLine)+3,r13
 655               	.LM65:
 656 040e F301      		movw r30,r6
 657 0410 8589      		ldd r24,Z+21
 658 0412 9689      		ldd r25,Z+22
 659 0414 8784      		ldd r8,Z+15
 660 0416 9088      		ldd r9,Z+16
 661 0418 889D      		mul r24,r8
 662 041a 9001      		movw r18,r0
 663 041c 899D      		mul r24,r9
 664 041e 300D      		add r19,r0
 665 0420 989D      		mul r25,r8
 666 0422 300D      		add r19,r0
 667 0424 1124      		clr r1
 668 0426 C901      		movw r24,r18
 669 0428 8C01      		movw r16,r24
 670 042a 2227      		clr r18
 671 042c 17FD      		sbrc r17,7
 672 042e 2095      		com r18
 673 0430 322F      		mov r19,r18
 674               	.LBB15:
 675               	.LM66:
 676 0432 A090 0000 		lds r10,_ZZN5route11driveOnLineEiiE6dState
 677 0436 B090 0000 		lds r11,(_ZZN5route11driveOnLineEiiE6dState)+1
 678 043a C090 0000 		lds r12,(_ZZN5route11driveOnLineEiiE6dState)+2
 679 043e D090 0000 		lds r13,(_ZZN5route11driveOnLineEiiE6dState)+3
 680               	.LBB16:
 681 0442 F601      		movw r30,r12
 682 0444 E501      		movw r28,r10
 683 0446 D7FE      		sbrs r13,7
 684 0448 07C0      		rjmp .L25
 685 044a CC27      		clr r28
 686 044c DD27      		clr r29
 687 044e FE01      		movw r30,r28
 688 0450 CA19      		sub r28,r10
 689 0452 DB09      		sbc r29,r11
 690 0454 EC09      		sbc r30,r12
 691 0456 FD09      		sbc r31,r13
 692               	.L25:
 693               	.LBE16:
 694               	.LBE15:
 695               	.LBB17:
 696 0458 C201      		movw r24,r4
 697 045a 6AE0      		ldi r22,lo8(10)
 698 045c 70E0      		ldi r23,hi8(10)
 699 045e 0E94 0000 		call __divmodhi4
 700               	.LBB18:
 701 0462 77FF      		sbrs r23,7
 702 0464 03C0      		rjmp .L27
 703 0466 7095      		com r23
 704 0468 6195      		neg r22
 705 046a 7F4F      		sbci r23,lo8(-1)
 706               	.L27:
 707               	.LBE18:
 708               	.LBE17:
 709 046c CB01      		movw r24,r22
 710 046e AA27      		clr r26
 711 0470 97FD      		sbrc r25,7
 712 0472 A095      		com r26
 713 0474 BA2F      		mov r27,r26
 714 0476 C80F      		add r28,r24
 715 0478 D91F      		adc r29,r25
 716 047a EA1F      		adc r30,r26
 717 047c FB1F      		adc r31,r27
 718 047e C901      		movw r24,r18
 719 0480 B801      		movw r22,r16
 720 0482 9E01      		movw r18,r28
 721 0484 AF01      		movw r20,r30
 722 0486 0E94 0000 		call __mulsi3
 723 048a DC01      		movw r26,r24
 724 048c CB01      		movw r24,r22
 725 048e BC01      		movw r22,r24
 726 0490 CD01      		movw r24,r26
 727 0492 28EE      		ldi r18,lo8(1000)
 728 0494 33E0      		ldi r19,hi8(1000)
 729 0496 40E0      		ldi r20,hlo8(1000)
 730 0498 50E0      		ldi r21,hhi8(1000)
 731 049a 0E94 0000 		call __divmodsi4
 732 049e 7901      		movw r14,r18
 733               	.LM67:
 734 04a0 C201      		movw r24,r4
 735 04a2 64E6      		ldi r22,lo8(100)
 736 04a4 70E0      		ldi r23,hi8(100)
 737 04a6 0E94 0000 		call __divmodhi4
 738 04aa F301      		movw r30,r6
 739 04ac 8585      		ldd r24,Z+13
 740 04ae 9685      		ldd r25,Z+14
 741 04b0 869F      		mul r24,r22
 742 04b2 8001      		movw r16,r0
 743 04b4 879F      		mul r24,r23
 744 04b6 100D      		add r17,r0
 745 04b8 969F      		mul r25,r22
 746 04ba 100D      		add r17,r0
 747 04bc 1124      		clr r1
 748 04be E401      		movw r28,r8
 749 04c0 C00F      		add r28,r16
 750 04c2 D11F      		adc r29,r17
 751 04c4 C601      		movw r24,r12
 752 04c6 B501      		movw r22,r10
 753 04c8 24E6      		ldi r18,lo8(100)
 754 04ca 30E0      		ldi r19,hi8(100)
 755 04cc 40E0      		ldi r20,hlo8(100)
 756 04ce 50E0      		ldi r21,hhi8(100)
 757 04d0 0E94 0000 		call __divmodsi4
 758 04d4 C20F      		add r28,r18
 759 04d6 D31F      		adc r29,r19
 760 04d8 CE0D      		add r28,r14
 761 04da DF1D      		adc r29,r15
 762 04dc C219      		sub r28,r2
 763 04de D309      		sbc r29,r3
 764               	.LM68:
 765 04e0 F401      		movw r30,r8
 766 04e2 E01B      		sub r30,r16
 767 04e4 F10B      		sbc r31,r17
 768 04e6 E21B      		sub r30,r18
 769 04e8 F30B      		sbc r31,r19
 770 04ea EE0D      		add r30,r14
 771 04ec FF1D      		adc r31,r15
 772 04ee E219      		sub r30,r2
 773 04f0 F309      		sbc r31,r3
 774               	.LBB19:
 775               	.LBB20:
 776               	.LM69:
 777 04f2 8F01      		movw r16,r30
 778 04f4 EC17      		cp r30,r28
 779 04f6 FD07      		cpc r31,r29
 780 04f8 0CF4      		brge .L29
 781 04fa 8E01      		movw r16,r28
 782               	.L29:
 783               	.LBE20:
 784               	.LBE19:
 785               	.LM70:
 786 04fc 0F3F      		cpi r16,255
 787 04fe 1105      		cpc r17,__zero_reg__
 788 0500 C9F0      		breq .L30
 789 0502 C4F0      		brlt .L30
 790               	.LM71:
 791 0504 2FEF      		ldi r18,lo8(255)
 792 0506 30E0      		ldi r19,hi8(255)
 793 0508 C29F      		mul r28,r18
 794 050a C001      		movw r24,r0
 795 050c C39F      		mul r28,r19
 796 050e 900D      		add r25,r0
 797 0510 D29F      		mul r29,r18
 798 0512 900D      		add r25,r0
 799 0514 1124      		clr r1
 800 0516 B801      		movw r22,r16
 801 0518 0E94 0000 		call __divmodhi4
 802 051c EB01      		movw r28,r22
 803               	.LM72:
 804 051e E29F      		mul r30,r18
 805 0520 C001      		movw r24,r0
 806 0522 E39F      		mul r30,r19
 807 0524 900D      		add r25,r0
 808 0526 F29F      		mul r31,r18
 809 0528 900D      		add r25,r0
 810 052a 1124      		clr r1
 811 052c B801      		movw r22,r16
 812 052e 0E94 0000 		call __divmodhi4
 813 0532 FB01      		movw r30,r22
 814               	.L30:
 815               	.LM73:
 816 0534 AF01      		movw r20,r30
 817 0536 BE01      		movw r22,r28
 818 0538 80E0      		ldi r24,lo8(uP+107)
 819 053a 90E0      		ldi r25,hi8(uP+107)
 820 053c 0E94 0000 		call _ZN5Motor13regulatePowerEii
 821               	.LBE14:
 822               	.LBE13:
 823               	/* epilogue: frame size=0 */
 824 0540 DF91      		pop r29
 825 0542 CF91      		pop r28
 826 0544 1F91      		pop r17
 827 0546 0F91      		pop r16
 828 0548 FF90      		pop r15
 829 054a EF90      		pop r14
 830 054c DF90      		pop r13
 831 054e CF90      		pop r12
 832 0550 BF90      		pop r11
 833 0552 AF90      		pop r10
 834 0554 9F90      		pop r9
 835 0556 8F90      		pop r8
 836 0558 7F90      		pop r7
 837 055a 6F90      		pop r6
 838 055c 5F90      		pop r5
 839 055e 4F90      		pop r4
 840 0560 3F90      		pop r3
 841 0562 2F90      		pop r2
 842 0564 0895      		ret
 843               	/* epilogue end (size=19) */
 844               	/* function void route::driveOnLine(int, int) size 311 (274) */
 845               	.LFE17:
 847               		.lcomm _ZZN5route7doDriveEvE10spinUpTime,2
 848               	.global	_ZN5route7doDriveEv
 850               	_ZN5route7doDriveEv:
 851               	.LFB14:
 852               	.LM74:
 853               	/* prologue: frame size=0 */
 854 0566 0F93      		push r16
 855 0568 1F93      		push r17
 856 056a CF93      		push r28
 857 056c DF93      		push r29
 858               	/* prologue end (size=4) */
 859 056e EC01      		movw r28,r24
 860               	.LBB21:
 861               	.LBB22:
 862               	.LM75:
 863 0570 0885      		ldd r16,Y+8
 864 0572 1985      		ldd r17,Y+9
 865               	.LM76:
 866 0574 80E0      		ldi r24,lo8(uP+7)
 867 0576 90E0      		ldi r25,hi8(uP+7)
 868 0578 0E94 0000 		call _ZN11ADConverter8findLineEv
 869 057c AC01      		movw r20,r24
 870 057e 8887      		std Y+8,r24
 871 0580 9987      		std Y+9,r25
 872               	.LM77:
 873 0582 2091 0000 		lds r18,uP+29
 874 0586 3091 0000 		lds r19,(uP+29)+1
 875               	.LM78:
 876 058a 6091 0000 		lds r22,_ZZN5route7doDriveEvE10spinUpTime
 877 058e 7091 0000 		lds r23,(_ZZN5route7doDriveEvE10spinUpTime)+1
 878 0592 6F5F      		subi r22,lo8(-(1))
 879 0594 7F4F      		sbci r23,hi8(-(1))
 880 0596 7093 0000 		sts (_ZZN5route7doDriveEvE10spinUpTime)+1,r23
 881 059a 6093 0000 		sts _ZZN5route7doDriveEvE10spinUpTime,r22
 882               	.LM79:
 883 059e 8A85      		ldd r24,Y+10
 884 05a0 9927      		clr r25
 885 05a2 8330      		cpi r24,3
 886 05a4 9105      		cpc r25,__zero_reg__
 887 05a6 29F1      		breq .L40
 888               	.LM80:
 889 05a8 8430      		cpi r24,4
 890 05aa 9105      		cpc r25,__zero_reg__
 891 05ac 1CF4      		brge .L56
 892 05ae 0097      		sbiw r24,0
 893 05b0 39F0      		breq .L33
 894 05b2 41C0      		rjmp .L53
 895               	.L56:
 896 05b4 8430      		cpi r24,4
 897 05b6 9105      		cpc r25,__zero_reg__
 898 05b8 11F1      		breq .L43
 899 05ba 0597      		sbiw r24,5
 900 05bc 69F1      		breq .L47
 901 05be 3BC0      		rjmp .L53
 902               	.L33:
 903               	.LM81:
 904 05c0 9093 0000 		sts (_ZZN5route7doDriveEvE10spinUpTime)+1,r25
 905 05c4 8093 0000 		sts _ZZN5route7doDriveEvE10spinUpTime,r24
 906               	.LM82:
 907 05c8 8B85      		ldd r24,Y+11
 908 05ca 9C85      		ldd r25,Y+12
 909 05cc 8217      		cp r24,r18
 910 05ce 9307      		cpc r25,r19
 911 05d0 2CF4      		brge .L34
 912               	.LM83:
 913 05d2 B901      		movw r22,r18
 914 05d4 CE01      		movw r24,r28
 915 05d6 0E94 0000 		call _ZN5route11driveOnLineEii
 916 05da 3BC0      		rjmp .L31
 917               	.L34:
 918               	.LM84:
 919 05dc 2FEF      		ldi r18,hi8(-250)
 920 05de 0630      		cpi r16,lo8(-250)
 921 05e0 1207      		cpc r17,r18
 922 05e2 14F4      		brge .L36
 923               	.LM85:
 924 05e4 84E0      		ldi r24,lo8(4)
 925 05e6 25C0      		rjmp .L59
 926               	.L36:
 927               	.LM86:
 928 05e8 0B3F      		cpi r16,251
 929 05ea 1105      		cpc r17,__zero_reg__
 930 05ec 0CF1      		brlt .L58
 931               	.LM87:
 932 05ee 85E0      		ldi r24,lo8(5)
 933 05f0 20C0      		rjmp .L59
 934               	.L40:
 935               	.LM88:
 936 05f2 CE01      		movw r24,r28
 937 05f4 0E94 0000 		call _ZN5route12seekLineBackEv
 938 05f8 8823      		tst r24
 939 05fa 11F5      		brne .L57
 940 05fc 19C0      		rjmp .L58
 941               	.L43:
 942               	.LM89:
 943 05fe CE01      		movw r24,r28
 944 0600 0E94 0000 		call _ZN5route12seekLineLeftEi
 945 0604 8823      		tst r24
 946 0606 E1F4      		brne .L57
 947               	.LM90:
 948 0608 8091 0000 		lds r24,_ZZN5route7doDriveEvE10spinUpTime
 949 060c 9091 0000 		lds r25,(_ZZN5route7doDriveEvE10spinUpTime)+1
 950 0610 855F      		subi r24,lo8(501)
 951 0612 9140      		sbci r25,hi8(501)
 952 0614 F4F0      		brlt .L31
 953 0616 0CC0      		rjmp .L58
 954               	.L47:
 955               	.LM91:
 956 0618 CE01      		movw r24,r28
 957 061a 0E94 0000 		call _ZN5route13seekLineRightEi
 958 061e 8823      		tst r24
 959 0620 79F4      		brne .L57
 960               	.LM92:
 961 0622 8091 0000 		lds r24,_ZZN5route7doDriveEvE10spinUpTime
 962 0626 9091 0000 		lds r25,(_ZZN5route7doDriveEvE10spinUpTime)+1
 963 062a 855F      		subi r24,lo8(501)
 964 062c 9140      		sbci r25,hi8(501)
 965 062e 8CF0      		brlt .L31
 966               	.L58:
 967 0630 82E0      		ldi r24,lo8(2)
 968               	.L59:
 969 0632 8A87      		std Y+10,r24
 970               	.LM93:
 971 0634 0EC0      		rjmp .L31
 972               	.L53:
 973               	.LM94:
 974 0636 8B85      		ldd r24,Y+11
 975 0638 9C85      		ldd r25,Y+12
 976 063a 8217      		cp r24,r18
 977 063c 9307      		cpc r25,r19
 978 063e 14F4      		brge .L54
 979               	.L57:
 980               	.LM95:
 981 0640 1A86      		std Y+10,__zero_reg__
 982 0642 07C0      		rjmp .L31
 983               	.L54:
 984               	.LM96:
 985 0644 40E0      		ldi r20,lo8(0)
 986 0646 50E0      		ldi r21,hi8(0)
 987 0648 BA01      		movw r22,r20
 988 064a 80E0      		ldi r24,lo8(uP+107)
 989 064c 90E0      		ldi r25,hi8(uP+107)
 990 064e 0E94 0000 		call _ZN5Motor13regulatePowerEii
 991               	.L31:
 992               	.LBE22:
 993               	.LBE21:
 994               	/* epilogue: frame size=0 */
 995 0652 DF91      		pop r29
 996 0654 CF91      		pop r28
 997 0656 1F91      		pop r17
 998 0658 0F91      		pop r16
 999 065a 0895      		ret
 1000               	/* epilogue end (size=5) */
 1001               	/* function void route::doDrive() size 126 (117) */
 1002               	.LFE14:
 1004               	.global	_ZN5route7executeEv
 1006               	_ZN5route7executeEv:
 1007               	.LFB20:
 1008               	.LM97:
 1009               	/* prologue: frame size=0 */
 1010               	/* prologue end (size=0) */
 1011               	.LBB23:
 1012               	.LM98:
 1013 065c 0E94 0000 		call _ZN5route7doDriveEv
 1014               	.LBE23:
 1015               	/* epilogue: frame size=0 */
 1016 0660 0895      		ret
 1017               	/* epilogue end (size=1) */
 1018               	/* function virtual void route::execute() size 3 (2) */
 1019               	.LFE20:
 1021               	.Letext0:
DEFINED SYMBOLS
                            *ABS*:00000000 route.c
                            *ABS*:0000003f __SREG__
                            *ABS*:0000003e __SP_H__
                            *ABS*:0000003d __SP_L__
                            *ABS*:00000000 __tmp_reg__
                            *ABS*:00000001 __zero_reg__
C:\DOCUME~1\Ejer\LOKALE~1\Temp/ccM7aaaa.s:22     .data:00000000 _ZTV5route
C:\DOCUME~1\Ejer\LOKALE~1\Temp/ccM7aaaa.s:1006   .text:0000065c _ZN5route7executeEv
C:\DOCUME~1\Ejer\LOKALE~1\Temp/ccM7aaaa.s:29     .text:00000000 _ZN5routeC2Eiiiiii
C:\DOCUME~1\Ejer\LOKALE~1\Temp/ccM7aaaa.s:128    .text:0000009e _ZN5routeC1Eiiiiii
C:\DOCUME~1\Ejer\LOKALE~1\Temp/ccM7aaaa.s:227    .text:0000013c _ZN5route12seekLineBackEv
C:\DOCUME~1\Ejer\LOKALE~1\Temp/ccM7aaaa.s:348    .text:000001fa _ZN5route12seekLineLeftEi
C:\DOCUME~1\Ejer\LOKALE~1\Temp/ccM7aaaa.s:407    .text:0000024c _ZN5route13seekLineRightEi
C:\DOCUME~1\Ejer\LOKALE~1\Temp/ccM7aaaa.s:466    .text:0000029e _ZN5route11waitForLineEv
                             .bss:00000000 _ZZN5route11driveOnLineEiiE12tickToCorner
C:\DOCUME~1\Ejer\LOKALE~1\Temp/ccM7aaaa.s:526    .bss:00000004 _ZZN5route11driveOnLineEiiE12lastDistance
C:\DOCUME~1\Ejer\LOKALE~1\Temp/ccM7aaaa.s:527    .bss:00000008 _ZZN5route11driveOnLineEiiE8lastLine
C:\DOCUME~1\Ejer\LOKALE~1\Temp/ccM7aaaa.s:528    .bss:0000000c _ZZN5route11driveOnLineEiiE6dState
C:\DOCUME~1\Ejer\LOKALE~1\Temp/ccM7aaaa.s:532    .text:000002f8 _ZN5route11driveOnLineEii
C:\DOCUME~1\Ejer\LOKALE~1\Temp/ccM7aaaa.s:529    .bss:00000010 _ZZN5route7doDriveEvE10spinUpTime
C:\DOCUME~1\Ejer\LOKALE~1\Temp/ccM7aaaa.s:850    .text:00000566 _ZN5route7doDriveEv

UNDEFINED SYMBOLS
__do_copy_data
__do_clear_bss
_ZN10TimerClassC2Ei
uP
_ZN5Motor13regulatePowerEii
_Z4ventl
_ZN11ADConverter8findLineEv
__divmodhi4
__mulsi3
_ZN15SpeedCalculator8getSpeedEv
__divmodsi4
