#FIG 3.2
Landscape
Center
Inches
Letter  
100.00
Single
-2
1200 2
6 2475 3075 3525 3525
6 2550 3150 3300 3375
4 0 0 50 -1 0 10 0.0000 4 135 750 2550 3300 Lokalisering\001
-6
2 4 0 1 0 7 50 -1 -1 0.000 0 0 7 0 0 5
	 3525 3525 3525 3075 2475 3075 2475 3525 3525 3525
4 0 0 50 -1 0 10 0.0000 4 135 555 2550 3450 opdateres\001
-6
6 2475 3975 3525 4275
2 4 0 1 0 7 50 -1 -1 0.000 0 0 7 0 0 5
	 3525 4275 3525 3975 2475 3975 2475 4275 3525 4275
4 0 0 50 -1 0 10 0.0000 4 105 555 2550 4200 Ankomst\001
-6
6 1050 2700 2025 3525
6 1125 2775 1425 3375
6 1125 2775 1425 3375
1 3 0 1 0 7 50 -1 -1 4.000 1 0.0000 1275 2925 106 106 1275 2925 1350 3000
2 1 0 1 0 7 50 -1 -1 4.000 0 0 -1 0 0 6
	 1275 3075 1275 3225 1125 3375 1275 3225 1425 3375 1275 3225
2 1 0 1 0 7 50 -1 -1 4.000 0 0 -1 0 0 2
	 1275 3075 1275 3000
2 1 0 1 0 7 50 -1 -1 4.000 0 0 -1 0 0 2
	 1125 3075 1425 3075
-6
-6
6 1592 2767 1976 3375
5 1 0 1 0 7 50 -1 -1 0.000 0 1 0 0 1894.997 3072.000 1895 2924 1747 3071 1895 3220
5 1 0 1 0 7 50 -1 -1 0.000 0 1 0 0 1896.503 3071.500 1895 2775 1600 3071 1895 3368
5 1 0 1 0 7 50 -1 -1 0.000 0 1 0 0 1890.483 3076.500 1894 2847 1661 3072 1894 3306
1 3 0 1 0 0 50 -1 20 0.000 0 -0.0000 1895 3071 74 74 1895 3071 1821 3071
-6
4 0 0 50 -1 0 10 0.0000 4 105 405 1050 3525 Person\001
4 0 0 50 -1 0 10 0.0000 4 105 405 1575 3525 Sensor\001
-6
2 1 0 1 0 7 50 -1 -1 0.000 0 0 -1 1 0 2
	2 1 1.00 60.00 120.00
	 3000 3525 3000 3975
2 1 0 1 0 7 50 -1 -1 0.000 0 0 -1 0 0 2
	 2475 3300 2100 3300
4 0 0 50 -1 0 10 0.0000 4 75 615 3075 3750 <<uses>>\001
