#FIG 3.2
Landscape
Center
Inches
Letter  
100.00
Single
-2
1200 2
6 4275 3075 6450 4650
5 1 0 1 0 7 50 -1 -1 0.000 0 0 0 0 4800.000 3562.500 4500 3525 4650 3300 4950 3300
5 1 0 1 0 7 50 -1 -1 0.000 0 0 0 0 5246.591 3501.137 4950 3300 5175 3150 5475 3225
5 1 0 1 0 7 50 -1 -1 0.000 0 0 0 0 5706.618 3408.088 5475 3225 5850 3150 6000 3375
5 1 0 1 0 7 50 -1 -1 0.000 0 0 0 0 6085.714 3578.571 6000 3375 6300 3525 6225 3750
5 1 0 1 0 7 50 -1 -1 0.000 0 0 0 0 6187.500 3937.500 6225 3750 6375 3975 6225 4125
5 1 0 1 0 7 50 -1 -1 0.000 0 0 0 0 5962.500 4112.500 6225 4125 6075 4350 5850 4350
5 1 0 1 0 7 50 -1 -1 0.000 0 0 0 0 5643.750 4293.750 5850 4350 5700 4500 5475 4425
5 1 0 1 0 7 50 -1 -1 0.000 0 0 0 0 5268.750 4368.750 5475 4425 5325 4575 5100 4500
5 1 0 1 0 7 50 -1 -1 0.000 0 0 0 0 4950.000 4331.250 5100 4500 4800 4500 4725 4350
5 1 0 1 0 7 50 -1 -1 0.000 0 0 0 0 4612.500 4187.500 4725 4350 4500 4350 4425 4125
5 1 0 1 0 7 50 -1 -1 0.000 0 0 0 0 4500.000 3975.000 4425 4125 4350 3900 4425 3825
5 1 0 1 0 7 50 -1 -1 0.000 0 0 0 0 4512.500 3687.500 4425 3825 4350 3675 4500 3525
-6
6 6900 2925 7725 3450
2 2 0 1 0 7 50 -1 -1 0.000 0 0 -1 0 0 5
	 6900 2925 7725 2925 7725 3450 6900 3450 6900 2925
2 1 0 1 0 7 50 -1 -1 0.000 0 0 -1 0 0 2
	 6900 3150 7725 3150
2 1 0 1 0 7 50 -1 -1 0.000 0 0 -1 0 0 2
	 6900 3300 7725 3300
4 0 0 50 -1 2 8 0.0000 4 90 645 6975 3075 KlientCaller\001
-6
6 2775 2550 3975 3825
2 1 0 1 0 7 50 -1 -1 0.000 0 0 -1 0 0 2
	 2775 2775 3975 2775
2 1 0 1 0 7 50 -1 -1 0.000 0 0 -1 0 0 2
	 2775 2925 3975 2925
2 2 0 1 0 7 50 -1 -1 0.000 0 0 -1 0 0 5
	 2775 2550 3975 2550 3975 3825 2775 3825 2775 2550
4 0 0 50 -1 1 8 0.0000 4 15 30 3375 3525 .\001
4 0 0 50 -1 1 8 0.0000 4 15 30 3375 3675 .\001
4 0 0 50 -1 0 8 0.0000 4 135 960 2850 3075 +getTemp(type):int\001
4 0 0 50 -1 0 8 0.0000 4 135 1005 2850 3225 +getWinState():bool\001
4 0 0 50 -1 0 8 0.0000 4 135 1035 2850 3375 +getAutomata():bool\001
4 0 0 50 -1 2 8 0.0000 4 90 540 3075 2700 GHServer\001
-6
6 2850 4500 3900 5250
2 1 0 1 0 7 50 -1 -1 0.000 0 0 -1 0 0 2
	 2850 4800 3900 4800
2 2 0 1 0 7 50 -1 -1 0.000 0 0 -1 0 0 5
	 2850 4500 3900 4500 3900 5250 2850 5250 2850 4500
2 1 0 1 0 7 50 -1 -1 0.000 0 0 -1 0 0 2
	 2850 4950 3900 4950
4 0 0 50 -1 2 8 0.0000 4 90 765 3000 4650 GHServerStub\001
4 0 0 50 -1 0 8 0.0000 4 120 435 2925 5100 +parse()\001
-6
2 1 0 1 0 7 50 -1 -1 0.000 0 0 -1 1 0 2
	0 0 1.00 60.00 120.00
	 7200 3450 7200 4500
2 1 0 1 0 7 50 -1 -1 0.000 0 0 -1 1 0 2
	0 0 1.00 60.00 120.00
	 3450 4500 3450 3825
2 1 1 1 0 7 50 -1 -1 4.000 0 0 -1 1 0 2
	0 0 1.00 60.00 120.00
	 3225 3825 3225 4500
2 1 1 1 0 7 50 -1 -1 4.000 0 0 -1 1 0 2
	0 0 1.00 60.00 120.00
	 3900 4800 4575 4350
2 1 1 1 0 7 50 -1 -1 4.000 0 0 -1 1 0 2
	0 0 1.00 60.00 120.00
	 6075 4350 6675 5025
2 1 1 1 0 7 50 -1 -1 4.000 0 0 -1 1 0 2
	0 0 1.00 60.00 120.00
	 7425 4500 7425 3450
2 1 0 1 0 7 50 -1 -1 0.000 0 0 -1 1 0 2
	0 0 1.00 60.00 120.00
	 6675 4725 6225 4200
2 1 0 1 0 7 50 -1 -1 0.000 0 0 -1 1 0 2
	0 0 1.00 60.00 120.00
	 4425 4275 3900 4575
2 1 0 1 0 7 50 -1 -1 0.000 0 0 -1 0 0 2
	 6675 4725 7875 4725
2 1 0 1 0 7 50 -1 -1 0.000 0 0 -1 0 0 2
	 6675 4875 7875 4875
2 2 0 1 0 7 50 -1 -1 0.000 0 0 -1 0 0 5
	 6675 4500 7875 4500 7875 5775 6675 5775 6675 4500
3 2 2 1 0 7 50 -1 -1 4.000 0 1 0 3
	0 0 1.00 60.00 120.00
	 6900 3075 5550 2550 3975 3300
	 0.000 -1.000 0.000
4 0 0 50 -1 0 10 0.0000 4 105 900 5250 2775 Pr\370ver at kalde\001
4 0 0 50 -1 2 16 0.0000 4 210 615 5025 3900 g1.net\001
4 0 0 50 -1 1 8 0.0000 4 15 30 7275 5475 .\001
4 0 0 50 -1 1 8 0.0000 4 15 30 7275 5625 .\001
4 0 0 50 -1 0 8 0.0000 4 135 960 6750 5025 +getTemp(type):int\001
4 0 0 50 -1 0 8 0.0000 4 135 1005 6750 5175 +getWinState():bool\001
4 0 0 50 -1 0 8 0.0000 4 135 1035 6750 5325 +getAutomata():bool\001
4 0 0 50 -1 2 8 0.0000 4 120 855 6825 4650 GHServerProxy\001
