#FIG 3.2
Landscape
Center
Inches
Letter  
100.00
Single
-2
1200 2
0 32 #414541
0 33 #c0c0c0
0 34 #e7e7e7
0 35 #717571
0 36 #9c0000
0 37 #8c8c8c
0 38 #424242
0 39 #8c8c8c
0 40 #424242
0 41 #8c8c8c
0 42 #8c8c8c
0 43 #424242
# Resistor
6 4125 4425 4800 4575
2 1 0 1 0 7 100 0 -1 0.000 0 0 -1 0 0 12
	 4125 4500 4270 4500 4294 4575 4342 4425 4390 4575 4438 4425
	 4486 4575 4534 4425 4582 4575 4630 4425 4654 4500 4800 4500
-6
# Resistor
6 4125 5025 4800 5175
2 1 0 1 0 7 100 0 -1 0.000 0 0 -1 0 0 12
	 4125 5100 4270 5100 4294 5175 4342 5025 4390 5175 4438 5025
	 4486 5175 4534 5025 4582 5175 4630 5025 4654 5100 4800 5100
-6
6 5550 4500 5850 5475
# Resistor
6 5625 4500 5775 5175
2 1 0 1 0 7 100 0 -1 0.000 0 0 -1 0 0 12
	 5700 4500 5700 4645 5625 4669 5775 4717 5625 4765 5775 4813
	 5625 4861 5775 4909 5625 4957 5775 5005 5700 5029 5700 5175
-6
# Ground
6 5550 5175 5850 5475
2 1 0 1 -1 -1 0 0 -1 0.000 0 0 -1 0 0 2
	 5700 5175 5700 5325
2 1 0 1 -1 -1 0 0 -1 0.000 0 0 -1 0 0 2
	 5550 5325 5850 5325
2 1 0 1 -1 -1 0 0 -1 0.000 0 0 -1 0 0 2
	 5625 5400 5775 5400
2 1 0 1 -1 -1 0 0 -1 0.000 0 0 -1 0 0 2
	 5670 5475 5745 5475
-6
-6
6 1350 4275 2925 4725
2 3 0 1 0 7 100 0 20 0.000 0 0 7 0 0 8
	 1351 4439 1351 4562 2249 4562 2249 4660 2863 4493 2249 4329
	 2249 4439 1351 4439
-6
6 1350 4875 2925 5325
2 3 0 1 0 7 100 0 20 0.000 0 0 7 0 0 8
	 1351 5039 1351 5162 2249 5162 2249 5260 2863 5093 2249 4929
	 2249 5039 1351 5039
-6
6 7050 4275 8625 4725
2 3 0 1 0 7 100 0 20 0.000 0 0 7 0 0 8
	 7051 4439 7051 4562 7949 4562 7949 4660 8563 4493 7949 4329
	 7949 4439 7051 4439
-6
2 1 0 1 0 7 50 -1 -1 0.000 0 0 -1 0 0 3
	 4800 4500 5700 4500 6900 4500
2 1 0 1 0 7 50 -1 -1 0.000 0 0 -1 0 0 2
	 4125 4500 3600 4500
2 1 0 1 0 7 50 -1 -1 0.000 0 0 -1 0 0 2
	 4125 5100 3600 5100
2 1 0 1 0 7 50 -1 -1 0.000 0 0 -1 0 0 3
	 4800 5100 5100 5100 5100 4500
2 1 0 1 0 7 50 -1 -1 4.000 0 0 -1 0 0 2
	 3600 4500 3300 4500
2 1 0 1 0 7 50 -1 -1 4.000 0 0 -1 0 0 2
	 3600 5100 3300 5100
2 1 0 1 0 7 50 -1 -1 4.000 0 0 -1 0 0 2
	 3000 4500 3300 4500
2 1 0 1 0 7 50 -1 -1 4.000 0 0 -1 0 0 2
	 3000 5100 3300 5100
2 1 1 1 0 7 50 -1 -1 4.000 0 0 -1 0 0 2
	 3900 3300 3900 6000
2 1 1 1 0 7 50 -1 -1 4.000 0 0 -1 0 0 2
	 5400 3300 5400 6000
4 0 0 50 -1 0 12 0.0000 4 135 360 4275 4950 1000\001
4 0 0 50 -1 0 12 0.0000 4 135 270 4350 4350 470\001
4 0 0 50 -1 0 12 0.0000 4 135 180 5925 4875 75\001
4 0 0 50 -1 0 12 0.0000 4 180 1215 4050 3825 Digital til analog\001
4 0 0 50 -1 0 12 0.0000 4 135 525 5700 3825 Sk\346rm\001
4 0 0 50 -1 0 12 0.0000 4 135 480 3300 3825 FPGA\001
4 0 0 50 -1 0 12 0.0000 4 180 1185 975 4950 Digital r\370d, bit 0\001
4 0 0 50 -1 0 12 0.0000 4 180 1185 975 4350 Digital r\370d, bit 1\001
4 0 0 50 -1 0 12 0.0000 4 180 825 7050 4350 Analog r\370d\001
