#FIG 3.2
Landscape
Center
Metric
A4      
100.00
Single
-2
1200 2
0 32 #aaaaaa
6 5805 3015 6615 4500
2 1 0 1 0 7 50 0 -1 0.000 0 0 -1 1 0 2
	0 0 1.00 60.00 120.00
	 6435 3870 6435 3555
2 1 0 1 0 7 50 0 -1 0.000 0 0 -1 1 0 2
	0 0 1.00 60.00 120.00
	 5985 3555 5985 3870
2 2 0 1 0 11 50 0 20 0.000 0 0 -1 0 0 5
	 5805 3870 6615 3870 6615 4500 5805 4500 5805 3870
4 0 0 50 0 0 12 0.0000 4 180 615 5895 3375 Signaler\001
4 0 0 50 0 0 12 0.0000 4 135 555 5895 3150 DATA/\001
4 0 0 50 0 0 12 0.0000 4 135 360 6030 4140 CPU\001
-6
6 7380 3015 8190 4500
2 1 0 1 0 7 50 0 -1 0.000 0 0 -1 1 0 2
	0 0 1.00 60.00 120.00
	 8010 3870 8010 3555
2 1 0 1 0 7 50 0 -1 0.000 0 0 -1 1 0 2
	0 0 1.00 60.00 120.00
	 7560 3555 7560 3870
2 2 0 1 0 11 50 0 20 0.000 0 0 -1 0 0 5
	 7380 3870 8190 3870 8190 4500 7380 4500 7380 3870
4 0 0 50 0 0 12 0.0000 4 180 615 7470 3375 Signaler\001
4 0 0 50 0 0 12 0.0000 4 135 555 7470 3150 DATA/\001
4 0 0 50 0 0 12 0.0000 4 135 360 7605 4140 CPU\001
-6
6 4230 3015 5040 4500
2 1 0 1 0 7 50 0 -1 0.000 0 0 -1 1 0 2
	0 0 1.00 60.00 120.00
	 4860 3870 4860 3555
2 1 0 1 0 7 50 0 -1 0.000 0 0 -1 1 0 2
	0 0 1.00 60.00 120.00
	 4410 3555 4410 3870
2 2 0 1 0 11 50 0 20 0.000 0 0 -1 0 0 5
	 4230 3870 5040 3870 5040 4500 4230 4500 4230 3870
4 0 0 50 0 0 12 0.0000 4 180 615 4320 3375 Signaler\001
4 0 0 50 0 0 12 0.0000 4 135 555 4320 3150 DATA/\001
4 0 0 50 0 0 12 0.0000 4 135 360 4455 4140 CPU\001
-6
2 1 0 1 0 7 50 0 -1 0.000 0 0 -1 0 0 2
	 6255 4500 6255 5625
2 1 0 1 0 7 50 0 -1 0.000 0 0 -1 0 0 4
	 4680 4500 4680 4950 7830 4950 7830 4500
2 2 0 1 0 11 50 0 20 0.000 0 0 -1 0 0 5
	 5535 5625 6840 5625 6840 6570 5535 6570 5535 5625
2 2 0 0 0 32 51 0 20 0.000 0 0 -1 0 0 5
	 4275 3915 5130 3915 5130 4545 4275 4545 4275 3915
2 2 0 0 0 32 51 0 20 0.000 0 0 -1 0 0 5
	 5580 5670 6930 5670 6930 6615 5580 6615 5580 5670
2 2 0 0 0 32 51 0 20 0.000 0 0 -1 0 0 5
	 5850 3915 6705 3915 6705 4545 5850 4545 5850 3915
2 2 0 0 0 32 51 0 20 0.000 0 0 -1 0 0 5
	 7425 3915 8280 3915 8280 4545 7425 4545 7425 3915
2 2 0 1 0 7 50 0 -1 0.000 0 0 -1 0 0 5
	 3690 1845 8865 1845 8865 7200 3690 7200 3690 1845
4 0 0 50 0 0 12 0.0000 4 135 885 5805 6120 F\346lles data\001
4 0 0 50 0 0 12 0.0000 4 135 180 6120 4365 #2\001
4 0 0 50 0 0 12 0.0000 4 135 180 7740 4365 #3\001
4 0 0 50 0 0 12 0.0000 4 135 180 4545 4365 #1\001
4 0 0 50 0 10 25 0.0000 4 330 3435 4545 2565 Spartan 2 - FPGA\001
4 0 0 50 0 0 20 0.0000 4 255 2565 5085 6930 Multiprocessor system\001
