#FIG 3.2
Landscape
Center
Metric
A4      
100.00
Single
-2
1200 2
0 32 #909090
0 33 #e6e4ce
0 34 #9b9b9b
0 35 #ce9100
0 36 #f762aa
0 37 #7070ff
0 38 #5f5f5f
6 3015 7560 4230 7965
2 2 0 1 0 0 50 0 -1 4.000 0 0 -1 0 0 5
	 3015 7560 4230 7560 4230 7965 3015 7965 3015 7560
4 0 0 50 0 0 12 0.0000 4 180 1050 3105 7830 System Clock\001
-6
6 5265 3375 5625 4815
2 1 0 1 0 7 50 0 -1 0.000 0 0 -1 0 0 2
	 5310 3375 5310 4635
2 1 0 1 0 7 50 0 -1 0.000 0 0 -1 0 0 2
	 5580 3375 5580 4635
2 1 0 1 0 7 50 0 -1 0.000 0 0 -1 0 0 3
	 5265 4590 5445 4815 5625 4590
4 0 0 50 0 0 12 1.5708 4 135 375 5490 4230 Addr\001
-6
6 4680 5355 5040 6525
2 1 0 1 0 7 50 0 -1 0.000 0 0 -1 0 0 3
	 4680 5580 4860 5355 5040 5580
2 1 0 1 0 7 50 0 -1 0.000 0 0 -1 0 0 2
	 4725 5535 4725 6345
2 1 0 1 0 7 50 0 -1 0.000 0 0 -1 0 0 2
	 4995 5535 4995 6345
2 1 0 1 0 7 50 0 -1 0.000 0 0 -1 0 0 3
	 4680 6300 4860 6525 5040 6300
4 0 0 50 0 0 12 1.5708 4 135 375 4905 6120 Data\001
-6
6 5310 5355 5670 6525
2 1 0 1 0 7 50 0 -1 0.000 0 0 -1 0 0 2
	 5355 5355 5355 6345
2 1 0 1 0 7 50 0 -1 0.000 0 0 -1 0 0 2
	 5625 5355 5625 6345
2 1 0 1 0 7 50 0 -1 0.000 0 0 -1 0 0 3
	 5310 6300 5490 6525 5670 6300
4 0 0 50 0 0 12 1.5708 4 135 375 5535 6120 Addr\001
-6
6 17055 3375 17415 4815
2 1 0 1 0 7 50 0 -1 0.000 0 0 -1 0 0 2
	 17100 3375 17100 4635
2 1 0 1 0 7 50 0 -1 0.000 0 0 -1 0 0 2
	 17370 3375 17370 4635
2 1 0 1 0 7 50 0 -1 0.000 0 0 -1 0 0 3
	 17055 4590 17235 4815 17415 4590
4 0 0 50 0 0 12 1.5708 4 135 375 17280 4230 Addr\001
-6
6 16470 5355 16830 6525
2 1 0 1 0 7 50 0 -1 0.000 0 0 -1 0 0 3
	 16470 5580 16650 5355 16830 5580
2 1 0 1 0 7 50 0 -1 0.000 0 0 -1 0 0 2
	 16515 5535 16515 6345
2 1 0 1 0 7 50 0 -1 0.000 0 0 -1 0 0 2
	 16785 5535 16785 6345
2 1 0 1 0 7 50 0 -1 0.000 0 0 -1 0 0 3
	 16470 6300 16650 6525 16830 6300
4 0 0 50 0 0 12 1.5708 4 135 375 16695 6120 Data\001
-6
6 17100 5355 17460 6525
2 1 0 1 0 7 50 0 -1 0.000 0 0 -1 0 0 2
	 17145 5355 17145 6345
2 1 0 1 0 7 50 0 -1 0.000 0 0 -1 0 0 2
	 17415 5355 17415 6345
2 1 0 1 0 7 50 0 -1 0.000 0 0 -1 0 0 3
	 17100 6300 17280 6525 17460 6300
4 0 0 50 0 0 12 1.5708 4 135 375 17325 6120 Addr\001
-6
6 9180 3375 9540 4815
2 1 0 1 0 7 50 0 -1 0.000 0 0 -1 0 0 2
	 9225 3375 9225 4635
2 1 0 1 0 7 50 0 -1 0.000 0 0 -1 0 0 2
	 9495 3375 9495 4635
2 1 0 1 0 7 50 0 -1 0.000 0 0 -1 0 0 3
	 9180 4590 9360 4815 9540 4590
4 0 0 50 0 0 12 1.5708 4 135 375 9405 4230 Addr\001
-6
6 9225 5355 9585 6525
2 1 0 1 0 7 50 0 -1 0.000 0 0 -1 0 0 2
	 9270 5355 9270 6345
2 1 0 1 0 7 50 0 -1 0.000 0 0 -1 0 0 2
	 9540 5355 9540 6345
2 1 0 1 0 7 50 0 -1 0.000 0 0 -1 0 0 3
	 9225 6300 9405 6525 9585 6300
4 0 0 50 0 0 12 1.5708 4 135 375 9450 6120 Addr\001
-6
6 13140 3375 13500 4815
2 1 0 1 0 7 50 0 -1 0.000 0 0 -1 0 0 2
	 13185 3375 13185 4635
2 1 0 1 0 7 50 0 -1 0.000 0 0 -1 0 0 2
	 13455 3375 13455 4635
2 1 0 1 0 7 50 0 -1 0.000 0 0 -1 0 0 3
	 13140 4590 13320 4815 13500 4590
4 0 0 50 0 0 12 1.5708 4 135 375 13365 4230 Addr\001
-6
6 12555 5355 12915 6525
2 1 0 1 0 7 50 0 -1 0.000 0 0 -1 0 0 3
	 12555 5580 12735 5355 12915 5580
2 1 0 1 0 7 50 0 -1 0.000 0 0 -1 0 0 2
	 12600 5535 12600 6345
2 1 0 1 0 7 50 0 -1 0.000 0 0 -1 0 0 2
	 12870 5535 12870 6345
2 1 0 1 0 7 50 0 -1 0.000 0 0 -1 0 0 3
	 12555 6300 12735 6525 12915 6300
4 0 0 50 0 0 12 1.5708 4 135 375 12780 6120 Data\001
-6
6 13185 5355 13545 6525
2 1 0 1 0 7 50 0 -1 0.000 0 0 -1 0 0 2
	 13230 5355 13230 6345
2 1 0 1 0 7 50 0 -1 0.000 0 0 -1 0 0 2
	 13500 5355 13500 6345
2 1 0 1 0 7 50 0 -1 0.000 0 0 -1 0 0 3
	 13185 6300 13365 6525 13545 6300
4 0 0 50 0 0 12 1.5708 4 135 375 13410 6120 Addr\001
-6
6 10890 6705 11250 8145
2 1 0 1 0 7 50 0 -1 0.000 0 0 -1 0 0 2
	 10935 6705 10935 7965
2 1 0 1 0 7 50 0 -1 0.000 0 0 -1 0 0 2
	 11205 6705 11205 7965
2 1 0 1 0 7 50 0 -1 0.000 0 0 -1 0 0 3
	 10890 7920 11070 8145 11250 7920
4 0 0 50 0 0 12 1.5708 4 135 375 11115 7560 Addr\001
-6
6 8595 3375 8955 4815
2 1 0 1 0 7 50 0 -1 0.000 0 0 -1 0 0 2
	 8640 3555 8640 4635
2 1 0 1 0 7 50 0 -1 0.000 0 0 -1 0 0 2
	 8910 3555 8910 4635
2 1 0 1 0 7 50 0 -1 0.000 0 0 -1 0 0 3
	 8595 4590 8775 4815 8955 4590
2 1 0 1 0 7 50 0 -1 0.000 0 0 -1 0 0 3
	 8595 3600 8775 3375 8955 3600
4 0 0 50 0 0 12 1.5708 4 135 375 8820 4275 Data\001
-6
6 10395 6705 10755 8145
2 1 0 1 0 7 50 0 -1 0.000 0 0 -1 0 0 2
	 10440 6885 10440 7965
2 1 0 1 0 7 50 0 -1 0.000 0 0 -1 0 0 2
	 10710 6885 10710 7965
2 1 0 1 0 7 50 0 -1 0.000 0 0 -1 0 0 3
	 10395 7920 10575 8145 10755 7920
2 1 0 1 0 7 50 0 -1 0.000 0 0 -1 0 0 3
	 10395 6930 10575 6705 10755 6930
4 0 0 50 0 0 12 1.5708 4 135 375 10620 7605 Data\001
-6
6 13725 3375 14085 4815
2 1 0 1 0 7 50 0 -1 0.000 0 0 -1 0 0 2
	 13770 3555 13770 4635
2 1 0 1 0 7 50 0 -1 0.000 0 0 -1 0 0 2
	 14040 3555 14040 4635
2 1 0 1 0 7 50 0 -1 0.000 0 0 -1 0 0 3
	 13725 4590 13905 4815 14085 4590
2 1 0 1 0 7 50 0 -1 0.000 0 0 -1 0 0 3
	 13725 3600 13905 3375 14085 3600
4 0 0 50 0 0 12 1.5708 4 135 555 13950 4365 Control\001
-6
6 8595 5355 8955 6525
6 8595 5355 8955 6525
2 1 0 1 0 7 50 0 -1 0.000 0 0 -1 0 0 3
	 8595 5580 8775 5355 8955 5580
2 1 0 1 0 7 50 0 -1 0.000 0 0 -1 0 0 2
	 8640 5535 8640 6345
2 1 0 1 0 7 50 0 -1 0.000 0 0 -1 0 0 2
	 8910 5535 8910 6345
2 1 0 1 0 7 50 0 -1 0.000 0 0 -1 0 0 3
	 8595 6300 8775 6525 8955 6300
4 0 0 50 0 0 12 1.5708 4 135 375 8820 6120 Data\001
-6
-6
6 13725 5355 14085 6525
2 1 0 1 0 7 50 0 -1 0.000 0 0 -1 0 0 3
	 13725 5580 13905 5355 14085 5580
2 1 0 1 0 7 50 0 -1 0.000 0 0 -1 0 0 2
	 13770 5535 13770 6345
2 1 0 1 0 7 50 0 -1 0.000 0 0 -1 0 0 2
	 14040 5535 14040 6345
2 1 0 1 0 7 50 0 -1 0.000 0 0 -1 0 0 3
	 13725 6300 13905 6525 14085 6300
4 0 0 50 0 0 12 1.5708 4 135 555 13950 6255 Control\001
-6
6 11430 6705 11790 8145
2 1 0 1 0 7 50 0 -1 0.000 0 0 -1 0 0 2
	 11475 6885 11475 7965
2 1 0 1 0 7 50 0 -1 0.000 0 0 -1 0 0 2
	 11745 6885 11745 7965
2 1 0 1 0 7 50 0 -1 0.000 0 0 -1 0 0 3
	 11430 7920 11610 8145 11790 7920
2 1 0 1 0 7 50 0 -1 0.000 0 0 -1 0 0 3
	 11430 6930 11610 6705 11790 6930
4 0 0 50 0 0 12 1.5708 4 135 555 11655 7695 Control\001
-6
6 9765 3375 10125 6525
6 9765 3375 10125 4815
2 1 0 1 0 7 50 0 -1 0.000 0 0 -1 0 0 2
	 9810 3555 9810 4635
2 1 0 1 0 7 50 0 -1 0.000 0 0 -1 0 0 2
	 10080 3555 10080 4635
2 1 0 1 0 7 50 0 -1 0.000 0 0 -1 0 0 3
	 9765 4590 9945 4815 10125 4590
2 1 0 1 0 7 50 0 -1 0.000 0 0 -1 0 0 3
	 9765 3600 9945 3375 10125 3600
4 0 0 50 0 0 12 1.5708 4 135 555 9990 4365 Control\001
-6
6 9765 5355 10125 6525
2 1 0 1 0 7 50 0 -1 0.000 0 0 -1 0 0 3
	 9765 5580 9945 5355 10125 5580
2 1 0 1 0 7 50 0 -1 0.000 0 0 -1 0 0 2
	 9810 5535 9810 6345
2 1 0 1 0 7 50 0 -1 0.000 0 0 -1 0 0 2
	 10080 5535 10080 6345
2 1 0 1 0 7 50 0 -1 0.000 0 0 -1 0 0 3
	 9765 6300 9945 6525 10125 6300
4 0 0 50 0 0 12 1.5708 4 135 555 9990 6255 Control\001
-6
-6
6 5850 3375 6210 6525
6 5850 3375 6210 4815
2 1 0 1 0 7 50 0 -1 0.000 0 0 -1 0 0 2
	 5895 3555 5895 4635
2 1 0 1 0 7 50 0 -1 0.000 0 0 -1 0 0 2
	 6165 3555 6165 4635
2 1 0 1 0 7 50 0 -1 0.000 0 0 -1 0 0 3
	 5850 4590 6030 4815 6210 4590
2 1 0 1 0 7 50 0 -1 0.000 0 0 -1 0 0 3
	 5850 3600 6030 3375 6210 3600
4 0 0 50 0 0 12 1.5708 4 135 555 6075 4365 Control\001
-6
6 5850 5355 6210 6525
2 1 0 1 0 7 50 0 -1 0.000 0 0 -1 0 0 3
	 5850 5580 6030 5355 6210 5580
2 1 0 1 0 7 50 0 -1 0.000 0 0 -1 0 0 2
	 5895 5535 5895 6345
2 1 0 1 0 7 50 0 -1 0.000 0 0 -1 0 0 2
	 6165 5535 6165 6345
2 1 0 1 0 7 50 0 -1 0.000 0 0 -1 0 0 3
	 5850 6300 6030 6525 6210 6300
4 0 0 50 0 0 12 1.5708 4 135 555 6075 6255 Control\001
-6
-6
6 17640 3375 18000 6525
6 17640 3375 18000 4815
2 1 0 1 0 7 50 0 -1 0.000 0 0 -1 0 0 2
	 17685 3555 17685 4635
2 1 0 1 0 7 50 0 -1 0.000 0 0 -1 0 0 2
	 17955 3555 17955 4635
2 1 0 1 0 7 50 0 -1 0.000 0 0 -1 0 0 3
	 17640 4590 17820 4815 18000 4590
2 1 0 1 0 7 50 0 -1 0.000 0 0 -1 0 0 3
	 17640 3600 17820 3375 18000 3600
4 0 0 50 0 0 12 1.5708 4 135 555 17865 4365 Control\001
-6
6 17640 5355 18000 6525
2 1 0 1 0 7 50 0 -1 0.000 0 0 -1 0 0 3
	 17640 5580 17820 5355 18000 5580
2 1 0 1 0 7 50 0 -1 0.000 0 0 -1 0 0 2
	 17685 5535 17685 6345
2 1 0 1 0 7 50 0 -1 0.000 0 0 -1 0 0 2
	 17955 5535 17955 6345
2 1 0 1 0 7 50 0 -1 0.000 0 0 -1 0 0 3
	 17640 6300 17820 6525 18000 6300
4 0 0 50 0 0 12 1.5708 4 135 555 17865 6255 Control\001
-6
-6
2 1 0 1 0 0 50 0 -1 0.000 0 0 -1 1 0 2
	0 0 1.00 60.00 120.00
	 2790 5085 3645 5085
2 1 1 1 0 0 50 0 -1 4.000 0 0 -1 1 0 4
	0 0 1.00 60.00 120.00
	 2790 5715 2430 5715 2430 5085 2790 5085
2 1 0 1 0 0 50 0 -1 4.000 0 0 -1 0 0 2
	 4725 6165 3645 6165
2 1 0 1 0 0 50 0 -1 0.000 0 0 -1 0 0 2
	 1620 4815 2790 4815
2 2 0 1 0 0 50 0 -1 0.000 0 0 -1 0 0 5
	 2790 6120 1620 6120 1620 4590 2790 4590 2790 6120
2 1 0 1 0 0 50 0 -1 4.000 0 0 -1 0 0 2
	 3645 6705 3645 7560
2 1 0 1 0 0 50 0 -1 4.000 0 0 -1 1 0 2
	0 0 1.00 60.00 120.00
	 6345 5085 7560 5085
2 1 0 1 0 0 50 0 -1 0.000 0 0 -1 1 0 2
	0 0 1.00 60.00 120.00
	 4725 5940 2790 5940
2 1 0 1 0 0 50 0 -1 0.000 0 0 -1 1 0 2
	0 0 1.00 60.00 120.00
	 4725 5715 2790 5715
2 1 0 1 0 0 50 0 -1 4.000 0 0 -1 0 0 2
	 6165 5715 7560 5715
2 1 0 1 0 0 50 0 -1 4.000 0 0 -1 0 0 2
	 6165 6165 7560 6165
2 1 0 1 0 7 50 0 19 0.000 0 0 -1 0 0 2
	 4995 5715 5355 5715
2 1 0 1 0 0 50 0 -1 4.000 0 0 -1 1 0 2
	0 0 1.00 60.00 120.00
	 4455 5355 4455 5715
2 1 0 1 0 0 50 0 -1 4.000 0 0 -1 1 1 2
	0 0 1.00 60.00 120.00
	0 0 1.00 60.00 120.00
	 3915 5355 3915 5940
2 1 0 1 0 7 50 0 19 0.000 0 0 -1 0 0 2
	 4995 6165 5355 6165
2 1 0 1 0 0 50 0 -1 4.000 0 0 -1 1 0 2
	0 0 1.00 60.00 120.00
	 4185 6165 4185 5355
2 1 0 1 0 0 50 0 -1 4.000 0 0 -1 0 0 2
	 3645 6165 3645 6525
2 2 0 1 0 7 50 0 -1 0.000 0 0 -1 0 0 5
	 3645 4815 6345 4815 6345 5355 3645 5355 3645 4815
2 1 0 1 0 7 50 0 -1 0.000 0 0 -1 0 0 2
	 4680 3555 4680 4635
2 1 0 1 0 7 50 0 -1 0.000 0 0 -1 0 0 2
	 4950 3555 4950 4635
2 1 0 1 0 7 50 0 -1 0.000 0 0 -1 0 0 3
	 4635 4590 4815 4815 4995 4590
2 1 0 1 0 7 50 0 -1 0.000 0 0 -1 0 0 3
	 4635 3600 4815 3375 4995 3600
2 2 0 1 0 7 50 0 -1 0.000 0 0 -1 0 0 5
	 3645 1800 6390 1800 6390 3375 3645 3375 3645 1800
2 1 0 1 0 7 50 0 -1 0.000 0 0 -1 1 0 2
	0 0 1.00 60.00 120.00
	 3780 4320 3780 4815
2 1 0 1 0 7 50 0 -1 0.000 0 0 -1 1 0 2
	0 0 1.00 60.00 120.00
	 4095 4815 4095 4320
2 1 0 1 0 7 50 0 -1 0.000 0 0 -1 1 0 2
	0 0 1.00 60.00 120.00
	 3780 3375 3780 3870
2 1 0 1 0 7 50 0 -1 0.000 0 0 -1 1 0 2
	0 0 1.00 60.00 120.00
	 4095 3870 4095 3375
2 1 0 1 0 0 50 0 -1 4.000 0 0 -1 0 0 2
	 5625 5715 5895 5715
2 1 0 1 0 0 50 0 -1 4.000 0 0 -1 0 0 2
	 5625 6165 5895 6165
2 1 0 1 0 7 50 0 19 0.000 0 0 -1 0 0 2
	 4995 5940 5355 5940
2 1 0 1 0 0 50 0 -1 4.000 0 0 -1 0 0 2
	 5625 5940 5895 5940
2 1 0 1 0 0 50 0 -1 4.000 0 0 -1 0 0 2
	 6165 5940 7560 5940
2 1 0 1 0 7 50 0 -1 0.000 0 0 -1 0 0 2
	 3420 6525 18045 6525
2 1 0 1 0 7 50 0 -1 0.000 0 0 -1 0 0 2
	 18045 6705 3420 6705
2 1 0 1 0 0 50 0 -1 4.000 0 0 -1 1 0 2
	0 0 1.00 60.00 120.00
	 16245 5355 16245 5715
2 1 0 1 0 0 50 0 -1 4.000 0 0 -1 1 1 2
	0 0 1.00 60.00 120.00
	0 0 1.00 60.00 120.00
	 15705 5355 15705 5940
2 1 0 1 0 0 50 0 -1 4.000 0 0 -1 1 0 2
	0 0 1.00 60.00 120.00
	 15975 6165 15975 5355
2 2 0 1 0 7 50 0 -1 0.000 0 0 -1 0 0 5
	 15435 4815 18135 4815 18135 5355 15435 5355 15435 4815
2 1 0 1 0 7 50 0 -1 0.000 0 0 -1 0 0 2
	 16470 3555 16470 4635
2 1 0 1 0 7 50 0 -1 0.000 0 0 -1 0 0 2
	 16740 3555 16740 4635
2 1 0 1 0 7 50 0 -1 0.000 0 0 -1 0 0 3
	 16425 4590 16605 4815 16785 4590
2 1 0 1 0 7 50 0 -1 0.000 0 0 -1 0 0 3
	 16425 3600 16605 3375 16785 3600
2 2 0 1 0 7 50 0 -1 0.000 0 0 -1 0 0 5
	 15435 1800 18180 1800 18180 3375 15435 3375 15435 1800
2 1 0 1 0 7 50 0 -1 0.000 0 0 -1 1 0 2
	0 0 1.00 60.00 120.00
	 15570 4320 15570 4815
2 1 0 1 0 7 50 0 -1 0.000 0 0 -1 1 0 2
	0 0 1.00 60.00 120.00
	 15885 4815 15885 4320
2 1 0 1 0 7 50 0 -1 0.000 0 0 -1 1 0 2
	0 0 1.00 60.00 120.00
	 15570 3375 15570 3870
2 1 0 1 0 7 50 0 -1 0.000 0 0 -1 1 0 2
	0 0 1.00 60.00 120.00
	 15885 3870 15885 3375
2 1 0 1 0 0 50 0 -1 4.000 0 0 -1 0 0 2
	 15975 6165 15435 6165
2 1 0 1 0 0 50 0 -1 4.000 0 0 -1 0 0 2
	 16245 5715 15435 5715
2 1 0 1 0 0 50 0 -1 4.000 0 0 -1 0 0 2
	 15705 5940 15435 5940
2 1 0 1 0 7 50 0 19 0.000 0 0 -1 0 0 2
	 8910 5715 9270 5715
2 1 0 1 0 0 50 0 -1 4.000 0 0 -1 1 0 2
	0 0 1.00 60.00 120.00
	 8370 5355 8370 5715
2 1 0 1 0 0 50 0 -1 4.000 0 0 -1 1 1 2
	0 0 1.00 60.00 120.00
	0 0 1.00 60.00 120.00
	 7830 5355 7830 5940
2 1 0 1 0 7 50 0 19 0.000 0 0 -1 0 0 2
	 8910 6165 9270 6165
2 1 0 1 0 0 50 0 -1 4.000 0 0 -1 1 0 2
	0 0 1.00 60.00 120.00
	 8100 6165 8100 5355
2 2 0 1 0 7 50 0 -1 0.000 0 0 -1 0 0 5
	 7560 4815 10260 4815 10260 5355 7560 5355 7560 4815
2 2 0 1 0 7 50 0 -1 0.000 0 0 -1 0 0 5
	 7560 1800 10305 1800 10305 3375 7560 3375 7560 1800
2 1 0 1 0 7 50 0 -1 0.000 0 0 -1 1 0 2
	0 0 1.00 60.00 120.00
	 7695 4320 7695 4815
2 1 0 1 0 7 50 0 -1 0.000 0 0 -1 1 0 2
	0 0 1.00 60.00 120.00
	 8010 4815 8010 4320
2 1 0 1 0 7 50 0 -1 0.000 0 0 -1 1 0 2
	0 0 1.00 60.00 120.00
	 7695 3375 7695 3870
2 1 0 1 0 7 50 0 -1 0.000 0 0 -1 1 0 2
	0 0 1.00 60.00 120.00
	 8010 3870 8010 3375
2 1 0 1 0 0 50 0 -1 4.000 0 0 -1 0 0 2
	 9540 5715 9810 5715
2 1 0 1 0 0 50 0 -1 4.000 0 0 -1 0 0 2
	 9540 6165 9810 6165
2 1 0 1 0 0 50 0 -1 4.000 0 0 -1 0 0 2
	 8640 6165 7560 6165
2 1 0 1 0 0 50 0 -1 4.000 0 0 -1 0 0 2
	 8640 5715 7560 5715
2 1 0 1 0 0 50 0 -1 4.000 0 0 -1 0 0 2
	 8640 5940 7560 5940
2 1 0 1 0 7 50 0 19 0.000 0 0 -1 0 0 2
	 8910 5940 9270 5940
2 1 0 1 0 0 50 0 -1 4.000 0 0 -1 0 0 2
	 9540 5940 9810 5940
2 1 0 1 0 0 50 0 -1 4.000 0 0 -1 0 0 2
	 10080 5715 11475 5715
2 1 0 1 0 0 50 0 -1 4.000 0 0 -1 1 0 2
	0 0 1.00 60.00 120.00
	 10260 5085 11475 5085
2 1 0 1 0 0 50 0 -1 4.000 0 0 -1 0 0 2
	 10080 5940 11475 5940
2 1 0 1 0 0 50 0 -1 4.000 0 0 -1 0 0 2
	 10080 6165 11475 6165
2 1 0 1 0 7 50 0 19 0.000 0 0 -1 0 0 2
	 12870 5715 13230 5715
2 1 0 1 0 0 50 0 -1 4.000 0 0 -1 1 0 2
	0 0 1.00 60.00 120.00
	 12330 5355 12330 5715
2 1 0 1 0 0 50 0 -1 4.000 0 0 -1 1 1 2
	0 0 1.00 60.00 120.00
	0 0 1.00 60.00 120.00
	 11790 5355 11790 5940
2 1 0 1 0 7 50 0 19 0.000 0 0 -1 0 0 2
	 12870 6165 13230 6165
2 1 0 1 0 0 50 0 -1 4.000 0 0 -1 1 0 2
	0 0 1.00 60.00 120.00
	 12060 6165 12060 5355
2 2 0 1 0 7 50 0 -1 0.000 0 0 -1 0 0 5
	 11520 4815 14220 4815 14220 5355 11520 5355 11520 4815
2 1 0 1 0 7 50 0 -1 0.000 0 0 -1 0 0 2
	 12555 3555 12555 4635
2 1 0 1 0 7 50 0 -1 0.000 0 0 -1 0 0 2
	 12825 3555 12825 4635
2 1 0 1 0 7 50 0 -1 0.000 0 0 -1 0 0 3
	 12510 4590 12690 4815 12870 4590
2 1 0 1 0 7 50 0 -1 0.000 0 0 -1 0 0 3
	 12510 3600 12690 3375 12870 3600
2 2 0 1 0 7 50 0 -1 0.000 0 0 -1 0 0 5
	 11520 1800 14265 1800 14265 3375 11520 3375 11520 1800
2 1 0 1 0 7 50 0 -1 0.000 0 0 -1 1 0 2
	0 0 1.00 60.00 120.00
	 11655 4320 11655 4815
2 1 0 1 0 7 50 0 -1 0.000 0 0 -1 1 0 2
	0 0 1.00 60.00 120.00
	 11970 4815 11970 4320
2 1 0 1 0 7 50 0 -1 0.000 0 0 -1 1 0 2
	0 0 1.00 60.00 120.00
	 11655 3375 11655 3870
2 1 0 1 0 7 50 0 -1 0.000 0 0 -1 1 0 2
	0 0 1.00 60.00 120.00
	 11970 3870 11970 3375
2 1 0 1 0 0 50 0 -1 4.000 0 0 -1 0 0 2
	 13500 5715 13770 5715
2 1 0 1 0 0 50 0 -1 4.000 0 0 -1 0 0 2
	 13500 6165 13770 6165
2 1 0 1 0 0 50 0 -1 4.000 0 0 -1 0 0 2
	 12600 6165 11520 6165
2 1 0 1 0 0 50 0 -1 4.000 0 0 -1 0 0 2
	 12600 5715 11520 5715
2 1 0 1 0 0 50 0 -1 4.000 0 0 -1 0 0 2
	 12600 5940 11520 5940
2 1 0 1 0 7 50 0 19 0.000 0 0 -1 0 0 2
	 12870 5940 13230 5940
2 1 0 1 0 0 50 0 -1 4.000 0 0 -1 0 0 2
	 13500 5940 13770 5940
2 1 0 1 0 0 50 0 -1 4.000 0 0 -1 0 0 2
	 14040 5715 15435 5715
2 1 0 1 0 0 50 0 -1 4.000 0 0 -1 1 0 2
	0 0 1.00 60.00 120.00
	 14220 5085 15435 5085
2 1 0 1 0 0 50 0 -1 4.000 0 0 -1 0 0 2
	 14040 5940 15435 5940
2 1 0 1 0 0 50 0 -1 4.000 0 0 -1 0 0 2
	 14040 6165 15435 6165
2 2 0 1 0 0 50 0 -1 4.000 0 0 -1 0 0 5
	 10125 8145 12150 8145 12150 9045 10125 9045 10125 8145
2 2 0 0 0 11 51 0 20 0.000 0 0 -1 0 0 5
	 3420 6525 18045 6525 18045 6705 3420 6705 3420 6525
4 0 0 50 0 0 12 0.0000 4 180 630 1755 5715 Request\001
4 0 0 50 0 0 12 0.0000 4 135 435 1890 5130 Grant\001
4 0 0 50 0 0 12 0.0000 4 180 390 2340 5985 Busy\001
4 0 0 50 0 0 12 0.0000 4 135 1095 1665 4770 Bus Controller\001
4 0 0 50 0 0 12 0.0000 4 135 255 3285 6210 Clk\001
4 0 0 50 0 0 12 0.0000 4 135 900 4365 5130 Bus Master\001
4 0 0 50 0 0 12 1.5708 4 135 375 4860 4275 Data\001
4 0 0 50 0 0 12 0.0000 4 135 360 4860 2655 CPU\001
4 0 0 50 0 0 12 1.5708 4 165 375 3825 4230 REQ\001
4 0 0 50 0 0 12 1.5708 4 135 360 4140 4275 CLK\001
4 0 0 50 0 0 12 0.0000 4 135 840 8730 6660 central bus\001
4 0 0 50 0 0 12 0.0000 4 135 900 16155 5130 Bus Master\001
4 0 0 50 0 0 12 1.5708 4 135 375 16650 4275 Data\001
4 0 0 50 0 0 12 0.0000 4 135 360 16650 2655 CPU\001
4 0 0 50 0 0 12 1.5708 4 165 375 15615 4230 REQ\001
4 0 0 50 0 0 12 1.5708 4 135 360 15930 4275 CLK\001
4 0 0 50 0 0 12 0.0000 4 135 900 8280 5130 Bus Master\001
4 0 0 50 0 0 12 0.0000 4 135 360 8775 2655 CPU\001
4 0 0 50 0 0 12 1.5708 4 165 375 7740 4230 REQ\001
4 0 0 50 0 0 12 1.5708 4 135 360 8055 4275 CLK\001
4 0 0 50 0 0 12 0.0000 4 135 900 12240 5130 Bus Master\001
4 0 0 50 0 0 12 1.5708 4 135 375 12735 4275 Data\001
4 0 0 50 0 0 12 0.0000 4 135 360 12735 2655 CPU\001
4 0 0 50 0 0 12 1.5708 4 165 375 11700 4230 REQ\001
4 0 0 50 0 0 12 1.5708 4 135 360 12015 4275 CLK\001
4 0 0 50 0 0 12 0.0000 4 180 630 10845 8640 Memory\001
