#FIG 3.2  Produced by xfig version 3.2.5
Landscape
Center
Inches
Letter  
100.00
Single
-2
1200 2
1 3 0 2 0 11 49 -1 20 0.000 1 3.1416 3375 600 150 150 3375 600 3225 600
1 3 0 2 0 11 49 -1 20 0.000 1 3.1416 4175 600 150 150 4175 600 4025 600
1 3 0 2 0 11 49 -1 20 0.000 1 3.1416 2575 600 150 150 2575 600 2425 600
1 3 0 2 0 11 49 -1 20 0.000 1 3.1416 2175 1300 150 150 2175 1300 2025 1300
1 3 0 2 0 11 49 -1 20 0.000 1 3.1416 2975 1300 150 150 2975 1300 2825 1300
1 3 0 2 0 11 49 -1 20 0.000 1 3.1416 3775 1300 150 150 3775 1300 3625 1300
1 3 0 2 0 11 49 -1 20 0.000 1 3.1416 4575 1300 150 150 4575 1300 4425 1300
1 3 0 2 0 11 49 -1 20 0.000 1 3.1416 2575 2000 150 150 2575 2000 2425 2000
1 3 0 2 0 11 49 -1 20 0.000 1 3.1416 3375 2000 150 150 3375 2000 3225 2000
1 3 0 2 0 11 49 -1 20 0.000 1 3.1416 4175 2000 150 150 4175 2000 4025 2000
2 2 1 1 0 11 50 -1 -1 4.000 0 0 -1 0 0 5
	 4125 1650 4125 975 2625 975 2625 1650 4125 1650
2 1 0 2 0 7 50 -1 -1 0.000 0 0 -1 0 0 2
	 2575 600 2175 1300
2 1 0 2 0 7 50 -1 -1 0.000 0 0 -1 0 0 2
	 4175 600 4575 1300
2 1 0 2 0 7 50 -1 -1 0.000 0 0 -1 0 0 2
	 4175 2000 3375 2000
2 1 0 2 0 7 50 -1 -1 0.000 0 0 -1 0 0 2
	 3375 2000 2575 2000
2 1 0 2 0 7 50 -1 -1 0.000 0 0 -1 0 0 4
	 3775 1300 3375 600 4175 600 3775 1300
2 1 0 2 0 7 50 -1 -1 0.000 0 0 -1 0 0 4
	 2975 1300 2575 600 3375 600 2975 1300
2 1 0 2 0 7 50 -1 -1 0.000 0 0 -1 0 0 4
	 2575 2000 2175 1300 2975 1300 2575 2000
2 1 0 2 0 7 50 -1 -1 0.000 0 0 -1 0 0 4
	 4175 2000 3775 1300 4575 1300 4175 2000
2 1 0 2 0 7 50 -1 -1 0.000 0 0 -1 0 0 4
	 3375 2000 2975 1300 3775 1300 3375 2000
2 3 0 2 0 11 50 -1 20 0.000 0 0 -1 0 0 5
	 3638 1152 3724 1102 3524 755 3438 805 3638 1152
2 3 0 2 0 11 50 -1 20 0.000 0 0 -1 0 0 5
	 3833 1101 3920 1151 4120 804 4033 754 3833 1101
2 3 0 2 0 11 50 -1 20 0.000 0 0 -1 0 0 5
	 3975 650 3975 550 3575 550 3575 650 3975 650
2 3 0 2 0 11 50 -1 20 0.000 0 0 -1 0 0 5
	 3175 650 3175 550 2775 550 2775 650 3175 650
2 3 0 2 0 11 50 -1 20 0.000 0 0 -1 0 0 5
	 2838 1152 2924 1102 2724 755 2638 805 2838 1152
2 3 0 2 0 11 50 -1 20 0.000 0 0 -1 0 0 5
	 3033 1101 3120 1151 3320 804 3233 754 3033 1101
2 3 0 2 0 11 50 -1 20 0.000 0 0 -1 0 0 5
	 2775 1350 2775 1250 2375 1250 2375 1350 2775 1350
2 3 0 2 0 11 50 -1 20 0.000 0 0 -1 0 0 5
	 2438 1852 2524 1802 2324 1455 2238 1505 2438 1852
2 3 0 2 0 11 50 -1 20 0.000 0 0 -1 0 0 5
	 2633 1801 2720 1851 2920 1504 2833 1454 2633 1801
2 3 0 2 0 11 50 -1 20 0.000 0 0 -1 0 0 5
	 3575 1350 3575 1250 3175 1250 3175 1350 3575 1350
2 3 0 2 0 11 50 -1 20 0.000 0 0 -1 0 0 5
	 4375 1350 4375 1250 3975 1250 3975 1350 4375 1350
2 3 0 2 0 11 50 -1 20 0.000 0 0 -1 0 0 5
	 4233 1801 4320 1851 4520 1504 4433 1454 4233 1801
2 3 0 2 0 11 50 -1 20 0.000 0 0 -1 0 0 5
	 4038 1852 4124 1802 3924 1455 3838 1505 4038 1852
2 3 0 2 0 11 50 -1 20 0.000 0 0 -1 0 0 5
	 3433 1801 3520 1851 3720 1504 3633 1454 3433 1801
2 3 0 2 0 11 50 -1 20 0.000 0 0 -1 0 0 5
	 3238 1852 3324 1802 3124 1455 3038 1505 3238 1852
2 3 0 2 0 11 50 -1 20 0.000 0 0 -1 0 0 5
	 4438 1147 4525 1097 4325 750 4238 800 4438 1147
2 3 0 2 0 11 50 -1 20 0.000 0 0 -1 0 0 5
	 2225 1097 2312 1147 2512 800 2425 750 2225 1097
2 3 0 2 0 11 50 -1 20 0.000 0 0 -1 0 0 5
	 3975 2050 3975 1950 3575 1950 3575 2050 3975 2050
2 3 0 2 0 11 50 -1 20 0.000 0 0 -1 0 0 5
	 3175 2050 3175 1950 2775 1950 2775 2050 3175 2050
