#FIG 3.2
Landscape
Center
Inches
Letter  
100.00
Single
-2
1200 2
1 4 0 1 0 7 50 -1 -1 0.000 1 0.0000 1650 1425 37 37 1650 1463 1650 1388
2 1 0 1 0 7 50 -1 -1 0.000 0 0 -1 0 0 9
	 1725 1350 1725 975 1500 975 1575 1050 1500 1350 825 1350
	 825 1500 1725 1575 1725 1500
2 1 0 1 0 7 50 -1 -1 0.000 0 0 -1 0 0 4
	 1875 1650 1800 1950 1950 1950 2025 1650
2 1 0 1 0 7 50 -1 -1 0.000 0 0 -1 0 0 4
	 7875 1650 7950 1950 7800 1950 7725 1650
2 1 0 1 0 7 50 -1 -1 0.000 0 0 -1 0 0 2
	 975 2175 975 1350
2 1 0 1 0 7 50 -1 -1 0.000 0 0 -1 0 0 5
	 796 2181 1096 2181 1171 2556 721 2556 796 2181
2 2 0 1 0 11 50 -1 20 0.000 0 0 -1 0 0 5
	 1800 1275 7950 1275 7950 1650 1800 1650 1800 1275
2 2 0 1 0 7 50 -1 -1 0.000 0 0 -1 0 0 5
	 1800 1350 1575 1350 1575 1500 1800 1500 1800 1350
2 2 0 1 0 7 50 -1 -1 0.000 0 0 -1 0 0 5
	 4050 1125 4350 1125 4350 1275 4050 1275 4050 1125
2 2 0 1 0 7 50 -1 -1 0.000 0 0 -1 0 0 5
	 5250 1125 5550 1125 5550 1275 5250 1275 5250 1125
2 3 0 1 0 7 50 -1 -1 0.000 0 0 -1 0 0 7
	 7575 1275 7575 975 7725 975 7650 1050 7725 1125 7725 1275
	 7575 1275
2 1 0 1 0 7 50 -1 -1 0.000 0 0 -1 0 0 2
	 1575 1050 7650 1050
2 1 0 2 0 7 50 -1 -1 0.000 0 0 -1 0 0 2
	 6675 4200 6375 4425
2 1 1 1 0 7 50 -1 -1 4.000 0 0 -1 0 0 2
	 3600 1950 3075 1950
2 1 1 1 0 7 50 -1 -1 4.000 0 0 -1 0 0 2
	 6375 1950 6900 1950
2 1 0 1 0 7 50 -1 -1 4.000 0 0 -1 0 0 4
	 3075 1950 1725 1950 1725 2100 3075 2100
2 1 0 1 0 7 50 -1 -1 4.000 0 0 -1 0 0 2
	 6900 1950 8025 1950
2 1 0 1 0 7 50 -1 -1 4.000 0 0 -1 0 0 2
	 8025 2100 6900 2100
2 1 1 1 0 7 50 -1 -1 4.000 0 0 -1 0 0 2
	 6900 2100 6375 2100
2 1 1 1 0 7 50 -1 -1 4.000 0 0 -1 0 0 2
	 3075 2100 3600 2100
2 1 1 1 0 7 50 -1 -1 4.000 0 0 -1 0 0 2
	 8025 1950 8400 1950
2 1 1 1 0 7 50 -1 -1 4.000 0 0 -1 0 0 2
	 8025 2100 8400 2100
2 1 2 1 0 7 50 -1 -1 3.000 0 0 -1 0 0 2
	 6375 1950 6075 1950
2 1 2 1 0 7 50 -1 -1 3.000 0 0 -1 0 0 2
	 6375 2100 6075 2100
2 1 2 1 0 7 50 -1 -1 3.000 0 0 -1 0 0 2
	 3600 1950 3900 1950
2 1 2 1 0 7 50 -1 -1 3.000 0 0 -1 0 0 2
	 3600 2100 3900 2100
2 1 0 1 0 7 50 -1 -1 3.000 0 0 -1 0 0 2
	 1800 2100 1800 2250
2 1 1 1 0 7 50 -1 -1 4.000 0 0 -1 0 0 2
	 1800 2250 1800 2550
2 1 0 2 0 7 50 -1 -1 0.000 0 0 -1 0 0 2
	 6675 4050 6375 4275
2 4 0 1 0 7 50 -1 -1 0.000 0 0 10 0 0 5
	 2250 2850 3675 2850 3675 3750 2250 3750 2250 2850
2 4 0 1 0 7 50 -1 -1 0.000 0 0 10 0 0 5
	 5850 2850 7275 2850 7275 3750 5850 3750 5850 2850
2 4 0 1 0 7 50 -1 -1 4.000 0 0 10 0 0 5
	 5475 5625 5475 4650 4125 4650 4125 5625 5475 5625
2 2 0 1 0 7 50 -1 -1 4.000 0 0 -1 0 0 5
	 7125 1050 7425 1050 7425 1275 7125 1275 7125 1050
3 0 0 1 0 7 50 -1 -1 0.000 0 1 0 3
	0 0 1.00 60.00 120.00
	 1125 525 1125 1050 1350 1275
	 0.000 1.000 0.000
3 0 0 1 0 7 50 -1 -1 0.000 0 1 0 4
	0 0 1.00 60.00 120.00
	 1425 2775 1200 2850 1050 2775 975 2625
	 0.000 1.000 1.000 0.000
3 0 0 1 0 7 50 -1 -1 0.000 0 1 0 3
	0 0 1.00 60.00 120.00
	 2250 750 2325 900 2475 975
	 0.000 1.000 0.000
3 0 0 1 0 7 50 -1 -1 0.000 0 1 0 4
	0 0 1.00 60.00 120.00
	 4425 600 4650 825 4650 975 4425 1125
	 0.000 1.000 1.000 0.000
3 0 0 1 0 7 50 -1 -1 0.000 0 1 0 4
	0 0 1.00 60.00 120.00
	 5775 525 5775 675 5625 825 5550 1050
	 0.000 1.000 1.000 0.000
3 0 1 2 0 7 50 -1 -1 4.000 0 0 0 4
	 5400 1650 5400 2625 5700 2925 5850 3000
	 0.000 1.000 1.000 0.000
3 0 0 1 0 7 50 -1 -1 4.000 0 1 0 3
	0 0 1.00 60.00 120.00
	 7275 4575 7125 4350 6750 4200
	 0.000 1.000 0.000
3 2 1 2 0 7 50 -1 -1 4.000 0 0 0 2
	 6525 3750 6525 4125
	 0.000 0.000
3 0 1 2 0 7 50 -1 -1 4.000 0 0 0 4
	 6525 4350 6525 4650 6075 5100 5475 5100
	 0.000 1.000 1.000 0.000
3 0 1 2 0 7 50 -1 -1 4.000 0 0 0 4
	 4200 1650 4200 2550 3900 2850 3675 2925
	 0.000 1.000 1.000 0.000
3 0 1 2 0 7 50 -1 -1 4.000 0 0 0 4
	 3000 3750 3000 4725 3375 5100 4125 5100
	 0.000 1.000 1.000 0.000
3 0 0 1 0 7 50 -1 -1 0.000 0 1 0 3
	0 0 1.00 60.00 120.00
	 6975 600 6975 825 7200 1050
	 0.000 1.000 0.000
4 0 0 50 -1 0 12 0.0000 4 135 345 2025 675 Tr\345d\001
4 0 0 50 -1 0 12 0.0000 4 135 525 3825 600 Sensor\001
4 0 0 50 -1 0 12 0.0000 4 180 630 1500 2850 1 kg. lod\001
4 0 0 50 -1 0 12 0.0000 4 135 735 825 525 vinkelarm\001
4 0 0 50 -1 0 12 0.0000 4 180 1185 6000 3375 Sinus generator\001
4 0 0 50 -1 0 12 0.0000 4 135 855 2550 3450 Transducer\001
4 0 0 50 -1 0 12 0.0000 4 135 420 2775 3225 Sinus\001
4 0 0 50 -1 0 12 0.0000 4 135 1545 6900 4800 afkobles efter behov\001
4 0 0 50 -1 0 12 0.0000 4 180 735 4425 5175 Computer\001
4 0 0 50 -1 0 12 0.0000 4 135 705 5250 450 Oscilator\001
4 0 0 50 -1 0 12 0.0000 4 180 780 6750 525 Styrofoam\001
