#FIG 3.2  Produced by xfig version 3.2.5-alpha5
Landscape
Center
Inches
Letter  
100.00
Single
-2
1200 2
6 5625 1425 8025 2025
6 5625 1425 8025 2025
2 2 0 1 0 7 50 -1 -1 4.000 0 0 -1 0 0 5
	 5625 1425 8025 1425 8025 2025 5625 2025 5625 1425
4 0 0 50 -1 0 12 0.0000 4 195 2145 5850 1800 Find n\346ste robot position\001
-6
-6
6 5625 2700 8025 3300
2 2 0 1 0 7 50 -1 -1 4.000 0 0 -1 0 0 5
	 5625 2700 8025 2700 8025 3300 5625 3300 5625 2700
4 0 0 50 -1 0 12 0.0000 4 195 2205 5775 3075 Flyt robotten til positionen\001
-6
6 5625 225 8025 825
2 2 0 1 0 7 50 -1 -1 4.000 0 0 -1 0 0 5
	 5625 225 8025 225 8025 825 5625 825 5625 225
4 0 0 50 -1 0 12 0.0000 4 150 1800 6000 525 Forbinder til robotten\001
-6
6 5775 -1050 7725 -375
2 4 0 1 0 7 50 -1 -1 4.000 0 0 7 0 0 5
	 7725 -375 7725 -1050 5775 -1050 5775 -375 7725 -375
4 0 0 50 -1 0 12 0.0000 4 150 690 6450 -675 START\001
-6
6 10050 2175 12750 5250
2 1 0 1 0 7 50 -1 -1 4.000 0 0 -1 1 0 2
	1 1 1.00 60.00 120.00
	 11325 3450 11325 2775
2 1 0 1 0 7 50 -1 -1 4.000 0 0 -1 1 0 2
	1 1 1.00 60.00 120.00
	 11325 4650 11325 4050
2 2 0 1 0 7 50 -1 -1 4.000 0 0 -1 0 0 5
	 10200 5250 12600 5250 12600 4650 10200 4650 10200 5250
2 2 0 1 0 7 50 -1 -1 4.000 0 0 -1 0 0 5
	 10200 4050 12600 4050 12600 3450 10200 3450 10200 4050
2 2 0 1 0 7 50 -1 -1 4.000 0 0 -1 0 0 5
	 10200 2775 12600 2775 12600 2175 10200 2175 10200 2775
4 1 0 50 -1 0 12 0.0000 4 195 2625 11400 5025 Tager et billede med kameraet\001
4 1 0 50 -1 0 12 0.0000 4 195 2100 11325 3825 Find mark\370rs 2Dposition\001
4 1 0 50 -1 0 12 0.0000 4 195 1755 11325 2550 Gem 2D-3D punkter\001
-6
2 1 0 1 0 7 50 -1 -1 4.000 0 0 -1 1 0 2
	1 1 1.00 60.00 120.00
	 6675 -375 6675 225
2 1 0 1 0 7 50 -1 -1 4.000 0 0 -1 1 0 2
	1 1 1.00 60.00 120.00
	 6675 825 6675 1425
2 1 0 1 0 7 50 -1 -1 4.000 0 0 -1 1 0 2
	1 1 1.00 60.00 120.00
	 6675 2025 6675 2700
2 1 0 1 0 7 50 -1 -1 4.000 0 0 -1 1 0 2
	1 1 1.00 60.00 120.00
	 11325 300 11325 -375
2 1 0 1 0 7 50 -1 -1 4.000 0 0 -1 1 0 4
	1 1 1.00 60.00 120.00
	 9825 975 9375 975 9375 1725 8025 1725
2 1 0 1 0 7 50 -1 -1 0.000 0 0 -1 0 0 5
	 11325 1725 9825 975 11325 300 12825 975 11325 1725
2 1 0 1 0 7 50 -1 -1 4.000 0 0 -1 1 0 2
	1 1 1.00 60.00 120.00
	 11325 2175 11325 1725
2 4 0 1 0 7 50 -1 -1 4.000 0 0 7 0 0 5
	 12300 -1050 12300 -375 10350 -375 10350 -1050 12300 -1050
2 1 0 1 0 7 50 -1 -1 4.000 0 0 -1 1 0 3
	1 1 1.00 60.00 120.00
	 6675 3300 6675 5025 10200 5025
4 0 0 50 -1 0 12 6.2832 4 150 390 11400 150 NEJ\001
4 0 0 50 -1 0 12 6.2832 4 150 255 9525 900 JA\001
4 1 0 50 -1 0 12 0.0000 4 195 795 11325 -825 punkts\346t\001
4 1 0 50 -1 0 12 0.0000 4 150 1485 11325 -450 Returnere 2D-3D\001
4 1 0 50 -1 0 12 0.0000 4 195 1950 11250 1050 Er der flere positioner?\001
