#FIG 3.2
Landscape
Center
Metric
A4      
100.00
Single
-2
1200 2
0 32 #aaaaaa
2 1 1 1 0 7 50 0 -1 4.000 0 0 -1 0 0 2
	 540 4320 12150 4320
2 1 1 1 12 7 50 0 -1 4.000 0 0 -1 0 0 2
	 3555 4725 3555 2250
2 1 1 1 12 7 50 0 -1 4.000 0 0 -1 0 0 2
	 2250 2250 2250 2700
2 1 0 2 0 7 50 0 -1 0.000 0 0 -1 0 0 6
	 1350 5400 10125 5400 10350 5850 10800 5850 11025 5400 11700 5400
2 1 0 2 0 7 50 0 -1 0.000 0 0 -1 0 0 22
	 1350 3375 2925 3375 3150 3825 3600 3825 3825 3375 4275 3375
	 4500 3825 4950 3825 5175 3375 5625 3375 5850 3825 6300 3825
	 6525 3375 6975 3375 7200 3825 7650 3825 7875 3375 8325 3375
	 8550 3825 9000 3825 9225 3375 11700 3375
2 1 0 2 0 7 50 0 -1 0.000 0 0 -1 0 0 6
	 1350 2700 2250 2700 2250 3150 3150 3150 3150 2700 11700 2700
2 1 0 2 12 7 50 0 -1 4.000 0 0 -1 1 0 2
	1 1 1.00 60.00 120.00
	 6480 2385 3555 2385
2 1 0 2 12 7 50 0 -1 4.000 0 0 -1 1 0 2
	1 1 1.00 60.00 120.00
	 3105 2385 3555 2385
2 1 0 2 12 7 50 0 -1 4.000 0 0 -1 1 0 2
	1 1 1.00 60.00 120.00
	 2655 2385 2250 2385
2 1 0 2 0 7 50 0 -1 0.000 0 0 -1 0 0 46
	 1350 4725 3555 4725 3555 5175 3870 5175 3870 4725 4185 4725
	 4185 5175 4545 5175 4545 4725 4860 4725 4860 5175 5220 5175
	 5220 4725 5535 4725 5535 5175 5895 5175 5895 4725 6210 4725
	 6210 5175 6570 5175 6570 4725 6885 4725 6885 5175 7245 5175
	 7245 4725 7560 4725 7560 5175 7920 5175 7920 4725 8235 4725
	 8235 5175 8640 5175 8640 4725 8910 4725 8910 5175 9270 5175
	 9270 4725 9585 4725 9585 5175 9945 5175 9945 4725 10305 4725
	 10305 5175 10710 5175 10710 4725 11700 4725
2 1 0 2 0 7 50 0 -1 0.000 0 0 -1 0 0 20
	 3690 3600 3825 3825 4275 3825 4500 3375 4950 3375 5175 3825
	 5625 3825 5850 3375 6300 3375 6525 3825 6975 3825 7200 3375
	 7650 3375 7875 3825 8325 3825 8550 3375 9000 3375 9225 3825
	 9675 3825 9900 3375
2 1 1 1 12 7 50 0 -1 4.000 0 0 -1 0 0 2
	 9945 4725 9945 2250
2 1 0 2 12 7 50 0 -1 4.000 0 0 -1 1 0 2
	1 1 1.00 60.00 120.00
	 6930 2385 9945 2385
2 2 0 1 0 7 50 0 -1 0.000 0 0 -1 0 0 5
	 360 1935 12150 1935 12150 7425 360 7425 360 1935
2 2 0 0 0 32 51 0 20 0.000 0 0 -1 0 0 5
	 675 7425 12330 7425 12330 7650 675 7650 675 7425
2 2 0 0 0 32 51 0 20 0.000 0 0 -1 0 0 5
	 12375 7650 12150 7650 12150 2070 12375 2070 12375 7650
4 0 0 50 0 18 16 0.0000 4 180 870 1350 5085 CLOCK\001
4 0 12 50 0 2 12 0.0000 4 180 225 2790 2430 (a)\001
4 0 0 50 0 18 16 0.0000 4 180 870 1350 3015 CLOCK\001
4 0 0 50 0 18 16 0.0000 4 180 690 1350 3735 DATA\001
4 0 0 50 0 18 16 0.0000 4 180 690 1395 5760 DATA\001
4 0 9 50 0 18 16 1.5708 4 180 915 1035 5580 DEVICE\001
4 0 9 50 0 18 16 1.5708 4 180 675 1035 3510 HOST\001
4 0 0 50 0 18 14 1.5708 4 165 705 4095 6750 DATA0\001
4 0 0 50 0 18 14 1.5708 4 165 705 4770 6750 DATA1\001
4 0 0 50 0 18 14 1.5708 4 165 705 5445 6750 DATA2\001
4 0 0 50 0 18 14 1.5708 4 165 705 6120 6750 DATA3\001
4 0 0 50 0 18 14 1.5708 4 165 705 6795 6750 DATA4\001
4 0 0 50 0 18 14 1.5708 4 165 705 7470 6750 DATA5\001
4 0 0 50 0 18 14 1.5708 4 165 705 8145 6750 DATA6\001
4 0 0 50 0 18 14 1.5708 4 165 795 9495 6750 PARITY\001
4 0 0 50 0 18 14 1.5708 4 165 705 8865 6750 DATA7\001
4 0 12 50 0 0 12 0.0000 4 180 240 6615 2430 (b)\001
4 0 0 50 0 18 14 1.5708 4 165 600 9945 6750 STOP\001
4 0 0 50 0 18 14 1.5708 4 165 465 10620 6750 ACK\001
4 0 0 50 0 18 14 1.5708 4 165 705 3420 6750 START\001
