#FIG 3.2  Produced by xfig version 3.2.5-alpha5
Landscape
Center
Metric
A4      
100.00
Single
-2
1200 2
6 7515 8820 9495 9045
4 0 0 53 -1 0 12 0.0000 4 150 1035 8460 9000 Ivar Balslev\001
4 0 0 53 -1 2 12 0.0000 4 195 795 7515 9000 Vejleder:\001
-6
6 8235 5580 12375 8145
4 2 0 53 -1 2 34 0.0000 4 390 2850 12339 5997 DIODE OG\001
4 2 0 53 -1 2 34 0.0000 4 390 3360 12339 6713 LANDMARK\001
4 2 0 53 -1 2 34 0.0000 4 390 2940 12339 7429 BASSERET\001
4 2 0 53 -1 2 34 0.0000 4 390 4065 12339 8145 KALIBRERING\001
-6
6 5715 -1890 11565 -990
2 1 0 1 0 7 50 -1 -1 0.000 0 0 -1 0 0 2
	 10890 -1305 6525 -1305
4 1 0 50 -1 2 12 0.0000 4 195 5775 8640 -1710 M \346 r s k   I n s t i t u t t e t   f o r   P r o d u k t i o n s t e k n o l o g i\001
4 1 0 50 -1 0 12 0.0000 4 195 3675 8640 -1440 S y d d a n s k   u n i v e r s i t e t - O d e n s e\001
4 1 0 50 -1 0 12 0.0000 4 195 3975 8640 -1035 B a c h e l or   p r o j e k t  -  s o m m e r   2 0 0 5 \001
-6
1 3 0 1 0 0 53 -1 20 0.000 1 0.0000 8055 6255 497 497 8055 6255 8552 6255
1 3 0 70 7 7 52 -1 -1 0.000 1 0.0000 8865 2790 1510 1510 8865 2790 10375 2790
1 3 0 1 0 0 53 -1 20 0.000 1 0.0000 6570 360 242 242 6570 360 6812 360
1 3 0 1 0 0 53 -1 20 0.000 1 0.0000 8910 2790 2565 2565 8910 2790 11475 2790
2 1 0 1 0 7 50 -1 -1 0.000 0 0 -1 0 0 2
	 4950 7110 7245 7110
2 1 0 1 0 7 50 -1 -1 0.000 0 0 -1 0 0 2
	 7245 7920 4995 7920
2 1 0 1 7 7 50 -1 -1 0.000 0 0 -1 0 0 2
	 8595 2835 9045 2835
2 1 0 1 7 7 51 -1 -1 0.000 0 0 -1 0 0 2
	 8820 2610 8820 3105
2 5 0 1 0 -1 51 -1 20 0.000 0 0 -1 0 0 5
	0 ../img/robot.png
	 7245 495 9586 495 9586 2750 7245 2750 7245 495
2 5 0 1 0 -1 50 -1 20 0.000 0 0 -1 0 0 5
	0 ../img/markor.png
	 5490 2352 7330 2352 7330 5265 5490 5265 5490 2352
2 5 0 1 0 -1 49 -1 20 0.000 0 0 -1 0 0 5
	0 ../img/kamera2.png
	 9487 -630 11160 -630 11160 733 9487 733 9487 -630
2 5 0 1 0 -1 50 -1 -1 0.000 0 0 -1 0 0 5
	0 ../img/dioden.png
	 7136 4044 7136 5130 11025 5130 11025 4044 7136 4044
4 0 0 53 -1 0 12 0.0000 4 150 2070 5175 8100 Tobias Nielsen - 200975\001
4 0 0 53 -1 0 12 0.0000 4 150 1605 5220 7290 Leo Zhou - 020382\001
4 0 0 53 -1 2 12 0.0000 4 195 1275 4950 6435 Udarbejdet af:\001
