#FIG 3.2
Landscape
Center
Metric
A4      
100.00
Single
-2
1200 2
6 1350 810 8145 900
2 1 0 1 0 7 50 0 -1 0.000 0 0 -1 0 0 2
	 2700 810 2700 900
2 1 0 1 0 7 50 0 -1 0.000 0 0 -1 0 0 2
	 4050 810 4050 900
2 1 0 1 0 7 50 0 -1 0.000 0 0 -1 0 0 2
	 5400 810 5400 900
2 1 0 1 0 7 50 0 -1 0.000 0 0 -1 0 0 2
	 6750 810 6750 900
2 1 0 1 0 7 50 0 -1 0.000 0 0 -1 0 0 2
	 1350 810 1350 900
2 1 0 1 0 7 50 0 -1 0.000 0 0 -1 0 0 2
	 8145 810 8145 900
2 1 0 1 0 7 50 0 -1 0.000 0 0 -1 0 0 2
	 1350 900 8145 900
-6
2 1 2 1 0 7 50 0 -1 3.000 0 0 -1 0 0 2
	 1350 900 1350 1350
2 1 0 1 0 7 50 0 -1 0.000 0 0 -1 0 0 2
	 2700 1350 2700 1800
2 1 0 1 0 7 50 0 -1 0.000 0 0 -1 0 0 2
	 3735 1350 3735 1800
2 1 0 1 0 7 50 0 -1 0.000 0 0 -1 0 0 2
	 4050 1350 4050 1800
2 1 0 1 0 7 50 0 -1 0.000 0 0 -1 0 0 2
	 5400 1350 5400 1800
2 1 0 1 0 7 50 0 -1 0.000 0 0 -1 0 0 2
	 5130 1350 5130 1800
2 1 0 1 0 7 50 0 -1 0.000 0 0 -1 0 0 2
	 6750 1350 6750 1800
2 1 0 1 0 7 50 0 -1 0.000 0 0 -1 0 0 2
	 6435 1350 6435 1800
2 1 0 1 0 7 50 0 -1 0.000 0 0 -1 0 0 2
	 7830 1350 7830 1800
2 2 0 1 0 7 50 0 -1 0.000 0 0 -1 0 0 5
	 1350 1350 8145 1350 8145 1800 1350 1800 1350 1350
2 1 2 1 0 7 50 0 -1 3.000 0 0 -1 0 0 2
	 2700 900 2700 1350
2 1 2 1 0 7 50 0 -1 3.000 0 0 -1 0 0 2
	 4050 900 4050 1350
2 1 2 1 0 7 50 0 -1 3.000 0 0 -1 0 0 2
	 5400 900 5400 1350
2 1 2 1 0 7 50 0 -1 3.000 0 0 -1 0 0 2
	 6750 900 6750 1350
2 1 2 1 0 7 50 0 -1 3.000 0 0 -1 0 0 2
	 8145 900 8145 1350
2 1 1 1 0 7 50 0 -1 4.000 0 0 -1 1 0 2
	0 0 1.00 60.00 120.00
	 5130 2340 5130 1800
2 1 1 1 0 7 50 0 -1 4.000 0 0 -1 1 0 2
	0 0 1.00 60.00 120.00
	 6435 2340 6435 1800
2 1 1 1 0 7 50 0 -1 4.000 0 0 -1 1 0 3
	0 0 1.00 60.00 120.00
	 4320 2520 3735 2520 3735 1800
2 1 1 1 0 7 50 0 -1 4.000 0 0 -1 1 0 3
	0 0 1.00 60.00 120.00
	 7020 2520 7830 2520 7830 1800
2 3 0 1 0 7 50 0 15 0.000 0 0 -1 0 0 4
	 6930 2340 7020 2430 6930 2430 6930 2340
2 3 0 1 0 7 50 0 -1 0.000 0 0 -1 0 0 7
	 4320 2340 6930 2340 6930 2430 7020 2430 7020 2700 4320 2700
	 4320 2340
2 1 1 2 0 7 50 0 -1 12.000 0 0 -1 0 0 2
	 180 2925 8370 2925
2 1 0 1 0 7 50 0 -1 0.000 0 0 -1 0 0 2
	 2700 4050 2700 4500
2 1 0 1 0 7 50 0 -1 0.000 0 0 -1 0 0 2
	 3735 4050 3735 4500
2 1 0 1 0 7 50 0 -1 0.000 0 0 -1 0 0 2
	 5130 4050 5130 4500
2 1 0 1 0 7 50 0 -1 0.000 0 0 -1 0 0 2
	 6075 4050 6075 4500
2 1 0 1 0 7 50 0 -1 0.000 0 0 -1 0 0 2
	 7290 4050 7290 4500
2 1 0 1 0 7 50 0 -1 0.000 0 0 -1 0 0 2
	 2700 3375 2700 3465
2 1 0 1 0 7 50 0 -1 0.000 0 0 -1 0 0 2
	 1350 3375 1350 3465
2 1 0 1 0 7 50 0 -1 0.000 0 0 -1 0 0 2
	 1350 3465 8145 3465
2 2 0 1 0 7 50 0 -1 0.000 0 0 -1 0 0 5
	 1350 4050 8145 4050 8145 4500 1350 4500 1350 4050
2 1 2 1 0 7 50 0 -1 3.000 0 0 -1 0 0 2
	 1350 3465 1350 4050
2 1 2 1 0 7 50 0 -1 3.000 0 0 -1 0 0 2
	 2700 3465 2700 4050
2 1 2 1 0 7 50 0 -1 3.000 0 0 -1 0 0 2
	 5130 4050 5130 3465
2 1 2 1 0 7 50 0 -1 3.000 0 0 -1 0 0 2
	 7290 4050 7290 3465
2 1 0 1 0 7 50 0 -1 0.000 0 0 -1 0 0 2
	 5130 3375 5130 3465
2 1 0 1 0 7 50 0 -1 0.000 0 0 -1 0 0 2
	 7290 3375 7290 3465
2 1 1 1 0 7 50 0 -1 4.000 0 0 -1 1 0 3
	0 0 1.00 60.00 120.00
	 3960 5175 3735 5175 3735 4500
2 1 1 1 0 7 50 0 -1 4.000 0 0 -1 1 0 3
	0 0 1.00 60.00 120.00
	 5805 5175 6075 5175 6075 4500
2 3 0 1 0 7 50 0 15 0.000 0 0 -1 0 0 4
	 5715 4995 5805 5085 5715 5085 5715 4995
2 3 0 1 0 7 50 0 -1 0.000 0 0 -1 0 0 7
	 5715 4995 5715 5085 5805 5085 5805 5355 3960 5355 3960 4995
	 5715 4995
4 0 0 50 0 0 12 0.0000 4 135 855 225 855 Timer ticks\001
4 0 0 50 0 0 12 0.0000 4 165 585 225 1665 Tr\345d tid\001
4 0 0 50 0 1 12 0.0000 4 135 195 1935 1665 T1\001
4 0 0 50 0 1 12 0.0000 4 135 195 3150 1620 T2\001
4 0 0 50 0 1 12 0.0000 4 135 195 4500 1620 T2\001
4 0 0 50 0 1 12 0.0000 4 135 195 7200 1620 T2\001
4 0 0 50 0 1 12 0.0000 4 135 195 5850 1620 T2\001
4 0 0 50 0 1 12 0.0000 4 135 195 3780 1620 T1\001
4 0 0 50 0 1 12 0.0000 4 135 195 5175 1620 T1\001
4 0 0 50 0 1 12 0.0000 4 135 195 6480 1620 T1\001
4 0 0 50 0 1 12 0.0000 4 135 195 7875 1620 T1\001
4 0 0 50 0 1 12 0.0000 4 135 195 1935 4365 T1\001
4 0 0 50 0 1 12 0.0000 4 135 195 3150 4320 T2\001
4 0 0 50 0 1 12 0.0000 4 135 195 4365 4365 T1\001
4 0 0 50 0 1 12 0.0000 4 135 195 5490 4365 T2\001
4 0 0 50 0 1 12 0.0000 4 135 195 7650 4365 T2\001
4 0 0 50 0 1 12 0.0000 4 135 195 6570 4320 T1\001
4 0 0 50 0 0 12 0.0000 4 135 855 225 3465 Timer ticks\001
4 0 0 50 0 0 12 0.0000 4 165 585 270 4365 Tr\345d tid\001
4 0 0 50 0 0 12 0.0000 4 180 1695 4050 5220 Her genstartes timeren\001
4 0 0 50 0 0 12 0.0000 4 210 2280 4545 2565 Tr\345den schedulerer sig selv ud\001
