#FIG 3.2
Landscape
Center
Metric
Letter  
100.00
Single
-2
1200 2
5 1 0 1 0 7 50 -1 -1 0.000 0 1 1 0 4512.874 3956.313 3860 4407 5306 3974 3908 3443
	1 1 5.00 38.57 77.13
6 2520 5625 2835 5940
1 3 0 1 0 0 50 -1 20 0.000 1 0.0000 2700 5805 68 68 2700 5805 2761 5835
1 4 0 1 0 7 50 -1 -1 0.000 1 0.0000 2681 5801 132 132 2569 5734 2794 5869
-6
1 3 0 1 0 0 50 -1 20 0.000 1 0.0000 2722 451 68 68 2722 451 2783 481
2 4 0 1 0 7 50 -1 -1 0.000 0 0 20 0 0 5
	 4101 2190 4101 1226 1449 1226 1449 2190 4101 2190
2 4 0 1 0 7 50 -1 -1 0.000 0 0 20 0 0 5
	 4101 4407 4101 3443 1449 3443 1449 4407 4101 4407
2 1 0 1 0 7 50 -1 -1 0.000 0 0 -1 1 0 2
	1 1 5.00 38.57 77.13
	 2702 2190 2702 3443
2 1 0 1 0 7 50 -1 -1 0.000 0 0 -1 1 0 2
	1 1 5.00 40.49 80.98
	 2722 451 2722 1241
2 1 0 1 0 7 50 -1 -1 0.000 0 0 -1 1 0 2
	1 1 5.00 38.57 77.13
	 2655 4395 2655 5648
4 0 0 50 -1 0 13 0.0000 4 180 1125 2783 2850 makeMeeting\001
4 0 0 50 -1 0 13 0.0000 4 180 1125 5394 4004 addParicipant\001
4 0 0 50 -1 0 16 0.0000 4 240 1980 1800 1800 WaitingForMeeting\001
4 0 0 50 -1 0 16 0.0000 4 240 2025 1755 4005 EnteringParticipants\001
4 0 0 50 -1 0 13 0.0000 4 180 615 2783 4915 publish\001
