#FIG 3.2
Portrait
Center
Metric
Letter  
100.00
Single
-2
1200 2
6 0 -315 9720 11295
2 2 0 0 -1 11 50 -1 20 0.000 0 0 -1 0 0 5
	 0 -315 6435 -315 6435 900 0 900 0 -315
2 2 0 0 0 11 50 -1 20 0.000 0 0 -1 0 0 5
	 6435 900 8235 900 8235 11295 6435 11295 6435 900
2 2 0 0 0 11 50 -1 20 0.000 0 0 -1 0 0 5
	 8235 900 9720 900 9720 -315 8235 -315 8235 900
-6
