#FIG 3.2  Produced by xfig version 3.2.5
Landscape
Center
Inches
Letter  
100.00
Single
-2
1200 2
1 3 0 1 0 7 50 -1 20 4.000 1 0.0000 3450 3600 75 75 3450 3600 3450 3675
1 3 0 1 0 7 50 -1 20 4.000 1 0.0000 3900 3600 75 75 3900 3600 3900 3675
1 3 0 1 0 7 50 -1 20 4.000 1 0.0000 4350 3600 75 75 4350 3600 4350 3675
1 3 0 1 0 7 50 -1 20 4.000 1 0.0000 4800 3600 75 75 4800 3600 4800 3675
1 3 0 1 0 7 50 -1 20 4.000 1 0.0000 5250 3600 75 75 5250 3600 5250 3675
1 3 0 1 0 7 50 -1 20 4.000 1 0.0000 5700 3600 75 75 5700 3600 5700 3675
1 3 0 1 0 7 50 -1 20 4.000 1 0.0000 4575 3900 75 75 4575 3900 4575 3975
1 3 0 1 0 7 50 -1 20 4.000 1 0.0000 4350 4200 75 75 4350 4200 4350 4275
1 3 0 1 0 7 50 -1 20 4.000 1 0.0000 4125 4500 75 75 4125 4500 4125 4575
1 3 0 1 0 7 50 -1 20 4.000 1 0.0000 5025 3300 75 75 5025 3300 5025 3375
1 3 0 1 0 7 50 -1 20 4.000 1 0.0000 4800 3000 75 75 4800 3000 4800 3075
1 3 0 0 0 4 52 -1 20 0.000 1 0.0000 4800 3600 237 237 4800 3600 5037 3600
2 2 1 0 0 7 50 -1 -1 12.000 0 0 -1 0 0 5
	 3300 2850 5850 2850 5850 4650 3300 4650 3300 2850
2 1 1 1 0 7 51 -1 -1 4.000 0 0 -1 0 0 3
	 4125 4500 5025 3300 4800 3000
2 1 0 3 2 -1 51 -1 -1 0.000 0 0 -1 0 0 2
	 3450 3600 5700 3600
3 2 0 1 0 7 50 -1 -1 0.000 0 1 0 3
	0 0 1.00 60.00 120.00
	 4050 3300 4200 3375 4500 3450
	 0.000 -1.000 0.000
4 0 0 50 -1 0 12 0.0000 4 150 675 3750 3225 Conflict\001
