#FIG 3.2
Landscape
Center
Inches
Letter  
100.00
Single
-2
1200 2
6 3150 2025 4350 4200
2 3 0 1 0 7 50 -1 -1 0.000 0 0 -1 0 0 5
	 3150 2025 3150 3525 4350 4200 4350 2700 3150 2025
2 1 0 1 0 7 50 -1 -1 0.000 0 0 -1 1 1 3
	1 1 1.00 60.00 120.00
	1 1 1.00 60.00 120.00
	 3375 2475 3375 3450 4125 3825
-6
1 3 0 1 1 7 50 -1 -1 0.000 1 0.0000 6900 2100 75 75 6900 2100 6975 2100
1 3 0 1 1 7 49 -1 20 0.000 1 0.0000 1725 3825 75 75 1725 3825 1800 3825
1 3 0 1 1 7 48 -1 -1 0.000 1 0.0000 3750 3150 75 75 3750 3150 3825 3150
2 1 0 1 0 7 50 -1 -1 0.000 0 0 -1 1 1 3
	1 1 1.00 60.00 120.00
	1 1 1.00 60.00 120.00
	 6375 1350 6375 2325 7125 2700
2 1 0 1 0 7 50 -1 -1 0.000 0 0 -1 1 0 2
	1 1 1.00 60.00 120.00
	 6375 2325 5775 2850
2 1 0 1 1 7 50 -1 -1 0.000 0 0 -1 0 0 2
	 1725 3825 6900 2100
2 1 0 5 7 7 49 -1 -1 0.000 0 0 -1 0 0 2
	 4275 2925 4275 3075
2 1 0 5 7 7 49 -1 -1 0.000 0 0 -1 0 0 2
	 3975 2925 3975 3150
2 1 0 5 7 7 49 -1 -1 0.000 0 0 -1 0 0 2
	 4125 2925 4125 3150
2 1 0 5 7 7 49 -1 -1 0.000 0 0 -1 0 0 2
	 3825 3000 3825 3225
4 0 0 50 -1 0 12 0.0000 2 195 690 7050 2025 $(x,y,z)$\001
4 0 0 50 -1 0 12 0.0000 2 135 135 5550 3000 X\001
4 0 0 50 -1 0 12 0.0000 2 135 135 7125 2850 Y\001
4 0 0 50 -1 0 12 0.0000 2 135 120 6300 1275 Z\001
4 0 0 50 -1 0 12 0.0000 2 180 1950 1200 4200 \\emph{Projection Center}\001
4 0 0 50 -1 0 12 0.0000 2 165 315 1650 3675 $N$\001
4 0 0 50 -1 0 12 0.0000 2 165 240 3675 2925 $I$\001
4 0 0 50 -1 0 12 0.0000 2 135 75 4200 3675 J\001
4 0 0 48 -1 0 12 0.0000 2 195 555 3825 3300 $(u,v)$\001
