#FIG 3.2
Landscape
Center
Inches
Letter  
100.00
Single
-2
1200 2
0 32 #636363
0 33 #cdcdcd
0 34 #6c6c6c
0 35 #dd9d93
0 36 #f1ece0
0 37 #c3c3c3
0 38 #ededed
0 39 #da7a1a
0 40 #f1e41a
0 41 #887dc2
0 42 #d6d6d6
0 43 #8c8ca5
0 44 #4a4a4a
0 45 #5a5a5a
0 46 #8e8e8e
0 47 #b79b73
0 48 #4193ff
0 49 #bf703b
0 50 #db7700
0 51 #dab800
0 52 #006400
0 53 #5a6b3b
0 54 #d3d3d3
0 55 #aaaaaa
0 56 #8e8ea4
0 57 #f3b95d
0 58 #89996b
0 59 #646464
0 60 #b7e6ff
0 61 #86c0ec
0 62 #bdbdbd
0 63 #d39552
0 64 #98d2fe
0 65 #8c6b6b
0 66 #8c9c6b
0 67 #f76b00
0 68 #5a6b39
0 69 #8c9c6b
0 70 #8c9c7b
0 71 #184a18
0 72 #adadad
0 73 #f7bd5a
0 74 #636b9c
0 75 #f7f7f7
0 76 #de0000
0 77 #adadad
0 78 #f7bd5a
0 79 #adadad
0 80 #f7bd5a
0 81 #636b9c
0 82 #526b29
0 83 #949494
0 84 #526363
0 85 #186b4a
0 86 #9ca5b5
0 87 #ff9400
0 88 #ff9400
0 89 #00634a
0 90 #7b844a
0 91 #63737b
0 92 #e7bd7b
0 93 #184a18
0 94 #f7bd5a
0 95 #006300
0 96 #dedede
0 97 #f3eed3
0 98 #f5ae5d
0 99 #95ce99
0 100 #b5157d
0 101 #eeeeee
0 102 #848484
0 103 #7b7b7b
0 104 #005a00
0 105 #e77373
0 106 #ffcb31
0 107 #29794a
0 108 #de2821
0 109 #2159c6
0 110 #f8f8f8
0 111 #e6e6e6
0 112 #a5b5c6
0 113 #6b6b94
0 114 #846b6b
0 115 #529c4a
0 116 #d6e7e7
0 117 #21845a
# US Air Force Strike/Recon fighter
6 600 225 12450 10050
6 622 294 7189 9979
5 1 0 1 -1 7 0 0 -1 0.000 0 0 0 0 5162.599 4450.738 5113 4446 5162 4401 5211 4446
6 622 294 1472 8609
6 669 4357 905 4593
2 1 0 1 -1 -1 0 0 -1 0.000 0 0 -1 0 0 4
	 888 4461 827 4547 729 4547 680 4474
2 1 0 1 -1 -1 0 0 -1 0.000 0 0 -1 0 0 4
	 888 4461 827 4376 729 4376 680 4450
-6
1 2 0 1 -1 -1 0 0 -1 0.000 1 4.7120 1036 4461 73 36 1072 4389 998 4547
2 1 0 2 -1 -1 0 0 -1 0.000 0 0 -1 0 0 9
	 1145 5296 1157 5148 1170 5087 1195 5012 1219 4964 1256 4903
	 1305 4804 1330 4608 1330 4461
2 1 0 2 -1 -1 0 0 -1 0.000 0 0 -1 0 0 9
	 1145 3628 1157 3775 1170 3835 1195 3910 1219 3958 1256 4020
	 1305 4119 1330 4314 1330 4461
2 1 0 1 -1 -1 0 0 -1 0.000 0 0 -1 0 0 6
	 1133 3996 1183 4106 1243 4156 1243 4253 1219 4338 1207 4461
2 1 0 2 -1 -1 0 0 -1 0.000 0 0 -1 0 0 11
	 1096 4362 1072 4215 1084 4094 1121 4020 1207 3934 1330 4020
	 1403 4094 1440 4167 1452 4266 1452 4389 1452 4461
2 1 0 1 -1 -1 0 0 -1 0.000 0 0 -1 0 0 2
	 950 4461 839 8495
2 3 0 1 -1 -1 0 0 -1 0.000 0 0 -1 0 0 5
	 729 5737 790 5737 803 5197 716 5197 729 5737
2 1 0 2 -1 -1 0 0 -1 0.000 0 0 -1 0 0 9
	 680 4461 680 4964 716 5761 753 5970 778 6154 803 6325
	 827 6594 790 8506 790 8495
2 1 0 2 -1 -1 0 0 -1 0.000 0 0 -1 0 0 5
	 1010 4670 876 8519 839 8581 803 8519 888 4461
2 1 0 2 -1 -1 0 0 -1 0.000 0 0 -1 0 0 11
	 1145 5296 1157 5443 1145 5553 1121 5638 1084 5724 1048 5772
	 1010 5834 986 5895 974 5957 950 6374 888 8506
2 1 0 2 -1 -1 0 0 -1 0.000 0 0 -1 0 0 7
	 974 4461 974 4523 986 4597 1010 4657 1072 4597 1109 4547
	 1121 4461
2 1 0 1 -1 -1 0 0 -1 0.000 0 0 -1 0 0 2
	 950 4461 839 429
2 3 0 1 -1 -1 0 0 -1 0.000 0 0 -1 0 0 5
	 729 3187 790 3187 803 3726 716 3726 729 3187
2 1 0 2 -1 -1 0 0 -1 0.000 0 0 -1 0 0 9
	 680 4461 680 3958 716 3161 753 2954 778 2770 803 2599
	 827 2329 790 416 790 429
2 1 0 2 -1 -1 0 0 -1 0.000 0 0 -1 0 0 5
	 1010 4253 876 403 839 342 803 403 888 4461
2 1 0 2 -1 -1 0 0 -1 0.000 0 0 -1 0 0 11
	 1145 3628 1157 3481 1145 3370 1121 3284 1084 3199 1048 3150
	 1010 3089 986 3027 974 2966 950 2549 888 416
2 1 0 2 -1 -1 0 0 -1 0.000 0 0 -1 0 0 7
	 974 4461 974 4400 986 4327 1010 4266 1072 4327 1109 4376
	 1121 4461
2 2 0 1 -1 -1 0 0 0 0.000 0 0 0 0 0 5
	 1219 4156 1305 4156 1305 4242 1219 4242 1219 4156
2 1 0 2 -1 -1 0 0 -1 0.000 0 0 -1 0 0 11
	 1096 4560 1072 4707 1084 4830 1121 4903 1207 4988 1330 4903
	 1403 4830 1440 4755 1452 4657 1452 4536 1452 4461
2 1 0 1 -1 -1 0 0 -1 0.000 0 0 -1 0 0 6
	 1133 4927 1183 4817 1243 4769 1243 4670 1219 4584 1207 4461
2 2 0 1 -1 -1 0 0 0 0.000 0 0 0 0 0 5
	 1219 4769 1305 4769 1305 4683 1219 4683 1219 4769
2 1 0 2 -1 -1 0 0 -1 0.000 0 0 -1 0 0 7
	 1145 4009 1268 4094 1330 4156 1354 4228 1366 4314 1378 4389
	 1378 4461
2 1 0 2 -1 -1 0 0 -1 0.000 0 0 -1 0 0 7
	 1145 4916 1268 4830 1330 4769 1354 4694 1366 4608 1378 4536
	 1378 4461
2 2 0 1 -1 -1 0 0 -1 0.000 0 0 0 0 0 5
	 1256 4119 1390 4119 1390 4266 1256 4266 1256 4119
2 2 0 1 -1 -1 0 0 -1 0.000 0 0 0 0 0 5
	 1256 4804 1390 4804 1390 4657 1256 4657 1256 4804
-6
6 3409 5019 3551 5160
1 4 0 1 -1 -1 0 0 -1 0.000 1 0.0000 3478 5084 61 61 3445 5036 3515 5130
1 1 0 1 -1 -1 0 0 -1 0.000 1 0.0000 3496 5082 23 38 3496 5082 3520 5120
-6
1 3 0 1 -1 -1 0 0 -1 0.000 1 0.0000 2040 9867 98 98 2040 9867 2102 9940
1 3 0 1 -1 -1 0 0 -1 0.000 0 0.0000 4736 9720 195 195 4736 9720 4933 9916
1 3 2 1 -1 -1 0 0 -1 3.000 0 0.0000 4712 6203 195 195 4712 6203 4897 6398
2 3 0 0 -1 56 5 0 20 0.000 0 0 -1 0 0 14
	 1826 4450 5806 422 6696 1317 5586 2415 6622 3437 6247 3818
	 6885 4445 6254 5083 6627 5456 5598 6485 6702 7591 5801 8467
	 1804 4451 1826 4450
2 3 0 0 -1 59 3 0 20 0.000 0 0 -1 0 0 93
	 3548 3701 3548 3688 3548 3640 3523 3616 3474 3579 3414 3469
	 3401 3444 3438 3407 3621 3308 3683 3223 3683 3137 3756 3014
	 3805 3003 3903 2917 3953 2893 3965 2832 4038 2709 4076 2573
	 4332 2549 4492 2329 4529 2219 4736 2046 4774 2059 4945 1875
	 5007 1642 5129 1409 5191 1409 5496 1310 5595 1250 5718 1115
	 5766 1115 6036 1016 6060 1128 6085 1275 6098 1385 6098 1593
	 5901 1679 5705 1765 5571 1875 5448 2072 5399 2243 5313 2254
	 5239 2353 5239 2524 5252 2538 5472 2660 5534 2660 5705 2867
	 5816 3014 5546 3137 5362 3187 5338 3223 5424 3284 5521 3383
	 5424 3493 5313 3640 5301 3664 5313 3664 5436 3701 5558 3835
	 5619 3862 5865 3873 5951 3996 6170 4020 6170 4106 6245 4204
	 6306 4314 6379 4314 6490 4413 6494 4445 4504 4437 4517 4351
	 4259 4290 4259 4437 3879 4437 3879 4376 3903 4253 3903 4057
	 3867 4044 3805 4044 3744 4044 3720 4044 3720 3972 3768 3873
	 3720 3849 3646 3824 3634 3824 3634 3787 3634 3750 3609 3750
	 3573 3701 3573 3677 3548 3701
2 3 0 0 -1 59 3 0 20 0.000 0 0 -1 0 0 8
	 5615 3175 6359 3175 6617 3432 6350 3698 5628 3698 5889 3437
	 5611 3171 5615 3175
2 3 0 0 -1 59 3 0 20 0.000 0 0 -1 0 0 8
	 3159 3404 2754 3809 2938 3866 3126 3821 3278 3821 3278 3596
	 3155 3400 3159 3404
2 3 0 0 -1 59 3 0 20 0.000 0 0 -1 0 0 6
	 3029 5192 3266 5191 3678 5738 3540 5738 3021 5191 3029 5192
2 3 0 0 -1 59 3 0 20 0.000 0 0 -1 0 0 6
	 4280 4434 4280 4307 4492 4360 4492 4441 4267 4441 4280 4434
2 3 0 0 -1 56 5 0 20 0.000 0 0 -1 0 0 48
	 845 342 894 422 967 3008 1023 3107 1060 3174 1109 3265
	 1145 3364 1151 3463 1145 3616 1145 3800 1207 3934 1121 4009
	 1078 4087 1072 4180 1072 4253 1109 4389 1121 4450 1102 4554
	 1072 4657 1078 4780 1084 4836 1138 4916 1207 4988 1170 5063
	 1157 5135 1151 5240 1145 5339 1151 5387 1157 5454 1151 5521
	 1133 5596 1096 5695 1048 5780 967 5903 888 8497 839 8571
	 790 8510 833 6524 766 5979 716 5734 686 4930 686 3968
	 716 3171 815 2521 839 2037 803 422 839 355 845 342
2 3 0 0 -1 44 3 0 20 0.000 0 0 -1 0 0 15
	 850 351 885 433 1008 4271 984 4332 976 4415 976 4508
	 988 4589 1012 4664 881 8499 850 8565 805 8512 894 4454
	 805 411 845 346 850 351
2 3 0 0 -1 44 3 0 20 0.000 0 0 -1 0 0 13
	 1816 4455 1819 4426 5805 424 6700 1303 6454 1552 6356 1454
	 6504 1299 5817 628 2160 4293 2049 4285 2000 4378 1902 4452
	 1816 4455
2 3 0 0 -1 44 3 0 20 0.000 0 0 -1 0 0 12
	 1821 4459 1920 4459 1997 4541 2091 4541 5819 8269 6493 7587
	 6346 7440 6448 7338 6693 7582 5803 8470 1807 4460 1821 4459
2 3 0 0 -1 59 4 0 20 0.000 0 0 -1 0 0 24
	 1221 3958 1315 4126 1388 4119 1388 4266 1347 4266 1372 4359
	 1372 4547 1356 4657 1393 4662 1393 4800 1302 4800 1209 4968
	 1131 4907 1086 4825 1078 4698 1110 4560 1135 4470 1099 4338
	 1086 4233 1086 4114 1090 4089 1144 4009 1213 3942 1221 3958
2 3 0 0 -1 59 4 0 20 0.000 0 0 -1 0 0 16
	 2406 4441 2442 4335 2503 4242 2610 4130 2674 4074 2806 3991
	 3010 3934 3162 3913 3321 3913 3390 3927 3591 4024 3663 4138
	 3701 4215 3725 4303 3734 4445 2406 4441
2 3 0 0 -1 56 5 0 20 0.000 0 0 -1 0 0 26
	 1822 9158 1932 9109 1936 9076 1966 9024 2031 8994 2386 8949
	 2570 9003 2807 8966 3269 8815 3464 8778 3780 8746 4338 8773
	 4866 8815 5339 8880 5768 8966 6197 9096 6883 9215 5405 9366
	 4967 9387 2794 9391 2365 9362 2147 9314 1940 9243 1821 9171
	 1818 9150 1822 9158
2 3 0 0 -1 59 3 0 20 0.000 0 0 -1 0 0 63
	 3822 8752 3790 8819 3717 8857 3704 8862 3643 8851 3589 8832
	 3546 8825 3466 8912 3393 8923 3282 8936 3271 8947 3227 8985
	 3142 9028 3129 9028 3091 9083 3209 9083 3263 9065 3362 9015
	 3460 9065 3504 9070 3638 9065 3747 9076 3870 9058 3908 9114
	 3969 9114 4121 9114 4250 9102 4325 9119 4477 9132 4600 9138
	 4753 9108 4846 9102 4876 9108 4980 9132 5127 9156 5421 9156
	 5555 9199 5753 9162 5739 9162 5531 9169 5531 9119 5544 9095
	 5550 9070 5416 9089 5403 9065 5445 9046 5469 9028 5274 9004
	 5287 8980 5421 8966 5649 9022 5697 9028 5838 9065 5954 9083
	 6090 9127 6194 9127 6261 9119 6163 9095 5783 8980 5360 8886
	 4906 8819 4268 8771 3822 8752
2 3 0 0 -1 44 3 0 20 0.000 0 0 -1 0 0 9
	 1824 9153 1942 9111 6173 9217 6189 9242 5801 9312 1915 9217
	 1826 9172 1829 9148 1824 9153
2 3 0 0 -1 59 3 0 20 0.000 0 0 -1 0 0 7
	 2455 8964 2917 8830 3002 8883 2806 8952 2578 8998 2455 8956
	 2455 8964
2 3 0 0 -1 44 3 0 20 0.000 0 0 -1 0 0 7
	 3369 8670 3366 8765 3410 8784 3484 8768 3509 8715 3366 8670
	 3369 8670
2 3 0 1 59 44 1 0 20 0.000 0 0 -1 0 0 8
	 3316 5100 3445 5009 3733 5039 3683 5083 3721 5125 3451 5168
	 3365 5119 3316 5100
2 1 0 1 -1 -1 0 0 -1 0.000 0 0 -1 0 0 2
	 1513 9977 7189 9854
2 1 0 2 -1 -1 0 0 -1 0.000 0 0 -1 0 0 28
	 5411 9365 6919 9217 6196 9095 5963 9022 5742 8961 5386 8886
	 4994 8825 4627 8789 4259 8765 3732 8739 3438 8653 3303 8629
	 3119 8629 2984 8653 2887 8690 2714 8776 2396 8947 1783 9156
	 1942 9242 2040 9279 2126 9303 2211 9327 2310 9352 2408 9365
	 2591 9378 2861 9389 4897 9389 5424 9365
2 3 0 1 -1 -1 0 0 -1 0.000 0 0 -1 0 0 6
	 2899 9279 3340 9279 3708 9365 3266 9365 2874 9279 2899 9279
2 1 0 1 -1 -1 0 0 -1 0.000 0 0 -1 0 0 2
	 2887 8704 3021 8899
2 3 0 1 -1 -1 0 0 -1 0.000 0 0 -1 0 0 7
	 3487 8765 3511 8715 3364 8666 3364 8765 3414 8789 3487 8776
	 3487 8765
2 3 0 1 -1 -1 0 0 -1 0.000 0 0 -1 0 0 5
	 2899 8825 2776 8862 2874 8752 2899 8813 2899 8825
2 3 0 2 -1 -1 0 0 -1 0.000 0 0 -1 0 0 9
	 2372 8947 2052 8985 2004 8998 1979 9009 1942 9046 1930 9070
	 1930 9108 2359 8961 2372 8947
2 1 0 2 -1 -1 0 0 -1 0.000 0 0 -1 0 0 8
	 2384 8947 2567 8998 2800 8961 2984 8899 3107 8862 3266 8813
	 3450 8776 3732 8752
2 3 0 1 -1 -1 0 0 -1 0.000 0 0 -1 0 0 6
	 4271 8765 4271 8825 4504 8813 4504 8776 4271 8776 4271 8765
2 1 0 2 -1 -1 0 0 -1 0.000 0 0 -1 0 0 6
	 6306 9231 5595 9132 6221 9180 6625 9205 6245 9156 6281 9169
2 3 0 2 -1 -1 0 0 -1 0.000 0 0 -1 0 0 7
	 1905 9217 5790 9316 6269 9231 5790 9205 1930 9108 1795 9156
	 1905 9217
2 2 0 1 7 7 0 0 20 0.000 0 0 0 0 0 5
	 1795 9279 1599 9279 1599 9058 1795 9058 1795 9279
2 3 0 1 -1 -1 0 0 -1 0.000 0 0 -1 0 0 8
	 2445 8961 2911 8825 3008 8886 2861 8947 2764 8972 2678 8985
	 2555 8998 2445 8961
2 1 0 2 -1 -1 0 0 -1 0.000 0 0 -1 0 0 8
	 6587 9205 5546 9058 5963 9033 5301 8961 4909 8936 4038 8912
	 3720 8923 3438 8961
2 1 0 1 -1 -1 0 0 -1 0.000 0 0 -1 0 0 4
	 3364 8862 3487 8862 3426 8912 3364 8862
2 1 0 2 -1 -1 0 0 -1 0.000 0 0 -1 0 0 9
	 1770 4437 5804 8482 6698 7588 5595 6484 6625 5454 6257 5087
	 6895 4450 1783 4450 1770 4461
2 3 0 1 -1 -1 0 0 -1 0.000 0 0 -1 0 0 6
	 6428 7318 6170 7575 5338 6741 5595 6484 6416 7305 6428 7318
2 1 0 2 -1 -1 0 0 -1 0.000 0 0 -1 0 0 9
	 1770 4461 5804 416 6698 1310 5595 2415 6625 3431 6257 3811
	 6895 4450 1783 4450 1770 4437
2 3 0 1 -1 -1 0 0 -1 0.000 0 0 -1 0 0 6
	 6428 1580 6170 1323 5338 2158 5595 2415 6416 1593 6428 1580
2 3 0 1 -1 -1 0 0 -1 0.000 0 0 -1 0 0 10
	 6906 4461 6257 3811 6134 3934 6245 4033 6134 4143 6257 4242
	 6134 4351 6257 4450 6906 4450 6906 4461
2 4 0 1 -1 -1 0 0 -1 0.000 0 0 5 0 0 5
	 3107 4314 3107 4020 3401 4020 3401 4314 3107 4314
2 2 0 1 -1 -1 0 0 -1 0.000 0 0 0 0 0 5
	 2984 4450 2984 4362 3414 4362 3414 4450 2984 4450
2 1 0 1 -1 -1 0 0 -1 0.000 0 0 -1 0 0 8
	 3670 3100 5840 943 6074 1176 4811 2463 5362 2979 4112 2979
	 3990 3100 3683 3100
2 2 0 1 -1 -1 0 0 -1 0.000 0 0 0 0 0 5
	 3070 4009 3070 3921 3388 3921 3388 4009 3070 4009
2 3 0 1 -1 -1 2 0 -1 0.000 0 0 -1 0 0 9
	 2984 3958 2984 4450 2788 4450 2776 4314 2788 4228 2887 4068
	 2984 3947 2996 3947 2984 3958
2 3 0 1 -1 -1 2 0 -1 0.000 0 0 -1 0 0 6
	 3474 3958 3474 4437 3621 4437 3621 4167 3561 4044 3474 3958
2 1 0 1 -1 -1 2 0 -1 0.000 0 0 -1 0 0 3
	 3903 4242 3903 4461 3903 4450
2 1 0 1 -1 -1 2 0 -1 0.000 0 0 -1 0 0 2
	 4038 4266 4038 4437
2 1 0 1 -1 -1 2 0 -1 0.000 0 0 -1 0 0 2
	 4137 4290 4137 4437
2 3 0 1 -1 -1 2 0 -1 0.000 0 0 -1 0 0 5
	 5607 2439 5350 2696 5693 3040 5951 2781 5607 2439
2 3 0 1 -1 -1 2 0 -1 0.000 0 0 -1 0 0 5
	 5607 6473 5350 6214 5693 5871 5951 6128 5607 6473
2 1 0 1 -1 -1 0 0 -1 0.000 0 0 -1 0 0 11
	 2481 4450 2396 4510 2469 4571 2396 4608 2481 4657 2861 4657
	 2947 4597 2861 4547 2947 4499 2849 4450 2481 4450
2 1 0 1 -1 -1 0 0 -1 0.000 0 0 -1 0 0 2
	 4712 5614 3940 5614
2 1 0 1 -1 -1 0 0 -1 0.000 0 0 -1 0 0 2
	 5975 5614 5571 5210
2 3 0 2 -1 -1 0 0 -1 0.000 0 0 7 0 0 7
	 2960 5258 3364 5737 3683 5737 3266 5184 2899 5184 2899 5197
	 2960 5258
2 2 0 1 -1 -1 0 0 -1 0.000 0 0 0 0 0 5
	 3082 4204 3082 4143 3008 4143 3008 4204 3082 4204
2 3 0 2 -1 -1 0 0 -1 0.000 0 0 -1 0 0 19
	 3732 4450 3720 4303 3695 4204 3658 4130 3597 4033 3487 3972
	 3376 3921 3241 3910 3168 3910 3058 3921 2947 3947 2800 3996
	 2727 4033 2641 4094 2555 4180 2481 4266 2420 4376 2396 4450
	 3732 4450
2 3 0 1 -1 -1 0 0 -1 0.000 0 0 -1 0 0 20
	 3487 4461 3388 4523 3487 4608 3388 4670 3487 4731 3388 4804
	 3474 4865 3388 4927 3487 4977 5325 4977 5424 4903 5325 4854
	 5424 4769 5313 4718 5424 4646 5325 4584 5424 4523 5313 4450
	 3487 4450 3487 4461
2 1 0 3 -1 -1 2 0 -1 0.000 0 0 -1 0 0 2
	 3903 4424 4259 4424
2 2 0 1 -1 -1 0 0 0 0.000 0 0 0 0 0 5
	 2874 4228 2776 4228 2776 4130 2874 4130 2874 4228
2 1 0 1 -1 -1 0 0 -1 0.000 0 0 -1 0 0 2
	 3511 4731 5289 4731
2 1 0 1 -1 -1 0 0 -1 0.000 0 0 -1 0 0 14
	 3499 5210 6170 5210 6416 5454 6122 5761 5987 5614 4480 5614
	 4026 6018 4504 6497 4688 6497 5987 7808 5804 7992 3768 5946
	 4026 5712 3523 5210
2 3 0 1 -1 -1 0 0 -1 0.000 0 0 -1 0 0 11
	 3867 4988 3768 5063 3867 5111 3768 5160 3867 5210 5338 5210
	 5436 5148 5338 5111 5436 5050 5338 4988 3867 4988
2 1 0 1 -1 -1 0 0 -1 0.000 0 0 -1 0 0 4
	 3327 3787 3450 3787 3388 3701 3327 3787
2 1 0 1 -1 -1 0 0 -1 0.000 0 0 -1 0 0 7
	 3278 3824 3131 3824 2935 3873 2738 3811 3156 3394 3278 3603
	 3278 3824
2 3 0 1 -1 -1 0 0 -1 0.000 0 0 -1 0 0 10
	 6895 4437 6245 5087 6122 4964 6232 4865 6122 4755 6245 4657
	 6122 4547 6245 4450 6895 4450 6895 4437
2 2 0 1 7 7 0 0 20 0.000 0 0 0 0 0 5
	 7090 4584 6895 4584 6895 4303 7090 4303 7090 4584
2 2 0 1 7 7 0 0 20 0.000 0 0 0 0 0 5
	 1783 4597 1575 4597 1575 4314 1783 4314 1783 4597
2 3 0 1 -1 -1 0 0 -1 0.000 0 0 -1 0 0 15
	 4589 5614 4529 5662 4589 5737 4529 5798 4589 5858 4529 5919
	 4589 5981 4835 5981 4897 5919 4835 5858 4897 5798 4835 5737
	 4897 5662 4835 5614 4589 5614
2 3 0 1 -1 -1 1 0 -1 0.000 0 0 -1 0 0 20
	 4553 5981 4382 6055 4467 6104 4382 6154 4467 6189 4382 6251
	 4480 6300 4382 6337 4541 6411 4933 6411 5056 6337 4982 6312
	 5056 6251 4969 6203 5056 6141 4969 6104 5056 6042 4921 5981
	 4565 5981 4553 5981
2 4 1 1 -1 -1 0 0 -1 4.000 0 0 5 0 0 5
	 2813 4474 2519 4474 2519 4584 2813 4584 2813 4474
2 3 0 2 -1 -1 0 0 -1 0.000 0 0 -1 0 0 7
	 6355 3174 5607 3174 5877 3431 5607 3701 6355 3701 6612 3431
	 6355 3174
2 4 2 1 -1 -1 0 0 -1 3.000 0 0 5 0 0 5
	 5239 3653 4137 3653 4137 3223 5239 3223 5239 3653
2 3 0 1 -1 -1 0 0 -1 0.000 0 0 -1 0 0 6
	 2481 4461 2359 4536 2016 4536 1930 4461 2494 4461 2481 4461
2 2 0 1 -1 -1 0 0 -1 0.000 0 0 0 0 0 5
	 3364 4277 3523 4277 3523 4044 3364 4044 3364 4277
2 3 0 2 -1 -1 0 0 -1 0.000 0 0 -1 0 0 6
	 4271 4437 4271 4303 4492 4351 4492 4450 4271 4450 4271 4437
2 3 0 2 -1 -1 0 0 -1 0.000 0 0 -1 0 0 12
	 6440 7342 6343 7441 6490 7588 5816 8262 2090 4536 1988 4536
	 1905 4462 1807 4461 5804 8471 6698 7588 6440 7329 6440 7342
2 3 0 2 -1 -1 2 0 -1 0.000 0 0 -1 0 0 12
	 6453 1569 6343 1457 6490 1310 5816 636 2174 4281 2054 4285
	 1889 4450 1795 4450 5804 429 6698 1310 6440 1569 6453 1569
2 3 0 1 -1 7 0 0 -1 0.000 0 0 -1 0 0 7
	 3306 5090 3442 5004 3730 5041 3675 5084 3730 5127 3447 5170
	 3306 5090
3 2 0 1 -1 -1 0 0 -1 0.000 0 0 0 5
	 1967 9022 2004 9033 2004 9058 1992 9070 1930 9083
	 0.000 -1.000 -1.000 -1.000 0.000
3 2 0 1 -1 -1 0 0 -1 0.000 0 0 0 4
	 5987 4081 4958 3910 4026 3897 3340 3910
	 0.000 -1.000 -1.000 0.000
3 2 0 2 -1 -1 2 0 -1 0.000 0 0 0 7
	 2972 3947 2923 4057 2887 4180 2887 4204 2887 4242 2887 4327
	 2887 4450
	 0.000 -1.000 -1.000 -1.000 -1.000 -1.000 0.000
3 2 0 1 -1 -1 0 0 -1 0.000 0 0 0 11
	 4639 3187 4026 3199 3793 3247 3597 3334 3511 3407 3511 3493
	 3573 3541 3744 3628 3915 3664 4088 3677 4615 3677
	 0.000 -1.000 -1.000 -1.000 -1.000 -1.000 -1.000 -1.000
	 -1.000 -1.000 0.000
3 2 0 1 -1 -1 0 0 -1 0.000 0 0 0 7
	 1992 4437 2004 4389 2040 4351 2064 4351 2052 4389 2052 4437
	 2052 4437
	 0.000 -1.000 -1.000 -1.000 -1.000 -1.000 0.000
3 2 0 1 -1 -1 0 0 -1 0.000 0 0 0 9
	 1979 4437 2004 4376 2040 4338 2090 4314 2175 4303 2261 4327
	 2346 4389 2384 4437 2384 4437
	 0.000 -1.000 -1.000 -1.000 -1.000 -1.000 -1.000 -1.000
	 0.000
4 0 -1 0 0 16 9 0.0000 4 90 1170 3891 5148 WEAPON BAY NO.1\001
4 0 -1 0 0 16 9 0.0000 4 90 1170 3658 4633 WEAPON BAY NO.2\001
4 0 -1 0 0 16 9 0.0000 4 90 360 2519 4793 NOSE\001
4 0 -1 0 0 16 9 0.0000 4 90 360 2519 4916 GEAR\001
4 0 -1 0 0 16 9 0.0000 4 90 345 3462 5871 INLET\001
4 0 -1 0 0 18 18 0.0000 4 210 555 1547 735 RFX\001
4 0 -1 0 0 18 18 0.0000 4 270 2730 1547 995 Strike/Recon Fighter\001
4 0 -1 0 0 16 9 0.0000 4 90 345 4958 5772 MAIN \001
4 0 -1 0 0 16 9 0.0000 4 90 360 4958 5919 GEAR\001
4 0 -1 0 0 16 9 0.0000 4 90 1155 3894 4208 AAR RECEPTACLE\001
4 0 -1 0 0 16 9 0.0000 4 90 270 5239 4400 GPS\001
4 0 -1 0 0 16 9 0.0000 4 90 780 4602 5478 ENGINE BAY\001
4 0 -1 0 0 16 9 0.0000 4 90 255 6281 4413 TAIL\001
4 0 -1 0 0 16 9 0.0000 4 90 600 5889 3493 EXHAUST\001
4 0 -1 0 0 16 9 0.0000 4 90 270 6024 3628 BAY\001
4 0 -1 0 0 16 9 0.0000 4 90 285 2871 5098 DLIR\001
4 0 -1 0 0 18 11 0.0000 4 150 2220 1575 1286 USAF 2025 Study Submission\001
-6
# Sidelooking battlefield
# surveilence LIDAR
6 6622 1853 12433 2987
6 6622 1853 12433 2987
4 0 0 0 0 0 12 0.0000 4 180 5820 6666 2455 The author is not responsible for any losses which may result from the use or\001
4 0 0 0 -1 0 12 0.0000 4 180 5520 6666 2003 Distribution of this artwork as part of the xfig package, where xfig is part\001
4 0 0 0 -1 0 12 0.0000 4 180 4080 6666 2228 of a commercially sold software package is permitted.\001
4 0 0 0 0 0 12 0.0000 4 135 1770 6666 2678 misuse of this material.\001
4 0 0 0 -1 0 12 0.0000 4 180 1545 6666 2903  \251 1995, Carlo Kopp\001
-6
-6
-6
