#FIG 3.2
Portrait
Center
Inches
Letter  
100.00
Single
-2
1200 2
6 3000 1350 8775 4050
6 5426 3635 5953 3898
2 2 0 1 0 7 50 -1 -1 4.000 0 0 -1 0 0 5
	 5426 3635 5953 3635 5953 3898 5426 3898 5426 3635
2 1 0 1 0 7 50 -1 -1 4.000 0 0 -1 0 0 3
	 5426 3635 5689 3810 5953 3635
-6
6 7950 1425 8741 2040
3 2 0 1 0 7 50 -1 -1 0.000 0 0 0 4
	 7965 1469 8100 1603 7965 1803 8100 2003
	 0.000 -1.000 -1.000 0.000
4 0 0 50 -1 0 11 0.0000 4 175 439 8230 1603 Tr\345d 2\001
-6
2 2 0 1 0 7 50 -1 -1 0.000 0 0 -1 0 0 5
	 4957 3275 6084 3275 6084 4005 4957 4005 4957 3275
2 1 0 1 0 7 50 -1 -1 0.000 0 0 -1 0 0 4
	 4957 3275 5289 3141 6350 3141 6084 3275
2 1 0 1 0 7 50 -1 -1 4.000 0 0 -1 0 0 3
	 6350 3141 6350 3806 6084 4005
2 1 0 1 0 7 50 -1 -1 0.000 0 0 -1 1 0 2
	2 1 1.00 52.72 105.44
	 3364 2146 4691 3141
2 1 0 1 0 7 50 -1 -1 0.000 0 0 -1 1 0 2
	2 1 1.00 52.72 105.44
	 7852 2155 6525 3150
2 1 1 1 0 7 50 -1 -1 4.000 0 0 -1 1 0 2
	2 0 1.00 60.00 120.00
	 6450 3000 7725 2025
3 2 0 1 0 7 50 -1 -1 0.000 0 0 0 4
	 3032 1417 3163 1549 3032 1748 3163 1947
	 0.000 -1.000 -1.000 0.000
4 0 0 50 -1 0 11 0.0000 4 175 439 3296 1549 Tr\345d 1\001
4 0 0 50 -1 0 11 0.0000 4 141 615 5161 3458 Mailbox \001
4 0 0 50 -1 0 10 0.0000 4 142 1081 6075 2250 2.Condition_signal\001
4 0 0 50 -1 0 11 0.0000 4 107 594 7050 3075 3.Receive\001
4 0 0 50 -1 0 11 0.0000 4 107 405 4050 2475 1.Send\001
-6
