#FIG 3.2
Landscape
Center
Metric
A4      
100.00
Single
-2
1200 2
6 3240 3600 4680 4365
2 2 0 1 0 7 50 0 -1 0.000 0 0 -1 0 0 5
	 3240 3600 4680 3600 4680 4365 3240 4365 3240 3600
4 0 0 50 0 0 12 0.0000 4 180 1095 3420 4050 GATE Keeper\001
-6
6 3240 5265 4680 6030
2 2 0 1 0 7 50 0 -1 0.000 0 0 -1 0 0 5
	 3240 5265 4680 5265 4680 6030 3240 6030 3240 5265
4 0 0 50 0 0 12 0.0000 4 180 1095 3420 5715 GATE Keeper\001
-6
6 3240 1845 4680 2610
2 2 0 1 0 7 50 0 -1 0.000 0 0 -1 0 0 5
	 3240 1845 4680 1845 4680 2610 3240 2610 3240 1845
4 0 0 50 0 0 12 0.0000 4 180 1095 3420 2295 GATE Keeper\001
-6
6 5850 3555 7920 4140
2 2 0 1 0 7 50 0 -1 0.000 0 0 -1 0 0 5
	 5850 3555 7920 3555 7920 4140 5850 4140 5850 3555
4 0 0 50 0 0 10 0.0000 4 135 540 6554 3887 Memory\001
-6
2 1 0 1 0 11 50 0 20 0.000 0 0 -1 0 0 18
	 4680 2025 4995 2025 4995 3645 4680 3645 4680 3735 4995 3735
	 4995 5310 4680 5310 4680 5400 5085 5400 5085 3735 5805 3735
	 5850 3690 5805 3645 5085 3645 5085 1935 4680 1935 4680 2025
2 1 0 1 0 11 50 0 20 0.000 0 0 -1 0 0 5
	 4680 2070 4995 2070 4995 2160 4680 2160 4680 2070
2 1 0 1 0 11 50 0 20 0.000 0 0 -1 0 0 7
	 5085 2070 5265 2070 5265 3645 5175 3645 5175 2160 5085 2160
	 5085 2070
2 1 0 1 0 11 50 0 20 0.000 0 0 -1 0 0 5
	 4680 3780 4995 3780 4995 3870 4680 3870 4680 3780
2 1 0 1 0 11 50 0 20 0.000 0 0 -1 0 0 16
	 5085 3780 5175 3780 5175 3735 5265 3735 5265 3780 5805 3780
	 5850 3825 5805 3870 5265 3870 5265 5535 4680 5535 4680 5445
	 5175 5445 5175 3870 5085 3870 5085 3780
2 2 0 1 0 11 50 0 20 0.000 0 0 -1 0 0 5
	 5085 2205 5175 2205 5175 2295 5085 2295 5085 2205
2 2 0 1 0 11 50 0 20 0.000 0 0 -1 0 0 5
	 5085 3915 5175 3915 5175 4005 5085 4005 5085 3915
2 2 0 1 0 11 50 0 20 0.000 0 0 -1 0 0 5
	 5355 3780 5445 3780 5445 3735 5355 3735 5355 3780
2 1 0 1 0 11 50 0 20 0.000 0 0 -1 0 0 7
	 5355 3645 5355 2295 5265 2295 5265 2205 5445 2205 5445 3645
	 5355 3645
2 1 0 1 0 11 50 0 20 0.000 0 0 -1 0 0 6
	 4995 2205 4725 2205 4680 2250 4725 2295 4995 2295 4995 2205
2 1 0 1 0 11 50 0 20 0.000 0 0 -1 0 0 16
	 5850 3915 5445 3915 5445 3870 5355 3870 5355 3915 5265 3915
	 5265 4005 5355 4005 5355 5580 4725 5580 4680 5625 4725 5670
	 5445 5670 5445 4005 5850 4005 5850 3915
2 1 0 1 0 11 50 0 20 0.000 0 0 -1 0 0 6
	 4995 3915 4725 3915 4680 3960 4725 4005 4995 4005 4995 3915
2 1 0 1 0 7 50 0 -1 0.000 0 0 -1 1 0 4
	1 1 1.00 60.00 120.00
	 4680 2340 6120 2340 6120 2070 6750 2070
2 1 0 1 0 7 50 0 -1 0.000 0 0 -1 1 0 6
	1 1 1.00 60.00 120.00
	 4680 4095 5535 4095 5535 2430 6255 2430 6255 2340 6750 2340
2 1 0 1 0 7 50 0 -1 0.000 0 0 -1 1 0 4
	1 1 1.00 60.00 120.00
	 4680 5760 5670 5760 5670 2610 6750 2610
2 1 0 1 0 7 50 0 -1 0.000 0 0 -1 1 0 6
	1 1 1.00 60.00 120.00
	 7920 2070 8055 2070 8055 2790 4860 2790 4860 2475 4680 2475
2 1 0 1 0 7 50 0 -1 0.000 0 0 -1 1 0 6
	1 1 1.00 60.00 120.00
	 7920 2340 8235 2340 8235 2880 4860 2880 4860 4230 4680 4230
2 1 0 1 0 7 50 0 -1 0.000 0 0 -1 1 0 4
	1 1 1.00 60.00 120.00
	 7875 2610 8415 2610 8415 5895 4680 5895
2 2 0 1 0 7 50 0 -1 0.000 0 0 -1 0 0 5
	 6750 1710 7920 1710 7920 2700 6750 2700 6750 1710
2 2 0 2 0 7 50 0 -1 0.000 0 0 -1 0 0 5
	 2475 1395 9180 1395 9180 6705 2475 6705 2475 1395
4 0 0 50 0 0 8 0.0000 4 105 465 5580 2295 data_port\001
4 0 0 50 0 0 8 0.0000 4 120 540 5355 2160 write_port\001
4 0 0 50 0 0 8 0.0000 4 75 405 5130 2025 Address\001
4 0 0 50 0 0 8 0.0000 4 105 465 6795 2115 request 1\001
4 0 0 50 0 0 8 0.0000 4 105 465 6795 2385 request 1\001
4 0 0 50 0 0 8 0.0000 4 105 465 6795 2655 request 1\001
4 0 0 50 0 0 8 0.0000 4 90 345 7515 2115 grant 1\001
4 0 0 50 0 0 8 0.0000 4 90 345 7515 2655 grant 1\001
4 0 0 50 0 0 8 0.0000 4 90 345 7515 2385 grant 1\001
4 0 0 50 0 0 12 0.0000 4 135 540 7020 1890 Arbitor\001
