#FIG 3.2
Landscape
Center
Inches
Letter  
100.00
Single
-2
1200 2
2 2 0 1 0 7 50 -1 -1 0.000 0 0 -1 0 0 5
	 4350 1950 4425 1950 4425 7500 4350 7500 4350 1950
2 2 0 1 0 7 50 -1 -1 0.000 0 0 -1 0 0 5
	 3825 7500 4950 7500 4950 7650 3825 7650 3825 7500
2 2 0 1 0 7 50 -1 -1 0.000 0 0 -1 0 0 5
	 3975 2550 4800 2550 4800 2850 3975 2850 3975 2550
2 2 0 1 0 7 50 -1 -1 0.000 0 0 -1 0 0 5
	 6900 -675 8700 -675 8700 1575 6900 1575 6900 -675
2 2 0 1 0 1 50 -1 35 0.000 0 0 -1 0 0 5
	 6900 150 8700 150 8700 1575 6900 1575 6900 150
2 1 0 1 0 7 50 -1 -1 0.000 0 0 -1 0 0 2
	 4800 8025 11550 8025
2 1 0 1 0 7 50 -1 -1 0.000 0 0 -1 0 0 2
	 11550 7875 11550 8175
2 1 0 1 0 7 50 -1 -1 0.000 0 0 -1 0 0 2
	 4800 7875 4800 8175
2 1 0 1 0 7 50 -1 -1 0.000 0 0 -1 0 0 2
	 11775 7725 12150 7725
2 1 0 1 0 7 50 -1 -1 0.000 0 0 -1 0 0 2
	 12000 7725 12000 2850
2 1 0 1 0 7 50 -1 -1 0.000 0 0 -1 0 0 2
	 12150 2850 11850 2850
2 2 0 1 0 0 50 -1 20 0.000 0 0 -1 0 0 5
	 3075 2625 3375 2625 3375 2850 3075 2850 3075 2625
3 0 0 4 0 7 50 -1 -1 0.000 0 0 0 8
	 8700 1575 7650 -375 6450 -1050 3900 -675 2400 375 1950 1950
	 2700 2850 3975 2700
	 0.000 1.000 1.000 1.000 1.000 1.000 1.000 0.000
3 0 0 3 1 7 50 -1 -1 0.000 0 0 0 5
	 4800 2700 7050 2625 10500 4200 11400 6600 11550 7725
	 0.000 1.000 1.000 1.000 0.000
3 0 0 1 0 7 50 -1 -1 0.000 0 1 0 3
	0 0 1.00 60.00 120.00
	 2775 3300 3150 3225 3225 2925
	 0.000 1.000 0.000
4 0 0 50 -1 2 20 0.0000 4 210 240 12525 5325 H\001
4 0 0 50 -1 2 20 0.0000 4 210 195 8475 8925 L\001
4 0 0 50 -1 2 20 0.0000 4 210 180 5025 2175 P\001
4 0 0 50 -1 0 12 0.0000 4 135 435 2325 3375 Ventil\001
