#FIG 3.2  Produced by xfig version 3.2.5
Landscape
Center
Inches
Letter  
100.00
Single
-2
1200 2
1 3 0 1 0 7 49 -1 20 0.000 1 0.0000 3525 4200 237 237 3525 4200 3600 4425
1 3 0 1 0 7 49 -1 20 0.000 1 0.0000 4650 4200 237 237 4650 4200 4725 4425
1 3 0 1 0 7 49 -1 20 0.000 1 0.0000 5775 4200 237 237 5775 4200 5850 4425
1 3 0 1 0 7 49 -1 20 0.000 1 0.0000 5175 3375 237 237 5175 3375 5250 3600
1 3 0 1 0 7 49 -1 20 0.000 1 0.0000 4125 3375 237 237 4125 3375 4200 3600
2 2 1 0 0 7 50 -1 -1 12.000 0 0 -1 0 0 5
	 3000 2625 6300 2625 6300 4875 3000 4875 3000 2625
2 1 0 10 14 7 50 -1 -1 0.000 0 0 -1 0 0 2
	 3525 4200 5775 4200
2 1 0 5 14 7 50 -1 -1 0.000 0 0 -1 0 0 4
	 3525 4200 4125 3375 5175 3375 5775 4200
2 1 0 1 0 7 50 -1 -1 0.000 0 0 -1 0 1 3
	2 1 1.00 60.00 120.00
	 4200 4350 4425 4650 4725 4650
2 1 0 1 0 7 50 -1 -1 0.000 0 0 -1 1 0 2
	2 1 1.00 60.00 120.00
	 4725 3000 4575 3300
4 0 0 50 -1 0 12 0.0000 4 150 1005 4875 4725 First choice\001
4 0 0 50 -1 0 12 0.0000 4 150 1260 4650 2925 Second choice\001
4 0 0 48 -1 0 12 0.0000 4 150 135 3450 4275 E\001
4 0 0 48 -1 0 12 0.0000 4 150 135 5700 4275 E\001
