   1               		.file	"switches.c"
   2               		.arch atmega128
   3               	__SREG__ = 0x3f
   4               	__SP_H__ = 0x3e
   5               	__SP_L__ = 0x3d
   6               	__tmp_reg__ = 0
   7               	__zero_reg__ = 1
   8               		.global __do_copy_data
   9               		.global __do_clear_bss
  17               	.Ltext0:
  18               	.global	_ZN8Switches7getButsEv
  20               	_ZN8Switches7getButsEv:
  21               	.LFB13:
  22               	.LM1:
  23               	/* prologue: frame size=0 */
  24               	/* prologue end (size=0) */
  25               	.LBB2:
  26               	.LM2:
  27 0000 89B3      		in r24,57-0x20
  28 0002 9927      		clr r25
  29               	.LBE2:
  30               	.LM3:
  31 0004 887F      		andi r24,lo8(248)
  32 0006 9070      		andi r25,hi8(248)
  33               	/* epilogue: frame size=0 */
  34 0008 0895      		ret
  35               	/* epilogue end (size=1) */
  36               	/* function uchar Switches::getButs() size 5 (4) */
  37               	.LFE13:
  39               	.global	_ZN8SwitchesC2Ev
  41               	_ZN8SwitchesC2Ev:
  42               	.LFB11:
  43               	.LM4:
  44               	/* prologue: frame size=0 */
  45               	/* prologue end (size=0) */
  46               	.LBB3:
  47               	.LM5:
  48 000a 1ABA      		out 58-0x20,__zero_reg__
  49               	.LBE3:
  50               	/* epilogue: frame size=0 */
  51 000c 0895      		ret
  52               	/* epilogue end (size=1) */
  53               	/* function Switches::Switches() size 2 (1) */
  54               	.LFE11:
  56               	.global	_ZN8SwitchesC1Ev
  58               	_ZN8SwitchesC1Ev:
  59               	.LFB12:
  60               	.LM6:
  61               	/* prologue: frame size=0 */
  62               	/* prologue end (size=0) */
  63               	.LBB4:
  64               	.LM7:
  65 000e 1ABA      		out 58-0x20,__zero_reg__
  66               	.LBE4:
  67               	/* epilogue: frame size=0 */
  68 0010 0895      		ret
  69               	/* epilogue end (size=1) */
  70               	/* function Switches::Switches() size 2 (1) */
  71               	.LFE12:
  73               	.Letext0:
DEFINED SYMBOLS
                            *ABS*:00000000 switches.c
                            *ABS*:0000003f __SREG__
                            *ABS*:0000003e __SP_H__
                            *ABS*:0000003d __SP_L__
                            *ABS*:00000000 __tmp_reg__
                            *ABS*:00000001 __zero_reg__
C:\DOCUME~1\Ejer\LOKALE~1\Temp/ccQRaaaa.s:20     .text:00000000 _ZN8Switches7getButsEv
C:\DOCUME~1\Ejer\LOKALE~1\Temp/ccQRaaaa.s:41     .text:0000000a _ZN8SwitchesC2Ev
C:\DOCUME~1\Ejer\LOKALE~1\Temp/ccQRaaaa.s:58     .text:0000000e _ZN8SwitchesC1Ev

UNDEFINED SYMBOLS
__do_copy_data
__do_clear_bss
