#FIG 3.2
Landscape
Center
Metric
A4      
100.00
Single
-2
1200 2
0 32 #aaaaaa
2 1 0 1 0 7 50 0 -1 0.000 0 0 -1 0 0 2
	 3510 1935 3510 2610
2 1 0 1 0 7 50 0 -1 0.000 0 0 -1 0 0 2
	 4635 1935 4635 2610
2 1 0 1 0 7 50 0 -1 0.000 0 0 -1 0 0 2
	 5760 1935 5760 2610
2 1 0 1 0 7 50 0 -1 0.000 0 0 -1 0 0 2
	 6885 1935 6885 2610
2 1 0 1 0 7 50 0 -1 0.000 0 0 -1 0 0 2
	 8010 1935 8010 2610
2 1 0 1 0 7 50 0 -1 0.000 0 0 -1 0 0 2
	 9135 1935 9135 2610
2 1 0 1 0 7 50 0 -1 0.000 0 0 -1 0 0 2
	 10260 1935 10260 2610
2 1 0 1 0 7 50 0 -1 0.000 0 0 -1 0 0 2
	 11385 1935 11385 3960
2 1 0 1 0 7 50 0 -1 0.000 0 0 -1 0 0 2
	 11385 1935 2385 1935
2 1 0 1 0 7 50 0 -1 0.000 0 0 -1 0 0 2
	 2385 1935 2385 3960
2 1 0 1 0 7 50 0 -1 0.000 0 0 -1 0 0 2
	 11385 2610 2385 2610
2 1 0 1 0 7 50 0 -1 0.000 0 0 -1 0 0 2
	 11385 3285 2385 3285
2 1 0 1 0 7 50 0 -1 0.000 0 0 -1 0 0 2
	 11385 3960 2385 3960
2 1 0 1 0 7 50 0 -1 0.000 0 0 -1 0 0 2
	 2385 1935 1755 1305
2 2 0 0 0 32 51 0 20 0.000 0 0 -1 0 0 5
	 2610 3960 11610 3960 11610 4140 2610 4140 2610 3960
2 2 0 0 0 32 51 0 20 0.000 0 0 -1 0 0 5
	 11610 4005 11385 4005 11385 2070 11610 2070 11610 4005
2 1 1 1 32 32 49 0 20 4.000 0 0 -1 0 0 2
	 5760 2610 5760 3960
2 1 1 1 32 32 49 0 20 4.000 0 0 -1 0 0 2
	 6885 2610 6885 3960
4 0 0 50 0 0 12 5.4978 4 135 585 1665 1575 BYTES\001
4 0 0 50 0 0 12 5.4978 4 135 390 2025 1350 BITS\001
4 0 0 50 0 0 20 0.0000 4 195 135 2880 1710 7\001
4 0 0 50 0 0 20 0.0000 4 195 135 5085 1710 5\001
4 0 0 50 0 0 20 0.0000 4 195 135 6300 1710 4\001
4 0 0 50 0 0 20 0.0000 4 195 135 3960 1710 6\001
4 0 0 50 0 0 20 0.0000 4 195 135 7425 1710 3\001
4 0 0 50 0 0 20 0.0000 4 195 135 9630 1710 1\001
4 0 0 50 0 0 20 0.0000 4 195 135 10710 1710 0\001
4 0 0 50 0 0 20 0.0000 4 195 135 8460 1710 2\001
4 0 0 50 0 16 20 0.0000 4 195 150 2070 2340 1\001
4 0 0 50 0 16 20 0.0000 4 195 150 2070 3015 2\001
4 0 0 50 0 16 20 0.0000 4 195 150 2070 3690 3\001
4 0 0 50 0 0 17 0.0000 4 165 180 4005 2205 Y\001
4 0 0 50 0 0 17 0.0000 4 165 180 2880 2205 X\001
4 0 0 50 0 0 17 0.0000 4 165 960 2475 2475 Overflow\001
4 0 0 50 0 0 17 0.0000 4 165 960 3600 2475 Overflow\001
4 0 0 50 0 0 17 0.0000 4 225 780 4815 2475 Sign bit\001
4 0 0 50 0 0 17 0.0000 4 165 180 5085 2205 Y\001
4 0 0 50 0 0 17 0.0000 4 225 780 5940 2475 Sign bit\001
4 0 0 50 0 0 17 0.0000 4 165 180 6255 2205 X\001
4 0 0 50 0 0 17 0.0000 4 165 705 7155 2340 Altid 1\001
4 0 0 50 0 0 17 0.0000 4 225 750 8145 2340 M knap\001
4 0 0 50 0 0 17 0.0000 4 225 705 9360 2340 H knap\001
4 0 0 50 0 0 17 0.0000 4 225 705 10440 2340 V knap\001
4 0 0 50 0 0 17 0.0000 4 165 810 5940 3165 Position\001
4 0 0 50 0 0 17 0.0000 4 165 180 6255 2880 X\001
4 0 0 50 0 0 17 0.0000 4 165 810 5940 3825 Position\001
4 0 0 50 0 0 17 0.0000 4 165 180 6255 3555 Y\001
