#FIG 3.2  Produced by xfig version 3.2.5
Landscape
Center
Inches
Letter  
100.00
Single
-2
1200 2
5 1 0 1 0 7 50 -1 -1 0.000 0 0 0 0 5775.250 5849.421 4875 4950 5395 4635 5849 4579
5 1 0 1 0 7 50 -1 -1 0.000 0 0 0 0 5774.250 8704.236 5775 4575 6598 4658 7498 4952
1 3 0 1 0 7 50 -1 -1 0.000 1 0.0000 5775 8400 75 75 5775 8400 5775 8475
1 3 0 1 0 7 50 -1 -1 0.000 1 0.0000 5775 5850 75 75 5775 5850 5775 5925
1 3 0 1 0 7 50 -1 -1 0.000 1 0.0000 5775 4575 75 75 5775 4575 5775 4650
2 1 0 1 0 7 50 -1 -1 0.000 0 0 -1 0 0 2
	 7500 4950 9000 5700
2 1 0 1 0 7 50 -1 -1 0.000 0 0 -1 0 0 3
	 7500 4950 4875 4950 3375 6450
2 1 1 1 4 7 50 -1 -1 4.000 0 0 -1 1 0 2
	0 0 1.00 120.00 120.00
	 7500 4950 6600 4500
2 1 1 1 4 -1 50 -1 -1 4.000 0 0 -1 0 0 2
	 7500 4950 5700 8550
2 1 1 1 1 7 50 -1 -1 3.000 0 0 -1 0 0 2
	 4875 4950 6000 4500
2 1 1 1 4 7 50 -1 -1 4.000 0 0 -1 0 0 2
	 4875 4950 6675 6750
2 1 1 1 4 7 50 -1 -1 4.000 0 0 -1 1 0 2
	0 0 1.00 120.00 120.00
	 4875 4950 5625 4200
2 1 1 1 1 7 50 -1 -1 4.000 0 0 -1 0 0 2
	 7500 4950 5700 4575
2 1 1 1 12 7 50 -1 -1 4.000 0 0 -1 0 0 2
	 5775 4575 5775 8625
4 0 0 50 -1 0 12 0.0000 2 210 1110 5325 4125 $\\vec{v_1}$\001
4 0 0 50 -1 0 12 0.0000 2 210 1170 6825 4425 $\\vec{w_1}$\001
4 0 0 50 -1 0 12 0.0000 2 210 1170 6150 4875 $\\vec{w_2}$\001
4 0 0 50 -1 0 12 0.0000 2 210 570 5925 8400 $C_3$\001
4 0 0 50 -1 0 12 0.0000 2 210 570 5850 5850 $C_2$\001
4 0 0 50 -1 0 12 0.0000 2 210 570 5850 4500 $C_1$\001
4 0 0 50 -1 0 12 0.0000 2 210 1110 5475 4875 $\\vec{v_2}$\001
4 0 0 50 -1 0 12 0.0000 2 210 840 6375 5175 $\\vec{l}$\001
