%!PS-Adobe-3.0 EPSF-3.0
%%Creator: inkscape 0.45.1
%%Pages: 1
%%Orientation: Portrait
%%BoundingBox: 41 396 389 685
%%HiResBoundingBox: 41.239991 396.10273 388.28808 684.67899
%%EndComments
%%Page: 1 1
0 842 translate
0.8 -0.8 scale
0 0 0 setrgbcolor
[] 0 setdash
1 setlinewidth
0 setlinejoin
0 setlinecap
gsave [1 0 0 1 0 0] concat
gsave [1 0 0 1 0 0] concat
gsave
0.56862748 0.67843139 1 setrgbcolor
newpath
52.859806 378.98819 moveto
484.85175 378.98819 lineto
484.85175 470.78534 lineto
52.859806 470.78534 lineto
52.859806 378.98819 lineto
closepath
eofill
grestore
0 0 0 setrgbcolor
[8.1335884 4.0667942] 0 setdash
1.0166985 setlinewidth
0 setlinejoin
0 setlinecap
newpath
52.859806 378.98819 moveto
484.85175 378.98819 lineto
484.85175 470.78534 lineto
52.859806 470.78534 lineto
52.859806 378.98819 lineto
closepath
stroke
grestore
0 0 0 setrgbcolor
[4.5192669 4.5192669] 0 setdash
4.5192671 setlinewidth
0 setlinejoin
0 setlinecap
newpath
206.39812 549.66873 moveto
115.76953 549.66873 lineto
115.76953 446.91829 lineto
stroke
gsave [1 0 0 1 0 0] concat
gsave
0.56862748 0.67843139 1 setrgbcolor
newpath
52.710964 292.69403 moveto
484.83725 292.69403 lineto
484.83725 365.42937 lineto
52.710964 365.42937 lineto
52.710964 292.69403 lineto
closepath
eofill
grestore
0 0 0 setrgbcolor
[8.1335884 4.0667942] 0 setdash
1.0166985 setlinewidth
0 setlinejoin
0 setlinecap
newpath
52.710964 292.69403 moveto
484.83725 292.69403 lineto
484.83725 365.42937 lineto
52.710964 365.42937 lineto
52.710964 292.69403 lineto
closepath
stroke
grestore
gsave
0.50196081 0.50196081 0.50196081 setrgbcolor
newpath
350.48526 347.99761 moveto
350.48526 347.99761 339.47923 358.67077 339.99623 368.72509 curveto
340.48732 378.27563 358.73391 390.24035 358.73391 390.24035 curveto
355.17525 393.99526 lineto
369.40991 391.17908 lineto
367.63057 380.38371 lineto
364.0719 384.13862 lineto
364.0719 384.13862 356.95081 376.54102 357.19645 366.37827 curveto
357.44209 356.21517 371.39707 344.24524 371.39707 344.24524 curveto
350.48526 347.99761 lineto
closepath
eofill
grestore
0 0 0 setrgbcolor
[3.9018511 3.9018511] 0 setdash
3.9018512 setlinewidth
0 setlinejoin
0 setlinecap
newpath
204.39665 525.40328 moveto
88.55779 525.40328 lineto
88.55779 332.77318 lineto
118.9336 331.78268 lineto
stroke
gsave [1 0 0 1 0 0] concat
gsave
0.56862748 0.67843139 1 setrgbcolor
newpath
52.058338 197.02179 moveto
484.18462 197.02179 lineto
484.18462 269.75713 lineto
52.058338 269.75713 lineto
52.058338 197.02179 lineto
closepath
eofill
grestore
0 0 0 setrgbcolor
[8.1335884 4.0667942] 0 setdash
1.0166985 setlinewidth
0 setlinejoin
0 setlinecap
newpath
52.058338 197.02179 moveto
484.18462 197.02179 lineto
484.18462 269.75713 lineto
52.058338 269.75713 lineto
52.058338 197.02179 lineto
closepath
stroke
grestore
0 0 0 setrgbcolor
[3.9583867 3.9583867] 0 setdash
3.9583867 setlinewidth
0 setlinejoin
0 setlinecap
newpath
204.06749 499.77971 moveto
63.714362 499.77971 lineto
63.714362 232.9829 lineto
197.31047 233.13826 lineto
stroke
gsave
1 0.48627451 0.0039215689 setrgbcolor
newpath
349.74717 350.44177 moveto
349.74717 350.44177 338.74114 361.11493 339.25814 371.16925 curveto
339.74923 380.71979 357.99582 392.68451 357.99582 392.68451 curveto
354.43716 396.43942 lineto
368.67182 393.62324 lineto
366.89248 382.82787 lineto
363.33381 386.58278 lineto
363.33381 386.58278 356.21272 378.98518 356.45836 368.82243 curveto
356.704 358.65933 368.1336 349.9724 368.1336 349.9724 curveto
349.74717 350.44177 lineto
closepath
eofill
grestore
gsave
<<
/ShadingType 2
/ColorSpace /DeviceRGB
/Coords [335.39325 458.28934 335.5 530.7359]
/Extend [true true]
/Domain [0 1]
/Function <<
/FunctionType 3
/Functions
[
<<
/FunctionType 2
/Domain [0 1]
/C0 [1 1 1]
/C1 [0.65490198 0.98431373 0.91764706]
/N 1
>>
<<
/FunctionType 2
/Domain [0 1]
/C0 [0.65490198 0.98431373 0.91764706]
/C1 [0 0.38039216 0.52549022]
/N 1
>>
]
/Domain [0 1]
/Bounds [ 0.5 ]
/Encode [ 0 1 0 1 ]
>>
>>
newpath
120.69687 386.96839 moveto
150.37544 386.96839 lineto
129.5876 386.80303 119.93184 401.29508 120.21473 416.96839 curveto
368.05401 416.96839 lineto
368.497 403.18187 377.59289 386.93 391.73258 386.96839 curveto
431.41115 386.96839 lineto
416.53058 388.39696 410.62632 408.2326 410.39792 423.13391 curveto
410.16962 438.02904 421.02538 457.69926 431.34922 458.41355 curveto
122.83972 458.41355 lineto
122.83972 458.41355 96.435852 448.79274 96.590772 421.89115 curveto
96.745692 394.98956 120.69687 386.96839 120.69687 386.96839 curveto
closepath
eoclip
gsave [1 0 0 1 -58.588848 -71.822356] concat
shfill
grestore
grestore
0 0 0 setrgbcolor
[] 0 setdash
1 setlinewidth
0 setlinejoin
0 setlinecap
newpath
120.69687 386.96839 moveto
150.37544 386.96839 lineto
129.5876 386.80303 119.93184 401.29508 120.21473 416.96839 curveto
368.05401 416.96839 lineto
368.497 403.18187 377.59289 386.93 391.73258 386.96839 curveto
431.41115 386.96839 lineto
416.53058 388.39696 410.62632 408.2326 410.39792 423.13391 curveto
410.16962 438.02904 421.02538 457.69926 431.34922 458.41355 curveto
122.83972 458.41355 lineto
122.83972 458.41355 96.435852 448.79274 96.590772 421.89115 curveto
96.745692 394.98956 120.69687 386.96839 120.69687 386.96839 curveto
closepath
stroke
gsave
<<
/ShadingType 2
/ColorSpace /DeviceRGB
/Coords [178.07129 457.9238 178.07129 487.74942]
/Extend [true true]
/Domain [0 1]
/Function <<
/FunctionType 3
/Functions
[
<<
/FunctionType 2
/Domain [0 1]
/C0 [0.28235295 0.28235295 0.28235295]
/C1 [0.60784316 0.60784316 0.60784316]
/N 1
>>
<<
/FunctionType 2
/Domain [0 1]
/C0 [0.60784316 0.60784316 0.60784316]
/C1 [0.74901962 0.74901962 0.74901962]
/N 1
>>
]
/Domain [0 1]
/Bounds [ 0.5 ]
/Encode [ 0 1 0 1 ]
>>
>>
newpath
368.91115 409.91482 moveto
169.98258 409.46839 lineto
168.68425 396.12386 161.80874 386.93683 148.91115 386.61125 curveto
132.01221 386.17565 119.93522 400.28594 119.98258 416.61125 curveto
368.19687 416.96839 lineto
368.42973 414.62244 368.4637 412.47537 368.91115 409.91482 curveto
closepath
eoclip
gsave [1 0 0 1 -58.588848 -71.822356] concat
shfill
grestore
grestore
0 0 0 setrgbcolor
[] 0 setdash
1 setlinewidth
0 setlinejoin
0 setlinecap
newpath
368.91115 409.91482 moveto
169.98258 409.46839 lineto
168.68425 396.12386 161.80874 386.93683 148.91115 386.61125 curveto
132.01221 386.17565 119.93522 400.28594 119.98258 416.61125 curveto
368.19687 416.96839 lineto
368.42973 414.62244 368.4637 412.47537 368.91115 409.91482 curveto
closepath
stroke
gsave
0.94509804 0.94509804 0.94509804 setrgbcolor
newpath
122.12544 416.00157 moveto
122.99007 406.32386 128.97104 388.32956 147.64846 388.81538 curveto
156.63423 389.04911 165.95178 391.84823 167.83972 410.39696 curveto
368.6433 411.11125 lineto
368.70568 409.5511 lineto
169.95816 409.29856 lineto
168.23675 391.33368 159.27321 386.6439 147.22973 386.31759 curveto
130.7294 386.56082 121.80916 398.87008 119.45054 416.62216 curveto
122.12544 416.00157 lineto
closepath
eofill
grestore
0 0 0 setrgbcolor
[] 0 setdash
1 setlinewidth
0 setlinejoin
0 setlinecap
newpath
122.12544 416.00157 moveto
122.99007 406.32386 128.97104 388.32956 147.64846 388.81538 curveto
156.63423 389.04911 165.95178 391.84823 167.83972 410.39696 curveto
368.6433 411.11125 lineto
368.70568 409.5511 lineto
169.95816 409.29856 lineto
168.23675 391.33368 159.27321 386.6439 147.22973 386.31759 curveto
130.7294 386.56082 121.80916 398.87008 119.45054 416.62216 curveto
122.12544 416.00157 lineto
closepath
stroke
gsave
0.3764706 0.3764706 0.3764706 setrgbcolor
newpath
184.43703 349.97241 moveto
184.43703 349.97241 187.88691 360.91276 181.44719 372.27698 curveto
175.00747 383.6412 158.67814 395.42927 158.67814 395.42927 curveto
161.7086 399.46988 lineto
149.58677 396.43943 lineto
151.102 384.82267 lineto
154.13246 388.86328 lineto
154.13246 388.86328 163.13817 379.60059 166.79997 369.7516 curveto
170.46177 359.90261 168.77967 349.46733 168.77967 349.46733 curveto
184.43703 349.97241 lineto
closepath
eofill
grestore
gsave
<<
/ShadingType 3
/ColorSpace /DeviceRGB
/Coords [443.10721 477.83121 0 443.10721 477.83121 26.261209]
/Extend [true true]
/Domain [0 1]
/Function <<
/FunctionType 3
/Functions
[
<<
/FunctionType 2
/Domain [0 1]
/C0 [1 1 1]
/C1 [0.65490198 0.98431373 0.91764706]
/N 1
>>
<<
/FunctionType 2
/Domain [0 1]
/C0 [0.65490198 0.98431373 0.91764706]
/C1 [0 0.38039216 0.52549022]
/N 1
>>
]
/Domain [0 1]
/Bounds [ 0.5 ]
/Encode [ 0 1 0 1 ]
>>
>>
newpath
431.33514 386.57013 moveto
461.63971 403.99526 lineto
457.08892 405.51049 454.30079 414.78463 454.31611 420.1577 curveto
454.33143 425.53076 457.1453 434.38338 461.13464 436.0676 curveto
431.0826 458.29096 lineto
421.19808 458.11299 409.85449 434.82941 410.12193 420.66277 curveto
410.38932 406.49864 419.57397 386.62356 431.33514 386.57013 curveto
closepath
eoclip
gsave [-6.6544376 1.4527833 -0.5920633 -2.7119294 3646.7058 1038.1758] concat
shfill
grestore
grestore
0 0 0 setrgbcolor
[] 0 setdash
1 setlinewidth
0 setlinejoin
0 setlinecap
newpath
431.33514 386.57013 moveto
461.63971 403.99526 lineto
457.08892 405.51049 454.30079 414.78463 454.31611 420.1577 curveto
454.33143 425.53076 457.1453 434.38338 461.13464 436.0676 curveto
431.0826 458.29096 lineto
421.19808 458.11299 409.85449 434.82941 410.12193 420.66277 curveto
410.38932 406.49864 419.57397 386.62356 431.33514 386.57013 curveto
closepath
stroke
gsave
1 0.48627451 0.0039215689 setrgbcolor
newpath
180.8173 349.82139 moveto
180.8173 349.82139 184.26718 360.76174 177.82746 372.12596 curveto
171.38774 383.49018 155.05841 395.27825 155.05841 395.27825 curveto
158.08887 399.31886 lineto
145.96704 396.28841 lineto
147.48227 384.67165 lineto
150.51273 388.71226 lineto
150.51273 388.71226 159.51844 379.44957 163.18024 369.60058 curveto
166.84204 359.75159 165.15994 349.31631 165.15994 349.31631 curveto
180.8173 349.82139 lineto
closepath
eofill
grestore
gsave
0 0 0 setrgbcolor
newpath
219.94176 497.09869 moveto
221.12535 497.09869 lineto
221.12535 500.68463 lineto
225.42613 500.68463 lineto
225.42613 497.09869 lineto
226.60973 497.09869 lineto
226.60973 505.84674 lineto
225.42613 505.84674 lineto
225.42613 501.68073 lineto
221.12535 501.68073 lineto
221.12535 505.84674 lineto
219.94176 505.84674 lineto
219.94176 497.09869 lineto
fill
grestore
gsave
0 0 0 setrgbcolor
newpath
228.91832 499.28424 moveto
229.99644 499.28424 lineto
229.99644 505.84674 lineto
228.91832 505.84674 lineto
228.91832 499.28424 lineto
228.91832 496.72955 moveto
229.99644 496.72955 lineto
229.99644 498.09479 lineto
228.91832 498.09479 lineto
228.91832 496.72955 lineto
fill
grestore
gsave
0 0 0 setrgbcolor
newpath
236.5648 502.48932 moveto
236.5648 501.70807 236.40269 501.1026 236.07848 500.67291 curveto
235.75816 500.24323 235.30699 500.02839 234.72496 500.02838 curveto
234.14683 500.02839 233.69566 500.24323 233.37144 500.67291 curveto
233.05113 501.1026 232.89097 501.70807 232.89098 502.48932 curveto
232.89097 503.26667 233.05113 503.87018 233.37144 504.29987 curveto
233.69566 504.72955 234.14683 504.9444 234.72496 504.9444 curveto
235.30699 504.9444 235.75816 504.72955 236.07848 504.29987 curveto
236.40269 503.87018 236.5648 503.26667 236.5648 502.48932 curveto
237.64293 505.03229 moveto
237.64292 506.14947 237.39488 506.97955 236.89879 507.52252 curveto
236.40269 508.06939 235.64292 508.34283 234.61949 508.34283 curveto
234.24058 508.34283 233.88316 508.31354 233.54723 508.25494 curveto
233.21129 508.20025 232.88511 508.11432 232.56871 507.99713 curveto
232.56871 506.9483 lineto
232.88511 507.12018 233.19761 507.24713 233.50621 507.32916 curveto
233.8148 507.41119 234.12925 507.45221 234.44957 507.45221 curveto
235.1566 507.45221 235.68589 507.26666 236.03746 506.89557 curveto
236.38902 506.52838 236.5648 505.97174 236.5648 505.22565 curveto
236.5648 504.69244 lineto
236.34214 505.07916 236.05699 505.36823 235.70934 505.55963 curveto
235.36167 505.75104 234.94566 505.84674 234.46129 505.84674 curveto
233.6566 505.84674 233.00816 505.5401 232.51598 504.92682 curveto
232.02379 504.31354 231.77769 503.50104 231.77769 502.48932 curveto
231.77769 501.4737 232.02379 500.65925 232.51598 500.04596 curveto
233.00816 499.43268 233.6566 499.12604 234.46129 499.12604 curveto
234.94566 499.12604 235.36167 499.22175 235.70934 499.41315 curveto
236.05699 499.60456 236.34214 499.89362 236.5648 500.28033 curveto
236.5648 499.28424 lineto
237.64293 499.28424 lineto
237.64293 505.03229 lineto
fill
grestore
gsave
0 0 0 setrgbcolor
newpath
245.31871 501.8858 moveto
245.31871 505.84674 lineto
244.24059 505.84674 lineto
244.24059 501.92096 lineto
244.24058 501.29987 244.11949 500.83503 243.8773 500.52643 curveto
243.63511 500.21784 243.27183 500.06354 242.78746 500.06354 curveto
242.20543 500.06354 241.74644 500.24909 241.41051 500.62018 curveto
241.07457 500.99128 240.9066 501.49714 240.9066 502.13776 curveto
240.9066 505.84674 lineto
239.82262 505.84674 lineto
239.82262 496.72955 lineto
240.9066 496.72955 lineto
240.9066 500.30377 lineto
241.16441 499.90925 241.46715 499.61433 241.8148 499.41901 curveto
242.16636 499.2237 242.57066 499.12604 243.02769 499.12604 curveto
243.7816 499.12604 244.35191 499.36042 244.73863 499.82916 curveto
245.12534 500.29401 245.3187 500.97956 245.31871 501.8858 curveto
fill
grestore
gsave
0 0 0 setrgbcolor
newpath
253.0941 502.29596 moveto
253.0941 502.8233 lineto
248.13707 502.8233 lineto
248.18394 503.56549 248.4066 504.1319 248.80504 504.52252 curveto
249.20738 504.90924 249.76597 505.1026 250.48082 505.1026 curveto
250.89488 505.1026 251.29527 505.05182 251.68199 504.95026 curveto
252.07261 504.84869 252.45933 504.69635 252.84215 504.49323 curveto
252.84215 505.51276 lineto
252.45542 505.67682 252.05894 505.80182 251.65269 505.88776 curveto
251.24644 505.97369 250.83433 506.01666 250.41637 506.01666 curveto
249.36949 506.01666 248.53941 505.71198 247.92613 505.1026 curveto
247.31676 504.49323 247.01207 503.66901 247.01207 502.62994 curveto
247.01207 501.55573 247.30113 500.70417 247.87926 500.07526 curveto
248.46129 499.44245 249.24449 499.12604 250.22887 499.12604 curveto
251.11167 499.12604 251.80894 499.4112 252.32066 499.98151 curveto
252.83628 500.54792 253.09409 501.3194 253.0941 502.29596 curveto
252.01598 501.97955 moveto
252.00816 501.38971 251.84214 500.91901 251.51793 500.56744 curveto
251.19761 500.21589 250.77183 500.04011 250.24059 500.0401 curveto
249.63902 500.04011 249.1566 500.21003 248.79332 500.54987 curveto
248.43394 500.88971 248.22691 501.36823 248.17223 501.98541 curveto
252.01598 501.97955 lineto
fill
grestore
gsave
0 0 0 setrgbcolor
newpath
258.66637 500.29205 moveto
258.54527 500.22175 258.41246 500.17097 258.26793 500.13971 curveto
258.1273 500.10456 257.97105 500.08698 257.79918 500.08698 curveto
257.1898 500.08698 256.72105 500.2862 256.39293 500.68463 curveto
256.06871 501.07917 255.9066 501.64753 255.9066 502.38971 curveto
255.9066 505.84674 lineto
254.82262 505.84674 lineto
254.82262 499.28424 lineto
255.9066 499.28424 lineto
255.9066 500.30377 lineto
256.13316 499.90534 256.42808 499.61042 256.79137 499.41901 curveto
257.15464 499.2237 257.59605 499.12604 258.11559 499.12604 curveto
258.1898 499.12604 258.27183 499.1319 258.36168 499.14362 curveto
258.45152 499.15143 258.55113 499.16511 258.66051 499.18463 curveto
258.66637 500.29205 lineto
fill
grestore
gsave
0 0 0 setrgbcolor
newpath
fill
grestore
gsave
0 0 0 setrgbcolor
newpath
268.35191 499.53619 moveto
268.35191 500.54401 lineto
268.04722 500.37604 267.74058 500.25104 267.43199 500.16901 curveto
267.1273 500.08307 266.81871 500.04011 266.50621 500.0401 curveto
265.80699 500.04011 265.26402 500.26276 264.8773 500.70807 curveto
264.49058 501.14948 264.29722 501.77057 264.29723 502.57135 curveto
264.29722 503.37213 264.49058 503.99518 264.8773 504.44049 curveto
265.26402 504.8819 265.80699 505.1026 266.50621 505.1026 curveto
266.81871 505.1026 267.1273 505.06159 267.43199 504.97955 curveto
267.74058 504.89362 268.04722 504.76666 268.35191 504.59869 curveto
268.35191 505.59479 lineto
268.05113 505.73541 267.73863 505.84088 267.41441 505.91119 curveto
267.0941 505.98151 266.7523 506.01666 266.38902 506.01666 curveto
265.40074 506.01666 264.61558 505.70612 264.03355 505.08502 curveto
263.45152 504.46393 263.16051 503.62604 263.16051 502.57135 curveto
263.16051 501.50104 263.45347 500.65925 264.03941 500.04596 curveto
264.62926 499.43268 265.43589 499.12604 266.45934 499.12604 curveto
266.79136 499.12604 267.11558 499.1612 267.43199 499.23151 curveto
267.74839 499.29792 268.05503 499.39948 268.35191 499.53619 curveto
fill
grestore
gsave
0 0 0 setrgbcolor
newpath
272.7816 500.0401 moveto
272.20347 500.04011 271.74644 500.26667 271.41051 500.71979 curveto
271.07457 501.16901 270.9066 501.7862 270.9066 502.57135 curveto
270.9066 503.35651 271.07261 503.97565 271.40465 504.42877 curveto
271.74058 504.87799 272.19957 505.1026 272.7816 505.1026 curveto
273.35582 505.1026 273.81089 504.87604 274.14684 504.42291 curveto
274.48277 503.96979 274.65074 503.3526 274.65074 502.57135 curveto
274.65074 501.79401 274.48277 501.17878 274.14684 500.72565 curveto
273.81089 500.26862 273.35582 500.04011 272.7816 500.0401 curveto
272.7816 499.12604 moveto
273.7191 499.12604 274.45542 499.43073 274.99059 500.0401 curveto
275.52574 500.64948 275.79331 501.49323 275.79332 502.57135 curveto
275.79331 503.64557 275.52574 504.48932 274.99059 505.1026 curveto
274.45542 505.71198 273.7191 506.01666 272.7816 506.01666 curveto
271.84019 506.01666 271.10191 505.71198 270.56676 505.1026 curveto
270.03551 504.48932 269.76988 503.64557 269.76988 502.57135 curveto
269.76988 501.49323 270.03551 500.64948 270.56676 500.0401 curveto
271.10191 499.43073 271.84019 499.12604 272.7816 499.12604 curveto
fill
grestore
gsave
0 0 0 setrgbcolor
newpath
282.68394 500.54401 moveto
282.95347 500.05964 283.27573 499.70222 283.65074 499.47174 curveto
284.02573 499.24128 284.46714 499.12604 284.97496 499.12604 curveto
285.65854 499.12604 286.18589 499.36628 286.55699 499.84674 curveto
286.92807 500.32331 287.11362 501.003 287.11363 501.8858 curveto
287.11363 505.84674 lineto
286.02965 505.84674 lineto
286.02965 501.92096 lineto
286.02964 501.29206 285.91831 500.82526 285.69566 500.52057 curveto
285.473 500.21589 285.13315 500.06354 284.67613 500.06354 curveto
284.11753 500.06354 283.67612 500.24909 283.35191 500.62018 curveto
283.02769 500.99128 282.86558 501.49714 282.86559 502.13776 curveto
282.86559 505.84674 lineto
281.7816 505.84674 lineto
281.7816 501.92096 lineto
281.7816 501.28815 281.67027 500.82136 281.44762 500.52057 curveto
281.22496 500.21589 280.88121 500.06354 280.41637 500.06354 curveto
279.86558 500.06354 279.42808 500.25104 279.10387 500.62604 curveto
278.77965 500.99714 278.61754 501.50104 278.61754 502.13776 curveto
278.61754 505.84674 lineto
277.53355 505.84674 lineto
277.53355 499.28424 lineto
278.61754 499.28424 lineto
278.61754 500.30377 lineto
278.86363 499.90143 279.15855 499.60456 279.5023 499.41315 curveto
279.84605 499.22175 280.25425 499.12604 280.72691 499.12604 curveto
281.20347 499.12604 281.60777 499.24714 281.9398 499.48932 curveto
282.27574 499.73151 282.52378 500.08307 282.68394 500.54401 curveto
fill
grestore
gsave
0 0 0 setrgbcolor
newpath
294.37926 500.54401 moveto
294.64878 500.05964 294.97105 499.70222 295.34605 499.47174 curveto
295.72105 499.24128 296.16245 499.12604 296.67027 499.12604 curveto
297.35386 499.12604 297.8812 499.36628 298.2523 499.84674 curveto
298.62339 500.32331 298.80893 501.003 298.80894 501.8858 curveto
298.80894 505.84674 lineto
297.72496 505.84674 lineto
297.72496 501.92096 lineto
297.72495 501.29206 297.61362 500.82526 297.39098 500.52057 curveto
297.16831 500.21589 296.82847 500.06354 296.37144 500.06354 curveto
295.81284 500.06354 295.37144 500.24909 295.04723 500.62018 curveto
294.723 500.99128 294.56089 501.49714 294.5609 502.13776 curveto
294.5609 505.84674 lineto
293.47691 505.84674 lineto
293.47691 501.92096 lineto
293.47691 501.28815 293.36558 500.82136 293.14293 500.52057 curveto
292.92027 500.21589 292.57652 500.06354 292.11168 500.06354 curveto
291.56089 500.06354 291.12339 500.25104 290.79918 500.62604 curveto
290.47496 500.99714 290.31285 501.50104 290.31285 502.13776 curveto
290.31285 505.84674 lineto
289.22887 505.84674 lineto
289.22887 499.28424 lineto
290.31285 499.28424 lineto
290.31285 500.30377 lineto
290.55894 499.90143 290.85386 499.60456 291.19762 499.41315 curveto
291.54136 499.22175 291.94957 499.12604 292.42223 499.12604 curveto
292.89878 499.12604 293.30308 499.24714 293.63512 499.48932 curveto
293.97105 499.73151 294.21909 500.08307 294.37926 500.54401 curveto
fill
grestore
gsave
0 0 0 setrgbcolor
newpath
300.85387 503.2569 moveto
300.85387 499.28424 lineto
301.93199 499.28424 lineto
301.93199 503.21588 lineto
301.93199 503.83698 302.05308 504.30377 302.29527 504.61627 curveto
302.53746 504.92487 302.90074 505.07916 303.38512 505.07916 curveto
303.96714 505.07916 304.42613 504.89362 304.76207 504.52252 curveto
305.10191 504.15143 305.27183 503.64557 305.27184 503.00494 curveto
305.27184 499.28424 lineto
306.34996 499.28424 lineto
306.34996 505.84674 lineto
305.27184 505.84674 lineto
305.27184 504.83893 lineto
305.01011 505.23737 304.70542 505.53424 304.35777 505.72955 curveto
304.01402 505.92096 303.61363 506.01666 303.1566 506.01666 curveto
302.40269 506.01666 301.83043 505.78229 301.4398 505.31354 curveto
301.04918 504.84479 300.85387 504.15924 300.85387 503.2569 curveto
fill
grestore
gsave
0 0 0 setrgbcolor
newpath
314.03746 501.8858 moveto
314.03746 505.84674 lineto
312.95934 505.84674 lineto
312.95934 501.92096 lineto
312.95933 501.29987 312.83824 500.83503 312.59605 500.52643 curveto
312.35386 500.21784 311.99058 500.06354 311.50621 500.06354 curveto
310.92418 500.06354 310.46519 500.24909 310.12926 500.62018 curveto
309.79332 500.99128 309.62535 501.49714 309.62535 502.13776 curveto
309.62535 505.84674 lineto
308.54137 505.84674 lineto
308.54137 499.28424 lineto
309.62535 499.28424 lineto
309.62535 500.30377 lineto
309.88316 499.90925 310.1859 499.61433 310.53355 499.41901 curveto
310.88511 499.2237 311.28941 499.12604 311.74644 499.12604 curveto
312.50035 499.12604 313.07066 499.36042 313.45738 499.82916 curveto
313.84409 500.29401 314.03745 500.97956 314.03746 501.8858 curveto
fill
grestore
gsave
0 0 0 setrgbcolor
newpath
316.19957 499.28424 moveto
317.27769 499.28424 lineto
317.27769 505.84674 lineto
316.19957 505.84674 lineto
316.19957 499.28424 lineto
316.19957 496.72955 moveto
317.27769 496.72955 lineto
317.27769 498.09479 lineto
316.19957 498.09479 lineto
316.19957 496.72955 lineto
fill
grestore
gsave
0 0 0 setrgbcolor
newpath
324.25035 499.53619 moveto
324.25035 500.54401 lineto
323.94566 500.37604 323.63902 500.25104 323.33043 500.16901 curveto
323.02574 500.08307 322.71714 500.04011 322.40465 500.0401 curveto
321.70543 500.04011 321.16246 500.26276 320.77574 500.70807 curveto
320.38902 501.14948 320.19566 501.77057 320.19566 502.57135 curveto
320.19566 503.37213 320.38902 503.99518 320.77574 504.44049 curveto
321.16246 504.8819 321.70543 505.1026 322.40465 505.1026 curveto
322.71714 505.1026 323.02574 505.06159 323.33043 504.97955 curveto
323.63902 504.89362 323.94566 504.76666 324.25035 504.59869 curveto
324.25035 505.59479 lineto
323.94956 505.73541 323.63706 505.84088 323.31285 505.91119 curveto
322.99253 505.98151 322.65074 506.01666 322.28746 506.01666 curveto
321.29918 506.01666 320.51402 505.70612 319.93199 505.08502 curveto
319.34996 504.46393 319.05894 503.62604 319.05894 502.57135 curveto
319.05894 501.50104 319.35191 500.65925 319.93785 500.04596 curveto
320.52769 499.43268 321.33433 499.12604 322.35777 499.12604 curveto
322.6898 499.12604 323.01402 499.1612 323.33043 499.23151 curveto
323.64683 499.29792 323.95347 499.39948 324.25035 499.53619 curveto
fill
grestore
gsave
0 0 0 setrgbcolor
newpath
329.11949 502.54791 moveto
328.24839 502.54792 327.64488 502.64753 327.30894 502.84674 curveto
326.97301 503.04596 326.80504 503.38581 326.80504 503.86627 curveto
326.80504 504.24909 326.93004 504.55377 327.18004 504.78033 curveto
327.43394 505.00299 327.77769 505.11432 328.21129 505.11432 curveto
328.80894 505.11432 329.28746 504.90338 329.64684 504.48151 curveto
330.01011 504.05573 330.19175 503.49127 330.19176 502.78815 curveto
330.19176 502.54791 lineto
329.11949 502.54791 lineto
331.26988 502.1026 moveto
331.26988 505.84674 lineto
330.19176 505.84674 lineto
330.19176 504.85065 lineto
329.94566 505.24909 329.63902 505.54401 329.27184 505.73541 curveto
328.90464 505.92291 328.45543 506.01666 327.92418 506.01666 curveto
327.2523 506.01666 326.71715 505.82916 326.31871 505.45416 curveto
325.92418 505.07526 325.72691 504.5694 325.72691 503.93658 curveto
325.72691 503.19831 325.97301 502.64167 326.46519 502.26666 curveto
326.96129 501.89167 327.69957 501.70417 328.68004 501.70416 curveto
330.19176 501.70416 lineto
330.19176 501.59869 lineto
330.19175 501.1026 330.02769 500.71979 329.69957 500.45026 curveto
329.37535 500.17682 328.91832 500.04011 328.32848 500.0401 curveto
327.95347 500.04011 327.58824 500.08503 327.23277 500.17487 curveto
326.8773 500.26472 326.53551 500.39948 326.20738 500.57916 curveto
326.20738 499.58307 lineto
326.60191 499.43073 326.98472 499.31745 327.35582 499.24323 curveto
327.72691 499.16511 328.08824 499.12604 328.4398 499.12604 curveto
329.38902 499.12604 330.098 499.37214 330.56676 499.86432 curveto
331.0355 500.35651 331.26988 501.1026 331.26988 502.1026 curveto
fill
grestore
gsave
0 0 0 setrgbcolor
newpath
334.56285 497.42096 moveto
334.56285 499.28424 lineto
336.78355 499.28424 lineto
336.78355 500.12213 lineto
334.56285 500.12213 lineto
334.56285 503.68463 lineto
334.56285 504.21979 334.63511 504.56354 334.77965 504.71588 curveto
334.92808 504.86823 335.22691 504.9444 335.67613 504.9444 curveto
336.78355 504.9444 lineto
336.78355 505.84674 lineto
335.67613 505.84674 lineto
334.8441 505.84674 334.26988 505.69244 333.95348 505.38385 curveto
333.63707 505.07135 333.47887 504.50495 333.47887 503.68463 curveto
333.47887 500.12213 lineto
332.68785 500.12213 lineto
332.68785 499.28424 lineto
333.47887 499.28424 lineto
333.47887 497.42096 lineto
334.56285 497.42096 lineto
fill
grestore
gsave
0 0 0 setrgbcolor
newpath
338.20738 499.28424 moveto
339.28551 499.28424 lineto
339.28551 505.84674 lineto
338.20738 505.84674 lineto
338.20738 499.28424 lineto
338.20738 496.72955 moveto
339.28551 496.72955 lineto
339.28551 498.09479 lineto
338.20738 498.09479 lineto
338.20738 496.72955 lineto
fill
grestore
gsave
0 0 0 setrgbcolor
newpath
344.07848 500.0401 moveto
343.50035 500.04011 343.04332 500.26667 342.70738 500.71979 curveto
342.37144 501.16901 342.20347 501.7862 342.20348 502.57135 curveto
342.20347 503.35651 342.36949 503.97565 342.70152 504.42877 curveto
343.03746 504.87799 343.49644 505.1026 344.07848 505.1026 curveto
344.65269 505.1026 345.10777 504.87604 345.44371 504.42291 curveto
345.77964 503.96979 345.94761 503.3526 345.94762 502.57135 curveto
345.94761 501.79401 345.77964 501.17878 345.44371 500.72565 curveto
345.10777 500.26862 344.65269 500.04011 344.07848 500.0401 curveto
344.07848 499.12604 moveto
345.01597 499.12604 345.7523 499.43073 346.28746 500.0401 curveto
346.82261 500.64948 347.09019 501.49323 347.09019 502.57135 curveto
347.09019 503.64557 346.82261 504.48932 346.28746 505.1026 curveto
345.7523 505.71198 345.01597 506.01666 344.07848 506.01666 curveto
343.13707 506.01666 342.39879 505.71198 341.86363 505.1026 curveto
341.33238 504.48932 341.06676 503.64557 341.06676 502.57135 curveto
341.06676 501.49323 341.33238 500.64948 341.86363 500.0401 curveto
342.39879 499.43073 343.13707 499.12604 344.07848 499.12604 curveto
fill
grestore
gsave
0 0 0 setrgbcolor
newpath
354.32652 501.8858 moveto
354.32652 505.84674 lineto
353.2484 505.84674 lineto
353.2484 501.92096 lineto
353.24839 501.29987 353.1273 500.83503 352.88512 500.52643 curveto
352.64292 500.21784 352.27964 500.06354 351.79527 500.06354 curveto
351.21324 500.06354 350.75425 500.24909 350.41832 500.62018 curveto
350.08238 500.99128 349.91441 501.49714 349.91441 502.13776 curveto
349.91441 505.84674 lineto
348.83043 505.84674 lineto
348.83043 499.28424 lineto
349.91441 499.28424 lineto
349.91441 500.30377 lineto
350.17222 499.90925 350.47496 499.61433 350.82262 499.41901 curveto
351.17418 499.2237 351.57847 499.12604 352.03551 499.12604 curveto
352.78941 499.12604 353.35972 499.36042 353.74644 499.82916 curveto
354.13316 500.29401 354.32652 500.97956 354.32652 501.8858 curveto
fill
grestore
gsave
0 1 0 setrgbcolor
newpath
118.56251 313.39909 moveto
199.99108 313.39909 lineto
199.99108 351.97052 lineto
118.56251 351.97052 lineto
118.56251 313.39909 lineto
closepath
eofill
grestore
gsave
0 0 0 setrgbcolor
newpath
220.81828 522.31512 moveto
220.81828 529.11786 lineto
222.24797 529.11786 lineto
223.455 529.11786 224.33781 528.84442 224.89641 528.29755 curveto
225.4589 527.75067 225.74015 526.88739 225.74016 525.7077 curveto
225.74015 524.53583 225.4589 523.67841 224.89641 523.13544 curveto
224.33781 522.58857 223.455 522.31513 222.24797 522.31512 curveto
220.81828 522.31512 lineto
219.63469 521.34247 moveto
222.06633 521.34247 lineto
223.76164 521.34248 225.00578 521.69599 225.79875 522.40302 curveto
226.59171 523.10615 226.9882 524.20771 226.9882 525.7077 curveto
226.9882 527.21552 226.58976 528.32294 225.79289 529.02997 curveto
224.99601 529.737 223.75382 530.09052 222.06633 530.09052 curveto
219.63469 530.09052 lineto
219.63469 521.34247 lineto
fill
grestore
gsave
0 0 0 setrgbcolor
newpath
231.80461 526.79169 moveto
230.93351 526.79169 230.33 526.8913 229.99406 527.09052 curveto
229.65812 527.28974 229.49016 527.62958 229.49016 528.11005 curveto
229.49016 528.49286 229.61516 528.79755 229.86516 529.02411 curveto
230.11906 529.24677 230.46281 529.35809 230.89641 529.35809 curveto
231.49406 529.35809 231.97258 529.14716 232.33195 528.72528 curveto
232.69523 528.2995 232.87687 527.73505 232.87688 527.03192 curveto
232.87688 526.79169 lineto
231.80461 526.79169 lineto
233.955 526.34637 moveto
233.955 530.09052 lineto
232.87688 530.09052 lineto
232.87688 529.09442 lineto
232.63078 529.49286 232.32414 529.78778 231.95695 529.97919 curveto
231.58976 530.16669 231.14055 530.26044 230.6093 530.26044 curveto
229.93742 530.26044 229.40227 530.07294 229.00383 529.69794 curveto
228.6093 529.31903 228.41203 528.81317 228.41203 528.18036 curveto
228.41203 527.44208 228.65813 526.88544 229.15031 526.51044 curveto
229.64641 526.13544 230.38469 525.94794 231.36516 525.94794 curveto
232.87688 525.94794 lineto
232.87688 525.84247 lineto
232.87687 525.34638 232.71281 524.96357 232.38469 524.69403 curveto
232.06047 524.4206 231.60344 524.28388 231.0136 524.28387 curveto
230.63859 524.28388 230.27336 524.3288 229.91789 524.41864 curveto
229.56242 524.50849 229.22063 524.64325 228.8925 524.82294 curveto
228.8925 523.82684 lineto
229.28703 523.67451 229.66984 523.56122 230.04094 523.487 curveto
230.41203 523.40888 230.77336 523.36982 231.12492 523.36981 curveto
232.07414 523.36982 232.78312 523.61591 233.25188 524.10809 curveto
233.72062 524.60029 233.955 525.34638 233.955 526.34637 curveto
fill
grestore
gsave
0 0 0 setrgbcolor
newpath
237.24797 521.66473 moveto
237.24797 523.52802 lineto
239.46867 523.52802 lineto
239.46867 524.36591 lineto
237.24797 524.36591 lineto
237.24797 527.92841 lineto
237.24797 528.46356 237.32023 528.80731 237.46477 528.95966 curveto
237.6132 529.112 237.91203 529.18817 238.36125 529.18817 curveto
239.46867 529.18817 lineto
239.46867 530.09052 lineto
238.36125 530.09052 lineto
237.52922 530.09052 236.955 529.93622 236.6386 529.62762 curveto
236.32219 529.31513 236.16399 528.74872 236.16399 527.92841 curveto
236.16399 524.36591 lineto
235.37297 524.36591 lineto
235.37297 523.52802 lineto
236.16399 523.52802 lineto
236.16399 521.66473 lineto
237.24797 521.66473 lineto
fill
grestore
gsave
0 0 0 setrgbcolor
newpath
243.87492 526.79169 moveto
243.00383 526.79169 242.40031 526.8913 242.06438 527.09052 curveto
241.72844 527.28974 241.56047 527.62958 241.56047 528.11005 curveto
241.56047 528.49286 241.68547 528.79755 241.93547 529.02411 curveto
242.18937 529.24677 242.53312 529.35809 242.96672 529.35809 curveto
243.56437 529.35809 244.04289 529.14716 244.40227 528.72528 curveto
244.76554 528.2995 244.94718 527.73505 244.94719 527.03192 curveto
244.94719 526.79169 lineto
243.87492 526.79169 lineto
246.02531 526.34637 moveto
246.02531 530.09052 lineto
244.94719 530.09052 lineto
244.94719 529.09442 lineto
244.70109 529.49286 244.39445 529.78778 244.02727 529.97919 curveto
243.66008 530.16669 243.21086 530.26044 242.67961 530.26044 curveto
242.00773 530.26044 241.47258 530.07294 241.07414 529.69794 curveto
240.67961 529.31903 240.48234 528.81317 240.48235 528.18036 curveto
240.48234 527.44208 240.72844 526.88544 241.22063 526.51044 curveto
241.71672 526.13544 242.455 525.94794 243.43547 525.94794 curveto
244.94719 525.94794 lineto
244.94719 525.84247 lineto
244.94718 525.34638 244.78312 524.96357 244.455 524.69403 curveto
244.13078 524.4206 243.67375 524.28388 243.08391 524.28387 curveto
242.70891 524.28388 242.34367 524.3288 241.9882 524.41864 curveto
241.63273 524.50849 241.29094 524.64325 240.96281 524.82294 curveto
240.96281 523.82684 lineto
241.35734 523.67451 241.74016 523.56122 242.11125 523.487 curveto
242.48234 523.40888 242.84367 523.36982 243.19524 523.36981 curveto
244.14445 523.36982 244.85343 523.61591 245.32219 524.10809 curveto
245.79093 524.60029 246.02531 525.34638 246.02531 526.34637 curveto
fill
grestore
gsave
0 0 0 setrgbcolor
newpath
fill
grestore
gsave
0 0 0 setrgbcolor
newpath
252.07219 520.97333 moveto
253.15031 520.97333 lineto
253.15031 530.09052 lineto
252.07219 530.09052 lineto
252.07219 520.97333 lineto
fill
grestore
gsave
0 0 0 setrgbcolor
newpath
255.40031 523.52802 moveto
256.47844 523.52802 lineto
256.47844 530.09052 lineto
255.40031 530.09052 lineto
255.40031 523.52802 lineto
255.40031 520.97333 moveto
256.47844 520.97333 lineto
256.47844 522.33856 lineto
255.40031 522.33856 lineto
255.40031 520.97333 lineto
fill
grestore
gsave
0 0 0 setrgbcolor
newpath
264.18352 526.12958 moveto
264.18352 530.09052 lineto
263.10539 530.09052 lineto
263.10539 526.16473 lineto
263.10539 525.54364 262.98429 525.0788 262.74211 524.7702 curveto
262.49992 524.46161 262.13664 524.30732 261.65227 524.30731 curveto
261.07023 524.30732 260.61125 524.49286 260.27531 524.86395 curveto
259.93937 525.23505 259.77141 525.74091 259.77141 526.38153 curveto
259.77141 530.09052 lineto
258.68742 530.09052 lineto
258.68742 523.52802 lineto
259.77141 523.52802 lineto
259.77141 524.54755 lineto
260.02922 524.15302 260.33195 523.8581 260.67961 523.66278 curveto
261.03117 523.46747 261.43547 523.36982 261.8925 523.36981 curveto
262.6464 523.36982 263.21671 523.60419 263.60344 524.07294 curveto
263.99015 524.53779 264.18351 525.22333 264.18352 526.12958 curveto
fill
grestore
gsave
0 0 0 setrgbcolor
newpath
266.30461 520.97333 moveto
267.3886 520.97333 lineto
267.3886 526.35809 lineto
270.60539 523.52802 lineto
271.98235 523.52802 lineto
268.50188 526.59833 lineto
272.12883 530.09052 lineto
270.72258 530.09052 lineto
267.3886 526.88544 lineto
267.3886 530.09052 lineto
266.30461 530.09052 lineto
266.30461 520.97333 lineto
fill
grestore
gsave
0 0.50196081 0 setrgbcolor
newpath
130.57206 305.70323 moveto
118.74108 313.39909 lineto
199.63394 313.39909 lineto
210.4117 305.4593 lineto
130.57206 305.70323 lineto
closepath
eofill
grestore
gsave
0 0 0 setrgbcolor
newpath
220.7776 546.96228 moveto
220.7776 550.24939 lineto
222.26588 550.24939 lineto
222.81666 550.24939 223.24244 550.10682 223.54323 549.82166 curveto
223.844 549.5365 223.99439 549.13025 223.9944 548.60291 curveto
223.99439 548.07947 223.844 547.67518 223.54323 547.39001 curveto
223.24244 547.10487 222.81666 546.96229 222.26588 546.96228 curveto
220.7776 546.96228 lineto
219.59401 545.98962 moveto
222.26588 545.98962 lineto
223.24635 545.98963 223.98658 546.21229 224.48659 546.65759 curveto
224.99049 547.09901 225.24244 547.74744 225.24245 548.60291 curveto
225.24244 549.46619 224.99049 550.11853 224.48659 550.55994 curveto
223.98658 551.00135 223.24635 551.22205 222.26588 551.22205 curveto
220.7776 551.22205 lineto
220.7776 554.73767 lineto
219.59401 554.73767 lineto
219.59401 545.98962 lineto
fill
grestore
gsave
0 0 0 setrgbcolor
newpath
232.2444 550.77673 moveto
232.2444 554.73767 lineto
231.16628 554.73767 lineto
231.16628 550.81189 lineto
231.16627 550.1908 231.04518 549.72596 230.80299 549.41736 curveto
230.5608 549.10877 230.19752 548.95447 229.71315 548.95447 curveto
229.13112 548.95447 228.67213 549.14002 228.3362 549.51111 curveto
228.00026 549.88221 227.83229 550.38807 227.83229 551.02869 curveto
227.83229 554.73767 lineto
226.74831 554.73767 lineto
226.74831 545.62048 lineto
227.83229 545.62048 lineto
227.83229 549.1947 lineto
228.0901 548.80018 228.39283 548.50526 228.74049 548.30994 curveto
229.09205 548.11463 229.49635 548.01697 229.95338 548.01697 curveto
230.70729 548.01697 231.2776 548.25135 231.66432 548.72009 curveto
232.05103 549.18494 232.24439 549.87049 232.2444 550.77673 curveto
fill
grestore
gsave
0 0 0 setrgbcolor
newpath
237.13698 555.34705 moveto
236.83229 556.12829 236.53541 556.63806 236.24635 556.87634 curveto
235.95729 557.11462 235.57057 557.23376 235.0862 557.23376 curveto
234.22487 557.23376 lineto
234.22487 556.33142 lineto
234.85768 556.33142 lineto
235.15455 556.33142 235.38502 556.26111 235.54909 556.12048 curveto
235.71315 555.97986 235.89479 555.64783 236.09401 555.12439 curveto
236.28737 554.6322 lineto
233.63307 548.17517 lineto
234.77565 548.17517 lineto
236.82643 553.30798 lineto
238.87721 548.17517 lineto
240.01979 548.17517 lineto
237.13698 555.34705 lineto
fill
grestore
gsave
0 0 0 setrgbcolor
newpath
245.69167 548.36853 moveto
245.69167 549.38806 lineto
245.38697 549.23182 245.07057 549.11463 244.74245 549.0365 curveto
244.41432 548.95838 244.07447 548.91932 243.72292 548.91931 curveto
243.18776 548.91932 242.78541 549.00135 242.51588 549.16541 curveto
242.25026 549.32947 242.11745 549.57557 242.11745 549.90369 curveto
242.11745 550.15369 242.21315 550.35096 242.40456 550.49548 curveto
242.59596 550.63611 242.98073 550.77088 243.55885 550.89978 curveto
243.92799 550.98181 lineto
244.69361 551.14588 245.23658 551.3783 245.5569 551.67908 curveto
245.88111 551.97595 246.04322 552.39197 246.04323 552.92712 curveto
246.04322 553.5365 245.80104 554.01892 245.31667 554.37439 curveto
244.83619 554.72986 244.17408 554.90759 243.33034 554.90759 curveto
242.97877 554.90759 242.61159 554.87244 242.22878 554.80212 curveto
241.84987 554.73572 241.44948 554.63416 241.0276 554.49744 curveto
241.0276 553.38416 lineto
241.42604 553.59119 241.81862 553.74744 242.20534 553.85291 curveto
242.59205 553.95447 242.97487 554.00525 243.35378 554.00525 curveto
243.86158 554.00525 244.25221 553.91931 244.52565 553.74744 curveto
244.79908 553.57166 244.9358 553.32556 244.93581 553.00916 curveto
244.9358 552.71619 244.83619 552.49158 244.63698 552.33533 curveto
244.44166 552.17908 244.01002 552.02869 243.34206 551.88416 curveto
242.96706 551.79626 lineto
242.29909 551.65564 241.81666 551.4408 241.51979 551.15173 curveto
241.22291 550.85877 241.07448 550.45838 241.07448 549.95056 curveto
241.07448 549.33338 241.29323 548.85682 241.73073 548.52087 curveto
242.16823 548.18494 242.78932 548.01697 243.59401 548.01697 curveto
243.99244 548.01697 244.36744 548.04627 244.71901 548.10486 curveto
245.07057 548.16346 245.39479 548.25135 245.69167 548.36853 curveto
fill
grestore
gsave
0 0 0 setrgbcolor
newpath
247.76588 548.17517 moveto
248.84401 548.17517 lineto
248.84401 554.73767 lineto
247.76588 554.73767 lineto
247.76588 548.17517 lineto
247.76588 545.62048 moveto
248.84401 545.62048 lineto
248.84401 546.98572 lineto
247.76588 546.98572 lineto
247.76588 545.62048 lineto
fill
grestore
gsave
0 0 0 setrgbcolor
newpath
255.81667 548.42712 moveto
255.81667 549.43494 lineto
255.51197 549.26697 255.20533 549.14197 254.89674 549.05994 curveto
254.59205 548.974 254.28346 548.93104 253.97096 548.93103 curveto
253.27174 548.93104 252.72877 549.15369 252.34206 549.599 curveto
251.95534 550.04041 251.76198 550.6615 251.76198 551.46228 curveto
251.76198 552.26306 251.95534 552.88611 252.34206 553.33142 curveto
252.72877 553.77283 253.27174 553.99353 253.97096 553.99353 curveto
254.28346 553.99353 254.59205 553.95252 254.89674 553.87048 curveto
255.20533 553.78455 255.51197 553.65759 255.81667 553.48962 curveto
255.81667 554.48572 lineto
255.51588 554.62634 255.20338 554.73181 254.87917 554.80212 curveto
254.55885 554.87244 254.21705 554.90759 253.85378 554.90759 curveto
252.86549 554.90759 252.08034 554.59705 251.49831 553.97595 curveto
250.91627 553.35486 250.62526 552.51697 250.62526 551.46228 curveto
250.62526 550.39197 250.91823 549.55018 251.50417 548.93689 curveto
252.09401 548.32361 252.90065 548.01697 253.92409 548.01697 curveto
254.25611 548.01697 254.58033 548.05213 254.89674 548.12244 curveto
255.21314 548.18885 255.51979 548.29041 255.81667 548.42712 curveto
fill
grestore
gsave
0 0 0 setrgbcolor
newpath
260.68581 551.43884 moveto
259.81471 551.43885 259.21119 551.53846 258.87526 551.73767 curveto
258.53932 551.93689 258.37135 552.27674 258.37135 552.7572 curveto
258.37135 553.14002 258.49635 553.4447 258.74635 553.67126 curveto
259.00026 553.89392 259.34401 554.00525 259.7776 554.00525 curveto
260.37526 554.00525 260.85377 553.79431 261.21315 553.37244 curveto
261.57643 552.94666 261.75807 552.3822 261.75807 551.67908 curveto
261.75807 551.43884 lineto
260.68581 551.43884 lineto
262.8362 550.99353 moveto
262.8362 554.73767 lineto
261.75807 554.73767 lineto
261.75807 553.74158 lineto
261.51197 554.14002 261.20533 554.43494 260.83815 554.62634 curveto
260.47096 554.81384 260.02174 554.90759 259.49049 554.90759 curveto
258.81862 554.90759 258.28346 554.72009 257.88503 554.34509 curveto
257.49049 553.96619 257.29323 553.46033 257.29323 552.82751 curveto
257.29323 552.08924 257.53932 551.5326 258.03151 551.15759 curveto
258.5276 550.7826 259.26588 550.5951 260.24635 550.59509 curveto
261.75807 550.59509 lineto
261.75807 550.48962 lineto
261.75807 549.99354 261.594 549.61072 261.26588 549.34119 curveto
260.94166 549.06775 260.48463 548.93104 259.89479 548.93103 curveto
259.51979 548.93104 259.15455 548.97596 258.79909 549.0658 curveto
258.44362 549.15565 258.10182 549.29041 257.7737 549.47009 curveto
257.7737 548.474 lineto
258.16823 548.32166 258.55104 548.20838 258.92213 548.13416 curveto
259.29323 548.05604 259.65455 548.01697 260.00612 548.01697 curveto
260.95533 548.01697 261.66432 548.26307 262.13307 548.75525 curveto
262.60182 549.24744 262.83619 549.99354 262.8362 550.99353 curveto
fill
grestore
gsave
0 0 0 setrgbcolor
newpath
265.06276 545.62048 moveto
266.14088 545.62048 lineto
266.14088 554.73767 lineto
265.06276 554.73767 lineto
265.06276 545.62048 lineto
fill
grestore
gsave
0.38039216 0.38039216 0.38039216 setrgbcolor
newpath
220.48973 252.73345 moveto
220.48973 252.73345 221.92393 265.30168 229.37118 270.84775 curveto
235.53241 275.43611 243.45397 272.70928 250.25556 277.83667 curveto
254.8767 281.32032 257.38321 288.00343 258.139 291.85558 curveto
259.61638 299.38554 258.11184 308.62708 256.67339 311.55307 curveto
255.26791 314.41197 252.69465 317.40607 249.13781 317.43286 curveto
245.62561 317.45965 215.83889 317.73164 215.83889 317.73164 curveto
215.83889 309.65042 lineto
209.27289 323.28748 lineto
216.84904 336.92453 lineto
216.84904 328.84331 lineto
216.84904 328.84331 261.39226 328.67799 267.01167 328.67799 curveto
272.67572 328.67799 275.93382 323.48617 275.93382 323.48617 curveto
275.93382 323.48617 278.8659 329.02434 284.14674 328.9797 curveto
289.38294 328.93506 337.05719 328.84331 337.05719 328.84331 curveto
337.56226 337.42961 lineto
345.13841 321.77225 lineto
336.55211 307.12504 lineto
336.55211 317.73164 lineto
336.55211 317.73164 305.80393 317.91787 302.00978 317.84644 curveto
298.19218 317.77457 297.25651 314.11846 295.66124 311.73164 curveto
294.01297 309.26552 290.09458 298.05218 292.42948 290.56465 curveto
292.88419 289.10652 294.72608 283.79047 300.29787 278.68891 curveto
306.33782 273.15868 314.24935 274.07199 320.7065 269.60507 curveto
327.74923 264.73307 330.78107 249.30252 330.78107 249.30252 curveto
310.15496 253.01851 lineto
310.15496 253.01851 309.73959 259.66102 302.70629 263.68239 curveto
295.673 267.70375 296.97576 264.22213 288.02177 269.10397 curveto
277.73044 274.71495 275.21953 282.3763 275.21953 282.3763 curveto
275.21953 282.3763 271.72273 274.71023 262.05252 269.39928 curveto
253.4896 264.69646 251.93018 268.40108 245.00298 264.34677 curveto
238.07577 260.29247 237.08103 248.63638 237.08103 248.63638 curveto
220.48973 252.73345 lineto
closepath
eofill
grestore
gsave
0 0.3764706 0 setrgbcolor
newpath
199.45536 312.86338 moveto
210.2766 305.31661 lineto
210.47303 339.64909 lineto
199.71003 352.0622 lineto
199.45536 312.86338 lineto
closepath
eofill
grestore
gsave
0 0 0 setrgbcolor
newpath
135.96231 327.61993 moveto
143.3627 327.61993 lineto
143.3627 328.61603 lineto
140.25723 328.61603 lineto
140.25723 336.36798 lineto
139.06778 336.36798 lineto
139.06778 328.61603 lineto
135.96231 328.61603 lineto
135.96231 327.61993 lineto
fill
grestore
gsave
0 0 0 setrgbcolor
newpath
148.06192 328.42267 moveto
147.20254 328.42268 146.51895 328.74299 146.01114 329.38361 curveto
145.50723 330.02424 145.25528 330.89728 145.25528 332.00275 curveto
145.25528 333.10431 145.50723 333.97541 146.01114 334.61603 curveto
146.51895 335.25665 147.20254 335.57697 148.06192 335.57697 curveto
148.92129 335.57697 149.60098 335.25665 150.10098 334.61603 curveto
150.60488 333.97541 150.85683 333.10431 150.85684 332.00275 curveto
150.85683 330.89728 150.60488 330.02424 150.10098 329.38361 curveto
149.60098 328.74299 148.92129 328.42268 148.06192 328.42267 curveto
148.06192 327.46173 moveto
149.28848 327.46174 150.26894 327.87385 151.00333 328.69806 curveto
151.73769 329.51838 152.10488 330.61994 152.10489 332.00275 curveto
152.10488 333.38166 151.73769 334.48322 151.00333 335.30743 curveto
150.26894 336.12775 149.28848 336.5379 148.06192 336.5379 curveto
146.83145 336.5379 145.84707 336.12775 145.1088 335.30743 curveto
144.37442 334.48712 144.00723 333.38556 144.00723 332.00275 curveto
144.00723 330.61994 144.37442 329.51838 145.1088 328.69806 curveto
145.84707 327.87385 146.83145 327.46174 148.06192 327.46173 curveto
fill
grestore
gsave
0 0 0 setrgbcolor
newpath
153.95645 327.61993 moveto
155.14005 327.61993 lineto
155.14005 331.3172 lineto
159.06583 327.61993 lineto
160.58926 327.61993 lineto
156.24747 331.69806 lineto
160.89981 336.36798 lineto
159.34122 336.36798 lineto
155.14005 332.15509 lineto
155.14005 336.36798 lineto
153.95645 336.36798 lineto
153.95645 327.61993 lineto
fill
grestore
gsave
0 0 0 setrgbcolor
newpath
161.83145 327.61993 moveto
167.3627 327.61993 lineto
167.3627 328.61603 lineto
163.01505 328.61603 lineto
163.01505 331.20587 lineto
167.18106 331.20587 lineto
167.18106 332.20197 lineto
163.01505 332.20197 lineto
163.01505 335.37189 lineto
167.46817 335.37189 lineto
167.46817 336.36798 lineto
161.83145 336.36798 lineto
161.83145 327.61993 lineto
fill
grestore
gsave
0 0 0 setrgbcolor
newpath
169.4252 327.61993 moveto
171.01895 327.61993 lineto
174.89786 334.93829 lineto
174.89786 327.61993 lineto
176.0463 327.61993 lineto
176.0463 336.36798 lineto
174.45255 336.36798 lineto
170.57364 329.04962 lineto
170.57364 336.36798 lineto
169.4252 336.36798 lineto
169.4252 327.61993 lineto
fill
grestore
gsave
1 0.55686277 0.0078431377 setrgbcolor
newpath
216.68135 256.09477 moveto
216.68135 256.09477 218.11555 268.663 225.5628 274.20907 curveto
231.72403 278.79743 239.64559 276.0706 246.44718 281.19799 curveto
251.06832 284.68164 253.57483 291.36475 254.33062 295.2169 curveto
255.808 302.74686 254.30346 311.9884 252.86501 314.91439 curveto
251.45953 317.77329 248.88627 320.76739 245.32943 320.79418 curveto
241.81723 320.82097 212.03051 321.09296 212.03051 321.09296 curveto
212.03051 313.01174 lineto
205.46451 326.6488 lineto
213.04066 340.28585 lineto
213.04066 332.20463 lineto
213.04066 332.20463 257.58388 332.03931 263.20329 332.03931 curveto
268.86734 332.03931 272.12544 326.84749 272.12544 326.84749 curveto
272.12544 326.84749 275.05752 332.38566 280.33836 332.34102 curveto
285.57456 332.29638 333.24881 332.20463 333.24881 332.20463 curveto
333.75388 340.79093 lineto
341.33003 325.13357 lineto
332.74373 310.48636 lineto
332.74373 321.09296 lineto
332.74373 321.09296 301.99555 321.27919 298.2014 321.20776 curveto
294.3838 321.13589 293.44813 317.47978 291.85286 315.09296 curveto
290.20459 312.62684 286.2862 301.4135 288.6211 293.92597 curveto
289.07581 292.46784 290.9177 287.15179 296.48949 282.05023 curveto
302.52944 276.52 310.44097 277.43331 316.89812 272.96639 curveto
323.94085 268.09439 325.71 256.45191 325.71 256.45191 curveto
306.34658 256.37983 lineto
306.34658 256.37983 305.93121 263.02234 298.89791 267.04371 curveto
291.86462 271.06507 293.16738 267.58345 284.21339 272.46529 curveto
273.92206 278.07627 271.41115 285.73762 271.41115 285.73762 curveto
271.41115 285.73762 267.91435 278.07155 258.24414 272.7606 curveto
249.68122 268.05778 248.1218 271.7624 241.1946 267.70809 curveto
234.26739 263.65379 234.53534 256.54339 234.53534 256.54339 curveto
216.68135 256.09477 lineto
closepath
eofill
grestore
gsave
0 1 0 setrgbcolor
newpath
179.55401 218.53982 moveto
260.98258 218.53982 lineto
260.98258 257.11125 lineto
179.55401 257.11125 lineto
179.55401 218.53982 lineto
closepath
eofill
grestore
gsave
0 0.50196081 0 setrgbcolor
newpath
195.13499 210.84396 moveto
179.73258 218.53982 lineto
260.62544 218.53982 lineto
273.9032 210.60003 lineto
195.13499 210.84396 lineto
closepath
eofill
grestore
gsave
0 0.33725491 0 setrgbcolor
newpath
260.44686 218.00411 moveto
274.09231 210.45734 lineto
274.30137 247.64697 lineto
260.71789 257.20293 lineto
260.44686 218.00411 lineto
closepath
eofill
grestore
gsave
0 0 0 setrgbcolor
newpath
200.08945 240.86319 moveto
200.08945 238.51358 lineto
198.15585 238.51358 lineto
198.15585 237.54092 lineto
201.26132 237.54092 lineto
201.26132 241.29678 lineto
200.80428 241.621 200.30038 241.8671 199.7496 242.03506 curveto
199.19882 242.19913 198.61093 242.28116 197.98593 242.28116 curveto
196.61874 242.28116 195.54843 241.88272 194.77499 241.08585 curveto
194.00546 240.28507 193.6207 239.17179 193.6207 237.746 curveto
193.6207 236.31632 194.00546 235.20304 194.77499 234.40616 curveto
195.54843 233.60539 196.61874 233.205 197.98593 233.20499 curveto
198.55624 233.205 199.09725 233.27531 199.60898 233.41592 curveto
200.1246 233.55656 200.5992 233.76359 201.03281 234.03702 curveto
201.03281 235.29678 lineto
200.5953 234.9257 200.13046 234.6464 199.63828 234.45889 curveto
199.14608 234.2714 198.6285 234.17765 198.08554 234.17764 curveto
197.01522 234.17765 196.21054 234.47648 195.67148 235.07413 curveto
195.13632 235.67179 194.86874 236.56241 194.86874 237.746 curveto
194.86874 238.92569 195.13632 239.81436 195.67148 240.41202 curveto
196.21054 241.00968 197.01522 241.3085 198.08554 241.3085 curveto
198.5035 241.3085 198.87655 241.27335 199.20468 241.20303 curveto
199.5328 241.12882 199.82772 241.01553 200.08945 240.86319 curveto
fill
grestore
gsave
0 0 0 setrgbcolor
newpath
203.42929 233.36319 moveto
204.61288 233.36319 lineto
204.61288 241.11514 lineto
208.87265 241.11514 lineto
208.87265 242.11124 lineto
203.42929 242.11124 lineto
203.42929 233.36319 lineto
fill
grestore
gsave
0 0 0 setrgbcolor
newpath
213.23788 234.16592 moveto
212.37851 234.16593 211.69491 234.48624 211.1871 235.12686 curveto
210.68319 235.76749 210.43124 236.64054 210.43124 237.746 curveto
210.43124 238.84757 210.68319 239.71866 211.1871 240.35928 curveto
211.69491 240.99991 212.37851 241.32022 213.23788 241.32022 curveto
214.09725 241.32022 214.77694 240.99991 215.27695 240.35928 curveto
215.78085 239.71866 216.0328 238.84757 216.03281 237.746 curveto
216.0328 236.64054 215.78085 235.76749 215.27695 235.12686 curveto
214.77694 234.48624 214.09725 234.16593 213.23788 234.16592 curveto
213.23788 233.20499 moveto
214.46444 233.205 215.44491 233.6171 216.17929 234.44131 curveto
216.91366 235.26163 217.28084 236.3632 217.28085 237.746 curveto
217.28084 239.12491 216.91366 240.22647 216.17929 241.05069 curveto
215.44491 241.871 214.46444 242.28116 213.23788 242.28116 curveto
212.00741 242.28116 211.02304 241.871 210.28476 241.05069 curveto
209.55038 240.23038 209.1832 239.12882 209.1832 237.746 curveto
209.1832 236.3632 209.55038 235.26163 210.28476 234.44131 curveto
211.02304 233.6171 212.00741 233.205 213.23788 233.20499 curveto
fill
grestore
gsave
0 0 0 setrgbcolor
newpath
220.31601 237.9335 moveto
220.31601 241.13858 lineto
222.21445 241.13858 lineto
222.85116 241.13858 223.32186 241.00772 223.62656 240.746 curveto
223.93514 240.48038 224.08944 240.07608 224.08945 239.53311 curveto
224.08944 238.98624 223.93514 238.5839 223.62656 238.32608 curveto
223.32186 238.06437 222.85116 237.93351 222.21445 237.9335 curveto
220.31601 237.9335 lineto
220.31601 234.33585 moveto
220.31601 236.97256 lineto
222.06796 236.97256 lineto
222.64608 236.97257 223.07577 236.86515 223.35703 236.6503 curveto
223.64218 236.43155 223.78475 236.09952 223.78476 235.65421 curveto
223.78475 235.21281 223.64218 234.88273 223.35703 234.66397 curveto
223.07577 234.44523 222.64608 234.33585 222.06796 234.33585 curveto
220.31601 234.33585 lineto
219.13242 233.36319 moveto
222.15585 233.36319 lineto
223.05819 233.3632 223.7535 233.5507 224.24179 233.92569 curveto
224.73007 234.3007 224.97421 234.8339 224.97421 235.5253 curveto
224.97421 236.06046 224.84921 236.48624 224.59921 236.80264 curveto
224.34921 237.11905 223.98202 237.31632 223.49765 237.39444 curveto
224.07968 237.51944 224.53085 237.78116 224.85117 238.1796 curveto
225.17538 238.57413 225.33749 239.06827 225.33749 239.66202 curveto
225.33749 240.44327 225.07186 241.04678 224.54062 241.47256 curveto
224.00936 241.89835 223.2535 242.11124 222.27304 242.11124 curveto
219.13242 242.11124 lineto
219.13242 233.36319 lineto
fill
grestore
gsave
0 0 0 setrgbcolor
newpath
230.28281 234.52921 moveto
228.67734 238.88272 lineto
231.89413 238.88272 lineto
230.28281 234.52921 lineto
229.61484 233.36319 moveto
230.95663 233.36319 lineto
234.29062 242.11124 lineto
233.06015 242.11124 lineto
232.26328 239.8671 lineto
228.31992 239.8671 lineto
227.52304 242.11124 lineto
226.27499 242.11124 lineto
229.61484 233.36319 lineto
fill
grestore
gsave
0 0 0 setrgbcolor
newpath
235.5621 233.36319 moveto
236.7457 233.36319 lineto
236.7457 241.11514 lineto
241.00546 241.11514 lineto
241.00546 242.11124 lineto
235.5621 242.11124 lineto
235.5621 233.36319 lineto
fill
grestore
gsave
0 1 0 setrgbcolor
newpath
338.77577 312.91432 moveto
420.20434 312.91432 lineto
420.20434 351.48575 lineto
338.77577 351.48575 lineto
338.77577 312.91432 lineto
closepath
eofill
grestore
gsave
0 0.50196081 0 setrgbcolor
newpath
350.78532 305.21846 moveto
338.95434 312.91432 lineto
419.8472 312.91432 lineto
430.62496 304.97453 lineto
350.78532 305.21846 lineto
closepath
eofill
grestore
gsave
0 0.3764706 0 setrgbcolor
newpath
419.66862 312.37861 moveto
430.99749 304.83184 lineto
431.17106 339.16432 lineto
419.89364 351.57743 lineto
419.66862 312.37861 lineto
closepath
eofill
grestore
gsave
0 0 0 setrgbcolor
newpath
356.17557 327.13516 moveto
363.57596 327.13516 lineto
363.57596 328.13126 lineto
360.47049 328.13126 lineto
360.47049 335.88321 lineto
359.28104 335.88321 lineto
359.28104 328.13126 lineto
356.17557 328.13126 lineto
356.17557 327.13516 lineto
fill
grestore
gsave
0 0 0 setrgbcolor
newpath
368.27518 327.9379 moveto
367.4158 327.9379 366.73221 328.25822 366.2244 328.89883 curveto
365.72049 329.53947 365.46853 330.41251 365.46854 331.51797 curveto
365.46853 332.61954 365.72049 333.49063 366.2244 334.13126 curveto
366.73221 334.77188 367.4158 335.09219 368.27518 335.09219 curveto
369.13455 335.09219 369.81423 334.77188 370.31424 334.13126 curveto
370.81814 333.49063 371.07009 332.61954 371.0701 331.51797 curveto
371.07009 330.41251 370.81814 329.53947 370.31424 328.89883 curveto
369.81423 328.25822 369.13455 327.9379 368.27518 327.9379 curveto
368.27518 326.97696 moveto
369.50173 326.97697 370.4822 327.38908 371.21658 328.21329 curveto
371.95095 329.03361 372.31814 330.13517 372.31815 331.51797 curveto
372.31814 332.89688 371.95095 333.99845 371.21658 334.82266 curveto
370.4822 335.64298 369.50173 336.05313 368.27518 336.05313 curveto
367.0447 336.05313 366.06033 335.64298 365.32205 334.82266 curveto
364.58768 334.00235 364.22049 332.90079 364.22049 331.51797 curveto
364.22049 330.13517 364.58768 329.03361 365.32205 328.21329 curveto
366.06033 327.38908 367.0447 326.97697 368.27518 326.97696 curveto
fill
grestore
gsave
0 0 0 setrgbcolor
newpath
374.16971 327.13516 moveto
375.3533 327.13516 lineto
375.3533 330.83243 lineto
379.27908 327.13516 lineto
380.80252 327.13516 lineto
376.46072 331.21329 lineto
381.11307 335.88321 lineto
379.55447 335.88321 lineto
375.3533 331.67032 lineto
375.3533 335.88321 lineto
374.16971 335.88321 lineto
374.16971 327.13516 lineto
fill
grestore
gsave
0 0 0 setrgbcolor
newpath
382.04471 327.13516 moveto
387.57596 327.13516 lineto
387.57596 328.13126 lineto
383.2283 328.13126 lineto
383.2283 330.7211 lineto
387.39432 330.7211 lineto
387.39432 331.71719 lineto
383.2283 331.71719 lineto
383.2283 334.88712 lineto
387.68143 334.88712 lineto
387.68143 335.88321 lineto
382.04471 335.88321 lineto
382.04471 327.13516 lineto
fill
grestore
gsave
0 0 0 setrgbcolor
newpath
389.63846 327.13516 moveto
391.23221 327.13516 lineto
395.11111 334.45352 lineto
395.11111 327.13516 lineto
396.25955 327.13516 lineto
396.25955 335.88321 lineto
394.6658 335.88321 lineto
390.7869 328.56485 lineto
390.7869 335.88321 lineto
389.63846 335.88321 lineto
389.63846 327.13516 lineto
fill
grestore
gsave
0.65882355 0.36470589 0.0039215689 setrgbcolor
newpath
271.94686 326.43268 moveto
269.32046 328.65807 266.54757 331.06386 261.41115 331.96839 curveto
261.41115 331.96839 263.87519 333.45244 268.55402 330.71839 curveto
272.20658 328.58403 271.94686 326.43268 271.94686 326.43268 curveto
closepath
eofill
grestore
gsave
1 0.80000001 0.11764706 setrgbcolor
newpath
254.804 298.57553 moveto
254.49886 306.53553 256.40847 321.66855 241.23258 321.25411 curveto
241.23258 321.25411 249.66437 323.03417 253.37544 319.28983 curveto
258.0814 314.54008 254.804 298.57553 254.804 298.57553 curveto
closepath
eofill
grestore
gsave
1 0.80000001 0.11764706 setrgbcolor
newpath
305.82608 258.31845 moveto
305.41958 260.25911 302.31349 265.91043 298.38768 267.72005 curveto
292.77851 270.30564 292.16214 267.47369 281.9492 273.75551 curveto
276.13746 277.33022 271.84018 283.80885 271.54037 286.35416 curveto
272.22241 284.64907 273.38936 283.91573 274.76091 282.65607 curveto
277.35971 280.26926 280.45513 277.02582 282.79038 275.46131 curveto
285.93358 273.3555 292.88807 272.32717 297.47848 269.99639 curveto
302.72583 267.33205 306.58135 262.60416 305.82608 258.31845 curveto
closepath
eofill
grestore
gsave
0.94117647 0.52156866 0.0039215689 setrgbcolor
newpath
325.69687 257.55818 moveto
321.74036 264.99395 315.19845 270.89632 310.0432 273.87861 curveto
304.13529 277.2963 297.64272 278.94382 293.5534 282.09594 curveto
287.5001 286.76194 287.23901 295.28936 287.66115 300.05818 curveto
287.66115 300.05818 287.58458 288.22121 298.43703 280.9292 curveto
304.65557 276.75083 311.19672 276.09433 316.94688 272.55818 curveto
322.6972 269.02193 325.69687 257.55818 325.69687 257.55818 curveto
closepath
eofill
grestore
gsave
0 1 0 setrgbcolor
newpath
282.90477 218.42808 moveto
364.33334 218.42808 lineto
364.33334 256.99951 lineto
282.90477 256.99951 lineto
282.90477 218.42808 lineto
closepath
eofill
grestore
gsave
0 0.50196081 0 setrgbcolor
newpath
294.91432 210.73222 moveto
283.08334 218.42808 lineto
363.9762 218.42808 lineto
374.75396 210.48829 lineto
294.91432 210.73222 lineto
closepath
eofill
grestore
gsave
0 0.3764706 0 setrgbcolor
newpath
363.79762 217.89237 moveto
375.12649 210.3456 lineto
375.30006 244.67808 lineto
364.02264 257.09119 lineto
363.79762 217.89237 lineto
closepath
eofill
grestore
gsave
0 0 0 setrgbcolor
newpath
301.51749 232.64893 moveto
302.70108 232.64893 lineto
302.70108 236.23486 lineto
307.00186 236.23486 lineto
307.00186 232.64893 lineto
308.18546 232.64893 lineto
308.18546 241.39697 lineto
307.00186 241.39697 lineto
307.00186 237.23096 lineto
302.70108 237.23096 lineto
302.70108 241.39697 lineto
301.51749 241.39697 lineto
301.51749 232.64893 lineto
fill
grestore
gsave
0 0 0 setrgbcolor
newpath
309.33975 232.64893 moveto
310.61124 232.64893 lineto
313.03702 236.24658 lineto
315.44522 232.64893 lineto
316.71671 232.64893 lineto
313.62296 237.23096 lineto
313.62296 241.39697 lineto
312.4335 241.39697 lineto
312.4335 237.23096 lineto
309.33975 232.64893 lineto
fill
grestore
gsave
0 0 0 setrgbcolor
newpath
319.06046 237.21924 moveto
319.06046 240.42432 lineto
320.95889 240.42432 lineto
321.59561 240.42432 322.06631 240.29346 322.371 240.03174 curveto
322.67959 239.76611 322.83389 239.36182 322.83389 238.81885 curveto
322.83389 238.27198 322.67959 237.86963 322.371 237.61182 curveto
322.06631 237.3501 321.59561 237.21924 320.95889 237.21924 curveto
319.06046 237.21924 lineto
319.06046 233.62158 moveto
319.06046 236.2583 lineto
320.81241 236.2583 lineto
321.39053 236.25831 321.82022 236.15088 322.10147 235.93604 curveto
322.38662 235.71729 322.5292 235.38526 322.52921 234.93994 curveto
322.5292 234.49854 322.38662 234.16846 322.10147 233.94971 curveto
321.82022 233.73096 321.39053 233.62159 320.81241 233.62158 curveto
319.06046 233.62158 lineto
317.87686 232.64893 moveto
320.9003 232.64893 lineto
321.80264 232.64893 322.49795 232.83643 322.98624 233.21143 curveto
323.47451 233.58643 323.71865 234.11964 323.71866 234.81104 curveto
323.71865 235.3462 323.59365 235.77198 323.34366 236.08838 curveto
323.09365 236.40479 322.72646 236.60206 322.2421 236.68018 curveto
322.82412 236.80518 323.27529 237.0669 323.59561 237.46533 curveto
323.91982 237.85987 324.08193 238.35401 324.08194 238.94775 curveto
324.08193 239.72901 323.81631 240.33252 323.28506 240.7583 curveto
322.75381 241.18408 321.99795 241.39697 321.01749 241.39697 curveto
317.87686 241.39697 lineto
317.87686 232.64893 lineto
fill
grestore
gsave
0 0 0 setrgbcolor
newpath
330.25186 237.29541 moveto
330.50576 237.38135 330.75186 237.56495 330.99014 237.84619 curveto
331.23232 238.12744 331.47451 238.51416 331.71671 239.00635 curveto
332.91788 241.39697 lineto
331.64639 241.39697 lineto
330.52725 239.15283 lineto
330.23818 238.5669 329.95693 238.17823 329.6835 237.98682 curveto
329.41397 237.79541 329.04483 237.69971 328.57608 237.69971 curveto
327.28702 237.69971 lineto
327.28702 241.39697 lineto
326.10342 241.39697 lineto
326.10342 232.64893 lineto
328.7753 232.64893 lineto
329.77529 232.64893 330.52139 232.85792 331.01358 233.27588 curveto
331.50576 233.69386 331.75185 234.32471 331.75186 235.16846 curveto
331.75185 235.71924 331.62295 236.17627 331.36514 236.53955 curveto
331.11123 236.90284 330.74014 237.15479 330.25186 237.29541 curveto
327.28702 233.62158 moveto
327.28702 236.72705 lineto
328.7753 236.72705 lineto
329.34561 236.72706 329.77529 236.5962 330.06436 236.33447 curveto
330.35732 236.06885 330.50381 235.68018 330.50381 235.16846 curveto
330.50381 234.65675 330.35732 234.27198 330.06436 234.01416 curveto
329.77529 233.75245 329.34561 233.62159 328.7753 233.62158 curveto
327.28702 233.62158 lineto
fill
grestore
gsave
0 0 0 setrgbcolor
newpath
334.44717 232.64893 moveto
335.63077 232.64893 lineto
335.63077 241.39697 lineto
334.44717 241.39697 lineto
334.44717 232.64893 lineto
fill
grestore
gsave
0 0 0 setrgbcolor
newpath
339.16983 233.62158 moveto
339.16983 240.42432 lineto
340.59952 240.42432 lineto
341.80654 240.42432 342.68936 240.15088 343.24796 239.604 curveto
343.81045 239.05713 344.0917 238.19385 344.09171 237.01416 curveto
344.0917 235.84229 343.81045 234.98487 343.24796 234.44189 curveto
342.68936 233.89503 341.80654 233.62159 340.59952 233.62158 curveto
339.16983 233.62158 lineto
337.98624 232.64893 moveto
340.41788 232.64893 lineto
342.11318 232.64893 343.35732 233.00245 344.1503 233.70947 curveto
344.94326 234.4126 345.33974 235.51417 345.33975 237.01416 curveto
345.33974 238.52198 344.94131 239.6294 344.14444 240.33643 curveto
343.34756 241.04346 342.10537 241.39697 340.41788 241.39697 curveto
337.98624 241.39697 lineto
337.98624 232.64893 lineto
fill
grestore
gsave
<<
/ShadingType 2
/ColorSpace /DeviceRGB
/Coords [526.53693 475.0563 526.53693 508.13742]
/Extend [true true]
/Domain [0 1]
/Function <<
/FunctionType 3
/Functions
[
<<
/FunctionType 2
/Domain [0 1]
/C0 [1 1 1]
/C1 [0.65490198 0.98431373 0.91764706]
/N 1
>>
<<
/FunctionType 2
/Domain [0 1]
/C0 [0.65490198 0.98431373 0.91764706]
/C1 [0 0.38039216 0.52549022]
/N 1
>>
]
/Domain [0 1]
/Bounds [ 0.5 ]
/Encode [ 0 1 0 1 ]
>>
>>
newpath
461.89225 403.74272 moveto
467.44809 403.74272 lineto
457.88365 408.69893 457.38146 430.96148 467.44809 435.81506 curveto
460.8821 435.81506 lineto
457.47187 435.58797 454.20331 427.1687 454.06357 420.1577 curveto
453.92384 413.14718 457.37756 404.03576 461.89225 403.74272 curveto
closepath
eoclip
gsave [1 0 0 1 -58.588848 -71.822356] concat
shfill
grestore
grestore
0 0 0 setrgbcolor
[] 0 setdash
1 setlinewidth
0 setlinejoin
0 setlinecap
newpath
461.89225 403.74272 moveto
467.44809 403.74272 lineto
457.88365 408.69893 457.38146 430.96148 467.44809 435.81506 curveto
460.8821 435.81506 lineto
457.47187 435.58797 454.20331 427.1687 454.06357 420.1577 curveto
453.92384 413.14718 457.37756 404.03576 461.89225 403.74272 curveto
closepath
stroke
0 0 0 setrgbcolor
[] 0 setdash
1.14452 setlinewidth
0 setlinejoin
0 setlinecap
newpath
467.62496 403.72568 moveto
476.28056 403.58032 475.9719 435.88716 467.44638 435.75813 curveto
stroke
grestore
showpage
%%EOF
