#FIG 3.2
Portrait
Center
Metric
A4
100.000000
Single
-2
1200 2
0 32 #ffffff
6 0 0 0 0
2 3 0 3 32 32 0 -1 20 0.000000 0 0 0 0 0 5
	3720 9871 6579 9871 6579 10721 3720 10721 3720 9871
2 3 0 3 0 0 0 0 -1 0.000000 0 0 0 0 0 5
	3720 9871 6579 9871 6579 10721 3720 10721 3720 9871
4 1 0 0 0 16 22.762205 0.0 4 0.0 0.0 5150 10461 PDAController\001
2 1 0 1 0 0 0 0 -1 0.000000 0 0 0 0 0 2
	3957 10532 6342 10532
-6
6 0 0 0 0
2 3 0 3 32 32 0 -1 20 0.000000 0 0 0 0 0 5
	8836 9871 10111 9871 10111 10721 8836 10721 8836 9871
2 3 0 3 0 0 0 0 -1 0.000000 0 0 0 0 0 5
	8836 9871 10111 9871 10111 10721 8836 10721 8836 9871
4 1 0 0 0 16 22.762205 0.0 4 0.0 0.0 9474 10461 PDA\001
2 1 0 1 0 0 0 0 -1 0.000000 0 0 0 0 0 2
	9072 10532 9875 10532
-6
6 0 0 0 0
2 3 0 3 32 32 0 -1 20 0.000000 0 0 0 0 0 5
	10500 9871 12508 9871 12508 10721 10500 10721 10500 9871
2 3 0 3 0 0 0 0 -1 0.000000 0 0 0 0 0 5
	10500 9871 12508 9871 12508 10721 10500 10721 10500 9871
4 1 0 0 0 16 22.762205 0.0 4 0.0 0.0 11504 10461 pda:PDA\001
2 1 0 1 0 0 0 0 -1 0.000000 0 0 0 0 0 2
	10736 10532 12272 10532
-6
6 0 0 0 0
2 1 1 1 0 0 0 0 -1 12.598425 0 0 0 0 0 2
	9474 10721 9474 13838
2 3 0 3 32 32 0 -1 20 12.598425 0 0 0 0 0 5
	9308 11309 9639 11309 9639 11716 9308 11716 9308 11309
2 3 0 3 0 0 0 0 -1 12.598425 0 0 0 0 0 5
	9308 11309 9639 11309 9639 11716 9308 11716 9308 11309
-6
6 0 0 0 0
2 1 1 1 0 0 0 0 -1 12.598425 0 0 0 0 0 2
	11504 10721 11504 13838
2 3 0 3 32 32 0 -1 20 12.598425 0 0 0 0 0 5
	11339 12066 11669 12066 11669 12362 11339 12362 11339 12066
2 3 0 3 0 0 0 0 -1 12.598425 0 0 0 0 0 5
	11339 12066 11669 12066 11669 12362 11339 12362 11339 12066
-6
6 0 0 0 0
2 1 1 1 0 0 0 0 -1 12.598425 0 0 0 0 0 2
	5150 10721 5150 13820
2 3 0 3 32 32 0 -1 20 12.598425 0 0 0 0 0 5
	4984 11312 5315 11312 5315 13100 4984 13100 4984 11312
2 3 0 3 0 0 0 0 -1 12.598425 0 0 0 0 0 5
	4984 11312 5315 11312 5315 13100 4984 13100 4984 11312
-6
6 0 0 0 0
2 1 0 3 0 0 0 0 -1 12.598425 0 0 0 0 1 2
  1 1 3.149606 236.220472 377.952756
	9308 11309 5315 11312
4 1 0 0 0 16 22.762205 0.0 4 0.0 0.0 7168 11225 pda:=find(pdaID):PDA\001
-6
6 0 0 0 0
2 3 0 3 32 32 0 -1 20 12.598425 0 0 0 0 0 5
	12871 9871 15351 9871 15351 10721 12871 10721 12871 9871
2 3 0 3 0 0 0 0 -1 12.598425 0 0 0 0 0 5
	12871 9871 15351 9871 15351 10721 12871 10721 12871 9871
4 1 0 0 0 16 22.762205 0.0 4 0.0 0.0 14111 10461 pers:Person\001
2 1 0 1 0 0 0 0 -1 12.598425 0 0 0 0 0 2
	13107 10532 15115 10532
-6
6 0 0 0 0
2 1 1 1 0 0 0 0 -1 12.598425 0 0 0 0 0 2
	14111 10721 14111 13857
2 3 0 3 32 32 0 -1 20 12.598425 0 0 0 0 0 5
	13945 12661 14276 12661 14276 13082 13945 13082 13945 12661
2 3 0 3 0 0 0 0 -1 12.598425 0 0 0 0 0 5
	13945 12661 14276 12661 14276 13082 13945 13082 13945 12661
-6
6 0 0 0 0
2 1 1 3 0 0 0 0 -1 12.598425 0 0 0 0 1 2
  1 1 3.149606 236.220472 377.952756
	5315 11759 9308 11716
-6
6 0 0 0 0
2 1 0 3 0 0 0 0 -1 12.598425 0 0 0 0 1 2
  1 1 3.149606 236.220472 377.952756
	11339 12066 5289 12066
4 1 0 0 0 16 22.762205 0.0 4 0.0 0.0 8314 12066 pers:=getUser()\001
-6
6 0 0 0 0
2 1 1 3 0 0 0 0 -1 12.598425 0 0 0 0 1 2
  1 1 3.149606 236.220472 377.952756
	5308 12380 11339 12362
-6
6 0 0 0 0
2 1 0 3 0 0 0 0 -1 12.598425 0 0 0 0 1 2
  1 1 3.149606 236.220472 377.952756
	13945 12661 5315 12653
4 1 0 0 0 16 22.762205 0.0 4 0.0 0.0 9630 12657 getMessages()\001
-6
6 0 0 0 0
2 1 1 3 0 0 0 0 -1 12.598425 0 0 0 0 1 2
  1 1 3.149606 236.220472 377.952756
	5315 13100 13945 13082
-6
6 0 0 0 0
2 1 0 3 0 0 0 0 -1 31.496063 0 0 0 1 1 4
  0 0 3.149606 377.952756 377.952756
  0 0 3.149606 377.952756 377.952756
	8929 9874 8929 9874 8929 9732 10251 9732 
-6
6 0 0 0 0
2 1 0 3 0 0 0 0 -1 31.496063 0 0 0 1 1 4
  0 0 3.149606 377.952756 377.952756
  0 0 3.149606 377.952756 377.952756
	10251 9732 10251 10582 10110 10582 10110 10582 
-6
