#FIG 3.2
Landscape
Center
Inches
Letter  
100.00
Single
-2
1200 2
# OP-amp (operational amplifier)
6 4425 5850 5625 6750
2 3 0 1 -1 7 0 0 20 0.000 0 0 -1 0 0 4
	 4575 5850 5475 6300 4575 6750 4575 5850
2 1 0 1 -1 -1 0 0 -1 0.000 0 0 -1 0 0 2
	 5475 6300 5625 6300
2 1 0 1 -1 -1 0 0 -1 0.000 0 0 -1 0 0 2
	 4425 6450 4575 6450
2 1 0 1 -1 -1 0 0 -1 0.000 0 0 -1 0 0 2
	 4425 6150 4575 6150
4 0 -1 0 0 0 8 0.0000 0 75 75 4650 6489 +\001
4 0 -1 0 0 0 8 0.0000 0 15 45 4650 6189 -\001
-6
# Resistor
6 3450 6075 4125 6225
2 1 0 1 0 7 100 0 -1 0.000 0 0 -1 0 0 12
	 3450 6150 3595 6150 3619 6225 3667 6075 3715 6225 3763 6075
	 3811 6225 3859 6075 3907 6225 3955 6075 3979 6150 4125 6150
-6
# Resistor
6 4650 5475 5325 5625
2 1 0 1 0 7 100 0 -1 0.000 0 0 -1 0 0 12
	 4650 5550 4795 5550 4819 5625 4867 5475 4915 5625 4963 5475
	 5011 5625 5059 5475 5107 5625 5155 5475 5179 5550 5325 5550
-6
# Resistor
6 6225 6300 6375 6975
2 1 0 1 0 7 100 0 -1 0.000 0 0 -1 0 0 12
	 6300 6975 6300 6830 6375 6806 6225 6758 6375 6710 6225 6662
	 6375 6614 6225 6566 6375 6518 6225 6470 6300 6446 6300 6300
-6
# OP-amp (operational amplifier)
6 4425 3525 5625 4425
2 3 0 1 -1 7 0 0 20 0.000 0 0 -1 0 0 4
	 4575 3525 5475 3975 4575 4425 4575 3525
2 1 0 1 -1 -1 0 0 -1 0.000 0 0 -1 0 0 2
	 5475 3975 5625 3975
2 1 0 1 -1 -1 0 0 -1 0.000 0 0 -1 0 0 2
	 4425 4125 4575 4125
2 1 0 1 -1 -1 0 0 -1 0.000 0 0 -1 0 0 2
	 4425 3825 4575 3825
4 0 -1 0 0 0 8 0.0000 0 75 75 4650 4164 +\001
4 0 -1 0 0 0 8 0.0000 0 15 45 4650 3864 -\001
-6
# Resistor
6 3450 3750 4125 3900
2 1 0 1 0 7 100 0 -1 0.000 0 0 -1 0 0 12
	 3450 3825 3595 3825 3619 3900 3667 3750 3715 3900 3763 3750
	 3811 3900 3859 3750 3907 3900 3955 3750 3979 3825 4125 3825
-6
# Resistor
6 4650 3150 5325 3300
2 1 0 1 0 7 100 0 -1 0.000 0 0 -1 0 0 12
	 4650 3225 4795 3225 4819 3300 4867 3150 4915 3300 4963 3150
	 5011 3300 5059 3150 5107 3300 5155 3150 5179 3225 5325 3225
-6
# Resistor
6 6225 3975 6375 4650
2 1 0 1 0 7 100 0 -1 0.000 0 0 -1 0 0 12
	 6300 4650 6300 4505 6375 4481 6225 4433 6375 4385 6225 4337
	 6375 4289 6225 4241 6375 4193 6225 4145 6300 4121 6300 3975
-6
6 3000 3975 3450 4425
1 3 0 1 0 7 50 -1 -1 0.000 1 0.0000 3225 4200 150 150 3225 4200 3225 4050
2 1 0 1 0 7 50 -1 -1 0.000 0 0 -1 0 0 2
	 3225 4050 3225 4200
2 1 0 1 0 7 50 -1 -1 0.000 0 0 -1 0 0 2
	 3300 4125 3150 4125
2 1 0 1 0 7 50 -1 -1 0.000 0 0 -1 0 0 2
	 3150 4275 3300 4275
-6
6 4050 6525 4500 6975
1 3 0 1 0 7 50 -1 -1 0.000 1 0.0000 4275 6750 150 150 4275 6750 4275 6600
2 1 0 1 0 7 50 -1 -1 0.000 0 0 -1 0 0 2
	 4275 6600 4275 6750
2 1 0 1 0 7 50 -1 -1 0.000 0 0 -1 0 0 2
	 4350 6675 4200 6675
2 1 0 1 0 7 50 -1 -1 0.000 0 0 -1 0 0 2
	 4200 6825 4350 6825
-6
2 1 0 1 0 7 50 -1 -1 0.000 0 0 -1 0 0 2
	 4125 6150 4425 6150
2 1 0 1 0 7 50 -1 -1 0.000 0 0 -1 0 0 3
	 4275 6150 4275 5550 4650 5550
2 1 0 1 0 7 50 -1 -1 0.000 0 0 -1 0 0 4
	 5250 5550 5775 5550 5775 6300 5550 6300
2 1 0 1 0 7 50 -1 -1 0.000 0 0 -1 0 0 2
	 5775 6300 6300 6300
2 1 0 1 0 7 50 -1 -1 0.000 0 0 -1 0 0 3
	 4425 6450 4275 6450 4275 6600
2 1 0 1 0 7 50 -1 -1 0.000 0 0 -1 0 0 3
	 3450 6150 3225 6150 3225 6900
2 1 0 1 0 7 50 -1 -1 0.000 0 0 -1 0 0 2
	 3300 6825 3150 6975
2 1 0 1 0 7 50 -1 -1 0.000 0 0 -1 0 0 2
	 6375 6900 6225 7050
2 1 0 1 0 7 50 -1 -1 0.000 0 0 -1 0 0 2
	 6075 6375 6075 6525
2 1 0 1 0 7 50 -1 -1 0.000 0 0 -1 0 0 2
	 6150 6450 6000 6450
2 1 0 1 0 7 50 -1 -1 0.000 0 0 -1 0 0 2
	 6000 6900 6150 6900
2 1 0 1 0 7 50 -1 -1 0.000 0 0 -1 0 0 2
	 4125 3825 4425 3825
2 1 0 1 0 7 50 -1 -1 0.000 0 0 -1 0 0 3
	 4275 3825 4275 3225 4650 3225
2 1 0 1 0 7 50 -1 -1 0.000 0 0 -1 0 0 4
	 5250 3225 5775 3225 5775 3975 5550 3975
2 1 0 1 0 7 50 -1 -1 0.000 0 0 -1 0 0 2
	 5775 3975 6300 3975
2 1 0 1 0 7 50 -1 -1 0.000 0 0 -1 0 0 3
	 4425 4125 4275 4125 4275 4650
2 1 0 1 0 7 50 -1 -1 0.000 0 0 -1 0 0 3
	 3450 3825 3225 3825 3225 4050
2 1 0 1 0 7 50 -1 -1 0.000 0 0 -1 0 0 2
	 3225 4350 3225 4575
2 1 0 1 0 7 50 -1 -1 0.000 0 0 -1 0 0 2
	 3300 4500 3150 4650
2 1 0 1 0 7 50 -1 -1 0.000 0 0 -1 0 0 2
	 4350 4575 4200 4725
2 1 0 1 0 7 50 -1 -1 0.000 0 0 -1 0 0 2
	 6375 4575 6225 4725
2 1 0 1 0 7 50 -1 -1 0.000 0 0 -1 0 0 2
	 6075 4050 6075 4200
2 1 0 1 0 7 50 -1 -1 0.000 0 0 -1 0 0 2
	 6150 4125 6000 4125
2 1 0 1 0 7 50 -1 -1 0.000 0 0 -1 0 0 2
	 6000 4575 6150 4575
2 1 0 1 0 7 50 -1 -1 0.000 0 0 -1 0 0 2
	 4350 7050 4200 7200
2 1 0 1 0 7 50 -1 -1 0.000 0 0 -1 0 0 2
	 4275 7125 4275 6900
4 0 0 50 -1 0 12 0.0000 4 135 210 4875 3075 R2\001
4 0 0 50 -1 0 12 0.0000 4 135 210 3675 3675 R1\001
4 0 0 50 -1 0 12 0.0000 4 135 210 3675 6000 R1\001
4 0 0 50 -1 0 12 0.0000 4 135 210 4950 5400 R2\001
4 0 0 50 -1 0 12 0.0000 2 195 825 6450 6750 $V_{out}$\001
4 0 0 50 -1 0 12 0.0000 2 195 825 6450 4425 $V_{out}$\001
