03jun03 06jul03

korpus         6890 (7394)+karnis(300)
dveri+vitrina  3654
magic korner   1500 (mozno 1200 drugaia firma)
dver mikrovoln 300
pol karuseli vidvigaetsa 800
telescope iaschik  9x350=
vedro          250
homer nikui    280
korzini 4      1560 ()
mechanizm otkritia  8x130=1040
dlia verha
ruchki         21x50=1050 (630)
	20474

shaish+sokal   6500
kior           1300
-------------------------------------------------------------------------------
bez vedar + nikui kilim                     ~500
bez korzinok                                ~1500
2 dveri vmesto 2 vetrin.                    ~500
Mozno magic korner pozse i karusel.         ~2300
bez telescopii                              ~1000
Otdelno vitrini 1139 + mechanizm podiema 1040 + korpus 1000 + ruchki 4x50 ~4000
-------------------------------------------------------------------------------

11678
27750 - 9% - 24800+ ~1000

arad
hakanaim, 18/6
maria o.

Shkaf v spalne - 9000
shkaf u Lev - 2x2300
