---CHART:---
 h   -> h_1 ... h_2 (loc_h:1):	0.3000
 h   -> h_0 ... h_1 (loc_h:1):	0.0000
 h   -> h_0 ... h_1 (loc_h:2):	0.0000
 h_  -> h_1 ... h_2 (loc_h:1):	0.1200
_h_  -> h_0 ... h_2 (loc_h:2):	0.0498
 h   -> h_0 ... h_1 (loc_h:0):	0.3000
 h_  -> h_1 ... h_2 (loc_h:2):	0.0630
_h_  -> h_1 ... h_2 (loc_h:2):	0.0630
_h_  -> h_0 ... h_1 (loc_h:0):	0.1200
 h_  -> h_0 ... h_1 (loc_h:0):	0.1200
 h_  -> h_0 ... h_2 (loc_h:2):	0.0498
_h_  -> h_1 ... h_2 (loc_h:1):	0.1200
 h   -> h_1 ... h_2 (loc_h:2):	0.0000
 h   -> h_0 ... h_2 (loc_h:2):	0.0000
_h_  -> h_0 ... h_1 (loc_h:1):	0.0630
 h_  -> h_0 ... h_1 (loc_h:1):	0.0630
---CHART:end---
