/* XPM */
static char *istar_pos_contrib_xpm[] = {
/* width height ncolors chars_per_pixel */
"22 22 2 1",
/* colors */
"` c black",
"a c none",
/* pixels */
"aaaaaaaaaaaaaaaaaaaaaa",
"aaaaaaaaaaaaaaaaaaaaaa",
"aaaaaaaaaaaaaaaaaaaaaa",
"aaaaaaaaaa``aaaaaaaaaa",
"aaaaaaaaa````aaaaaaaaa",
"aaaaaaaa``````aaaaaaaa",
"aaaaaaaaaa``aaaaaaaaaa",
"aaaaaaaaaa``aaaaaaaaaa",
"aaaaaaaaaa``aaaaaaaaaa",
"aaaaaaaaaa``aaaaaaaaaa",
"aaaaaaaaaa``aaaaaaaaaa",
"aaaaaaaaaa``aaaaaaaaaa",
"aaaaaaaaaa``aaaa``aaaa",
"aaaaaaaaaa``aaaa``aaaa",
"aaaaaaaaaa``aa``````aa",
"aaaaaaaaaa``aa``````aa",
"aaaaaaaaaa``aaaa``aaaa",
"aaaaaaaaaa``aaaa``aaaa",
"aaaaaaaaaaaaaaaaaaaaaa",
"aaaaaaaaaaaaaaaaaaaaaa",
"aaaaaaaaaaaaaaaaaaaaaa",
"aaaaaaaaaaaaaaaaaaaaaa"
};

