/* XPM */
static char *iconforge_xpm[] = {
/* width height ncolors chars_per_pixel */
"22 22 3 1",
/* colors */
"` c black",
"a c none",
/* pixels */
"aaaaaaaaaaaaaaaaaaaaaa",
"aaaaaaaaaaaaaaaaaaaaaa",
"aaaaaaaaaaa`aaaaaaaaaa",
"aaaaaaaaaaa`aaaaaaaaaa",
"aaaaaaaaa`````aaaaaaaa",
"aaaaaaa`````````aaaaaa",
"aaaaaa```````````aaaaa",
"aaaaa`````````````aaaa",
"aaaaa`````````````aaaa",
"aaaa```````````````aaa",
"aaaa```````````````aaa",
"aaaa```````````````aaa",
"aaaa```````````````aaa",
"aaaa```````````````aaa",
"aaaa`````aa`aa`````aaa",
"aaaa````aaa`aaa````aaa",
"aaaa``a`aaa`aaa`a``aaa",
"aaaa`aa`aaa`aaa`aa`aaa",
"aaaaaaa`aaa`aaa`aaaaaa",
"aaaaaaa`aaa`aaa`aaaaaa",
"aaaaaaaaaaaaaaaaaaaaaa",
"aaaaaaaaaaaaaaaaaaaaaa"
};

