V	180712123351Z		01	unknown	/C=NA/ST=None/L=None/O=Mullvad/CN=m1.mullvad.net/emailAddress=info@mullvad.net
V	180712123619Z		02	unknown	/C=NA/ST=None/L=None/O=Mullvad/CN=client/emailAddress=info@mullvad.net
V	180716103336Z		03	unknown	/C=NA/ST=None/L=None/O=Mullvad/CN=Mullvad/emailAddress=info@mullvad.net
V	180716103401Z		04	unknown	/C=NA/ST=None/L=None/O=Mullvad/CN=Mullvad/emailAddress=info@mullvad.net
V	180716103747Z		05	unknown	/C=NA/ST=None/L=None/O=Mullvad/CN=Mullvad/emailAddress=info@mullvad.net
V	180716164313Z		06	unknown	/C=NA/ST=None/L=None/O=Mullvad/CN=Mullvad/emailAddress=info@mullvad.net
V	180716165400Z		07	unknown	/C=NA/ST=None/L=None/O=Mullvad/CN=Mullvad/emailAddress=info@mullvad.net
V	180716170745Z		08	unknown	/C=NA/ST=None/L=None/O=Mullvad/CN=Mullvad/emailAddress=info@mullvad.net
V	180716172313Z		09	unknown	/C=NA/ST=None/L=None/O=Mullvad/CN=Mullvad/emailAddress=info@mullvad.net
V	180716174212Z		0A	unknown	/C=NA/ST=None/L=None/O=Mullvad/CN=Mullvad/emailAddress=info@mullvad.net
V	180716183420Z		0B	unknown	/C=NA/ST=None/L=None/O=Mullvad/CN=Mullvad/emailAddress=info@mullvad.net
V	180716190132Z		0C	unknown	/C=NA/ST=None/L=None/O=Mullvad/CN=Mullvad/emailAddress=info@mullvad.net
V	180719115554Z		0D	unknown	/C=NA/ST=None/L=None/O=Mullvad/CN=Mullvad/emailAddress=info@mullvad.net
V	180719182915Z		0E	unknown	/C=NA/ST=None/L=None/O=Mullvad/CN=Mullvad/emailAddress=info@mullvad.net
V	180720133554Z		0F	unknown	/C=NA/ST=None/L=None/O=Mullvad/CN=Mullvad/emailAddress=info@mullvad.net
V	180721223252Z		10	unknown	/C=NA/ST=None/L=None/O=Mullvad/CN=Mullvad/emailAddress=info@mullvad.net
V	181114184241Z		11	unknown	/CN=Mullvad100016
V	181116104707Z		12	unknown	/C=NA/ST=None/L=None/O=Mullvad/CN=Mullvad/emailAddress=info@mullvad.net
V	181212112023Z		13	unknown	/C=NA/ST=None/L=None/O=Mullvad/CN=Mullvad/emailAddress=info@mullvad.net
V	181212115050Z		14	unknown	/C=NA/ST=None/L=None/O=Mullvad/CN=Mullvad/emailAddress=info@mullvad.net
V	181212115521Z		15	unknown	/C=NA/ST=None/L=None/O=Mullvad/CN=Mullvad/emailAddress=info@mullvad.net
V	181212115935Z		16	unknown	/C=NA/ST=None/L=None/O=Mullvad/CN=Mullvad/emailAddress=info@mullvad.net
V	181212155106Z		17	unknown	/C=NA/ST=None/L=None/O=Mullvad/CN=Mullvad/emailAddress=info@mullvad.net
V	181220154029Z		18	unknown	/CN=Mullvad100023
V	181220170026Z		19	unknown	/CN=Mullvad100025
V	181220172131Z		1A	unknown	/CN=Mullvad100025
V	181220182319Z		1B	unknown	/CN=Mullvad100025
V	181220184000Z		1C	unknown	/CN=Mullvad100026
V	181220200226Z		1D	unknown	/CN=Mullvad100025
V	181220200553Z		1E	unknown	/CN=Mullvad100025
V	181220211234Z		1F	unknown	/CN=Mullvad100025
V	181220214740Z		20	unknown	/CN=Mullvad100025
V	181220221634Z		21	unknown	/CN=Mullvad100025
V	181221090527Z		22	unknown	/CN=Mullvad100025
V	181221105423Z		23	unknown	/CN=Mullvad100027
V	181221105627Z		24	unknown	/CN=Mullvad100028
V	181221110007Z		25	unknown	/CN=Mullvad100029
V	181221113456Z		26	unknown	/CN=Mullvad100030
V	181221131549Z		27	unknown	/CN=Mullvad100030
V	181221132918Z		28	unknown	/CN=Mullvad100030
V	181221153946Z		29	unknown	/CN=Mullvad100030
V	181230184528Z		2A	unknown	/CN=Mullvad100030
V	190101113057Z		2B	unknown	/CN=Mullvad100030
V	190107204620Z		2C	unknown	/CN=Mullvad100030
V	190107211839Z		2D	unknown	/CN=Mullvad100031
V	190107212606Z		2E	unknown	/CN=Mullvad100032
V	190107221246Z		2F	unknown	/CN=Mullvad100033
V	190107222324Z		30	unknown	/CN=Mullvad100034
V	190107230857Z		31	unknown	/CN=Mullvad100035
V	190108173932Z		32	unknown	/CN=m1.mullvad.net
V	190108205547Z		33	unknown	/CN=Mullvad100036
V	190108210011Z		34	unknown	/CN=Mullvad100036
V	190131221336Z		35	unknown	/CN=Mullvad100035
V	190131224640Z		36	unknown	/CN=Mullvad100037
V	190205132732Z		37	unknown	/CN=Mullvad100039
V	190212130301Z		38	unknown	/CN=Mullvad100039
V	190218221131Z		39	unknown	/CN=Mullvad100040
V	190219074039Z		3A	unknown	/CN=Mullvad100040
V	190219080002Z		3B	unknown	/CN=Mullvad100041
V	190219193303Z		3C	unknown	/CN=Mullvad100042
V	190219193837Z		3D	unknown	/CN=Mullvad100043
V	190219204246Z		3E	unknown	/CN=Mullvad100040
V	190219204933Z		3F	unknown	/CN=Mullvad100044
V	190219210313Z		40	unknown	/CN=Mullvad100045
V	190219215039Z		41	unknown	/CN=Mullvad100046
V	190220101244Z		42	unknown	/CN=Mullvad100047
V	190220102123Z		43	unknown	/CN=Mullvad100048
V	190220102803Z		44	unknown	/CN=Mullvad100049
V	190220103107Z		45	unknown	/CN=Mullvad100050
V	190220110755Z		46	unknown	/CN=Mullvad100051
V	190220111354Z		47	unknown	/CN=Mullvad100052
V	190220113640Z		48	unknown	/CN=Mullvad100053
V	190220120433Z		49	unknown	/CN=Mullvad100054
V	190220123921Z		4A	unknown	/CN=Mullvad100056
V	190220125550Z		4B	unknown	/CN=Mullvad100057
V	190220125730Z		4C	unknown	/CN=Mullvad100058
V	190220125859Z		4D	unknown	/CN=Mullvad100059
V	190220131137Z		4E	unknown	/CN=Mullvad100060
V	190226101349Z		4F	unknown	/CN=Mullvad100061
V	190226101508Z		50	unknown	/CN=Mullvad100062
V	190226174817Z		51	unknown	/CN=Mullvad100063
V	190226180435Z		52	unknown	/CN=Mullvad100064
V	190226182159Z		53	unknown	/CN=Mullvad100065
V	190227104642Z		54	unknown	/CN=Mullvad100066
V	190227184700Z		55	unknown	/CN=Mullvad100067
V	190304222523Z		56	unknown	/CN=Mullvad100069
V	190305094438Z		57	unknown	/CN=Mullvad100070
V	190305110207Z		58	unknown	/CN=Mullvad100071
V	190305110337Z		59	unknown	/CN=Mullvad100072
V	190305112138Z		5A	unknown	/CN=Mullvad100073
V	190305190203Z		5B	unknown	/CN=Mullvad100074
V	190305190604Z		5C	unknown	/CN=Mullvad100075
V	190305194207Z		5D	unknown	/CN=Mullvad100076
V	190306064806Z		5E	unknown	/CN=Mullvad100077
V	190306071608Z		5F	unknown	/CN=Mullvad100078
V	190306080430Z		60	unknown	/CN=Mullvad100079
V	190306153144Z		61	unknown	/CN=Mullvad100080
V	190311194611Z		62	unknown	/CN=Mullvad957689920052
V	190311203837Z		63	unknown	/CN=Mullvad156410830012
V	190311204443Z		64	unknown	/CN=Mullvad452980669408
V	190311204738Z		65	unknown	/CN=Mullvad220388509795
V	190311210121Z		66	unknown	/CN=Mullvad220388509795
V	190311210237Z		67	unknown	/CN=Mullvad220388509795
V	190311211156Z		68	unknown	/CN=Mullvad399120053029
V	190312163640Z		69	unknown	/CN=Mullvad126196802042
V	190312205018Z		6A	unknown	/CN=Mullvad600480881636
V	190312224700Z		6B	unknown	/CN=Mullvad373785873952
V	190312230131Z		6C	unknown	/CN=Mullvad963198225785
V	190312231813Z		6D	unknown	/CN=Mullvad992215984993
V	190313101938Z		6E	unknown	/CN=Mullvad306678479235
V	190313204244Z		6F	unknown	/CN=Mullvad331781109814
V	190315175902Z		70	unknown	/CN=Mullvad305691243498
V	190316174137Z		71	unknown	/CN=Mullvad628980717285
V	190316192303Z		72	unknown	/CN=Mullvad980529085508
V	190316192923Z		73	unknown	/CN=Mullvad616951852891
V	190316200005Z		74	unknown	/CN=Mullvad624710629355
V	190316201549Z		75	unknown	/CN=Mullvad825781791285
V	190317191006Z		76	unknown	/CN=Mullvad191518218122
V	190317193037Z		77	unknown	/CN=Mullvad377123816104
V	190318164031Z		78	unknown	/CN=Mullvad384144707880
V	190318194412Z		79	unknown	/CN=Mullvad684552430952
V	190320171216Z		7A	unknown	/CN=Mullvad939917267265
V	190320174330Z		7B	unknown	/CN=Mullvad743531143756
V	190320181825Z		7C	unknown	/CN=Mullvad485354737672
V	190320185808Z		7D	unknown	/CN=Mullvad293716083807
V	190320193055Z		7E	unknown	/CN=Mullvad512768395583
V	190320193306Z		7F	unknown	/CN=Mullvad158376899842
V	190320193431Z		80	unknown	/CN=Mullvad213682348424
V	190321205429Z		81	unknown	/CN=Mullvad379571202790
