<?xml version="1.0" encoding="UTF-8" standalone="no"?>
<!-- Created with Inkscape (http://www.inkscape.org/) -->

<svg
   xmlns:dc="http://purl.org/dc/elements/1.1/"
   xmlns:cc="http://creativecommons.org/ns#"
   xmlns:rdf="http://www.w3.org/1999/02/22-rdf-syntax-ns#"
   xmlns:svg="http://www.w3.org/2000/svg"
   xmlns="http://www.w3.org/2000/svg"
   xmlns:xlink="http://www.w3.org/1999/xlink"
   version="1.0"
   width="500"
   height="500"
   viewBox="0 0 1000 1000"
   id="page"
   xml:space="preserve"><metadata
     id="metadata12"><rdf:RDF><cc:Work
         rdf:about=""><dc:format>image/svg+xml</dc:format><dc:type
           rdf:resource="http://purl.org/dc/dcmitype/StillImage" /><dc:title></dc:title></cc:Work></rdf:RDF></metadata><defs
     id="defs38"><linearGradient
       id="linearGradient1312"><stop
         id="stop1314"
         style="stop-color:#999999;stop-opacity:1"
         offset="0" /><stop
         id="stop1316"
         style="stop-color:#555555;stop-opacity:1"
         offset="1" /></linearGradient><linearGradient
       x1="522.33539"
       y1="88.453316"
       x2="522.33539"
       y2="468.45331"
       id="linearGradient7484"
       xlink:href="#linearGradient1312"
       gradientUnits="userSpaceOnUse"
       gradientTransform="matrix(0.9999868,-1.3875445e-8,1.5541495e-8,0.9999816,-99.32689,108.71252)" /><linearGradient
       x1="299.33881"
       y1="9.8939447"
       x2="299.33881"
       y2="519.69983"
       id="linearGradient5747"
       xlink:href="#linearGradient2218"
       gradientUnits="userSpaceOnUse"
       gradientTransform="translate(-102.3354,111.5471)" /><linearGradient
       id="linearGradient2218"><stop
         id="stop2220"
         style="stop-color:#999999;stop-opacity:1"
         offset="0" /><stop
         id="stop2222"
         style="stop-color:#555555;stop-opacity:1"
         offset="1" /></linearGradient><linearGradient
       x1="299.33881"
       y1="9.8939447"
       x2="299.33881"
       y2="519.69983"
       id="linearGradient3970"
       xlink:href="#linearGradient2218"
       gradientUnits="userSpaceOnUse"
       gradientTransform="translate(-102.3354,111.5471)" /><linearGradient
       id="linearGradient2218-5"><stop
         id="stop2220-6"
         style="stop-color:#999999;stop-opacity:1"
         offset="0" /><stop
         id="stop2222-3"
         style="stop-color:#555555;stop-opacity:1"
         offset="1" /></linearGradient><linearGradient
       x1="522.33539"
       y1="88.453316"
       x2="522.33539"
       y2="468.45331"
       id="linearGradient7484-2"
       xlink:href="#linearGradient1312-9"
       gradientUnits="userSpaceOnUse"
       gradientTransform="matrix(0.9999868,-1.3875445e-8,1.5541495e-8,0.9999816,-99.32689,108.71252)" /><linearGradient
       id="linearGradient1312-9"><stop
         id="stop1314-1"
         style="stop-color:#999999;stop-opacity:1"
         offset="0" /><stop
         id="stop1316-4"
         style="stop-color:#555555;stop-opacity:1"
         offset="1" /></linearGradient><filter
       x="-0.2202934"
       y="-0.26357874"
       width="1.4405868"
       height="1.5271575"
       color-interpolation-filters="sRGB"
       id="filter4048"><feGaussianBlur
         id="feGaussianBlur4050"
         stdDeviation="26.895205" /></filter><linearGradient
       x1="299.33881"
       y1="9.8939447"
       x2="299.33881"
       y2="519.69983"
       id="linearGradient4052"
       xlink:href="#linearGradient2218"
       gradientUnits="userSpaceOnUse"
       gradientTransform="translate(-102.3354,111.5471)" /><linearGradient
       x1="522.33539"
       y1="88.453316"
       x2="522.33539"
       y2="468.45331"
       id="linearGradient4054"
       xlink:href="#linearGradient1312"
       gradientUnits="userSpaceOnUse"
       gradientTransform="matrix(0.9999868,-1.3875445e-8,1.5541495e-8,0.9999816,-99.32689,108.71252)" /><linearGradient
       x1="522.33539"
       y1="88.453316"
       x2="522.33539"
       y2="468.45331"
       id="linearGradient4057"
       xlink:href="#linearGradient1312"
       gradientUnits="userSpaceOnUse"
       gradientTransform="matrix(0.9999868,-1.3875445e-8,1.5541495e-8,0.9999816,-99.32689,108.71252)" /><linearGradient
       x1="299.33881"
       y1="9.8939447"
       x2="299.33881"
       y2="519.69983"
       id="linearGradient4060"
       xlink:href="#linearGradient2218"
       gradientUnits="userSpaceOnUse"
       gradientTransform="translate(-102.3354,111.5471)" /></defs><path
     d="m 143.15625,326.34375 c -1.11596,-0.003 -1.94878,0.15779 -2.4375,0.5 -10.4255,7.3005 4.20425,183.4975 39.65625,189.75 17.7265,3.1255 51.10575,-4.677 58.40625,5.75 7.3005,10.427 23.99275,45.34225 41.71875,48.46875 17.49139,3.08405 37.98684,-11.09297 41.53125,-28.5 5.93782,1.23274 12.10266,1.87563 18.40625,1.875 49.7075,0.003 89.998,-40.29698 90,-90 0.005,-49.7105 -40.296,-90.002 -90,-90 -25.13906,-0.002 -47.85866,10.31994 -64.1875,26.9375 -42.40045,-31.58578 -117.34485,-64.74221 -133.09375,-64.78125 z"
     transform="matrix(2.4,0,0,2.4,-181.43596,-580.75306)"
     id="path1431-7"
     style="opacity:0.15;fill:#111111;fill-opacity:1;stroke:none;filter:url(#filter4048)" /><path
     d="m 213.5912,132.44612 c 20.852,-14.60101 342.028,133.42 329.526,204.326 -6.252,35.454 -43.781,92.808 -29.182,113.661 14.601,20.85205 68.83,76.10805 62.578,111.56205 -6.251,35.453 -47.955,64.654 -83.408,58.403 -35.452,-6.253 -68.83,-76.108 -83.431,-96.962 -14.601,-20.854 -81.333,-5.201 -116.786,-11.452 -70.904,-12.505 -100.148,-364.93705 -79.297,-379.53805 z"
     id="path1431"
     style="opacity:0.75;fill:url(#linearGradient4060);fill-opacity:1;stroke:#000000;stroke-width:20;stroke-linecap:round;stroke-linejoin:round;stroke-miterlimit:3.13260007" /><path
     d="m 792.9966,387.1652 c -0.004,99.406 -80.586,179.997 -180.001,179.992 -99.411,0.007 -179.995,-80.586 -179.994,-179.995 -0.002,-99.413 80.585,-180.004 180,-179.998 99.408,-0.004 180.004,80.58 179.995,180.001 z"
     id="path1439"
     style="opacity:0.75;fill:url(#linearGradient4057);fill-opacity:1;stroke:#000000;stroke-width:20;stroke-linecap:round;stroke-linejoin:round;stroke-miterlimit:3" /><path
     d="m 610,210 0,120"
     id="path1441"
     style="opacity:0.75;fill-opacity:1;stroke:#000000;stroke-width:20;stroke-linecap:round;stroke-linejoin:round;stroke-miterlimit:3"
     transform="rotate(0,610,389)" /></svg>

