<?xml version="1.0" encoding="UTF-8" standalone="no"?>
<!-- Created with Inkscape (http://www.inkscape.org/) -->
<svg
   xmlns:dc="http://purl.org/dc/elements/1.1/"
   xmlns:cc="http://creativecommons.org/ns#"
   xmlns:rdf="http://www.w3.org/1999/02/22-rdf-syntax-ns#"
   xmlns:svg="http://www.w3.org/2000/svg"
   xmlns="http://www.w3.org/2000/svg"
   xmlns:sodipodi="http://sodipodi.sourceforge.net/DTD/sodipodi-0.dtd"
   xmlns:inkscape="http://www.inkscape.org/namespaces/inkscape"
   width="744.09448819"
   height="1052.3622047"
   id="svg2"
   sodipodi:version="0.32"
   inkscape:version="0.46"
   sodipodi:docname="mini-vignette.svg"
   inkscape:output_extension="org.inkscape.output.svg.inkscape"
   inkscape:export-filename="C:\Users\Edward\Webs\csrf-magic-web\mini-vignette.png"
   inkscape:export-xdpi="90"
   inkscape:export-ydpi="90">
  <defs
     id="defs4">
    <inkscape:perspective
       sodipodi:type="inkscape:persp3d"
       inkscape:vp_x="0 : 526.18109 : 1"
       inkscape:vp_y="0 : 1000 : 0"
       inkscape:vp_z="744.09448 : 526.18109 : 1"
       inkscape:persp3d-origin="372.04724 : 350.78739 : 1"
       id="perspective10" />
  </defs>
  <sodipodi:namedview
     id="base"
     pagecolor="#ffffff"
     bordercolor="#666666"
     borderopacity="1.0"
     gridtolerance="10000"
     guidetolerance="10"
     objecttolerance="10"
     inkscape:pageopacity="0.0"
     inkscape:pageshadow="2"
     inkscape:zoom="1.4994021"
     inkscape:cx="384.27784"
     inkscape:cy="868.43299"
     inkscape:document-units="px"
     inkscape:current-layer="layer1"
     showgrid="false"
     inkscape:window-width="1280"
     inkscape:window-height="750"
     inkscape:window-x="-8"
     inkscape:window-y="-8" />
  <metadata
     id="metadata7">
    <rdf:RDF>
      <cc:Work
         rdf:about="">
        <dc:format>image/svg+xml</dc:format>
        <dc:type
           rdf:resource="http://purl.org/dc/dcmitype/StillImage" />
      </cc:Work>
    </rdf:RDF>
  </metadata>
  <g
     inkscape:label="Layer 1"
     inkscape:groupmode="layer"
     id="layer1">
    <path
       style="fill:#000000;fill-opacity:1;stroke:none;stroke-width:5.19999981;stroke-miterlimit:4;stroke-dasharray:none;stroke-opacity:1"
       id="path2407"
       d="M 342.75538,136.94099 C 343.6267,136.58966 344.49351,136.22739 345.35645,135.85486 C 349.78286,133.87021 354.36905,132.27157 359.0906,131.20645 C 360.6169,130.82856 362.1677,130.64142 363.7379,130.66904 C 365.31143,130.73788 366.85928,131.01694 368.40227,131.31272 C 369.95333,131.67428 371.49292,132.0776 373.04932,132.41666 C 374.7429,132.87436 376.45941,132.93133 378.1994,132.90343 C 380.19172,132.8265 382.15441,132.47179 384.08309,131.98565 C 381.26899,133.23146 389.96386,129.97072 387.05353,131.02591 C 372.45065,136.32044 377.78919,134.51043 380.93774,133.10159 C 382.93287,132.20698 384.88534,131.22362 386.79629,130.1619 C 388.57129,129.20374 390.27726,128.13409 391.93533,126.98752 C 392.89618,126.30403 392.42613,126.64904 393.34614,125.9534 L 402.93302,123.7745 C 402.01563,124.51674 402.48605,124.15177 401.52091,124.86835 C 399.84683,126.02593 398.1778,127.1932 396.36786,128.13541 C 394.4704,129.23189 392.53084,130.25517 390.53141,131.15475 C 385.69585,133.44231 380.62462,135.25208 375.45896,136.63244 C 373.48452,137.05906 371.47812,137.36115 369.45307,137.36218 C 367.67107,137.34145 365.91586,137.13254 364.18541,136.69009 C 362.63827,136.33524 361.10283,135.92808 359.54457,135.62343 C 358.03431,135.35345 356.50867,135.12884 354.96983,135.15666 C 353.43315,135.24125 351.91955,135.4964 350.42756,135.87608 C 349.63279,136.07145 348.83996,136.27035 348.05633,136.50752 C 347.79712,136.58597 347.02805,136.84766 347.28199,136.75351 C 354.74395,133.9866 358.61877,132.69652 355.04574,133.89231 C 354.22207,134.28803 353.38305,134.66306 352.52858,134.98459 L 342.75538,136.94099 z" />
    <path
       style="fill:#000000;fill-opacity:1;stroke:none;stroke-width:5.19999981;stroke-miterlimit:4;stroke-dasharray:none;stroke-opacity:1"
       id="path2417"
       d="M 320.20446,136.94099 C 319.33314,136.58966 318.46633,136.22739 317.60339,135.85486 C 313.17698,133.87021 308.59079,132.27157 303.86924,131.20645 C 302.34294,130.82856 300.79214,130.64142 299.22194,130.66904 C 297.64841,130.73788 296.10056,131.01694 294.55757,131.31272 C 293.00651,131.67428 291.46692,132.0776 289.91052,132.41666 C 288.21694,132.87436 286.50043,132.93133 284.76044,132.90343 C 282.76812,132.8265 280.80543,132.47179 278.87675,131.98565 C 281.69085,133.23146 272.99598,129.97072 275.90631,131.02591 C 290.50919,136.32044 285.17065,134.51043 282.0221,133.10159 C 280.02697,132.20698 278.0745,131.22362 276.16355,130.1619 C 274.38855,129.20374 272.68258,128.13409 271.02451,126.98752 C 270.06366,126.30403 270.53371,126.64904 269.6137,125.9534 L 260.02682,123.7745 C 260.94421,124.51674 260.47379,124.15177 261.43893,124.86835 C 263.11301,126.02593 264.78204,127.1932 266.59198,128.13541 C 268.48944,129.23189 270.429,130.25517 272.42843,131.15475 C 277.26399,133.44231 282.33522,135.25208 287.50088,136.63244 C 289.47532,137.05906 291.48172,137.36115 293.50677,137.36218 C 295.28877,137.34145 297.04398,137.13254 298.77443,136.69009 C 300.32157,136.33524 301.85701,135.92808 303.41527,135.62343 C 304.92553,135.35345 306.45117,135.12884 307.99001,135.15666 C 309.52669,135.24125 311.04029,135.4964 312.53228,135.87608 C 313.32705,136.07145 314.11988,136.27035 314.90351,136.50752 C 315.16272,136.58597 315.93179,136.84766 315.67785,136.75351 C 308.21589,133.9866 304.34107,132.69652 307.9141,133.89231 C 308.73777,134.28803 309.57679,134.66306 310.43126,134.98459 L 320.20446,136.94099 z" />
    <path
       style="fill:#000000;fill-opacity:1;stroke:none;stroke-width:5.19999981;stroke-miterlimit:4;stroke-dasharray:none;stroke-opacity:1"
       id="path2437"
       d="M 373.98219,140.38489 C 374.95135,140.04227 375.98024,139.92218 376.98168,139.70352 C 378.93037,139.25678 380.81072,138.56494 382.68881,137.88955 C 384.5928,137.20071 386.44219,136.37366 388.28653,135.54121 C 390.2674,134.61434 392.27005,133.73519 394.26681,132.84335 C 396.71567,131.77051 399.18806,130.75422 401.70593,129.85488 C 404.69919,128.7364 407.81782,128.16327 410.97809,127.79037 C 419.46778,126.79819 427.99301,126.41426 436.52682,126.15643 C 445.45702,125.92427 454.38943,125.79952 463.32211,125.71739 C 476.0779,125.74578 488.82507,125.36125 501.56477,124.75588 C 513.51216,124.16038 525.4328,123.16423 537.35591,122.21913 C 544.37533,121.66863 540.89534,121.95419 547.79599,121.36368 L 539.0818,123.53361 C 532.22703,124.10525 535.68126,123.82792 528.71903,124.36462 C 516.84946,125.29415 504.98102,126.25742 493.08741,126.83289 C 480.28719,127.41684 467.48105,127.76747 454.66667,127.80646 C 445.59602,127.94203 436.52468,128.07651 427.45733,128.36548 C 424.34415,128.47668 421.23147,128.58816 418.12088,128.75999 C 417.26931,128.80703 414.7192,129.00819 415.56699,128.91531 C 417.82054,128.66843 426.56571,127.93296 420.57772,128.43993 C 417.46475,128.75818 414.38145,129.22364 411.42302,130.29248 C 408.9122,131.14584 406.45911,132.14119 404.02784,133.19967 C 402.04418,134.08784 400.05899,134.97298 398.08625,135.8852 C 396.24259,136.76445 394.3638,137.57217 392.46297,138.31982 C 390.59455,138.99279 388.73836,139.71401 386.82391,140.24763 C 385.87144,140.49242 384.91615,140.70131 383.94482,140.84714 L 373.98219,140.38489 z" />
    <path
       style="fill:#000000;fill-opacity:1;stroke:none;stroke-width:5.19999981;stroke-miterlimit:4;stroke-dasharray:none;stroke-opacity:1"
       id="path2453"
       d="M 400.44622,141.48706 C 400.58467,141.45539 400.72601,141.44797 400.86734,141.44206 C 404.46813,140.95815 387.78326,142.76425 391.79437,142.22884 C 392.02467,142.19544 392.25357,142.15324 392.48414,142.12187 C 392.763,142.08684 393.03737,142.02047 393.30995,141.95313 C 393.61565,141.87993 393.91913,141.79854 394.22324,141.71898 C 394.54692,141.61766 394.87314,141.52464 395.19464,141.41648 C 395.53675,141.30591 395.87605,141.18593 396.211,141.05521 C 396.57099,140.92437 396.92087,140.76834 397.27446,140.62161 C 397.65557,140.46192 398.03556,140.29999 398.41196,140.12943 C 398.81564,139.95235 399.2171,139.77018 399.61876,139.58853 C 400.04816,139.3997 400.47929,139.21503 400.90684,139.02195 C 401.3584,138.81962 401.81319,138.62461 402.26717,138.42775 C 402.74778,138.2263 403.22539,138.01787 403.70711,137.81905 C 404.21451,137.60464 404.72106,137.38832 405.22771,137.17215 C 405.75967,136.94475 406.29716,136.73073 406.83658,136.52176 C 407.39791,136.3053 407.96466,136.10338 408.53071,135.89971 C 409.11266,135.68169 409.69536,135.46579 410.28044,135.2563 C 410.88908,135.03949 411.50086,134.83171 412.11666,134.63618 C 412.75302,134.43655 413.39289,134.24849 414.03545,134.06994 C 414.69597,133.88517 415.3609,133.71752 416.02765,133.55697 C 416.71725,133.39328 417.41298,133.25712 418.11012,133.13001 C 418.83797,132.99481 419.56963,132.88233 420.30162,132.77233 C 421.05873,132.65503 421.81859,132.55732 422.57841,132.45958 C 423.35242,132.36445 424.12758,132.27921 424.90363,132.20259 C 428.95255,131.81911 433.00654,131.48644 437.05792,131.13371 C 437.87453,131.07289 438.69137,131.01525 439.50826,130.95837 C 440.35276,130.89941 441.19752,130.84441 442.04232,130.78993 C 442.91465,130.73342 443.78721,130.68048 444.65981,130.62826 C 445.5571,130.57463 446.45453,130.52331 447.352,130.47281 C 448.28478,130.42759 449.21828,130.40072 450.15162,130.37053 C 451.1108,130.33464 452.07036,130.31443 453.02996,130.29417 C 454.00496,130.27361 454.97998,130.25389 455.955,130.23445 C 456.94475,130.21475 457.93452,130.19583 458.92429,130.17719 C 459.92627,130.16083 460.9281,130.14023 461.92984,130.11304 C 462.93671,130.09202 463.94287,130.0503 464.94892,130.0059 C 465.96198,129.96121 466.97511,129.91817 467.98827,129.87576 C 469.01425,129.83287 470.04029,129.79162 471.06636,129.75095 C 472.10198,129.7149 473.137,129.66581 474.1721,129.61748 C 475.21405,129.56886 476.25609,129.52202 477.29815,129.47584 C 478.35197,129.4292 479.40587,129.38429 480.45979,129.34001 C 481.52515,129.29529 482.59058,129.25222 483.65603,129.20974 C 484.73246,129.16688 485.80894,129.12557 486.88545,129.08483 C 487.96801,129.04786 489.04993,128.99519 490.13203,128.9469 C 491.22034,128.89838 492.30873,128.85155 493.39715,128.80537 C 494.49107,128.76297 495.58429,128.70503 496.67771,128.65151 C 497.77251,128.60196 498.86651,128.53698 499.96075,128.47655 C 501.0634,128.4179 502.1659,128.3576 503.26808,128.29074 C 504.3776,128.22338 505.48726,128.15821 506.59696,128.09392 C 507.71557,128.02828 508.83363,127.95344 509.95193,127.88282 C 511.07651,127.81678 512.20028,127.73886 513.32413,127.66171 C 514.45117,127.58436 515.57838,127.50958 516.70565,127.43579 C 517.65125,127.37396 518.59698,127.31401 519.54273,127.2546 L 509.94041,129.6242 C 508.99464,129.68449 508.04891,129.74534 507.1033,129.80808 C 505.97598,129.88295 504.84874,129.95905 503.72159,130.03631 C 502.59736,130.11242 501.47274,130.18221 500.34817,130.25289 C 499.22929,130.3241 498.11049,130.39667 496.99109,130.45939 C 495.88124,130.52462 494.77147,130.5912 493.66166,130.65715 C 492.55869,130.72072 491.45534,130.77721 490.3523,130.83939 C 489.25762,130.89968 488.16283,130.95751 487.06767,131.00833 C 485.97379,131.06161 484.87981,131.11225 483.78553,131.15642 C 482.69694,131.20338 481.60838,131.25109 480.51986,131.29981 C 479.43727,131.3478 478.35458,131.39305 477.27161,131.43175 C 476.19491,131.47321 475.11823,131.51525 474.04162,131.55888 C 472.97598,131.60212 471.91036,131.64597 470.84481,131.6915 C 469.79068,131.7366 468.73659,131.78234 467.68257,131.82982 C 466.64026,131.87683 465.598,131.92475 464.55574,131.97295 C 463.52005,132.01984 462.48409,132.05988 461.44815,132.1008 C 460.42184,132.14227 459.39555,132.18435 458.36934,132.22804 C 457.3558,132.27121 456.34232,132.31563 455.32875,132.35781 C 454.32121,132.39709 453.31334,132.4258 452.30531,132.44919 C 451.30284,132.47222 450.30021,132.48748 449.29767,132.50775 C 448.30752,132.52685 447.31738,132.54623 446.32725,132.56644 C 445.35192,132.5864 444.37658,132.60642 443.40131,132.62886 C 442.44196,132.65204 441.48285,132.68275 440.52381,132.71631 C 439.5907,132.74905 438.65758,132.78389 437.72563,132.84191 C 436.82782,132.89369 435.93006,132.9463 435.03245,133.00144 C 434.15931,133.05525 433.28625,133.11048 432.41336,133.16829 C 431.56801,133.22441 430.72275,133.28179 429.87772,133.34256 C 429.06075,133.40134 428.24376,133.46019 427.42759,133.52936 C 444.18072,132.06366 438.47485,132.55566 434.80553,132.8872 C 434.03088,132.95849 433.25628,133.02984 432.48361,133.12074 C 431.72452,133.20445 430.96674,133.30146 430.21034,133.40655 C 429.48084,133.51178 428.75074,133.61434 428.02384,133.73642 C 427.32997,133.8545 426.63629,133.97316 425.94685,134.11539 C 425.28071,134.25714 424.61721,134.41179 423.9592,134.58763 C 423.31827,134.75629 422.67797,134.92723 422.04377,135.12001 C 421.42953,135.30283 420.81659,135.48982 420.21161,135.70177 C 419.62672,135.90237 419.04309,136.10688 418.46502,136.32649 C 417.9045,136.54173 417.33828,136.74111 416.77308,136.94361 C 416.23533,137.14146 415.69913,137.34367 415.16837,137.5597 C 414.65989,137.76759 414.15667,137.98748 413.6503,138.20037 C 413.17348,138.40912 412.68862,138.59902 412.21354,138.81185 C 411.75877,138.99857 411.3098,139.19831 410.85643,139.38828 C 410.42654,139.57539 410.00367,139.77816 409.57056,139.95779 C 409.16646,140.13063 408.76524,140.31048 408.36692,140.49622 C 407.98668,140.6609 407.614,140.84224 407.23157,141.00185 C 406.87831,141.15707 406.5216,141.30419 406.16966,141.4624 C 405.83097,141.59822 405.4953,141.74121 405.15343,141.86906 C 404.83078,141.98245 404.51135,142.10475 404.18312,142.20173 C 403.88331,142.30944 403.57794,142.4033 403.26983,142.48387 C 402.99443,142.55826 402.71872,142.63091 402.4457,142.7139 C 402.21852,142.77121 401.9868,142.81096 401.75603,142.85056 C 398.27759,143.52154 394.70112,143.79629 391.16836,143.83393 C 391.02715,143.84546 390.88527,143.85957 390.74403,143.83916 L 400.44622,141.48706 z" />
    <path
       d="M 289.79599,140.38489 C 288.82683,140.04227 287.79794,139.92218 286.7965,139.70352 C 284.84781,139.25678 282.96746,138.56494 281.08937,137.88955 C 279.18538,137.20071 277.33599,136.37366 275.49165,135.54121 C 273.51078,134.61434 271.50813,133.73519 269.51137,132.84335 C 267.06251,131.77051 264.59012,130.75422 262.07225,129.85488 C 259.07899,128.7364 255.96036,128.16327 252.80009,127.79037 C 244.3104,126.79819 235.78517,126.41426 227.25136,126.15643 C 218.32116,125.92427 209.38875,125.79952 200.45607,125.71739 C 187.70028,125.74578 174.95311,125.36125 162.21341,124.75588 C 150.26602,124.16038 138.34538,123.16423 126.42227,122.21913 C 119.40285,121.66863 122.88284,121.95419 115.98219,121.36368 L 124.69638,123.53361 C 131.55115,124.10525 128.09692,123.82792 135.05915,124.36462 C 146.92872,125.29415 158.79716,126.25742 170.69077,126.83289 C 183.49099,127.41684 196.29713,127.76747 209.11151,127.80646 C 218.18216,127.94203 227.2535,128.07651 236.32085,128.36548 C 239.43403,128.47668 242.54671,128.58816 245.6573,128.75999 C 246.50887,128.80703 249.05898,129.00819 248.21119,128.91531 C 245.95764,128.66843 237.21247,127.93296 243.20046,128.43993 C 246.31343,128.75818 249.39673,129.22364 252.35516,130.29248 C 254.86598,131.14584 257.31907,132.14119 259.75034,133.19967 C 261.734,134.08784 263.71919,134.97298 265.69193,135.8852 C 267.53559,136.76445 269.41438,137.57217 271.31521,138.31982 C 273.18363,138.99279 275.03982,139.71401 276.95427,140.24763 C 277.90674,140.49242 278.86203,140.70131 279.83336,140.84714 L 289.79599,140.38489 z"
       id="path2455"
       style="fill:#000000;fill-opacity:1;stroke:none;stroke-width:5.19999981;stroke-miterlimit:4;stroke-dasharray:none;stroke-opacity:1" />
    <path
       d="M 263.84054,141.48706 C 263.70209,141.45539 263.56075,141.44797 263.41942,141.44206 C 259.81863,140.95815 276.5035,142.76425 272.49239,142.22884 C 272.26209,142.19544 272.03319,142.15324 271.80262,142.12187 C 271.52376,142.08684 271.24939,142.02047 270.97681,141.95313 C 270.67111,141.87993 270.36763,141.79854 270.06352,141.71898 C 269.73984,141.61766 269.41362,141.52464 269.09212,141.41648 C 268.75001,141.30591 268.41071,141.18593 268.07576,141.05521 C 267.71577,140.92437 267.36589,140.76834 267.0123,140.62161 C 266.63119,140.46192 266.2512,140.29999 265.8748,140.12943 C 265.47112,139.95235 265.06966,139.77018 264.668,139.58853 C 264.2386,139.3997 263.80747,139.21503 263.37992,139.02195 C 262.92836,138.81962 262.47357,138.62461 262.01959,138.42775 C 261.53898,138.2263 261.06137,138.01787 260.57965,137.81905 C 260.07225,137.60464 259.5657,137.38832 259.05905,137.17215 C 258.52709,136.94475 257.9896,136.73073 257.45018,136.52176 C 256.88885,136.3053 256.3221,136.10338 255.75605,135.89971 C 255.1741,135.68169 254.5914,135.46579 254.00632,135.2563 C 253.39768,135.03949 252.7859,134.83171 252.1701,134.63618 C 251.53374,134.43655 250.89387,134.24849 250.25131,134.06994 C 249.59079,133.88517 248.92586,133.71752 248.25911,133.55697 C 247.56951,133.39328 246.87378,133.25712 246.17664,133.13001 C 245.44879,132.99481 244.71713,132.88233 243.98514,132.77233 C 243.22803,132.65503 242.46817,132.55732 241.70835,132.45958 C 240.93434,132.36445 240.15918,132.27921 239.38313,132.20259 C 235.33421,131.81911 231.28022,131.48644 227.22884,131.13371 C 226.41223,131.07289 225.59539,131.01525 224.7785,130.95837 C 223.934,130.89941 223.08924,130.84441 222.24444,130.78993 C 221.37211,130.73342 220.49955,130.68048 219.62695,130.62826 C 218.72966,130.57463 217.83223,130.52331 216.93476,130.47281 C 216.00198,130.42759 215.06848,130.40072 214.13514,130.37053 C 213.17596,130.33464 212.2164,130.31443 211.2568,130.29417 C 210.2818,130.27361 209.30678,130.25389 208.33176,130.23445 C 207.34201,130.21475 206.35224,130.19583 205.36247,130.17719 C 204.36049,130.16083 203.35866,130.14023 202.35692,130.11304 C 201.35005,130.09202 200.34389,130.0503 199.33784,130.0059 C 198.32478,129.96121 197.31165,129.91817 196.29849,129.87576 C 195.27251,129.83287 194.24647,129.79162 193.2204,129.75095 C 192.18478,129.7149 191.14976,129.66581 190.11466,129.61748 C 189.07271,129.56886 188.03067,129.52202 186.98861,129.47584 C 185.93479,129.4292 184.88089,129.38429 183.82697,129.34001 C 182.76161,129.29529 181.69618,129.25222 180.63073,129.20974 C 179.5543,129.16688 178.47782,129.12557 177.40131,129.08483 C 176.31875,129.04786 175.23683,128.99519 174.15473,128.9469 C 173.06642,128.89838 171.97803,128.85155 170.88961,128.80537 C 169.79569,128.76297 168.70247,128.70503 167.60905,128.65151 C 166.51425,128.60196 165.42025,128.53698 164.32601,128.47655 C 163.22336,128.4179 162.12086,128.3576 161.01868,128.29074 C 159.90916,128.22338 158.7995,128.15821 157.6898,128.09392 C 156.57119,128.02828 155.45313,127.95344 154.33483,127.88282 C 153.21025,127.81678 152.08648,127.73886 150.96263,127.66171 C 149.83559,127.58436 148.70838,127.50958 147.58111,127.43579 C 146.63551,127.37396 145.68978,127.31401 144.74403,127.2546 L 154.34635,129.6242 C 155.29212,129.68449 156.23785,129.74534 157.18346,129.80808 C 158.31078,129.88295 159.43802,129.95905 160.56517,130.03631 C 161.6894,130.11242 162.81402,130.18221 163.93859,130.25289 C 165.05747,130.3241 166.17627,130.39667 167.29567,130.45939 C 168.40552,130.52462 169.51529,130.5912 170.6251,130.65715 C 171.72807,130.72072 172.83142,130.77721 173.93446,130.83939 C 175.02914,130.89968 176.12393,130.95751 177.21909,131.00833 C 178.31297,131.06161 179.40695,131.11225 180.50123,131.15642 C 181.58982,131.20338 182.67838,131.25109 183.7669,131.29981 C 184.84949,131.3478 185.93218,131.39305 187.01515,131.43175 C 188.09185,131.47321 189.16853,131.51525 190.24514,131.55888 C 191.31078,131.60212 192.3764,131.64597 193.44195,131.6915 C 194.49608,131.7366 195.55017,131.78234 196.60419,131.82982 C 197.6465,131.87683 198.68876,131.92475 199.73102,131.97295 C 200.76671,132.01984 201.80267,132.05988 202.83861,132.1008 C 203.86492,132.14227 204.89121,132.18435 205.91742,132.22804 C 206.93096,132.27121 207.94444,132.31563 208.95801,132.35781 C 209.96555,132.39709 210.97342,132.4258 211.98145,132.44919 C 212.98392,132.47222 213.98655,132.48748 214.98909,132.50775 C 215.97924,132.52685 216.96938,132.54623 217.95951,132.56644 C 218.93484,132.5864 219.91018,132.60642 220.88545,132.62886 C 221.8448,132.65204 222.80391,132.68275 223.76295,132.71631 C 224.69606,132.74905 225.62918,132.78389 226.56113,132.84191 C 227.45894,132.89369 228.3567,132.9463 229.25431,133.00144 C 230.12745,133.05525 231.00051,133.11048 231.8734,133.16829 C 232.71875,133.22441 233.56401,133.28179 234.40904,133.34256 C 235.22601,133.40134 236.043,133.46019 236.85917,133.52936 C 220.10604,132.06366 225.81191,132.55566 229.48123,132.8872 C 230.25588,132.95849 231.03048,133.02984 231.80315,133.12074 C 232.56224,133.20445 233.32002,133.30146 234.07642,133.40655 C 234.80592,133.51178 235.53602,133.61434 236.26292,133.73642 C 236.95679,133.8545 237.65047,133.97316 238.33991,134.11539 C 239.00605,134.25714 239.66955,134.41179 240.32756,134.58763 C 240.96849,134.75629 241.60879,134.92723 242.24299,135.12001 C 242.85723,135.30283 243.47017,135.48982 244.07515,135.70177 C 244.66004,135.90237 245.24367,136.10688 245.82174,136.32649 C 246.38226,136.54173 246.94848,136.74111 247.51368,136.94361 C 248.05143,137.14146 248.58763,137.34367 249.11839,137.5597 C 249.62687,137.76759 250.13009,137.98748 250.63646,138.20037 C 251.11328,138.40912 251.59814,138.59902 252.07322,138.81185 C 252.52799,138.99857 252.97696,139.19831 253.43033,139.38828 C 253.86022,139.57539 254.28309,139.77816 254.7162,139.95779 C 255.1203,140.13063 255.52152,140.31048 255.91984,140.49622 C 256.30008,140.6609 256.67276,140.84224 257.05519,141.00185 C 257.40845,141.15707 257.76516,141.30419 258.1171,141.4624 C 258.45579,141.59822 258.79146,141.74121 259.13333,141.86906 C 259.45598,141.98245 259.77541,142.10475 260.10364,142.20173 C 260.40345,142.30944 260.70882,142.4033 261.01693,142.48387 C 261.29233,142.55826 261.56804,142.63091 261.84106,142.7139 C 262.06824,142.77121 262.29996,142.81096 262.53073,142.85056 C 266.00917,143.52154 269.58564,143.79629 273.1184,143.83393 C 273.25961,143.84546 273.40149,143.85957 273.54273,143.83916 L 263.84054,141.48706 z"
       id="path2457"
       style="fill:#000000;fill-opacity:1;stroke:none;stroke-width:5.19999981;stroke-miterlimit:4;stroke-dasharray:none;stroke-opacity:1" />
  </g>
</svg>
