\relax 
\citation{Hubel62,Hubel74}
\@writefile{toc}{\contentsline {chapter}{\numberline {1}Small Cu islands adsorbed on Ag(100)}{1}{chapter.1}}
\@writefile{lof}{\addvspace {10\p@ }}
\@writefile{lot}{\addvspace {10\p@ }}
\newlabel{chapter:Ag.Cu.Introduction}{{1}{1}{Small Cu islands adsorbed on Ag(100)\relax }{chapter.1}{}}
\@writefile{toc}{\contentsline {section}{\numberline {1.1}Introduction}{1}{section.1.1}}
\newlabel{sec:Ag.Cu.Introduction}{{1.1}{1}{Introduction\relax }{section.1.1}{}}
\citation{Daugman80,Daugman85}
\@writefile{lof}{\contentsline {figure}{\numberline {1.1}{\ignorespaces The effect of orientation contrast in non-CRF inhibition: the plot shows the response of a neuron to a stimulus composed of a single bar of optimal orientation in the CRF (central circle) and a grating of varying orientation outside the CRF. The inhibition by the surrounding grating is strongest when its orientation coincides with the optimal stimulus. (Courtesy of C. Blakemore and Exp. Brain Res.).}}{2}{figure.1.1}}
\newlabel{fig:Blakemore}{{1.1}{2}{The effect of orientation contrast in non-CRF inhibition: the plot shows the response of a neuron to a stimulus composed of a single bar of optimal orientation in the CRF (central circle) and a grating of varying orientation outside the CRF. The inhibition by the surrounding grating is strongest when its orientation coincides with the optimal stimulus. (Courtesy of C. Blakemore and Exp. Brain Res.)}{figure.1.1}{}}
\@writefile{toc}{\contentsline {section}{\numberline {1.2}Experiments}{2}{section.1.2}}
\newlabel{sec:Ag.Cu.Introduction.Experiments}{{1.2}{2}{Experiments\relax }{section.1.2}{}}
\@writefile{lot}{\contentsline {table}{\numberline {1.1}{\ignorespaces Operator parameters, errors, and performances for the images presented in Fig.\nobreakspace  {}\ref {Fig:Images}.}}{3}{table.1.1}}
\newlabel{tab:performance}{{1.1}{3}{Operator parameters, errors, and performances for the images presented in Fig.~\protect \ref {Fig:Images}}{table.1.1}{}}
\@setckpt{./Ag.Cu-System/Introduction/Ag.Cu.Introduction}{
\setcounter{page}{4}
\setcounter{equation}{0}
\setcounter{enumi}{0}
\setcounter{enumii}{0}
\setcounter{enumiii}{0}
\setcounter{enumiv}{0}
\setcounter{footnote}{0}
\setcounter{mpfootnote}{0}
\setcounter{part}{0}
\setcounter{chapter}{1}
\setcounter{section}{2}
\setcounter{subsection}{0}
\setcounter{subsubsection}{0}
\setcounter{paragraph}{0}
\setcounter{subparagraph}{0}
\setcounter{figure}{1}
\setcounter{table}{1}
\setcounter{parentequation}{0}
\setcounter{subfigure}{0}
\setcounter{lofdepth}{1}
\setcounter{subtable}{0}
\setcounter{lotdepth}{1}
\setcounter{float@type}{4}
\setcounter{r@tfl@t}{0}
\setcounter{Item}{0}
\setcounter{Hfootnote}{0}
\setcounter{section@level}{1}
}
