\relax 
\citation{Hubel62,Hubel74}
\@writefile{toc}{\contentsline {chapter}{\numberline {1}Contour Detection Based on non-CRF Inhibition}{3}}
\@writefile{lof}{\addvspace {10\p@ }}
\@writefile{lot}{\addvspace {10\p@ }}
\newlabel{chapter:contour_detection}{{1}{3}}
\@writefile{toc}{\contentsline {section}{\numberline {1.1}Introduction}{3}}
\newlabel{sec:biological_aspects}{{1.1}{3}}
\citation{Daugman80,Daugman85}
\@writefile{lof}{\contentsline {figure}{\numberline {1.1}{\ignorespaces }}{4}}
\newlabel{fig:Blakemore}{{1.1}{4}}
\@writefile{lot}{\contentsline {table}{\numberline {1.1}{\ignorespaces }}{5}}
\newlabel{tab:performance}{{1.1}{5}}
\@setckpt{./Ag.Cu-System/Introduction/Ag_Cu_Introduction}{
\setcounter{page}{6}
\setcounter{equation}{0}
\setcounter{enumi}{0}
\setcounter{enumii}{0}
\setcounter{enumiii}{0}
\setcounter{enumiv}{0}
\setcounter{footnote}{0}
\setcounter{mpfootnote}{0}
\setcounter{part}{0}
\setcounter{chapter}{1}
\setcounter{section}{1}
\setcounter{subsection}{0}
\setcounter{subsubsection}{0}
\setcounter{paragraph}{0}
\setcounter{subparagraph}{0}
\setcounter{figure}{1}
\setcounter{table}{1}
\setcounter{parentequation}{0}
\setcounter{subfigure}{0}
\setcounter{lofdepth}{1}
\setcounter{subtable}{0}
\setcounter{lotdepth}{1}
\setcounter{float@type}{4}
\setcounter{r@tfl@t}{0}
}
