\relax 
\citation{Adamson}
\citation{Schroedinger}
\citation{Born}
\@writefile{toc}{\contentsline {section}{\numberline {0.1}Quantum mechanics\let \reserved@d = *\def \par }{2}}
\@writefile{toc}{\contentsline {subsection}{\numberline {0.1.1}The Schrödinger equation; Born interpretation}{2}}
\newlabel{schroedinger-time}{{0.1.1}{2}}
\citation{Pauli}
\@writefile{toc}{\contentsline {subsection}{\numberline {0.1.2}Wavefunction properties}{3}}
\newlabel{normalized}{{0.1.2}{3}}
\newlabel{orthogonal}{{0.1.2}{3}}
\newlabel{Kronnecker}{{0.1.2}{3}}
\newlabel{schroedinger-time-independent}{{0.1.2}{3}}
\@writefile{toc}{\contentsline {subsection}{\numberline {0.1.3}The expectation value}{3}}
\newlabel{equation1}{{0.1.3}{3}}
\newlabel{expecting-value}{{0.1.3}{4}}
\@writefile{toc}{\contentsline {subsection}{\numberline {0.1.4}The Hamiltonian operator}{4}}
\citation{Born-Oppenheimer}
\@writefile{toc}{\contentsline {subsection}{\numberline {0.1.5}Born-Oppenheimer approximation}{5}}
\newlabel{Hamiltonian-simplyfied}{{0.1.5}{6}}
\@writefile{toc}{\contentsline {subsection}{\numberline {0.1.6}The Variation Method}{6}}
\citation{Computational-Chemistry}
\citation{Slater-Orbitals}
\citation{Gaussian-Orbitals}
\@writefile{toc}{\contentsline {subsection}{\numberline {0.1.7}Molecular wavefunction, atomic orbitals and basis sets}{7}}
\@writefile{toc}{\contentsline {subsubsection}{Basis sets\let \reserved@d = *\def \par }{7}}
\citation{Pople-basis-sets1, Pople-basis-sets2, Pople-basis-sets3, Pople-basis-sets4}
\@writefile{toc}{\contentsline {paragraph}{STOs}{8}}
\@writefile{toc}{\contentsline {paragraph}{GTOs}{8}}
\citation{Hartree1, Hartree2, Hartree3}
\citation{Fock}
\citation{Slater1, Slater2}
\@writefile{toc}{\contentsline {subsection}{\numberline {0.1.8}The Hartree approximation, Hartree-Fock Theory, Slater Determinant}{9}}
\@writefile{toc}{\contentsline {subsubsection}{Hartree-Fock equations}{9}}
\citation{Loewdin}
\citation{Parr-Yang}
\citation{Parr-Yang}
\@writefile{toc}{\contentsline {subsubsection}{Post-HF methods}{12}}
\@writefile{toc}{\contentsline {section}{\numberline {0.2}Density Functional Theory\let \reserved@d = *\def \par }{12}}
\@writefile{toc}{\contentsline {subsection}{\numberline {0.2.1}The electron density}{12}}
\newlabel{electron-density}{{0.2.1}{12}}
\citation{HK1}
\citation{Kohn-Rev.Mod.Phys.-1999}
\citation{Dreizler}
\citation{HK1}
\citation{Computational-Chemistry}
\@writefile{toc}{\contentsline {subsection}{\numberline {0.2.2}The first Hohenberg-Kohn theorem\let \reserved@d = *\def \par }{13}}
\@writefile{toc}{\contentsline {subsection}{\numberline {0.2.3}The second Hohenberg-Kohn theorem\let \reserved@d = *\def \par }{13}}
\citation{Thomas}
\citation{Fermi1, Fermi2, Fermi3}
\citation{Block}
\citation{Dirac}
\citation{Kohn-Sham}
\@writefile{toc}{\contentsline {subsection}{\numberline {0.2.4}The functionals\let \reserved@d = *\def \par }{14}}
\@writefile{toc}{\contentsline {subsubsection}{Thomas-Fermi-Dirac functionals}{14}}
\@writefile{toc}{\contentsline {subsubsection}{Kohn-Sham Theory}{14}}
\newlabel{DFT-energy}{{0.2.4}{15}}
\citation{Kohn-JPhysChem-1996}
\citation{Kohn-Rev.Mod.Phys.-1999}
\citation{Kohn-Rev.Mod.Phys.-1999}
\@writefile{toc}{\contentsline {subsubsection}{Local Density Approximation (LDA)}{16}}
\newlabel{LDA}{{0.2.4}{16}}
\@writefile{toc}{\contentsline {subsection}{\numberline {0.2.5}The method of choice}{17}}
\@setckpt{./General.Theory/DFT/DFT.Introduction}{
\setcounter{page}{18}
\setcounter{equation}{10}
\setcounter{enumi}{0}
\setcounter{enumii}{0}
\setcounter{enumiii}{0}
\setcounter{enumiv}{0}
\setcounter{footnote}{1}
\setcounter{mpfootnote}{0}
\setcounter{part}{0}
\setcounter{chapter}{0}
\setcounter{section}{2}
\setcounter{subsection}{5}
\setcounter{subsubsection}{0}
\setcounter{paragraph}{0}
\setcounter{subparagraph}{0}
\setcounter{figure}{0}
\setcounter{table}{0}
\setcounter{parentequation}{0}
\setcounter{subfigure}{0}
\setcounter{lofdepth}{1}
\setcounter{subtable}{0}
\setcounter{lotdepth}{1}
\setcounter{float@type}{4}
\setcounter{r@tfl@t}{0}
}
