"stop_id","stop_name","stop_lat","stop_lon"
"11_LINCOLN","Lincoln & 11th",38.850677,-97.615089
"7_WALNUT","7th & Walnut (Trans. Blue, Yellow, Red)",38.837919,-97.610709
"8_IRON","122 S. 8th (Church)",38.839641,-97.611144
"9_HAMILTON","N. 9th & Hamilton",38.859168,-97.612436
"9_INEZ","N. 9th & Inez",38.861829,-97.612407
"BAYARDS","Bayard's",38.878627,-97.61238
"BELMONT_KEY","Belmont & Key (Fire Station)",38.792451,-97.607171
"BEST_WESTERN","Best Western",38.870955,-97.612227
"BICENTER","BiCenter (Before Circle Drive)",38.835312,-97.599632
"BILL_BURKE","Bill Burke Park Entrance",38.827121,-97.589654
"BOSSELMAN","Bosselman Travel Center",38.873929,-97.610993
"BROADWAY_ASH","Broadway & Ash",38.842851,-97.624747
"BROADWAY_CRAWFORD","La Hacienda",38.828394,-97.624899
"BROADWAY_NORTH","Broadway & North",38.848883,-97.622532
"BROADWAY_SMITH","Broadway & Smith",38.811544,-97.617793
"BROADWAY_SOUTH","321 S. Broadway (Ace Hardware)",38.83494,-97.624826
"BROADWAY_WALNUT","Walnut & 161 S. Broadway",38.838141,-97.624756
"CENTRAL_HS","Central High School Crosswalk",38.827113,-97.602952
"CHURCH_OF_CHRIST","Salina Church of Christ",38.867769,-97.612296
"CLAFLIN_HIGHLAND","Claflin & Highland",38.814409,-97.611729
"COLLEGE_PRESCOTT","528 S. College & Prescott",38.830283,-97.620043
"COLLEGE_SPRUCE","Spruce & 302 S. College",38.835755,-97.619995
"COLLEGE_UNIVERSITY","134 S. College & University",38.83924,-97.61992
"CRAWFORD_10","W. Crawford & 679 S. 10th",38.827096,-97.614648
"CRAWFORD_3","Crawford & S. 3rd",38.827128,-97.606104
"CRAWFORD_ASPEN","164 Aspen & E. Crawford",38.827128,-97.578102
"CRAWFORD_DUVALL","1412 W. Crawford & Duvall",38.827127,-97.627095
"CRAWFORD_FAIRDALE","Fairdale & E. Crawford",38.82716,-97.572879
"CRAWFORD_OHIO","905 E. Crawford (Perry Liquor)",38.827105,-97.595662
"CRAWFORD_PHILLIPS","W. Crawford & Sinclair",38.827174,-97.61924
"CRAWFORD_ROACH","Roach & 737 E. Crawford",38.82711,-97.599003
"DIAMOND","125 E. Diamond",38.877954,-97.610473
"ELMHURST_WESTBEND","800 Elmhurst (Crossroads)",38.830072,-97.598441
"ELM_7","Elm & 7th (Fire Station)",38.845139,-97.610731
"ELM_FRONT","617 E. Elm (Comcare)",38.845106,-97.603049
"ELM_PENN","Elm & N. Penn",38.845095,-97.599312
"FAITH","Faith (Trans. Blue, Red)",38.826433,-97.593319
"GOLD","Gold Road",38.879458,-97.610511
"GOVT_CENTER","City Building on Ash",38.843036,-97.611787
"HAGEMAN_LENA","502 Lena & Hageman",38.808112,-97.617845
"HAGEMAN_VENUS","Hageman & Venus (Park)",38.804108,-97.617863
"HAZ_WASTE","311 E. Elm (Hazardous Waste)",38.845139,-97.606605
"HOLIDOME","Ramada Inn",38.827071,-97.631963
"IRON_11","Iron (Phillips Park)",38.840527,-97.616041
"KIRWIN_APTS","Kirwin (Saline Apartments)",38.815273,-97.592618
"KOHLS","Kohls",38.792543,-97.614974
"KRAFT_MANOR","Kraft Manor",38.811264,-97.612908
"KSU_SALINA","K-State Salina",38.798313,-97.634656
"MAGNOLIA_BELMONT","Magnolia & Belmont",38.798025,-97.6037
"MAGNOLIA_CROSSWALK","Magnolia Crosswalk",38.798062,-97.600055
"MALL_SOUTH","Central Mall (JCPenney)",38.798848,-97.609878
"MALL_WEST","Central Mall",38.801357,-97.610929
"MARKET_APTS","2713 Market Place",38.789859,-97.612458
"MARKET_SAMS","Sam's",38.786305,-97.611331
"MCADAMS_MANCHESTER","McAdams & Manchester (Church)",38.82331,-97.593366
"MLK_DAYCARE","MLK Daycare",38.860062,-97.609062
"NORTH_13","North & 13th",38.848883,-97.617463
"OAKDALE","Oakdale Park (North Entrance)",38.836348,-97.602941
"OCCK","OCCK Transportation Center",38.846397,-97.609424
"OHIO_ALBERT","Albert & Ohio",38.808948,-97.594573
"OHIO_BELMONT_N","Ohio & Wayne",38.805186,-97.594246
"OHIO_BELMONT_S","2130 S. Ohio (Bennington State Bank)",38.804342,-97.594259
"OHIO_CHURCH","Ohio & Magnolia",38.798171,-97.594667
"OHIO_CLOUD","Cloud & Ohio",38.812476,-97.594546
"OHIO_ELLSWORTH","Ohio Crosswalk & Ellsworth",38.817492,-97.594509
"OHIO_ELMHURST","Ohio & Elmhurst",38.82998,-97.594407
"OHIO_GREELEY","Ohio & 1101 Greeley",38.834301,-97.594373
"OHIO_GYPSUM","Ohio & 1100 Gypsum",38.838446,-97.594036
"OHIO_IRON","Ohio & 1101 E. Iron",38.84099,-97.593972
"OHIO_LAKEWOOD","N. Ohio Crosswalk",38.84427,-97.593943
"OHIO_MAGNOLIA","Ohio & Magnolia",38.798171,-97.594667
"OHIO_NOTTINGHAM","Ohio & Nottingham",38.801214,-97.594519
"OHIO_NOTTINGHAM_S","Ohio Crosswalk & 2194 Nottingham",38.801214,-97.594519
"OHIO_PRESCOTT","Prescott & 660 S. Ohio",38.827999,-97.594425
"OHIO_REPUBLIC","Republic & Ohio",38.819816,-97.59449
"PETCO","PETCO (Mid-State Plaza)",38.795186,-97.615124
"PLANET_BELMONT","Goodwill",38.792008,-97.615054
"PLANET_OTTO","9th & Otto",38.804939,-97.613177
"PRESCOTT_3","Prescott & 600 S. 3rd",38.830264,-97.606026
"PRESCOTT_ELMORE","Prescott & Elmore",38.828007,-97.600922
"PRES_MANOR","Presbyterian Manor",38.827146,-97.564178
"REPUBLIC_CHEROKEE","Republic & Cherokee",38.81995,-97.631065
"REPUBLIC_OSAGE","1319 W. Republic & Osage",38.819883,-97.62581
"SAL_ARMY","1137 N. Santa Fe (Salvation Army)",38.859285,-97.609075
"SANTA_ASH","Ash & Santa Fe",38.842825,-97.609459
"SANTA_BOND","Bond & 763 S. Santa Fe",38.824697,-97.609593
"SANTA_CRAWFORD","Santa Fe & Crawford",38.827101,-97.609574
"SANTA_CRAWFORD_Y","Crawford & 603 S. Santa Fe",38.827101,-97.609574
"SANTA_ELLSWORTH","1307 S. Santa Fe & Ellsworth",38.816974,-97.609652
"SANTA_IRON","Iron & 101 N. Santa Fe",38.840486,-97.609471
"SANTA_LINCOLN","Santa Fe/Lincoln",38.849654,-97.6094
"SANTA_MULBERRY","Mulberry & 256 S. Santa Fe",38.835905,-97.609502
"SANTA_PRESCOTT","Prescott & 543 S. Santa Fe",38.830248,-97.60955
"SANTA_REPUBLIC","Republic & 957 S. Santa Fe",38.819833,-97.609631
"SANTA_WOODLAND","Woodland & N. Santa Fe",38.854569,-97.609068
"SATURN_TULANE","405 Saturn & Tulane",38.801685,-97.615103
"SCHILLING_CENTENNIAL","Schilling & Centennial",38.783581,-97.632446
"SCHILLING_VIRGINIA","Schilling & Virginia",38.78358,-97.619706
"SENIOR_CENTER","245 N. 9th (Senior Center)",38.844688,-97.613729
"SOUTHGATE","Dillons Southgate",38.808447,-97.595732
"SOUTH_HS","South High School",38.798062,-97.600055
"SRHC","Salina Regional Health Center",38.832771,-97.609524
"SUNSET","Dillons at Sunset Plaza (Trans. Blue, Yellow)",38.827188,-97.6236
"SUPER_DILLONS","Super Dillons",38.799751,-97.614609
"TACO_BUENO","Taco Bueno",38.781621,-97.613858
"THOMAS","Thomas Park (North End)",38.86733,-97.612334
"TUSCONS","Tuscon's",38.789207,-97.613681
"VOTECH","Salina Area Technical School",38.793689,-97.636667
"WALMART","Wal-Mart (Trans. Red, Yellow)",38.784482,-97.614309
"WALNUT_4","Walnut & 4th",38.838162,-97.60734
"WENDYS","Wendy's",38.782692,-97.613676
"WESTCHESTER","901 Westchester (SRS Office)",38.830763,-97.596612
"WOODLAND_10","Woodland & N. 10th",38.854598,-97.613622
"YMCA","YMCA",38.831033,-97.601431
