Konvertovanie .daa do .iso.:. poweriso convert image.daa -o image.iso -ot iso
Napalenie ISO obrazu.:. growisofs -Z /dev/dvd=/cesta/k/iso
Napalenie ISO obrazu.:. wodim -v dev=/dev/dvd isoimage.iso
Napalenie suborov z disku.:. genisoimage -V nazov_CD -J -r /adresar/ | wodim -v dev=/dev/dvd -
Napalenie suborov z disku.:. growisofs -Z /dev/dvd -r -J /cesta/k/suborom
Napalenie suborov z disku.:. mkisofs -V nazov_CD -J -r -o image.iso /adresar/ | wodim -v dev=/dev/dvd image.iso
Obnova zalohy.:. tar xvpz --same-owner -f backup.tgz -C
Vyhladavanie suborov.:. find dir/ -name *nazov*
Vymazanie CD.:. wodim -v dev=/dev/dvd -blank=fast
Vymazanie DVD.:. dvd+rw-format /dev/dvd
Vyrazne zrychlenie pacmana.:. http://pastebin.sk/sk/8926/
Vyrazne zrychlenie pacmana.:. pacman-optimize && sync
Zalohovanie systemu.:. tar cvpzf /backup.tgz –exclude=/proc –exclude=/lost+found –exclude=/mnt –exclude=/media –exclude=/sys –exclude=/backup.tgz
Zmeni rozlozenie klavesnice.:. setxkbmap -layout sk qwerty
apply patch.:. patch -p0 -i c.patch (--dry-run)
cas a datum.:. sudo date -s "26 OCT 2008 19:30:00“
device is busy.:.  fuser -m /bod/pripojenia
diff patch rozdiel subor file.:. diff -u a b > c.patch
firefox sqlite databaza defragmentacia.:. for z in `ls *.sqlite`; do echo "VACUUM;" | sqlite3 $z; done
generovanie kernel mkinitcpio.:. mkinitcpio -p kernel26
git vytvori prazdy branch.:. git push origin master:refs/heads/<branch>
gtk zmena.:. GTK2_RC_FILES=/usr/share/themes/Redmond/gtk-2.0/gtkrc
hierarchia linux filesystem.:. man hier
hladanie subory obsahujuce "text".:. grep -lir "text to find" *
informacie o okne.:. xwininfo
invert negativ farby.:. xcalib -i -a
kompilacia virtualbox modul.:. vbox_build_module
mount nrg.:. sudo mount -o loop,offset=307200 file.nrg
pocet suborov typ v adresari.:. tree -if | grep .mp3 | wc -l
pozastavit proces.:. killall -s STOP smplayer
preklad test.:. msgfmt -cv gnome-terminal.gnome-2-26.sk.po; sudo cp messages.mo /usr/share/locale/sk_SK/LC_MESSAGES/gnome-terminal.mo; LC_MESSAGES="sk_SK" gnome-terminal
prevod konce riadkov windows unix.:.  sed ’s/$/\r/’ unix_soubor > win_soubor
prevod konce riadkov windows unix.:.  tr -d ‘\r‘ > win_soubor > unix_soubor
rychlost otacok.:. aticonfig --pplib-cmd "set fanspeed 0 <cislo>"
skratka nastavenie hlasitosti.:. amixer sset Master 4%-
stiahnut celu stranky download.:. wget --mirror -p --html-extension --convert-links http://localhost
teplota ati grafiky.:.  LD_PRELOAD=libXinerama.so.1 aticonfig --od-gettemperature
tree strom adresarov.:.  tree . -d -L 2
update fonts.:. fc-cache
velkost adresara.:. du -hs dir/
volne miesto na disku.:. df -h
vyuzitie hdd io.:. iotop
window class name.:.  xprop WM_CLASS
window role.:. xprop  WM_WINDOW_ROLE
xephyr.:. Xephyr :1 -host-cursor -screen 1280x800 -dpi 96
zalohovanie.:. rsync -av --delete /var/lib/pacman/local /media/data/zalohy/
zistit sample rate.:. cat /proc/asound/card0/pcm0p/sub0/hw_params
zmena miesta rezervovaneho pre roota na disku.:. tune2fs -m 0 /dev/sda7
zobrazit zoznam modulov.:.  hwdetect --show-modules-order
