%!PS-Adobe-3.0 EPSF-3.0
%%Creator: EpsGraphics2D 0.9.0 by Paul Mutton, http://www.jibble.org/
%%Title: GeoGebra, http://www.geogebra.org
%%CreationDate: Thu Mar 13 16:23:01 CET 2008
%%BoundingBox: 0 0 329 161
%%DocumentData: Clean7Bit
%%DocumentProcessColors: Black
%%ColorUsage: Color
%%Origin: 0 0
%%Pages: 1
%%Page: 1 1
%%EndComments

gsave
-0.0 161.0 translate
1.0 setlinewidth
10.0 setmiterlimit
0 setlinejoin
2 setlinecap
[ ] 0 setdash
gsave
newpath
0.0 -0.0 moveto
329.85495 -0.0 lineto
329.85495 -161.56161 lineto
0.0 -161.56161 lineto
0.0 -0.0 lineto
closepath
clip
newpath
1.0 setlinewidth
10.0 setmiterlimit
0 setlinejoin
2 setlinecap
[ ] 0 setdash
1.0 1.0 1.0 setrgbcolor
newpath
-131.26881 218.78134 moveto
463.64816 218.78134 lineto
463.64816 -302.928 lineto
-131.26881 -302.928 lineto
-131.26881 218.78134 lineto
closepath
fill
newpath
0.0 0.0 0.0 setrgbcolor
1.0 setlinewidth
10.0 setmiterlimit
1 setlinejoin
1 setlinecap
[ ] 0 setdash
newpath
26.578978 -127.69761 moveto
111.61835 -127.69761 lineto
stroke
newpath
0.0 0.0 0.0 setrgbcolor
1.0 setlinewidth
10.0 setmiterlimit
1 setlinejoin
1 setlinecap
[ ] 0 setdash
newpath
111.61835 -127.69761 moveto
168.31126 -99.35116 lineto
stroke
newpath
0.0 0.0 0.0 setrgbcolor
1.0 setlinewidth
10.0 setmiterlimit
1 setlinejoin
1 setlinecap
[ ] 0 setdash
newpath
168.31126 -99.35116 moveto
168.31126 -14.31179 lineto
stroke
newpath
0.0 0.0 0.0 setrgbcolor
1.0 setlinewidth
10.0 setmiterlimit
1 setlinejoin
1 setlinecap
[ ] 0 setdash
newpath
168.31126 -14.31179 moveto
111.61835 -42.658237 lineto
stroke
newpath
0.0 0.0 0.0 setrgbcolor
1.0 setlinewidth
10.0 setmiterlimit
1 setlinejoin
1 setlinecap
[ ] 0 setdash
newpath
111.61835 -42.658237 moveto
26.578978 -42.658237 lineto
stroke
newpath
0.0 0.0 0.0 setrgbcolor
1.0 setlinewidth
10.0 setmiterlimit
1 setlinejoin
1 setlinecap
[ ] 0 setdash
newpath
26.578978 -42.658237 moveto
26.578978 -127.69761 lineto
stroke
newpath
0.0 0.0 0.0 setrgbcolor
1.0 setlinewidth
10.0 setmiterlimit
1 setlinejoin
1 setlinecap
[ ] 0 setdash
newpath
26.578978 -42.658237 moveto
83.27189 -14.31179 lineto
stroke
newpath
0.0 0.0 0.0 setrgbcolor
1.0 setlinewidth
10.0 setmiterlimit
1 setlinejoin
1 setlinecap
[ ] 0 setdash
newpath
83.27189 -14.31179 moveto
168.31126 -14.31179 lineto
stroke
newpath
0.0 0.0 0.0 setrgbcolor
1.0 setlinewidth
10.0 setmiterlimit
1 setlinejoin
0 setlinecap
[ 5.0 4.0 ] 0 setdash
newpath
83.27189 -99.35116 moveto
26.578978 -127.69761 lineto
stroke
newpath
0.0 0.0 0.0 setrgbcolor
1.0 setlinewidth
10.0 setmiterlimit
1 setlinejoin
0 setlinecap
[ 5.0 4.0 ] 0 setdash
newpath
83.27189 -99.35116 moveto
168.31126 -99.35116 lineto
stroke
newpath
0.0 0.0 0.0 setrgbcolor
1.0 setlinewidth
10.0 setmiterlimit
1 setlinejoin
0 setlinecap
[ 5.0 4.0 ] 0 setdash
newpath
83.27189 -14.31179 moveto
83.27189 -99.35116 lineto
stroke
newpath
0.0 0.0 0.0 setrgbcolor
1.0 setlinewidth
10.0 setmiterlimit
1 setlinejoin
1 setlinecap
[ ] 0 setdash
newpath
111.61835 -127.69761 moveto
111.61835 -42.658237 lineto
stroke
newpath
0.0 0.0 0.0 setrgbcolor
1.0 setlinewidth
10.0 setmiterlimit
1 setlinejoin
1 setlinecap
[ ] 0 setdash
newpath
111.61835 -127.69761 moveto
300.40363 -127.90294 lineto
stroke
newpath
0.0 0.0 0.0 setrgbcolor
1.0 setlinewidth
10.0 setmiterlimit
1 setlinejoin
1 setlinecap
[ ] 0 setdash
newpath
111.61835 -42.658237 moveto
200.27103 -127.79404 lineto
stroke
newpath
0.0 0.0 0.0 setrgbcolor
newpath
27.420444 -127.69761 moveto
27.420444 -128.16235 27.043713 -128.53908 26.578978 -128.53908 curveto
26.114254 -128.53908 25.73751 -128.16235 25.73751 -127.69761 curveto
25.73751 -127.23289 26.114254 -126.85614 26.578978 -126.85614 curveto
27.043713 -126.85614 27.420444 -127.23289 27.420444 -127.69761 curveto
closepath
fill
newpath
0.0 0.0 0.0 setrgbcolor
1.0 setlinewidth
10.0 setmiterlimit
1 setlinejoin
1 setlinecap
[ ] 0 setdash
newpath
27.420444 -127.69761 moveto
27.420444 -128.16235 27.043713 -128.53908 26.578978 -128.53908 curveto
26.114254 -128.53908 25.73751 -128.16235 25.73751 -127.69761 curveto
25.73751 -127.23289 26.114254 -126.85614 26.578978 -126.85614 curveto
27.043713 -126.85614 27.420444 -127.23289 27.420444 -127.69761 curveto
closepath
stroke
newpath
0.0 0.0 0.0 setrgbcolor
newpath
17.261572 -135.2099 moveto
16.019094 -132.06425 lineto
14.771686 -135.2099 lineto
closepath
18.356136 -138.00053 moveto
17.56233 -135.97905 lineto
14.470926 -135.97905 lineto
13.66726 -138.00053 lineto
12.705818 -138.00053 lineto
15.600004 -130.70345 lineto
16.625542 -130.70345 lineto
19.475353 -138.00053 lineto
closepath
fill
newpath
0.0 0.0 0.0 setrgbcolor
newpath
112.459816 -127.69761 moveto
112.459816 -128.16235 112.08307 -128.53908 111.61835 -128.53908 curveto
111.153625 -128.53908 110.77688 -128.16235 110.77688 -127.69761 curveto
110.77688 -127.23289 111.153625 -126.85614 111.61835 -126.85614 curveto
112.08307 -126.85614 112.459816 -127.23289 112.459816 -127.69761 curveto
closepath
fill
newpath
0.0 0.0 0.0 setrgbcolor
1.0 setlinewidth
10.0 setmiterlimit
1 setlinejoin
1 setlinecap
[ ] 0 setdash
newpath
112.459816 -127.69761 moveto
112.459816 -128.16235 112.08307 -128.53908 111.61835 -128.53908 curveto
111.153625 -128.53908 110.77688 -128.16235 110.77688 -127.69761 curveto
110.77688 -127.23289 111.153625 -126.85614 111.61835 -126.85614 curveto
112.08307 -126.85614 112.459816 -127.23289 112.459816 -127.69761 curveto
closepath
stroke
newpath
0.0 0.0 0.0 setrgbcolor
newpath
119.588524 -138.84201 moveto
119.588524 -131.5449 lineto
121.48183 -131.5449 lineto
122.21154 -131.5449 122.77115 -131.68297 123.16065 -131.95908 curveto
123.550156 -132.23518 123.74491 -132.6329 123.74491 -133.15225 curveto
123.74491 -134.03645 123.24529 -134.66591 122.24605 -135.04062 curveto
123.439224 -135.40547 124.03581 -136.0645 124.03581 -137.01773 curveto
124.03581 -137.60939 123.83859 -138.06134 123.44415 -138.37361 curveto
123.04971 -138.68588 122.481064 -138.84201 121.73821 -138.84201 curveto
closepath
120.61407 -138.06792 moveto
120.82607 -138.06792 lineto
121.585365 -138.06792 122.07677 -138.02026 122.300285 -137.92494 curveto
122.72759 -137.74416 122.941246 -137.40889 122.941246 -136.91913 curveto
122.941246 -136.48524 122.747314 -136.1245 122.35945 -135.83688 curveto
121.97159 -135.54927 121.486755 -135.40547 120.90496 -135.40547 curveto
120.61407 -135.40547 lineto
closepath
120.61407 -134.74973 moveto
120.944405 -134.74973 lineto
121.49661 -134.74973 121.92474 -134.6314 122.22879 -134.39473 curveto
122.53284 -134.15807 122.68486 -133.82443 122.68486 -133.39384 curveto
122.68486 -132.67728 122.129364 -132.319 121.018364 -132.319 curveto
120.61407 -132.319 lineto
closepath
fill
newpath
0.0 0.0 0.0 setrgbcolor
newpath
169.15274 -99.35116 moveto
169.15274 -99.81588 168.77599 -100.19263 168.31126 -100.19263 curveto
167.84654 -100.19263 167.4698 -99.81588 167.4698 -99.35116 curveto
167.4698 -98.88644 167.84654 -98.50969 168.31126 -98.50969 curveto
168.77599 -98.50969 169.15274 -98.88644 169.15274 -99.35116 curveto
closepath
fill
newpath
0.0 0.0 0.0 setrgbcolor
1.0 setlinewidth
10.0 setmiterlimit
1 setlinejoin
1 setlinecap
[ ] 0 setdash
newpath
169.15274 -99.35116 moveto
169.15274 -99.81588 168.77599 -100.19263 168.31126 -100.19263 curveto
167.84654 -100.19263 167.4698 -99.81588 167.4698 -99.35116 curveto
167.4698 -98.88644 167.84654 -98.50969 168.31126 -98.50969 curveto
168.77599 -98.50969 169.15274 -98.88644 169.15274 -99.35116 curveto
closepath
stroke
newpath
0.0 0.0 0.0 setrgbcolor
newpath
186.66591 -105.36577 moveto
185.5319 -105.36577 184.65593 -105.03296 184.03798 -104.36735 curveto
183.42001 -103.70174 183.11104 -102.75919 183.11104 -101.53972 curveto
183.11104 -100.32354 183.42577 -99.38017 184.05524 -98.70963 curveto
184.6847 -98.03909 185.57135 -97.70382 186.71523 -97.70382 curveto
187.36932 -97.70382 188.1352 -97.810646 189.01282 -98.0243 curveto
189.01282 -98.9956 lineto
188.01357 -98.65047 187.24277 -98.4779 186.70042 -98.4779 curveto
185.90826 -98.4779 185.29524 -98.74579 184.86136 -99.28157 curveto
184.42747 -99.817345 184.21054 -100.57335 184.21054 -101.54958 curveto
184.21054 -102.4798 184.44228 -103.213615 184.90573 -103.75104 curveto
185.3692 -104.28846 186.00195 -104.55717 186.80397 -104.55717 curveto
187.49423 -104.55717 188.23381 -104.34515 189.02267 -103.921135 curveto
189.02267 -104.808624 lineto
188.30283 -105.18005 187.51724 -105.36577 186.66591 -105.36577 curveto
closepath
fill
newpath
0.0 0.0 0.0 setrgbcolor
newpath
84.11335 -99.35116 moveto
84.11335 -99.81588 83.73662 -100.19263 83.27189 -100.19263 curveto
82.80716 -100.19263 82.43042 -99.81588 82.43042 -99.35116 curveto
82.43042 -98.88644 82.80716 -98.50969 83.27189 -98.50969 curveto
83.73662 -98.50969 84.11335 -98.88644 84.11335 -99.35116 curveto
closepath
fill
newpath
0.0 0.0 0.0 setrgbcolor
1.0 setlinewidth
10.0 setmiterlimit
1 setlinejoin
1 setlinecap
[ ] 0 setdash
newpath
84.11335 -99.35116 moveto
84.11335 -99.81588 83.73662 -100.19263 83.27189 -100.19263 curveto
82.80716 -100.19263 82.43042 -99.81588 82.43042 -99.35116 curveto
82.43042 -98.88644 82.80716 -98.50969 83.27189 -98.50969 curveto
83.73662 -98.50969 84.11335 -98.88644 84.11335 -99.35116 curveto
closepath
stroke
newpath
0.0 0.0 0.0 setrgbcolor
newpath
68.259056 -97.61014 moveto
68.259056 -90.31304 lineto
70.684845 -90.31304 lineto
71.40798 -90.31304 71.99225 -90.39357 72.43763 -90.554634 curveto
72.88301 -90.7157 73.26841 -90.98852 73.59383 -91.37309 curveto
74.10988 -91.984474 74.367905 -92.78978 74.367905 -93.789024 curveto
74.367905 -95.00192 74.047424 -95.94199 73.40646 -96.60925 curveto
72.7655 -97.27651 71.86323 -97.61014 70.69964 -97.61014 curveto
closepath
69.29446 -96.83605 moveto
70.62075 -96.83605 lineto
71.5674 -96.83605 72.237946 -96.581314 72.632385 -96.07183 curveto
73.056404 -95.52948 73.26841 -94.801414 73.26841 -93.887634 curveto
73.26841 -93.02973 73.059685 -92.3559 72.64224 -91.86614 curveto
72.389145 -91.56703 72.08675 -91.36241 71.73504 -91.2523 curveto
71.38333 -91.14218 70.854126 -91.08713 70.14742 -91.08713 curveto
69.29446 -91.08713 lineto
closepath
fill
newpath
0.0 0.0 0.0 setrgbcolor
newpath
27.420444 -42.658237 moveto
27.420444 -43.12296 27.043713 -43.499706 26.578978 -43.499706 curveto
26.114254 -43.499706 25.73751 -43.12296 25.73751 -42.658237 curveto
25.73751 -42.193516 26.114254 -41.816772 26.578978 -41.816772 curveto
27.043713 -41.816772 27.420444 -42.193516 27.420444 -42.658237 curveto
closepath
fill
newpath
0.0 0.0 0.0 setrgbcolor
1.0 setlinewidth
10.0 setmiterlimit
1 setlinejoin
1 setlinecap
[ ] 0 setdash
newpath
27.420444 -42.658237 moveto
27.420444 -43.12296 27.043713 -43.499706 26.578978 -43.499706 curveto
26.114254 -43.499706 25.73751 -43.12296 25.73751 -42.658237 curveto
25.73751 -42.193516 26.114254 -41.816772 26.578978 -41.816772 curveto
27.043713 -41.816772 27.420444 -42.193516 27.420444 -42.658237 curveto
closepath
stroke
newpath
0.0 0.0 0.0 setrgbcolor
newpath
12.722254 -47.122135 moveto
12.722254 -39.825043 lineto
16.799751 -39.825043 lineto
16.799751 -40.599125 lineto
13.757652 -40.599125 lineto
13.757652 -42.941097 lineto
16.306704 -42.941097 lineto
16.306704 -43.705322 lineto
13.757652 -43.705322 lineto
13.757652 -46.348053 lineto
17.01176 -46.348053 lineto
17.01176 -47.122135 lineto
closepath
fill
newpath
0.0 0.0 0.0 setrgbcolor
newpath
112.459816 -42.658237 moveto
112.459816 -43.12296 112.08307 -43.499706 111.61835 -43.499706 curveto
111.153625 -43.499706 110.77688 -43.12296 110.77688 -42.658237 curveto
110.77688 -42.193516 111.153625 -41.816772 111.61835 -41.816772 curveto
112.08307 -41.816772 112.459816 -42.193516 112.459816 -42.658237 curveto
closepath
fill
newpath
0.0 0.0 0.0 setrgbcolor
1.0 setlinewidth
10.0 setmiterlimit
1 setlinejoin
1 setlinecap
[ ] 0 setdash
newpath
112.459816 -42.658237 moveto
112.459816 -43.12296 112.08307 -43.499706 111.61835 -43.499706 curveto
111.153625 -43.499706 110.77688 -43.12296 110.77688 -42.658237 curveto
110.77688 -42.193516 111.153625 -41.816772 111.61835 -41.816772 curveto
112.08307 -41.816772 112.459816 -42.193516 112.459816 -42.658237 curveto
closepath
stroke
newpath
0.0 0.0 0.0 setrgbcolor
newpath
118.74706 -55.536804 moveto
118.74706 -48.239708 lineto
122.824554 -48.239708 lineto
122.824554 -49.013794 lineto
119.782455 -49.013794 lineto
119.782455 -51.459305 lineto
122.33644 -51.459305 lineto
122.33644 -52.223526 lineto
119.782455 -52.223526 lineto
119.782455 -55.536804 lineto
closepath
fill
newpath
0.0 0.0 0.0 setrgbcolor
newpath
169.15274 -14.31179 moveto
169.15274 -14.776513 168.77599 -15.153257 168.31126 -15.153257 curveto
167.84654 -15.153257 167.4698 -14.776513 167.4698 -14.31179 curveto
167.4698 -13.847068 167.84654 -13.470324 168.31126 -13.470324 curveto
168.77599 -13.470324 169.15274 -13.847068 169.15274 -14.31179 curveto
closepath
fill
newpath
0.0 0.0 0.0 setrgbcolor
1.0 setlinewidth
10.0 setmiterlimit
1 setlinejoin
1 setlinecap
[ ] 0 setdash
newpath
169.15274 -14.31179 moveto
169.15274 -14.776513 168.77599 -15.153257 168.31126 -15.153257 curveto
167.84654 -15.153257 167.4698 -14.776513 167.4698 -14.31179 curveto
167.4698 -13.847068 167.84654 -13.470324 168.31126 -13.470324 curveto
168.77599 -13.470324 169.15274 -13.847068 169.15274 -14.31179 curveto
closepath
stroke
newpath
0.0 0.0 0.0 setrgbcolor
newpath
182.29094 -15.790648 moveto
181.40674 -16.043747 180.63594 -16.170296 179.97855 -16.170296 curveto
178.81825 -16.170296 177.9283 -15.839954 177.3087 -15.179271 curveto
176.68912 -14.518588 176.37932 -13.571938 176.37932 -12.33932 curveto
176.37932 -11.129712 176.69322 -10.188814 177.32103 -9.516627 curveto
177.94885 -8.8444395 178.82976 -8.508346 179.96376 -8.508346 curveto
180.70662 -8.508346 181.47906 -8.61846 182.28108 -8.838688 curveto
182.28108 -9.795198 lineto
181.27527 -9.453353 180.50447 -9.28243 179.96869 -9.28243 curveto
179.17982 -9.28243 178.56763 -9.550319 178.1321 -10.086096 curveto
177.69656 -10.621874 177.4788 -11.376236 177.4788 -12.349181 curveto
177.4788 -13.312266 177.71219 -14.060876 178.17894 -14.59501 curveto
178.64569 -15.129145 179.29979 -15.396212 180.14127 -15.396212 curveto
180.48639 -15.396212 180.85947 -15.3354025 181.26048 -15.213784 curveto
181.26048 -12.837297 lineto
182.29094 -12.837297 lineto
closepath
fill
newpath
0.0 0.0 0.0 setrgbcolor
newpath
84.11335 -14.31179 moveto
84.11335 -14.776513 83.73662 -15.153257 83.27189 -15.153257 curveto
82.80716 -15.153257 82.43042 -14.776513 82.43042 -14.31179 curveto
82.43042 -13.847068 82.80716 -13.470324 83.27189 -13.470324 curveto
83.73662 -13.470324 84.11335 -13.847068 84.11335 -14.31179 curveto
closepath
fill
newpath
0.0 0.0 0.0 setrgbcolor
1.0 setlinewidth
10.0 setmiterlimit
1 setlinejoin
1 setlinecap
[ ] 0 setdash
newpath
84.11335 -14.31179 moveto
84.11335 -14.776513 83.73662 -15.153257 83.27189 -15.153257 curveto
82.80716 -15.153257 82.43042 -14.776513 82.43042 -14.31179 curveto
82.43042 -13.847068 82.80716 -13.470324 83.27189 -13.470324 curveto
83.73662 -13.470324 84.11335 -13.847068 84.11335 -14.31179 curveto
closepath
stroke
newpath
0.0 0.0 0.0 setrgbcolor
newpath
65.73466 -10.939067 moveto
65.73466 -3.641973 lineto
66.77006 -3.641973 lineto
66.77006 -6.718586 lineto
70.241104 -6.718586 lineto
70.241104 -3.641973 lineto
71.276505 -3.641973 lineto
71.276505 -10.939067 lineto
70.241104 -10.939067 lineto
70.241104 -7.4926696 lineto
66.77006 -7.4926696 lineto
66.77006 -10.939067 lineto
closepath
fill
newpath
0.0 0.0 0.011764706 setrgbcolor
newpath
112.459816 -127.69761 moveto
112.459816 -128.16235 112.08307 -128.53908 111.61835 -128.53908 curveto
111.153625 -128.53908 110.77688 -128.16235 110.77688 -127.69761 curveto
110.77688 -127.23289 111.153625 -126.85614 111.61835 -126.85614 curveto
112.08307 -126.85614 112.459816 -127.23289 112.459816 -127.69761 curveto
closepath
fill
newpath
0.0 0.0 0.0 setrgbcolor
1.0 setlinewidth
10.0 setmiterlimit
1 setlinejoin
1 setlinecap
[ ] 0 setdash
newpath
112.459816 -127.69761 moveto
112.459816 -128.16235 112.08307 -128.53908 111.61835 -128.53908 curveto
111.153625 -128.53908 110.77688 -128.16235 110.77688 -127.69761 curveto
110.77688 -127.23289 111.153625 -126.85614 111.61835 -126.85614 curveto
112.08307 -126.85614 112.459816 -127.23289 112.459816 -127.69761 curveto
closepath
stroke
newpath
0.0 0.0 0.011764706 setrgbcolor
newpath
301.2451 -127.90294 moveto
301.2451 -128.36766 300.86838 -128.7444 300.40363 -128.7444 curveto
299.93887 -128.7444 299.56213 -128.36766 299.56213 -127.90294 curveto
299.56213 -127.43822 299.93887 -127.06147 300.40363 -127.06147 curveto
300.86838 -127.06147 301.2451 -127.43822 301.2451 -127.90294 curveto
closepath
fill
newpath
0.0 0.0 0.0 setrgbcolor
1.0 setlinewidth
10.0 setmiterlimit
1 setlinejoin
1 setlinecap
[ ] 0 setdash
newpath
301.2451 -127.90294 moveto
301.2451 -128.36766 300.86838 -128.7444 300.40363 -128.7444 curveto
299.93887 -128.7444 299.56213 -128.36766 299.56213 -127.90294 curveto
299.56213 -127.43822 299.93887 -127.06147 300.40363 -127.06147 curveto
300.86838 -127.06147 301.2451 -127.43822 301.2451 -127.90294 curveto
closepath
stroke
newpath
0.0 0.0 0.011764706 setrgbcolor
newpath
201.1125 -127.79404 moveto
201.1125 -128.25876 200.73575 -128.6355 200.27103 -128.6355 curveto
199.8063 -128.6355 199.42957 -128.25876 199.42957 -127.79404 curveto
199.42957 -127.32931 199.8063 -126.95257 200.27103 -126.95257 curveto
200.73575 -126.95257 201.1125 -127.32931 201.1125 -127.79404 curveto
closepath
fill
newpath
0.0 0.0 0.0 setrgbcolor
1.0 setlinewidth
10.0 setmiterlimit
1 setlinejoin
1 setlinecap
[ ] 0 setdash
newpath
201.1125 -127.79404 moveto
201.1125 -128.25876 200.73575 -128.6355 200.27103 -128.6355 curveto
199.8063 -128.6355 199.42957 -128.25876 199.42957 -127.79404 curveto
199.42957 -127.32931 199.8063 -126.95257 200.27103 -126.95257 curveto
200.73575 -126.95257 201.1125 -127.32931 201.1125 -127.79404 curveto
closepath
stroke
newpath
grestore
grestore
showpage

%%EOF