%!PS-Adobe-3.0 EPSF-3.0
%%Creator: EpsGraphics2D 0.9.0 by Paul Mutton, http://www.jibble.org/
%%Title: GeoGebra, http://www.geogebra.org
%%CreationDate: Wed Apr 16 17:57:40 CEST 2008
%%BoundingBox: 0 0 465 289
%%DocumentData: Clean7Bit
%%DocumentProcessColors: Black
%%ColorUsage: Color
%%Origin: 0 0
%%Pages: 1
%%Page: 1 1
%%EndComments

gsave
-0.0 289.0 translate
1.0 setlinewidth
10.0 setmiterlimit
0 setlinejoin
2 setlinecap
[ ] 0 setdash
gsave
newpath
0.0 -0.0 moveto
465.70837 -0.0 lineto
465.70837 -289.6352 lineto
0.0 -289.6352 lineto
0.0 -0.0 lineto
closepath
clip
newpath
1.0 setlinewidth
10.0 setmiterlimit
0 setlinejoin
2 setlinecap
[ ] 0 setdash
1.0 1.0 1.0 setrgbcolor
newpath
-86.473816 123.98053 moveto
650.1164 123.98053 lineto
650.1164 -521.96844 lineto
-86.473816 -521.96844 lineto
-86.473816 123.98053 lineto
closepath
fill
newpath
0.0 0.0 0.0 setrgbcolor
1.0 setlinewidth
10.0 setmiterlimit
1 setlinejoin
1 setlinecap
[ ] 0 setdash
newpath
-86.473816 -255.68727 moveto
650.1164 -136.80618 lineto
stroke
newpath
0.0 0.0 0.0 setrgbcolor
1.0 setlinewidth
10.0 setmiterlimit
1 setlinejoin
1 setlinecap
[ ] 0 setdash
newpath
-86.473816 -194.53543 moveto
650.1164 -181.2472 lineto
stroke
newpath
0.0 0.0 0.0 setrgbcolor
2.0 setlinewidth
10.0 setmiterlimit
1 setlinejoin
1 setlinecap
[ ] 0 setdash
newpath
-12.265717 123.98053 moveto
650.1164 -460.2932 lineto
stroke
newpath
0.0 0.0 0.0 setrgbcolor
1.0 setlinewidth
10.0 setmiterlimit
1 setlinejoin
1 setlinecap
[ ] 0 setdash
newpath
167.14777 -247.67574 moveto
263.55597 -188.22086 lineto
stroke
newpath
0.0 0.0 0.0 setrgbcolor
1.0 setlinewidth
10.0 setmiterlimit
1 setlinejoin
1 setlinecap
[ ] 0 setdash
newpath
183.71448 -48.8896 moveto
110.45485 -190.9828 lineto
stroke
newpath
0.0 0.0 0.0 setrgbcolor
1.0 setlinewidth
10.0 setmiterlimit
1 setlinejoin
1 setlinecap
[ ] 0 setdash
newpath
110.45485 -190.9828 moveto
167.14777 -247.67574 lineto
stroke
newpath
0.0 0.0 0.0 setrgbcolor
1.0 setlinewidth
10.0 setmiterlimit
1 setlinejoin
1 setlinecap
[ ] 0 setdash
newpath
167.14777 -247.67574 moveto
183.71448 -48.8896 lineto
stroke
newpath
0.0 0.0 0.0 setrgbcolor
1.0 setlinewidth
10.0 setmiterlimit
1 setlinejoin
1 setlinecap
[ ] 0 setdash
newpath
183.71448 -48.8896 moveto
263.55597 -188.22086 lineto
stroke
newpath
0.0 0.0 0.0 setrgbcolor
1.0 setlinewidth
10.0 setmiterlimit
1 setlinejoin
0 setlinecap
[ 9.0 8.0 ] 0 setdash
newpath
263.55597 -188.22086 moveto
110.45485 -190.9828 lineto
stroke
newpath
0.0 0.0 0.0 setrgbcolor
newpath
168.18962 -247.67574 moveto
168.18962 -248.25113 167.72314 -248.71759 167.14777 -248.71759 curveto
166.57236 -248.71759 166.10591 -248.25113 166.10591 -247.67574 curveto
166.10591 -247.10034 166.57236 -246.63388 167.14777 -246.63388 curveto
167.72314 -246.63388 168.18962 -247.10034 168.18962 -247.67574 curveto
closepath
fill
newpath
0.0 0.0 0.0 setrgbcolor
1.0 setlinewidth
10.0 setmiterlimit
1 setlinejoin
1 setlinecap
[ ] 0 setdash
newpath
168.18962 -247.67574 moveto
168.18962 -248.25113 167.72314 -248.71759 167.14777 -248.71759 curveto
166.57236 -248.71759 166.10591 -248.25113 166.10591 -247.67574 curveto
166.10591 -247.10034 166.57236 -246.63388 167.14777 -246.63388 curveto
167.72314 -246.63388 168.18962 -247.10034 168.18962 -247.67574 curveto
closepath
stroke
newpath
0.0 0.0 0.0 setrgbcolor
newpath
170.69096 -265.89844 moveto
169.2869 -265.89844 168.20232 -265.4864 167.43721 -264.66226 curveto
166.67209 -263.83813 166.28954 -262.6711 166.28954 -261.16125 curveto
166.28954 -259.65546 166.67921 -258.48746 167.45857 -257.65723 curveto
168.23793 -256.827 169.33574 -256.41187 170.75201 -256.41187 curveto
171.56189 -256.41187 172.51013 -256.54413 173.59676 -256.8087 curveto
173.59676 -258.0113 lineto
172.35956 -257.58395 171.4052 -257.3703 170.73369 -257.3703 curveto
169.75288 -257.3703 168.99388 -257.702 168.45668 -258.36536 curveto
167.91946 -259.02872 167.65086 -259.96475 167.65086 -261.17346 curveto
167.65086 -262.3252 167.93777 -263.23376 168.51161 -263.89917 curveto
169.08545 -264.56458 169.86887 -264.89728 170.8619 -264.89728 curveto
171.71654 -264.89728 172.63223 -264.63477 173.60896 -264.10977 curveto
173.60896 -265.20862 lineto
172.71768 -265.6685 171.74503 -265.89844 170.69096 -265.89844 curveto
closepath
fill
newpath
0.0 0.0 0.0 setrgbcolor
newpath
264.59784 -188.22086 moveto
264.59784 -188.79625 264.13138 -189.26271 263.55597 -189.26271 curveto
262.9806 -189.26271 262.51413 -188.79625 262.51413 -188.22086 curveto
262.51413 -187.64543 262.9806 -187.179 263.55597 -187.179 curveto
264.13138 -187.179 264.59784 -187.64543 264.59784 -188.22086 curveto
closepath
fill
newpath
0.0 0.0 0.0 setrgbcolor
1.0 setlinewidth
10.0 setmiterlimit
1 setlinejoin
1 setlinecap
[ ] 0 setdash
newpath
264.59784 -188.22086 moveto
264.59784 -188.79625 264.13138 -189.26271 263.55597 -189.26271 curveto
262.9806 -189.26271 262.51413 -188.79625 262.51413 -188.22086 curveto
262.51413 -187.64543 262.9806 -187.179 263.55597 -187.179 curveto
264.13138 -187.179 264.59784 -187.64543 264.59784 -188.22086 curveto
closepath
stroke
newpath
0.0 0.0 0.0 setrgbcolor
newpath
269.9641 -184.40802 moveto
269.9641 -175.3732 lineto
272.96756 -175.3732 lineto
273.8629 -175.3732 274.5863 -175.4729 275.13776 -175.67232 curveto
275.6892 -175.87173 276.16638 -176.20953 276.5693 -176.68568 curveto
277.20825 -177.44266 277.5277 -178.43974 277.5277 -179.67694 curveto
277.5277 -181.17868 277.13092 -182.34262 276.3373 -183.16878 curveto
275.5437 -183.99493 274.42657 -184.40802 272.9859 -184.40802 curveto
closepath
271.24606 -183.4496 moveto
272.8882 -183.4496 lineto
274.0603 -183.4496 274.89053 -183.13419 275.3789 -182.50337 curveto
275.9039 -181.83188 276.16638 -180.93044 276.16638 -179.79904 curveto
276.16638 -178.73683 275.90796 -177.90254 275.3911 -177.29614 curveto
275.07773 -176.9258 274.7033 -176.67245 274.26785 -176.53612 curveto
273.8324 -176.39978 273.17715 -176.33162 272.3022 -176.33162 curveto
271.24606 -176.33162 lineto
closepath
fill
newpath
0.0 0.0 0.0 setrgbcolor
newpath
241.53764 -203.08456 moveto
241.53764 -204.23537 240.60472 -205.16826 239.45393 -205.16826 curveto
238.30313 -205.16826 237.37024 -204.23537 237.37024 -203.08456 curveto
237.37024 -201.93378 238.30313 -201.00085 239.45393 -201.00085 curveto
240.60472 -201.00085 241.53764 -201.93378 241.53764 -203.08456 curveto
closepath
fill
newpath
0.0 0.0 0.0 setrgbcolor
1.0 setlinewidth
10.0 setmiterlimit
1 setlinejoin
1 setlinecap
[ ] 0 setdash
newpath
241.53764 -203.08456 moveto
241.53764 -204.23537 240.60472 -205.16826 239.45393 -205.16826 curveto
238.30313 -205.16826 237.37024 -204.23537 237.37024 -203.08456 curveto
237.37024 -201.93378 238.30313 -201.00085 239.45393 -201.00085 curveto
240.60472 -201.00085 241.53764 -201.93378 241.53764 -203.08456 curveto
closepath
stroke
newpath
0.0 0.0 0.0 setrgbcolor
newpath
247.04333 -221.91473 moveto
247.04333 -212.87991 lineto
248.24594 -212.87991 lineto
248.24594 -217.32407 lineto
251.9026 -212.87991 lineto
253.19067 -212.87991 lineto
249.65001 -217.18976 lineto
253.81946 -221.91473 lineto
252.19563 -221.91473 lineto
248.24594 -217.33627 lineto
248.24594 -221.91473 lineto
closepath
fill
newpath
0.0 0.0 0.0 setrgbcolor
newpath
184.75633 -48.8896 moveto
184.75633 -49.465008 184.2899 -49.931454 183.71448 -49.931454 curveto
183.13908 -49.931454 182.67262 -49.465008 182.67262 -48.8896 curveto
182.67262 -48.31421 183.13908 -47.847748 183.71448 -47.847748 curveto
184.2899 -47.847748 184.75633 -48.31421 184.75633 -48.8896 curveto
closepath
fill
newpath
0.0 0.0 0.0 setrgbcolor
1.0 setlinewidth
10.0 setmiterlimit
1 setlinejoin
1 setlinecap
[ ] 0 setdash
newpath
184.75633 -48.8896 moveto
184.75633 -49.465008 184.2899 -49.931454 183.71448 -49.931454 curveto
183.13908 -49.931454 182.67262 -49.465008 182.67262 -48.8896 curveto
182.67262 -48.31421 183.13908 -47.847748 183.71448 -47.847748 curveto
184.2899 -47.847748 184.75633 -48.31421 184.75633 -48.8896 curveto
closepath
stroke
newpath
0.0 0.0 0.0 setrgbcolor
newpath
179.73392 -26.758533 moveto
178.19556 -22.863794 lineto
176.6511 -26.758533 lineto
closepath
181.08914 -30.213743 moveto
180.10631 -27.710854 lineto
176.27872 -27.710854 lineto
175.28366 -30.213743 lineto
174.09326 -30.213743 lineto
177.67667 -21.178923 lineto
178.94643 -21.178923 lineto
182.47488 -30.213743 lineto
closepath
fill
newpath
0.0 0.0 0.0 setrgbcolor
newpath
111.496704 -190.9828 moveto
111.496704 -191.5582 111.03024 -192.02466 110.45485 -192.02466 curveto
109.87944 -192.02466 109.412994 -191.5582 109.412994 -190.9828 curveto
109.412994 -190.40741 109.87944 -189.94095 110.45485 -189.94095 curveto
111.03024 -189.94095 111.496704 -190.40741 111.496704 -190.9828 curveto
closepath
fill
newpath
0.0 0.0 0.0 setrgbcolor
1.0 setlinewidth
10.0 setmiterlimit
1 setlinejoin
1 setlinecap
[ ] 0 setdash
newpath
111.496704 -190.9828 moveto
111.496704 -191.5582 111.03024 -192.02466 110.45485 -192.02466 curveto
109.87944 -192.02466 109.412994 -191.5582 109.412994 -190.9828 curveto
109.412994 -190.40741 109.87944 -189.94095 110.45485 -189.94095 curveto
111.03024 -189.94095 111.496704 -190.40741 111.496704 -190.9828 curveto
closepath
stroke
newpath
0.0 0.0 0.0 setrgbcolor
newpath
102.22574 -179.19875 moveto
102.22574 -170.16393 lineto
104.56991 -170.16393 lineto
105.47339 -170.16393 106.16627 -170.33485 106.64853 -170.67671 curveto
107.13079 -171.01857 107.371925 -171.51102 107.371925 -172.15404 curveto
107.371925 -173.2488 106.75333 -174.02815 105.51613 -174.4921 curveto
106.99345 -174.94383 107.7321 -175.75983 107.7321 -176.94005 curveto
107.7321 -177.6726 107.487915 -178.2322 106.99954 -178.61882 curveto
106.51118 -179.00543 105.80711 -179.19875 104.88735 -179.19875 curveto
closepath
103.4955 -178.24033 moveto
103.757996 -178.24033 lineto
104.698105 -178.24033 105.30653 -178.18132 105.583275 -178.0633 curveto
106.11234 -177.83946 106.37688 -177.42435 106.37688 -176.81795 curveto
106.37688 -176.28075 106.136765 -175.83409 105.65653 -175.478 curveto
105.1763 -175.12189 104.57602 -174.94383 103.855675 -174.94383 curveto
103.4955 -174.94383 lineto
closepath
103.4955 -174.13193 moveto
103.90451 -174.13193 lineto
104.58823 -174.13193 105.11831 -173.98541 105.49476 -173.6924 curveto
105.87121 -173.39938 106.05943 -172.9863 106.05943 -172.45316 curveto
106.05943 -171.56596 105.37165 -171.12236 103.99608 -171.12236 curveto
103.4955 -171.12236 lineto
closepath
fill
newpath
0.0 0.0 0.0 setrgbcolor
newpath
140.88501 -219.32927 moveto
140.88501 -220.48009 139.95209 -221.41298 138.8013 -221.41298 curveto
137.6505 -221.41298 136.71759 -220.48009 136.71759 -219.32927 curveto
136.71759 -218.17845 137.6505 -217.24556 138.8013 -217.24556 curveto
139.95209 -217.24556 140.88501 -218.17845 140.88501 -219.32927 curveto
closepath
fill
newpath
0.0 0.0 0.0 setrgbcolor
1.0 setlinewidth
10.0 setmiterlimit
1 setlinejoin
1 setlinecap
[ ] 0 setdash
newpath
140.88501 -219.32927 moveto
140.88501 -220.48009 139.95209 -221.41298 138.8013 -221.41298 curveto
137.6505 -221.41298 136.71759 -220.48009 136.71759 -219.32927 curveto
136.71759 -218.17845 137.6505 -217.24556 138.8013 -217.24556 curveto
139.95209 -217.24556 140.88501 -218.17845 140.88501 -219.32927 curveto
closepath
stroke
newpath
0.0 0.0 0.0 setrgbcolor
newpath
135.55894 -237.54253 moveto
135.55894 -228.5077 lineto
136.84091 -228.5077 lineto
136.84091 -237.54253 lineto
closepath
fill
newpath
0.2509804 0.2509804 0.2509804 setrgbcolor
newpath
343.23212 -186.83984 moveto
343.23212 -188.56606 341.83273 -189.96541 340.10657 -189.96541 curveto
338.38037 -189.96541 336.98102 -188.56606 336.98102 -186.83984 curveto
336.98102 -185.11363 338.38037 -183.71428 340.10657 -183.71428 curveto
341.83273 -183.71428 343.23212 -185.11363 343.23212 -186.83984 curveto
closepath
fill
newpath
0.0 0.0 0.0 setrgbcolor
1.0 setlinewidth
10.0 setmiterlimit
1 setlinejoin
1 setlinecap
[ ] 0 setdash
newpath
343.23212 -186.83984 moveto
343.23212 -188.56606 341.83273 -189.96541 340.10657 -189.96541 curveto
338.38037 -189.96541 336.98102 -188.56606 336.98102 -186.83984 curveto
336.98102 -185.11363 338.38037 -183.71428 340.10657 -183.71428 curveto
341.83273 -183.71428 343.23212 -185.11363 343.23212 -186.83984 curveto
closepath
stroke
newpath
0.2509804 0.2509804 0.2509804 setrgbcolor
newpath
344.97754 -180.2406 moveto
344.97754 -171.20578 lineto
347.43768 -171.20578 lineto
348.52838 -171.20578 349.3118 -171.38994 349.78796 -171.75826 curveto
350.26413 -172.12656 350.5022 -172.73193 350.5022 -173.57437 curveto
350.5022 -174.53484 350.17664 -175.28773 349.52548 -175.83307 curveto
348.87433 -176.37842 347.97083 -176.6511 346.81503 -176.6511 curveto
346.24728 -176.6511 lineto
346.24728 -180.2406 lineto
closepath
346.24728 -175.68047 moveto
346.76617 -175.68047 lineto
347.52722 -175.68047 348.1153 -175.50546 348.53043 -175.15547 curveto
348.94553 -174.80547 349.15308 -174.31099 349.15308 -173.67204 curveto
349.15308 -173.13077 348.9903 -172.74416 348.66473 -172.51218 curveto
348.33914 -172.2802 347.79584 -172.1642 347.0348 -172.1642 curveto
346.24728 -172.1642 lineto
closepath
fill
newpath
grestore
grestore
showpage

%%EOF