%!PS-Adobe-3.0 EPSF-3.0
%%Creator: EpsGraphics2D 0.9.0 by Paul Mutton, http://www.jibble.org/
%%Title: GeoGebra, http://www.geogebra.org
%%CreationDate: Wed Apr 16 15:34:36 CEST 2008
%%BoundingBox: 0 0 334 267
%%DocumentData: Clean7Bit
%%DocumentProcessColors: Black
%%ColorUsage: Color
%%Origin: 0 0
%%Pages: 1
%%Page: 1 1
%%EndComments

gsave
-0.0 267.0 translate
1.0 setlinewidth
10.0 setmiterlimit
0 setlinejoin
2 setlinecap
[ ] 0 setdash
gsave
newpath
0.0 -0.0 moveto
334.43488 -0.0 lineto
334.43488 -267.7563 lineto
0.0 -267.7563 lineto
0.0 -0.0 lineto
closepath
clip
newpath
1.0 setlinewidth
10.0 setmiterlimit
0 setlinejoin
2 setlinecap
[ ] 0 setdash
1.0 1.0 1.0 setrgbcolor
newpath
-59.38563 135.44092 moveto
677.2046 135.44092 lineto
677.2046 -510.50806 lineto
-59.38563 -510.50806 lineto
-59.38563 135.44092 lineto
closepath
fill
newpath
0.0 0.0 0.0 setrgbcolor
1.0 setlinewidth
10.0 setmiterlimit
1 setlinejoin
1 setlinecap
[ ] 0 setdash
newpath
194.23595 -236.21535 moveto
290.64417 -176.76047 lineto
stroke
newpath
0.0 0.0 0.0 setrgbcolor
1.0 setlinewidth
10.0 setmiterlimit
1 setlinejoin
1 setlinecap
[ ] 0 setdash
newpath
210.80266 -37.429214 moveto
137.54303 -179.52242 lineto
stroke
newpath
0.0 0.0 0.0 setrgbcolor
1.0 setlinewidth
10.0 setmiterlimit
1 setlinejoin
1 setlinecap
[ ] 0 setdash
newpath
137.54303 -179.52242 moveto
194.23595 -236.21535 lineto
stroke
newpath
0.0 0.0 0.0 setrgbcolor
1.0 setlinewidth
10.0 setmiterlimit
1 setlinejoin
1 setlinecap
[ ] 0 setdash
newpath
194.23595 -236.21535 moveto
210.80266 -37.429214 lineto
stroke
newpath
0.0 0.0 0.0 setrgbcolor
1.0 setlinewidth
10.0 setmiterlimit
1 setlinejoin
1 setlinecap
[ ] 0 setdash
newpath
210.80266 -37.429214 moveto
290.64417 -176.76047 lineto
stroke
newpath
0.0 0.0 0.0 setrgbcolor
1.0 setlinewidth
10.0 setmiterlimit
1 setlinejoin
0 setlinecap
[ 9.0 8.0 ] 0 setdash
newpath
290.64417 -176.76047 moveto
137.54303 -179.52242 lineto
stroke
newpath
0.0 0.0 0.0 setrgbcolor
newpath
195.2778 -236.21535 moveto
195.2778 -236.79074 194.81134 -237.2572 194.23595 -237.2572 curveto
193.66054 -237.2572 193.19409 -236.79074 193.19409 -236.21535 curveto
193.19409 -235.63995 193.66054 -235.1735 194.23595 -235.1735 curveto
194.81134 -235.1735 195.2778 -235.63995 195.2778 -236.21535 curveto
closepath
fill
newpath
0.0 0.0 0.0 setrgbcolor
1.0 setlinewidth
10.0 setmiterlimit
1 setlinejoin
1 setlinecap
[ ] 0 setdash
newpath
195.2778 -236.21535 moveto
195.2778 -236.79074 194.81134 -237.2572 194.23595 -237.2572 curveto
193.66054 -237.2572 193.19409 -236.79074 193.19409 -236.21535 curveto
193.19409 -235.63995 193.66054 -235.1735 194.23595 -235.1735 curveto
194.81134 -235.1735 195.2778 -235.63995 195.2778 -236.21535 curveto
closepath
stroke
newpath
0.0 0.0 0.0 setrgbcolor
newpath
197.77914 -254.43805 moveto
196.37508 -254.43805 195.2905 -254.02599 194.52539 -253.20187 curveto
193.76027 -252.37775 193.37772 -251.21075 193.37772 -249.70088 curveto
193.37772 -248.19507 193.7674 -247.02705 194.54675 -246.19682 curveto
195.32611 -245.36661 196.42392 -244.95149 197.8402 -244.95149 curveto
198.65007 -244.95149 199.59831 -245.08376 200.68494 -245.34828 curveto
200.68494 -246.5509 lineto
199.44774 -246.12358 198.49338 -245.90991 197.82188 -245.90991 curveto
196.84106 -245.90991 196.08206 -246.2416 195.54486 -246.90497 curveto
195.00764 -247.56833 194.73904 -248.50436 194.73904 -249.71309 curveto
194.73904 -250.86482 195.02596 -251.77339 195.5998 -252.4388 curveto
196.17363 -253.10419 196.95706 -253.43689 197.95007 -253.43689 curveto
198.80472 -253.43689 199.72041 -253.1744 200.69714 -252.6494 curveto
200.69714 -253.74823 lineto
199.80588 -254.20811 198.8332 -254.43805 197.77914 -254.43805 curveto
closepath
fill
newpath
0.0 0.0 0.0 setrgbcolor
newpath
291.68604 -176.76047 moveto
291.68604 -177.33586 291.21954 -177.80232 290.64417 -177.80232 curveto
290.0688 -177.80232 289.60233 -177.33586 289.60233 -176.76047 curveto
289.60233 -176.18504 290.0688 -175.71861 290.64417 -175.71861 curveto
291.21954 -175.71861 291.68604 -176.18504 291.68604 -176.76047 curveto
closepath
fill
newpath
0.0 0.0 0.0 setrgbcolor
1.0 setlinewidth
10.0 setmiterlimit
1 setlinejoin
1 setlinecap
[ ] 0 setdash
newpath
291.68604 -176.76047 moveto
291.68604 -177.33586 291.21954 -177.80232 290.64417 -177.80232 curveto
290.0688 -177.80232 289.60233 -177.33586 289.60233 -176.76047 curveto
289.60233 -176.18504 290.0688 -175.71861 290.64417 -175.71861 curveto
291.21954 -175.71861 291.68604 -176.18504 291.68604 -176.76047 curveto
closepath
stroke
newpath
0.0 0.0 0.0 setrgbcolor
newpath
297.05228 -172.94763 moveto
297.05228 -163.91281 lineto
300.05576 -163.91281 lineto
300.9511 -163.91281 301.6745 -164.01251 302.22595 -164.21193 curveto
302.7774 -164.41135 303.25458 -164.74915 303.65747 -165.2253 curveto
304.29642 -165.98227 304.6159 -166.97935 304.6159 -168.21655 curveto
304.6159 -169.71829 304.21912 -170.88223 303.4255 -171.70839 curveto
302.6319 -172.53455 301.51477 -172.94763 300.07407 -172.94763 curveto
closepath
298.33426 -171.98921 moveto
299.9764 -171.98921 lineto
301.1485 -171.98921 301.9787 -171.67381 302.46707 -171.043 curveto
302.99207 -170.37149 303.25458 -169.47005 303.25458 -168.33865 curveto
303.25458 -167.27644 302.99615 -166.44215 302.47928 -165.83577 curveto
302.16592 -165.46542 301.7915 -165.21208 301.35605 -165.07574 curveto
300.9206 -164.9394 300.26535 -164.87123 299.39035 -164.87123 curveto
298.33426 -164.87123 lineto
closepath
fill
newpath
0.0 0.0 0.0 setrgbcolor
newpath
268.62582 -191.62418 moveto
268.62582 -192.775 267.6929 -193.70789 266.5421 -193.70789 curveto
265.3913 -193.70789 264.4584 -192.775 264.4584 -191.62418 curveto
264.4584 -190.47339 265.3913 -189.54047 266.5421 -189.54047 curveto
267.6929 -189.54047 268.62582 -190.47339 268.62582 -191.62418 curveto
closepath
fill
newpath
0.0 0.0 0.0 setrgbcolor
1.0 setlinewidth
10.0 setmiterlimit
1 setlinejoin
1 setlinecap
[ ] 0 setdash
newpath
268.62582 -191.62418 moveto
268.62582 -192.775 267.6929 -193.70789 266.5421 -193.70789 curveto
265.3913 -193.70789 264.4584 -192.775 264.4584 -191.62418 curveto
264.4584 -190.47339 265.3913 -189.54047 266.5421 -189.54047 curveto
267.6929 -189.54047 268.62582 -190.47339 268.62582 -191.62418 curveto
closepath
stroke
newpath
0.0 0.0 0.0 setrgbcolor
newpath
274.13153 -210.45435 moveto
274.13153 -201.41953 lineto
275.33414 -201.41953 lineto
275.33414 -205.86368 lineto
278.99078 -201.41953 lineto
280.27887 -201.41953 lineto
276.7382 -205.72939 lineto
280.90762 -210.45435 lineto
279.2838 -210.45435 lineto
275.33414 -205.87589 lineto
275.33414 -210.45435 lineto
closepath
fill
newpath
0.0 0.0 0.0 setrgbcolor
newpath
211.84451 -37.429214 moveto
211.84451 -38.004623 211.37808 -38.47107 210.80266 -38.47107 curveto
210.22726 -38.47107 209.7608 -38.004623 209.7608 -37.429214 curveto
209.7608 -36.853825 210.22726 -36.387363 210.80266 -36.387363 curveto
211.37808 -36.387363 211.84451 -36.853825 211.84451 -37.429214 curveto
closepath
fill
newpath
0.0 0.0 0.0 setrgbcolor
1.0 setlinewidth
10.0 setmiterlimit
1 setlinejoin
1 setlinecap
[ ] 0 setdash
newpath
211.84451 -37.429214 moveto
211.84451 -38.004623 211.37808 -38.47107 210.80266 -38.47107 curveto
210.22726 -38.47107 209.7608 -38.004623 209.7608 -37.429214 curveto
209.7608 -36.853825 210.22726 -36.387363 210.80266 -36.387363 curveto
211.37808 -36.387363 211.84451 -36.853825 211.84451 -37.429214 curveto
closepath
stroke
newpath
0.0 0.0 0.0 setrgbcolor
newpath
206.8221 -15.298149 moveto
205.28374 -11.403409 lineto
203.73927 -15.298149 lineto
closepath
208.17732 -18.753357 moveto
207.19449 -16.250467 lineto
203.3669 -16.250467 lineto
202.37184 -18.753357 lineto
201.18144 -18.753357 lineto
204.76485 -9.718537 lineto
206.0346 -9.718537 lineto
209.56308 -18.753357 lineto
closepath
fill
newpath
0.0 0.0 0.0 setrgbcolor
newpath
138.58488 -179.52242 moveto
138.58488 -180.09781 138.11842 -180.56427 137.54303 -180.56427 curveto
136.96762 -180.56427 136.50117 -180.09781 136.50117 -179.52242 curveto
136.50117 -178.94704 136.96762 -178.48058 137.54303 -178.48058 curveto
138.11842 -178.48058 138.58488 -178.94704 138.58488 -179.52242 curveto
closepath
fill
newpath
0.0 0.0 0.0 setrgbcolor
1.0 setlinewidth
10.0 setmiterlimit
1 setlinejoin
1 setlinecap
[ ] 0 setdash
newpath
138.58488 -179.52242 moveto
138.58488 -180.09781 138.11842 -180.56427 137.54303 -180.56427 curveto
136.96762 -180.56427 136.50117 -180.09781 136.50117 -179.52242 curveto
136.50117 -178.94704 136.96762 -178.48058 137.54303 -178.48058 curveto
138.11842 -178.48058 138.58488 -178.94704 138.58488 -179.52242 curveto
closepath
stroke
newpath
0.0 0.0 0.0 setrgbcolor
newpath
129.31392 -167.73837 moveto
129.31392 -158.70355 lineto
131.6581 -158.70355 lineto
132.56158 -158.70355 133.25446 -158.87448 133.73671 -159.21634 curveto
134.21898 -159.5582 134.46011 -160.05063 134.46011 -160.69365 curveto
134.46011 -161.7884 133.8415 -162.56776 132.60431 -163.03171 curveto
134.08162 -163.48344 134.82028 -164.29944 134.82028 -165.47966 curveto
134.82028 -166.21222 134.5761 -166.7718 134.08772 -167.15843 curveto
133.59937 -167.54506 132.8953 -167.73837 131.97554 -167.73837 curveto
closepath
130.58368 -166.77994 moveto
130.84618 -166.77994 lineto
131.78629 -166.77994 132.39471 -166.72093 132.67146 -166.6029 curveto
133.20053 -166.37907 133.46506 -165.96396 133.46506 -165.35757 curveto
133.46506 -164.82036 133.22495 -164.3737 132.74472 -164.01761 curveto
132.26448 -163.66151 131.6642 -163.48346 130.94385 -163.48346 curveto
130.58368 -163.48346 lineto
closepath
130.58368 -162.67154 moveto
130.99269 -162.67154 lineto
131.6764 -162.67154 132.2065 -162.52502 132.58295 -162.23201 curveto
132.9594 -161.939 133.14761 -161.52591 133.14761 -160.99277 curveto
133.14761 -160.10558 132.45982 -159.66197 131.08426 -159.66197 curveto
130.58368 -159.66197 lineto
closepath
fill
newpath
0.0 0.0 0.0 setrgbcolor
newpath
167.97319 -207.86888 moveto
167.97319 -209.0197 167.04028 -209.95259 165.88948 -209.95259 curveto
164.73868 -209.95259 163.80577 -209.0197 163.80577 -207.86888 curveto
163.80577 -206.71808 164.73868 -205.78519 165.88948 -205.78519 curveto
167.04028 -205.78519 167.97319 -206.71808 167.97319 -207.86888 curveto
closepath
fill
newpath
0.0 0.0 0.0 setrgbcolor
1.0 setlinewidth
10.0 setmiterlimit
1 setlinejoin
1 setlinecap
[ ] 0 setdash
newpath
167.97319 -207.86888 moveto
167.97319 -209.0197 167.04028 -209.95259 165.88948 -209.95259 curveto
164.73868 -209.95259 163.80577 -209.0197 163.80577 -207.86888 curveto
163.80577 -206.71808 164.73868 -205.78519 165.88948 -205.78519 curveto
167.04028 -205.78519 167.97319 -206.71808 167.97319 -207.86888 curveto
closepath
stroke
newpath
0.0 0.0 0.0 setrgbcolor
newpath
162.64713 -226.08214 moveto
162.64713 -217.04732 lineto
163.9291 -217.04732 lineto
163.9291 -226.08214 lineto
closepath
fill
newpath
grestore
grestore
showpage

%%EOF