%!PS-Adobe-3.0 EPSF-3.0
%%Creator: EpsGraphics2D 0.9.0 by Paul Mutton, http://www.jibble.org/
%%Title: GeoGebra, http://www.geogebra.org
%%CreationDate: Thu Feb 21 19:20:59 CET 2008
%%BoundingBox: 0 0 98 147
%%DocumentData: Clean7Bit
%%DocumentProcessColors: Black
%%ColorUsage: Color
%%Origin: 0 0
%%Pages: 1
%%Page: 1 1
%%EndComments

gsave
-0.0 147.0 translate
1.0 setlinewidth
10.0 setmiterlimit
0 setlinejoin
2 setlinecap
[ ] 0 setdash
gsave
newpath
0.0 -0.0 moveto
98.35048 -0.0 lineto
98.35048 -147.835 lineto
0.0 -147.835 lineto
0.0 -0.0 lineto
closepath
clip
newpath
1.0 setlinewidth
10.0 setmiterlimit
0 setlinejoin
2 setlinecap
[ ] 0 setdash
1.0 1.0 1.0 setrgbcolor
newpath
-181.23705 53.814415 moveto
215.25766 53.814415 lineto
215.25766 -297.52567 lineto
-181.23705 -297.52567 lineto
-181.23705 53.814415 lineto
closepath
fill
newpath
0.6 0.6 0.6 setrgbcolor
1.0 setlinewidth
10.0 setmiterlimit
1 setlinejoin
0 setlinecap
[ 5.0 4.0 ] 0 setdash
newpath
-166.70087 53.814415 moveto
-166.70087 -297.52567 lineto
stroke
newpath
newpath
-166.70087 53.814415 moveto
-166.70087 -297.52567 lineto
stroke
newpath
newpath
-138.35442 53.814415 moveto
-138.35442 -297.52567 lineto
stroke
newpath
newpath
-110.00795 53.814415 moveto
-110.00795 -297.52567 lineto
stroke
newpath
newpath
-81.6615 53.814415 moveto
-81.6615 -297.52567 lineto
stroke
newpath
newpath
-53.315037 53.814415 moveto
-53.315037 -297.52567 lineto
stroke
newpath
newpath
-24.968584 53.814415 moveto
-24.968584 -297.52567 lineto
stroke
newpath
newpath
3.3778794 53.814415 moveto
3.3778794 -297.52567 lineto
stroke
newpath
newpath
31.724333 53.814415 moveto
31.724333 -297.52567 lineto
stroke
newpath
newpath
60.070786 53.814415 moveto
60.070786 -297.52567 lineto
stroke
newpath
newpath
88.41724 53.814415 moveto
88.41724 -297.52567 lineto
stroke
newpath
newpath
116.763695 53.814415 moveto
116.763695 -297.52567 lineto
stroke
newpath
newpath
145.11017 53.814415 moveto
145.11017 -297.52567 lineto
stroke
newpath
newpath
173.45662 53.814415 moveto
173.45662 -297.52567 lineto
stroke
newpath
newpath
201.80307 53.814415 moveto
201.80307 -297.52567 lineto
stroke
newpath
newpath
-181.23705 53.35146 moveto
215.25766 53.35146 lineto
stroke
newpath
newpath
-181.23705 53.35146 moveto
215.25766 53.35146 lineto
stroke
newpath
newpath
-181.23705 25.005001 moveto
215.25766 25.005001 lineto
stroke
newpath
newpath
-181.23705 -3.3414567 moveto
215.25766 -3.3414567 lineto
stroke
newpath
newpath
-181.23705 -31.68791 moveto
215.25766 -31.68791 lineto
stroke
newpath
newpath
-181.23705 -60.034374 moveto
215.25766 -60.034374 lineto
stroke
newpath
newpath
-181.23705 -88.38083 moveto
215.25766 -88.38083 lineto
stroke
newpath
newpath
-181.23705 -116.72728 moveto
215.25766 -116.72728 lineto
stroke
newpath
newpath
-181.23705 -145.07373 moveto
215.25766 -145.07373 lineto
stroke
newpath
newpath
-181.23705 -173.42021 moveto
215.25766 -173.42021 lineto
stroke
newpath
newpath
-181.23705 -201.76666 moveto
215.25766 -201.76666 lineto
stroke
newpath
newpath
-181.23705 -230.11311 moveto
215.25766 -230.11311 lineto
stroke
newpath
newpath
-181.23705 -258.45956 moveto
215.25766 -258.45956 lineto
stroke
newpath
newpath
-181.23705 -286.80603 moveto
215.25766 -286.80603 lineto
stroke
newpath
0.2 0.2 0.2 setrgbcolor
newpath
-164.08902 -67.09525 moveto
-164.08902 -66.648254 lineto
-161.407 -66.648254 lineto
-161.407 -67.09525 lineto
closepath
-160.02672 -68.65977 moveto
-159.96832 -68.31143 -159.88527 -68.01041 -159.77754 -67.7567 curveto
-159.66983 -67.503 -159.47905 -67.154655 -159.2052 -66.71168 curveto
-157.985 -64.74849 lineto
-160.28647 -64.74849 lineto
-160.28647 -64.189735 lineto
-157.41719 -64.189735 lineto
-157.41719 -64.74849 lineto
-158.5629 -66.43784 -159.2042 -67.7416 -159.34111 -68.65977 curveto
closepath
fill
newpath
1.8 setlinewidth
10.0 setmiterlimit
0 setlinejoin
0 setlinecap
[ ] 0 setdash
newpath
-166.70087 -60.034374 moveto
-166.70087 -62.5086 lineto
stroke
newpath
newpath
-135.63542 -67.09525 moveto
-135.63542 -66.648254 lineto
-132.9534 -66.648254 lineto
-132.9534 -67.09525 lineto
closepath
-131.44023 -66.3432 moveto
-131.15633 -65.974724 -130.79892 -65.79049 -130.36803 -65.79049 curveto
-129.9774 -65.79049 -129.65776 -65.91986 -129.40909 -66.1786 curveto
-129.16042 -66.43733 -129.03607 -66.769066 -129.03607 -67.17378 curveto
-129.03607 -67.63891 -129.1755 -68.021484 -129.45439 -68.321495 curveto
-129.73326 -68.62151 -130.08714 -68.77152 -130.51602 -68.77152 curveto
-131.00934 -68.77152 -131.39493 -68.57319 -131.67279 -68.17652 curveto
-131.95067 -67.77986 -132.0896 -67.22916 -132.0896 -66.52442 curveto
-132.0896 -65.749214 -131.93002 -65.14717 -131.61089 -64.718285 curveto
-131.29173 -64.2894 -130.84221 -64.07496 -130.26231 -64.07496 curveto
-129.99652 -64.07496 -129.66429 -64.13134 -129.26562 -64.244095 curveto
-129.26562 -64.76359 lineto
-129.68645 -64.60251 -130.03076 -64.521965 -130.29855 -64.521965 curveto
-131.05968 -64.521965 -131.44023 -65.12904 -131.44023 -66.3432 curveto
closepath
-129.6341 -67.30668 moveto
-129.6341 -66.96841 -129.7101 -66.70262 -129.86212 -66.50932 curveto
-130.01414 -66.31602 -130.22507 -66.21937 -130.49487 -66.21937 curveto
-130.74657 -66.21937 -130.96303 -66.30394 -131.14424 -66.473076 curveto
-131.32547 -66.64221 -131.41608 -66.84558 -131.41608 -67.083176 curveto
-131.41608 -67.457695 -131.33 -67.75821 -131.15784 -67.98473 curveto
-130.98567 -68.21126 -130.75764 -68.32452 -130.47374 -68.32452 curveto
-130.21802 -68.32452 -130.01414 -68.2324 -129.86212 -68.04816 curveto
-129.7101 -67.86392 -129.6341 -67.61676 -129.6341 -67.30668 curveto
closepath
fill
newpath
1.8 setlinewidth
10.0 setmiterlimit
0 setlinejoin
0 setlinecap
[ ] 0 setdash
newpath
-138.35442 -60.034374 moveto
-138.35442 -62.5086 lineto
stroke
newpath
newpath
-107.18182 -67.09525 moveto
-107.18182 -66.648254 lineto
-104.4998 -66.648254 lineto
-104.4998 -67.09525 lineto
closepath
-103.29772 -68.677895 moveto
-103.29772 -68.14632 lineto
-103.00174 -68.265114 -102.71984 -68.32452 -102.45204 -68.32452 curveto
-102.158066 -68.32452 -101.92701 -68.23794 -101.75888 -68.06477 curveto
-101.59075 -67.89161 -101.50669 -67.653 -101.50669 -67.34896 curveto
-101.50669 -66.67845 -101.968796 -66.3432 -102.893005 -66.3432 curveto
-102.99771 -66.3432 -103.107445 -66.35025 -103.22221 -66.36434 curveto
-103.22221 -64.189735 lineto
-100.960014 -64.189735 lineto
-100.960014 -64.70922 lineto
-102.69971 -64.70922 lineto
-102.69971 -65.88714 lineto
-102.12585 -65.88714 -101.67784 -66.01903 -101.355675 -66.2828 curveto
-101.03351 -66.54657 -100.87243 -66.912025 -100.87243 -67.379166 curveto
-100.87243 -67.81409 -101.01891 -68.15488 -101.31188 -68.401535 curveto
-101.60485 -68.64819 -102.01108 -68.77152 -102.53057 -68.77152 curveto
-102.75609 -68.77152 -103.0118 -68.74031 -103.29772 -68.677895 curveto
closepath
fill
newpath
1.8 setlinewidth
10.0 setmiterlimit
0 setlinejoin
0 setlinecap
[ ] 0 setdash
newpath
-110.00795 -60.034374 moveto
-110.00795 -62.5086 lineto
stroke
newpath
newpath
-79.34678 -67.09525 moveto
-79.34678 -66.648254 lineto
-76.66476 -66.648254 lineto
-76.66476 -67.09525 lineto
closepath
-73.886086 -68.65977 moveto
-73.886086 -67.394264 lineto
-75.897606 -67.394264 lineto
-75.897606 -66.944244 lineto
-73.886086 -64.189735 lineto
-73.32733 -64.189735 lineto
-73.32733 -66.908 lineto
-72.72932 -66.908 lineto
-72.72932 -67.394264 lineto
-73.32733 -67.394264 lineto
-73.32733 -68.65977 lineto
closepath
-75.31469 -66.908 moveto
-73.846825 -66.908 lineto
-73.846825 -64.92065 lineto
closepath
fill
newpath
1.8 setlinewidth
10.0 setmiterlimit
0 setlinejoin
0 setlinecap
[ ] 0 setdash
newpath
-81.6615 -60.034374 moveto
-81.6615 -62.5086 lineto
stroke
newpath
newpath
-50.893185 -67.09525 moveto
-50.893185 -66.648254 lineto
-48.211163 -66.648254 lineto
-48.211163 -67.09525 lineto
closepath
-47.132915 -68.62655 moveto
-47.132915 -68.07081 lineto
-46.706047 -68.239944 -46.36979 -68.32452 -46.124138 -68.32452 curveto
-45.84023 -68.32452 -45.609177 -68.241455 -45.43098 -68.07534 curveto
-45.252785 -67.909225 -45.163685 -67.69428 -45.163685 -67.43051 curveto
-45.163685 -66.802284 -45.60364 -66.488174 -46.483555 -66.488174 curveto
-46.719135 -66.488174 lineto
-46.719135 -66.08648 lineto
-46.510735 -66.08346 lineto
-45.68519 -66.08346 -45.272415 -65.7925 -45.272415 -65.210594 curveto
-45.272415 -64.753525 -45.544243 -64.52499 -46.087894 -64.52499 curveto
-46.385895 -64.52499 -46.7141 -64.60855 -47.07251 -64.77567 curveto
-47.07251 -64.25618 lineto
-46.720142 -64.13738 -46.377842 -64.07798 -46.04561 -64.07798 curveto
-45.131466 -64.07798 -44.674397 -64.4233 -44.674397 -65.113945 curveto
-44.674397 -65.63947 -44.985485 -66.01399 -45.607666 -66.237495 curveto
-44.88682 -66.40462 -44.5264 -66.79926 -44.5264 -67.42145 curveto
-44.5264 -67.84228 -44.665337 -68.17249 -44.943203 -68.4121 curveto
-45.22107 -68.65172 -45.602634 -68.77152 -46.087894 -68.77152 curveto
-46.363747 -68.77152 -46.71209 -68.7232 -47.132915 -68.62655 curveto
closepath
fill
newpath
1.8 setlinewidth
10.0 setmiterlimit
0 setlinejoin
0 setlinecap
[ ] 0 setdash
newpath
-53.315037 -60.034374 moveto
-53.315037 -62.5086 lineto
stroke
newpath
newpath
-22.439587 -67.09525 moveto
-22.439587 -66.648254 lineto
-19.757565 -66.648254 lineto
-19.757565 -67.09525 lineto
closepath
-18.79409 -68.65977 moveto
-18.79409 -68.13726 lineto
-18.620926 -67.732544 -18.27057 -67.29158 -17.743027 -66.81437 curveto
-17.401733 -66.50932 lineto
-16.962784 -66.112656 -16.743309 -65.71901 -16.743309 -65.328384 curveto
-16.743309 -65.078705 -16.818314 -64.882385 -16.96832 -64.739426 curveto
-17.118328 -64.596466 -17.324213 -64.52499 -17.585972 -64.52499 curveto
-17.896055 -64.52499 -18.26151 -64.64479 -18.682339 -64.8844 curveto
-18.682339 -64.35887 lineto
-18.285673 -64.17161 -17.892029 -64.07798 -17.501404 -64.07798 curveto
-17.08259 -64.07798 -16.74633 -64.190735 -16.492624 -64.41625 curveto
-16.23892 -64.64177 -16.112068 -64.94078 -16.112068 -65.313286 curveto
-16.112068 -65.581085 -16.175997 -65.81868 -16.303856 -66.02607 curveto
-16.431715 -66.23347 -16.669815 -66.48516 -17.018156 -66.78114 curveto
-17.247698 -66.97746 lineto
-17.724905 -67.38218 -18.00076 -67.76878 -18.07526 -68.13726 curveto
-16.13321 -68.13726 lineto
-16.13321 -68.65977 lineto
closepath
fill
newpath
1.8 setlinewidth
10.0 setmiterlimit
0 setlinejoin
0 setlinecap
[ ] 0 setdash
newpath
-24.968584 -60.034374 moveto
-24.968584 -62.5086 lineto
stroke
newpath
newpath
6.014012 -67.09525 moveto
6.014012 -66.648254 lineto
8.696034 -66.648254 lineto
8.696034 -67.09525 lineto
closepath
10.076309 -68.65977 moveto
10.076309 -68.21277 lineto
10.970317 -68.21277 lineto
10.970317 -64.68506 lineto
10.076309 -64.90856 lineto
10.076309 -64.44948 lineto
11.568336 -64.07798 lineto
11.568336 -68.21277 lineto
12.462342 -68.21277 lineto
12.462342 -68.65977 lineto
closepath
fill
newpath
1.8 setlinewidth
10.0 setmiterlimit
0 setlinejoin
0 setlinecap
[ ] 0 setdash
newpath
3.3778794 -60.034374 moveto
3.3778794 -62.5086 lineto
stroke
newpath
newpath
37.19675 -68.77152 moveto
36.73565 -68.77152 36.362644 -68.554565 36.07773 -68.12064 curveto
35.792812 -67.68673 35.650356 -67.12042 35.650356 -66.42173 curveto
35.650356 -65.716995 35.79382 -65.150185 36.08075 -64.721306 curveto
36.36768 -64.29242 36.74572 -64.07798 37.21487 -64.07798 curveto
37.68402 -64.07798 38.06206 -64.29242 38.34899 -64.721306 curveto
38.63592 -65.150185 38.779385 -65.713974 38.779385 -66.41267 curveto
38.779385 -67.129486 38.63592 -67.70183 38.34899 -68.12971 curveto
38.06206 -68.55759 37.677982 -68.77152 37.19675 -68.77152 curveto
closepath
37.20279 -68.32452 moveto
37.833027 -68.32452 38.148144 -67.68421 38.148144 -66.40361 curveto
38.148144 -65.15119 37.83705 -64.52499 37.21487 -64.52499 curveto
36.594704 -64.52499 36.28462 -65.157234 36.28462 -66.42173 curveto
36.28462 -67.690254 36.590675 -68.32452 37.20279 -68.32452 curveto
closepath
fill
newpath
1.8 setlinewidth
10.0 setmiterlimit
0 setlinejoin
0 setlinecap
[ ] 0 setdash
newpath
31.724333 -60.034374 moveto
31.724333 -62.5086 lineto
stroke
newpath
newpath
65.260124 -68.65977 moveto
65.260124 -68.21277 lineto
66.15413 -68.21277 lineto
66.15413 -64.68506 lineto
65.260124 -64.90856 lineto
65.260124 -64.44948 lineto
66.75215 -64.07798 lineto
66.75215 -68.21277 lineto
67.64616 -68.21277 lineto
67.64616 -68.65977 lineto
closepath
fill
newpath
1.8 setlinewidth
10.0 setmiterlimit
0 setlinejoin
0 setlinecap
[ ] 0 setdash
newpath
60.070786 -60.034374 moveto
60.070786 -62.5086 lineto
stroke
newpath
newpath
92.67837 -68.65977 moveto
92.67837 -68.13726 lineto
92.85153 -67.732544 93.20188 -67.29158 93.72943 -66.81437 curveto
94.070724 -66.50932 lineto
94.509674 -66.112656 94.72915 -65.71901 94.72915 -65.328384 curveto
94.72915 -65.078705 94.654144 -64.882385 94.504135 -64.739426 curveto
94.354126 -64.596466 94.14824 -64.52499 93.88648 -64.52499 curveto
93.5764 -64.52499 93.210945 -64.64479 92.790115 -64.8844 curveto
92.790115 -64.35887 lineto
93.18678 -64.17161 93.58043 -64.07798 93.971054 -64.07798 curveto
94.38987 -64.07798 94.72613 -64.190735 94.97983 -64.41625 curveto
95.233536 -64.64177 95.36039 -64.94078 95.36039 -65.313286 curveto
95.36039 -65.581085 95.29646 -65.81868 95.1686 -66.02607 curveto
95.04074 -66.23347 94.80264 -66.48516 94.4543 -66.78114 curveto
94.224754 -66.97746 lineto
93.74755 -67.38218 93.471695 -67.76878 93.397194 -68.13726 curveto
95.33925 -68.13726 lineto
95.33925 -68.65977 lineto
closepath
fill
newpath
1.8 setlinewidth
10.0 setmiterlimit
0 setlinejoin
0 setlinecap
[ ] 0 setdash
newpath
88.41724 -60.034374 moveto
88.41724 -62.5086 lineto
stroke
newpath
newpath
121.246735 -68.62655 moveto
121.246735 -68.07081 lineto
121.67361 -68.239944 122.009865 -68.32452 122.255516 -68.32452 curveto
122.53942 -68.32452 122.77047 -68.241455 122.94867 -68.07534 curveto
123.12687 -67.909225 123.215965 -67.69428 123.215965 -67.43051 curveto
123.215965 -66.802284 122.77601 -66.488174 121.8961 -66.488174 curveto
121.660515 -66.488174 lineto
121.660515 -66.08648 lineto
121.86892 -66.08346 lineto
122.694466 -66.08346 123.10724 -65.7925 123.10724 -65.210594 curveto
123.10724 -64.753525 122.83541 -64.52499 122.291756 -64.52499 curveto
121.99376 -64.52499 121.66555 -64.60855 121.307144 -64.77567 curveto
121.307144 -64.25618 lineto
121.65951 -64.13738 122.00181 -64.07798 122.334045 -64.07798 curveto
123.248184 -64.07798 123.70525 -64.4233 123.70525 -65.113945 curveto
123.70525 -65.63947 123.394165 -66.01399 122.77199 -66.237495 curveto
123.49283 -66.40462 123.85325 -66.79926 123.85325 -67.42145 curveto
123.85325 -67.84228 123.71432 -68.17249 123.43645 -68.4121 curveto
123.15858 -68.65172 122.777016 -68.77152 122.291756 -68.77152 curveto
122.0159 -68.77152 121.667564 -68.7232 121.246735 -68.62655 curveto
closepath
fill
newpath
1.8 setlinewidth
10.0 setmiterlimit
0 setlinejoin
0 setlinecap
[ ] 0 setdash
newpath
116.763695 -60.034374 moveto
116.763695 -62.5086 lineto
stroke
newpath
newpath
151.40076 -68.65977 moveto
151.40076 -67.394264 lineto
149.38924 -67.394264 lineto
149.38924 -66.944244 lineto
151.40076 -64.189735 lineto
151.95952 -64.189735 lineto
151.95952 -66.908 lineto
152.55754 -66.908 lineto
152.55754 -67.394264 lineto
151.95952 -67.394264 lineto
151.95952 -68.65977 lineto
closepath
149.97217 -66.908 moveto
151.44002 -66.908 lineto
151.44002 -64.92065 lineto
closepath
fill
newpath
1.8 setlinewidth
10.0 setmiterlimit
0 setlinejoin
0 setlinecap
[ ] 0 setdash
newpath
145.11017 -60.034374 moveto
145.11017 -62.5086 lineto
stroke
newpath
newpath
178.27777 -68.677895 moveto
178.27777 -68.14632 lineto
178.57375 -68.265114 178.85564 -68.32452 179.12344 -68.32452 curveto
179.41742 -68.32452 179.64847 -68.23794 179.8166 -68.06477 curveto
179.98474 -67.89161 180.0688 -67.653 180.0688 -67.34896 curveto
180.0688 -66.67845 179.60669 -66.3432 178.68248 -66.3432 curveto
178.57777 -66.3432 178.46803 -66.35025 178.35327 -66.36434 curveto
178.35327 -64.189735 lineto
180.61548 -64.189735 lineto
180.61548 -64.70922 lineto
178.87578 -64.70922 lineto
178.87578 -65.88714 lineto
179.44965 -65.88714 179.89766 -66.01903 180.21982 -66.2828 curveto
180.54198 -66.54657 180.70306 -66.912025 180.70306 -67.379166 curveto
180.70306 -67.81409 180.55658 -68.15488 180.26361 -68.401535 curveto
179.97064 -68.64819 179.5644 -68.77152 179.04492 -68.77152 curveto
178.81941 -68.77152 178.56369 -68.74031 178.27777 -68.677895 curveto
closepath
fill
newpath
1.8 setlinewidth
10.0 setmiterlimit
0 setlinejoin
0 setlinecap
[ ] 0 setdash
newpath
173.45662 -60.034374 moveto
173.45662 -62.5086 lineto
stroke
newpath
newpath
207.04245 -66.3432 moveto
207.32635 -65.974724 207.68376 -65.79049 208.11465 -65.79049 curveto
208.50528 -65.79049 208.82494 -65.91986 209.07361 -66.1786 curveto
209.32228 -66.43733 209.44661 -66.769066 209.44661 -67.17378 curveto
209.44661 -67.63891 209.30717 -68.021484 209.02829 -68.321495 curveto
208.74942 -68.62151 208.39554 -68.77152 207.96666 -68.77152 curveto
207.47334 -68.77152 207.08775 -68.57319 206.80989 -68.17652 curveto
206.53203 -67.77986 206.3931 -67.22916 206.3931 -66.52442 curveto
206.3931 -65.749214 206.55267 -65.14717 206.87181 -64.718285 curveto
207.19095 -64.2894 207.64047 -64.07496 208.22037 -64.07496 curveto
208.48616 -64.07496 208.81839 -64.13134 209.21707 -64.244095 curveto
209.21707 -64.76359 lineto
208.79625 -64.60251 208.45193 -64.521965 208.18413 -64.521965 curveto
207.423 -64.521965 207.04245 -65.12904 207.04245 -66.3432 curveto
closepath
208.84859 -67.30668 moveto
208.84859 -66.96841 208.77258 -66.70262 208.62056 -66.50932 curveto
208.46854 -66.31602 208.25763 -66.21937 207.98781 -66.21937 curveto
207.73611 -66.21937 207.51967 -66.30394 207.33844 -66.473076 curveto
207.15723 -66.64221 207.06662 -66.84558 207.06662 -67.083176 curveto
207.06662 -67.457695 207.1527 -67.75821 207.32484 -67.98473 curveto
207.49701 -68.21126 207.72504 -68.32452 208.00894 -68.32452 curveto
208.26466 -68.32452 208.46854 -68.2324 208.62056 -68.04816 curveto
208.77258 -67.86392 208.84859 -67.61676 208.84859 -67.30668 curveto
closepath
fill
newpath
1.8 setlinewidth
10.0 setmiterlimit
0 setlinejoin
0 setlinecap
[ ] 0 setdash
newpath
201.80307 -60.034374 moveto
201.80307 -62.5086 lineto
stroke
newpath
1.8 setlinewidth
10.0 setmiterlimit
0 setlinejoin
0 setlinecap
[ ] 0 setdash
newpath
-181.23705 -60.034374 moveto
215.25766 -60.034374 lineto
stroke
newpath
newpath
214.6391 -60.034374 moveto
212.16487 -57.560146 lineto
stroke
newpath
newpath
214.6391 -60.034374 moveto
212.16487 -62.5086 lineto
stroke
newpath
newpath
25.989037 26.631151 moveto
25.989037 27.186886 lineto
26.415905 27.01775 26.752165 26.933182 26.997816 26.933182 curveto
27.281723 26.933182 27.512775 27.01624 27.690973 27.182356 curveto
27.869171 27.348473 27.95827 27.563416 27.95827 27.827188 curveto
27.95827 28.45541 27.518312 28.769522 26.638401 28.769522 curveto
26.402817 28.769522 lineto
26.402817 29.17122 lineto
26.611217 29.17424 lineto
27.436766 29.17424 27.849539 29.465195 27.849539 30.047106 curveto
27.849539 30.504177 27.577713 30.732714 27.03406 30.732714 curveto
26.736057 30.732714 26.40785 30.649153 26.049442 30.482029 curveto
26.049442 31.00152 lineto
26.401812 31.120317 26.744112 31.179716 27.076344 31.179716 curveto
27.990486 31.179716 28.447557 30.834396 28.447557 30.143755 curveto
28.447557 29.618225 28.136467 29.243708 27.514286 29.020206 curveto
28.23513 28.853083 28.595552 28.458431 28.595552 27.83625 curveto
28.595552 27.415422 28.45662 27.085203 28.178751 26.845592 curveto
27.900885 26.605982 27.519321 26.486177 27.03406 26.486177 curveto
26.758205 26.486177 26.409864 26.534502 25.989037 26.631151 curveto
closepath
fill
newpath
1.8 setlinewidth
10.0 setmiterlimit
0 setlinejoin
0 setlinecap
[ ] 0 setdash
newpath
29.250107 25.005001 moveto
31.724333 25.005001 lineto
stroke
newpath
newpath
25.874266 -1.8556695 moveto
25.874266 -1.3331584 lineto
26.04743 -0.9284388 26.397785 -0.48747563 26.92533 -0.010269004 curveto
27.266623 0.29478082 lineto
27.705572 0.6914463 27.925047 1.0850915 27.925047 1.4757164 curveto
27.925047 1.7253941 27.850042 1.9217132 27.700035 2.064674 curveto
27.550028 2.2076347 27.344143 2.279115 27.082384 2.279115 curveto
26.7723 2.279115 26.406845 2.1593099 25.986017 1.9196997 curveto
25.986017 2.4452312 lineto
26.382683 2.6324894 26.776327 2.7261186 27.166952 2.7261186 curveto
27.585766 2.7261186 27.922026 2.613361 28.175732 2.3878455 curveto
28.429436 2.1623302 28.556288 1.863321 28.556288 1.4908178 curveto
28.556288 1.2230182 28.49236 0.98542166 28.3645 0.7780281 curveto
28.23664 0.5706345 27.99854 0.3189432 27.6502 0.022954244 curveto
27.420658 -0.17336495 lineto
26.94345 -0.5780845 26.667597 -0.96468234 26.593096 -1.3331584 curveto
28.535147 -1.3331584 lineto
28.535147 -1.8556695 lineto
closepath
fill
newpath
1.8 setlinewidth
10.0 setmiterlimit
0 setlinejoin
0 setlinecap
[ ] 0 setdash
newpath
29.250107 -3.3414567 moveto
31.724333 -3.3414567 lineto
stroke
newpath
newpath
26.291067 -30.309267 moveto
26.291067 -29.862265 lineto
27.185074 -29.862265 lineto
27.185074 -26.334558 lineto
26.291067 -26.558062 lineto
26.291067 -26.098976 lineto
27.783092 -25.72748 lineto
27.783092 -29.862265 lineto
28.6771 -29.862265 lineto
28.6771 -30.309267 lineto
closepath
fill
newpath
1.8 setlinewidth
10.0 setmiterlimit
0 setlinejoin
0 setlinecap
[ ] 0 setdash
newpath
29.250107 -31.68791 moveto
31.724333 -31.68791 lineto
stroke
newpath
newpath
27.299845 -58.87462 moveto
26.838747 -58.87462 26.46574 -58.65766 26.180826 -58.223743 curveto
25.895912 -57.789825 25.753454 -57.223522 25.753454 -56.524826 curveto
25.753454 -55.82009 25.896917 -55.253284 26.183846 -54.8244 curveto
26.470774 -54.39552 26.848814 -54.181076 27.317966 -54.181076 curveto
27.787119 -54.181076 28.16516 -54.39552 28.452087 -54.8244 curveto
28.739016 -55.253284 28.88248 -55.81707 28.88248 -56.515766 curveto
28.88248 -57.232582 28.739016 -57.804928 28.452087 -58.232803 curveto
28.16516 -58.66068 27.781078 -58.87462 27.299845 -58.87462 curveto
closepath
27.305885 -58.427612 moveto
27.936121 -58.427612 28.251238 -57.78731 28.251238 -56.506706 curveto
28.251238 -55.25429 27.940147 -54.628082 27.317966 -54.628082 curveto
26.6978 -54.628082 26.387716 -55.26033 26.387716 -56.524826 curveto
26.387716 -57.79335 26.693773 -58.427612 27.305885 -58.427612 curveto
closepath
fill
newpath
1.8 setlinewidth
10.0 setmiterlimit
0 setlinejoin
0 setlinecap
[ ] 0 setdash
newpath
29.250107 -60.034374 moveto
31.724333 -60.034374 lineto
stroke
newpath
newpath
22.096481 -85.033394 moveto
22.096481 -84.58639 lineto
24.778503 -84.58639 lineto
24.778503 -85.033394 lineto
closepath
26.158777 -86.59791 moveto
26.158777 -86.1509 lineto
27.052786 -86.1509 lineto
27.052786 -82.6232 lineto
26.158777 -82.8467 lineto
26.158777 -82.38762 lineto
27.650805 -82.01612 lineto
27.650805 -86.1509 lineto
28.544811 -86.1509 lineto
28.544811 -86.59791 lineto
closepath
fill
newpath
1.8 setlinewidth
10.0 setmiterlimit
0 setlinejoin
0 setlinecap
[ ] 0 setdash
newpath
29.250107 -88.38083 moveto
31.724333 -88.38083 lineto
stroke
newpath
newpath
22.096481 -113.48699 moveto
22.096481 -113.039986 lineto
24.778503 -113.039986 lineto
24.778503 -113.48699 lineto
closepath
25.741978 -115.051506 moveto
25.741978 -114.52899 lineto
25.91514 -114.124275 26.265495 -113.68331 26.79304 -113.20611 curveto
27.134333 -112.901054 lineto
27.573282 -112.504395 27.792757 -112.11075 27.792757 -111.72012 curveto
27.792757 -111.47044 27.717752 -111.274124 27.567745 -111.131165 curveto
27.417738 -110.988205 27.211855 -110.916725 26.950096 -110.916725 curveto
26.640013 -110.916725 26.274555 -111.03653 25.853727 -111.27614 curveto
25.853727 -110.7506 lineto
26.250393 -110.56335 26.64404 -110.46972 27.034664 -110.46972 curveto
27.453478 -110.46972 27.789738 -110.58247 28.043442 -110.80799 curveto
28.297148 -111.03351 28.424 -111.33251 28.424 -111.70502 curveto
28.424 -111.97282 28.36007 -112.21042 28.23221 -112.41781 curveto
28.104351 -112.6252 27.866251 -112.87689 27.51791 -113.17288 curveto
27.288368 -113.3692 lineto
26.811161 -113.77392 26.535307 -114.160515 26.460808 -114.52899 curveto
28.402857 -114.52899 lineto
28.402857 -115.051506 lineto
closepath
fill
newpath
1.8 setlinewidth
10.0 setmiterlimit
0 setlinejoin
0 setlinecap
[ ] 0 setdash
newpath
29.250107 -116.72728 moveto
31.724333 -116.72728 lineto
stroke
newpath
newpath
22.096481 -141.9406 moveto
22.096481 -141.49359 lineto
24.778503 -141.49359 lineto
24.778503 -141.9406 lineto
closepath
25.856749 -143.47188 moveto
25.856749 -142.91615 lineto
26.283617 -143.08528 26.619877 -143.16985 26.865526 -143.16985 curveto
27.149435 -143.16985 27.380487 -143.08679 27.558685 -142.92067 curveto
27.736883 -142.75456 27.825981 -142.53963 27.825981 -142.27585 curveto
27.825981 -141.64763 27.386024 -141.33351 26.506111 -141.33351 curveto
26.270529 -141.33351 lineto
26.270529 -140.93181 lineto
26.47893 -140.92879 lineto
27.304478 -140.92879 27.71725 -140.63783 27.71725 -140.05592 curveto
27.71725 -139.59885 27.445423 -139.37032 26.90177 -139.37032 curveto
26.603767 -139.37032 26.275562 -139.45387 25.917154 -139.621 curveto
25.917154 -139.10152 lineto
26.269522 -138.98271 26.611822 -138.92331 26.944056 -138.92331 curveto
27.858198 -138.92331 28.31527 -139.26863 28.31527 -139.95927 curveto
28.31527 -140.4848 28.004179 -140.85933 27.381998 -141.08282 curveto
28.10284 -141.24995 28.463263 -141.6446 28.463263 -142.26678 curveto
28.463263 -142.6876 28.32433 -143.01784 28.046463 -143.25745 curveto
27.768595 -143.49706 27.387032 -143.61685 26.90177 -143.61685 curveto
26.625916 -143.61685 26.277576 -143.56853 25.856749 -143.47188 curveto
closepath
fill
newpath
1.8 setlinewidth
10.0 setmiterlimit
0 setlinejoin
0 setlinecap
[ ] 0 setdash
newpath
29.250107 -145.07373 moveto
31.724333 -145.07373 lineto
stroke
newpath
newpath
22.096481 -170.3942 moveto
22.096481 -169.94719 lineto
24.778503 -169.94719 lineto
24.778503 -170.3942 lineto
closepath
27.557175 -171.95871 moveto
27.557175 -170.69319 lineto
25.545658 -170.69319 lineto
25.545658 -170.24318 lineto
27.557175 -167.48866 lineto
28.115929 -167.48866 lineto
28.115929 -170.20692 lineto
28.713947 -170.20692 lineto
28.713947 -170.69319 lineto
28.115929 -170.69319 lineto
28.115929 -171.95871 lineto
closepath
26.128574 -170.20692 moveto
27.59644 -170.20692 lineto
27.59644 -168.21957 lineto
closepath
fill
newpath
1.8 setlinewidth
10.0 setmiterlimit
0 setlinejoin
0 setlinecap
[ ] 0 setdash
newpath
29.250107 -173.42021 moveto
31.724333 -173.42021 lineto
stroke
newpath
newpath
22.096481 -198.8478 moveto
22.096481 -198.40079 lineto
24.778503 -198.40079 lineto
24.778503 -198.8478 lineto
closepath
25.980581 -200.43042 moveto
25.980581 -199.89885 lineto
26.27657 -200.01764 26.558464 -200.07704 26.826263 -200.07704 curveto
27.12024 -200.07704 27.351292 -199.99046 27.51942 -199.8173 curveto
27.687551 -199.64413 27.771616 -199.40553 27.771616 -199.10149 curveto
27.771616 -198.43098 27.309511 -198.09573 26.3853 -198.09573 curveto
26.280596 -198.09573 26.170858 -198.10278 26.056087 -198.11688 curveto
26.056087 -195.94226 lineto
28.318289 -195.94226 lineto
28.318289 -196.46176 lineto
26.578598 -196.46176 lineto
26.578598 -197.63966 lineto
27.152454 -197.63966 27.600466 -197.77155 27.92263 -198.03532 curveto
28.244795 -198.2991 28.405878 -198.66455 28.405878 -199.1317 curveto
28.405878 -199.56662 28.259394 -199.90741 27.966425 -200.15407 curveto
27.673456 -200.40073 27.267227 -200.52405 26.747736 -200.52405 curveto
26.52222 -200.52405 26.266502 -200.49284 25.980581 -200.43042 curveto
closepath
fill
newpath
1.8 setlinewidth
10.0 setmiterlimit
0 setlinejoin
0 setlinecap
[ ] 0 setdash
newpath
29.250107 -201.76666 moveto
31.724333 -201.76666 lineto
stroke
newpath
newpath
22.096481 -227.30139 moveto
22.096481 -226.85439 lineto
24.778503 -226.85439 lineto
24.778503 -227.30139 lineto
closepath
26.291672 -226.54933 moveto
26.575579 -226.18085 26.932981 -225.99661 27.363876 -225.99661 curveto
27.754501 -225.99661 28.074148 -226.12598 28.322819 -226.38472 curveto
28.57149 -226.64346 28.695826 -226.97519 28.695826 -227.37991 curveto
28.695826 -227.84505 28.556389 -228.22762 28.277515 -228.52762 curveto
27.99864 -228.82764 27.644762 -228.97765 27.215881 -228.97765 curveto
26.722567 -228.97765 26.336975 -228.77931 26.059109 -228.38264 curveto
25.78124 -227.986 25.642307 -227.43529 25.642307 -226.73055 curveto
25.642307 -225.95534 25.80188 -225.35329 26.121025 -224.92441 curveto
26.440168 -224.49553 26.889688 -224.2811 27.469585 -224.2811 curveto
27.735373 -224.2811 28.067604 -224.33748 28.466284 -224.45023 curveto
28.466284 -224.96971 lineto
28.045456 -224.80862 27.701141 -224.72809 27.433342 -224.72809 curveto
26.672228 -224.72809 26.291672 -225.33517 26.291672 -226.54933 curveto
closepath
28.097807 -227.5128 moveto
28.097807 -227.17453 28.021797 -226.90875 27.869776 -226.71545 curveto
27.717754 -226.52216 27.506836 -226.4255 27.237022 -226.4255 curveto
26.98533 -226.4255 26.768877 -226.51007 26.58766 -226.6792 curveto
26.406443 -226.84834 26.315834 -227.05171 26.315834 -227.2893 curveto
26.315834 -227.66382 26.401913 -227.96434 26.574068 -228.19086 curveto
26.746225 -228.41737 26.974258 -228.53064 27.258165 -228.53064 curveto
27.513884 -228.53064 27.717754 -228.43852 27.869776 -228.25429 curveto
28.021797 -228.07005 28.097807 -227.82289 28.097807 -227.5128 curveto
closepath
fill
newpath
1.8 setlinewidth
10.0 setmiterlimit
0 setlinejoin
0 setlinecap
[ ] 0 setdash
newpath
29.250107 -230.11311 moveto
31.724333 -230.11311 lineto
stroke
newpath
newpath
22.096481 -255.13643 moveto
22.096481 -254.68942 lineto
24.778503 -254.68942 lineto
24.778503 -255.13643 lineto
closepath
26.158777 -256.70093 moveto
26.21717 -256.3526 26.300228 -256.05157 26.407951 -255.79787 curveto
26.515676 -255.54416 26.706459 -255.19583 26.980299 -254.75285 curveto
28.200497 -252.78966 lineto
25.899033 -252.78966 lineto
25.899033 -252.2309 lineto
28.768312 -252.2309 lineto
28.768312 -252.78966 lineto
27.622614 -254.479 26.981304 -255.78276 26.844385 -256.70093 curveto
closepath
fill
newpath
1.8 setlinewidth
10.0 setmiterlimit
0 setlinejoin
0 setlinecap
[ ] 0 setdash
newpath
29.250107 -258.45956 moveto
31.724333 -258.45956 lineto
stroke
newpath
newpath
22.096481 -283.59003 moveto
22.096481 -283.14304 lineto
24.778503 -283.14304 lineto
24.778503 -283.59003 lineto
closepath
26.651087 -282.72018 moveto
26.21415 -282.41614 25.995682 -282.0799 25.995682 -281.7114 curveto
25.995682 -281.3731 26.119514 -281.09827 26.367178 -280.88687 curveto
26.614841 -280.67545 26.938013 -280.56973 27.336693 -280.56973 curveto
27.705168 -280.56973 28.003674 -280.65933 28.23221 -280.83853 curveto
28.460747 -281.01773 28.575014 -281.2503 28.575014 -281.53622 curveto
28.575014 -281.96912 28.297148 -282.36377 27.741413 -282.72018 curveto
28.415945 -283.0504 28.753212 -283.47626 28.753212 -283.99777 curveto
28.753212 -284.37228 28.611761 -284.67734 28.32886 -284.9129 curveto
28.04596 -285.1485 27.681007 -285.2663 27.234003 -285.2663 curveto
26.795053 -285.2663 26.440168 -285.15506 26.16935 -284.93256 curveto
25.89853 -284.71005 25.763119 -284.4176 25.763119 -284.05515 curveto
25.763119 -283.51953 26.059109 -283.07455 26.651087 -282.72018 curveto
closepath
27.40918 -282.53293 moveto
27.825981 -282.2591 28.034382 -281.95404 28.034382 -281.61777 curveto
28.034382 -281.43857 27.964914 -281.2941 27.825981 -281.18436 curveto
27.687048 -281.07462 27.503817 -281.01974 27.276287 -281.01974 curveto
27.056812 -281.01974 26.878614 -281.0736 26.741695 -281.18134 curveto
26.604774 -281.28906 26.536314 -281.4285 26.536314 -281.59964 curveto
26.536314 -281.76678 26.59823 -281.9163 26.722063 -282.04816 curveto
26.845894 -282.18005 27.074934 -282.34164 27.40918 -282.53293 curveto
closepath
26.974258 -282.9618 moveto
26.734648 -283.14706 26.572056 -283.30865 26.48648 -283.44656 curveto
26.400906 -283.58447 26.358118 -283.75613 26.358118 -283.96152 curveto
26.358118 -284.21722 26.440672 -284.42413 26.605782 -284.58218 curveto
26.770891 -284.74023 26.988352 -284.81927 27.258165 -284.81927 curveto
27.51791 -284.81927 27.729836 -284.75183 27.893938 -284.6169 curveto
28.05804 -284.48203 28.14009 -284.30685 28.14009 -284.0914 curveto
28.14009 -283.9182 28.089249 -283.77173 27.987566 -283.65195 curveto
27.885883 -283.53214 27.68906 -283.38565 27.397099 -283.2125 curveto
closepath
fill
newpath
1.8 setlinewidth
10.0 setmiterlimit
0 setlinejoin
0 setlinecap
[ ] 0 setdash
newpath
29.250107 -286.80603 moveto
31.724333 -286.80603 lineto
stroke
newpath
newpath
31.724333 53.814415 moveto
31.724333 -297.52567 lineto
stroke
newpath
newpath
31.724333 53.814415 moveto
29.250107 51.340187 lineto
stroke
newpath
newpath
31.724333 53.814415 moveto
34.19856 51.340187 lineto
stroke
newpath
0.0 0.0 0.0 setrgbcolor
1.0 setlinewidth
10.0 setmiterlimit
1 setlinejoin
1 setlinecap
[ ] 0 setdash
newpath
164.6432 -297.52567 moveto
-11.026834 53.814415 lineto
stroke
newpath
0.0 0.0 0.0 setrgbcolor
1.0 setlinewidth
10.0 setmiterlimit
1 setlinejoin
1 setlinecap
[ ] 0 setdash
newpath
-149.07405 -297.52567 moveto
202.26604 53.814415 lineto
stroke
newpath
0.49019608 0.49019608 1.0 setrgbcolor
newpath
33.58 -31.68791 moveto
33.58 -32.712772 32.749195 -33.54358 31.724333 -33.54358 curveto
30.69947 -33.54358 29.868664 -32.712772 29.868664 -31.68791 curveto
29.868664 -30.663057 30.69947 -29.832241 31.724333 -29.832241 curveto
32.749195 -29.832241 33.58 -30.663057 33.58 -31.68791 curveto
closepath
fill
newpath
0.0 0.0 0.0 setrgbcolor
1.0 setlinewidth
10.0 setmiterlimit
1 setlinejoin
1 setlinecap
[ ] 0 setdash
newpath
33.58 -31.68791 moveto
33.58 -32.712772 32.749195 -33.54358 31.724333 -33.54358 curveto
30.69947 -33.54358 29.868664 -32.712772 29.868664 -31.68791 curveto
29.868664 -30.663057 30.69947 -29.832241 31.724333 -29.832241 curveto
32.749195 -29.832241 33.58 -30.663057 33.58 -31.68791 curveto
closepath
stroke
newpath
0.0 0.0 1.0 setrgbcolor
newpath
61.926456 -88.38083 moveto
61.926456 -89.405685 61.095646 -90.236496 60.070786 -90.236496 curveto
59.045925 -90.236496 58.215115 -89.405685 58.215115 -88.38083 curveto
58.215115 -87.355965 59.045925 -86.525154 60.070786 -86.525154 curveto
61.095646 -86.525154 61.926456 -87.355965 61.926456 -88.38083 curveto
closepath
fill
newpath
0.0 0.0 0.0 setrgbcolor
1.0 setlinewidth
10.0 setmiterlimit
1 setlinejoin
1 setlinecap
[ ] 0 setdash
newpath
61.926456 -88.38083 moveto
61.926456 -89.405685 61.095646 -90.236496 60.070786 -90.236496 curveto
59.045925 -90.236496 58.215115 -89.405685 58.215115 -88.38083 curveto
58.215115 -87.355965 59.045925 -86.525154 60.070786 -86.525154 curveto
61.095646 -86.525154 61.926456 -87.355965 61.926456 -88.38083 curveto
closepath
stroke
newpath
0.49019608 0.49019608 1.0 setrgbcolor
newpath
33.58 -116.72728 moveto
33.58 -117.752144 32.749195 -118.58295 31.724333 -118.58295 curveto
30.69947 -118.58295 29.868664 -117.752144 29.868664 -116.72728 curveto
29.868664 -115.702415 30.69947 -114.87161 31.724333 -114.87161 curveto
32.749195 -114.87161 33.58 -115.702415 33.58 -116.72728 curveto
closepath
fill
newpath
0.0 0.0 0.0 setrgbcolor
1.0 setlinewidth
10.0 setmiterlimit
1 setlinejoin
1 setlinecap
[ ] 0 setdash
newpath
33.58 -116.72728 moveto
33.58 -117.752144 32.749195 -118.58295 31.724333 -118.58295 curveto
30.69947 -118.58295 29.868664 -117.752144 29.868664 -116.72728 curveto
29.868664 -115.702415 30.69947 -114.87161 31.724333 -114.87161 curveto
32.749195 -114.87161 33.58 -115.702415 33.58 -116.72728 curveto
closepath
stroke
newpath
grestore
grestore
showpage

%%EOF