%!PS-Adobe-3.0 EPSF-3.0
%%Creator: EpsGraphics2D 0.9.0 by Paul Mutton, http://www.jibble.org/
%%Title: GeoGebra, http://www.geogebra.org
%%CreationDate: Sun Mar 16 15:37:49 CET 2008
%%BoundingBox: 0 0 200 150
%%DocumentData: Clean7Bit
%%DocumentProcessColors: Black
%%ColorUsage: Color
%%Origin: 0 0
%%Pages: 1
%%Page: 1 1
%%EndComments

gsave
-0.0 150.0 translate
1.0 setlinewidth
10.0 setmiterlimit
0 setlinejoin
2 setlinecap
[ ] 0 setdash
gsave
newpath
0.0 -0.0 moveto
200.56358 -0.0 lineto
200.56358 -150.20181 lineto
0.0 -150.20181 lineto
0.0 -0.0 lineto
closepath
clip
newpath
1.0 setlinewidth
10.0 setmiterlimit
0 setlinejoin
2 setlinecap
[ ] 0 setdash
1.0 1.0 1.0 setrgbcolor
newpath
-136.9487 196.14589 moveto
487.7141 196.14589 lineto
487.7141 -351.64893 lineto
-136.9487 -351.64893 lineto
-136.9487 196.14589 lineto
closepath
fill
newpath
0.0 0.0 0.0 setrgbcolor
1.0 setlinewidth
10.0 setmiterlimit
1 setlinejoin
1 setlinecap
[ ] 0 setdash
newpath
27.278692 -136.84384 moveto
112.31806 -136.84384 lineto
stroke
newpath
0.0 0.0 0.0 setrgbcolor
1.0 setlinewidth
10.0 setmiterlimit
1 setlinejoin
1 setlinecap
[ ] 0 setdash
newpath
112.31806 -136.84384 moveto
169.01099 -108.49738 lineto
stroke
newpath
0.0 0.0 0.0 setrgbcolor
1.0 setlinewidth
10.0 setmiterlimit
1 setlinejoin
1 setlinecap
[ ] 0 setdash
newpath
169.01099 -108.49738 moveto
169.01099 -23.458017 lineto
stroke
newpath
0.0 0.0 0.0 setrgbcolor
1.0 setlinewidth
10.0 setmiterlimit
1 setlinejoin
1 setlinecap
[ ] 0 setdash
newpath
169.01099 -23.458017 moveto
83.97161 -23.458017 lineto
stroke
newpath
0.0 0.0 0.0 setrgbcolor
1.0 setlinewidth
10.0 setmiterlimit
1 setlinejoin
1 setlinecap
[ ] 0 setdash
newpath
83.97161 -23.458017 moveto
27.278692 -51.804466 lineto
stroke
newpath
0.0 0.0 0.0 setrgbcolor
1.0 setlinewidth
10.0 setmiterlimit
1 setlinejoin
1 setlinecap
[ ] 0 setdash
newpath
27.278692 -51.804466 moveto
27.278692 -136.84384 lineto
stroke
newpath
0.0 0.0 0.0 setrgbcolor
1.0 setlinewidth
10.0 setmiterlimit
1 setlinejoin
1 setlinecap
[ ] 0 setdash
newpath
27.278692 -51.804466 moveto
112.31806 -51.804466 lineto
stroke
newpath
0.0 0.0 0.0 setrgbcolor
1.0 setlinewidth
10.0 setmiterlimit
1 setlinejoin
1 setlinecap
[ ] 0 setdash
newpath
112.31806 -51.804466 moveto
169.01099 -23.458017 lineto
stroke
newpath
0.0 0.0 0.0 setrgbcolor
1.0 setlinewidth
10.0 setmiterlimit
1 setlinejoin
1 setlinecap
[ ] 0 setdash
newpath
112.31806 -51.804466 moveto
112.31806 -136.84384 lineto
stroke
newpath
0.0 0.0 0.0 setrgbcolor
1.0 setlinewidth
10.0 setmiterlimit
1 setlinejoin
0 setlinecap
[ 9.0 8.0 ] 0 setdash
newpath
27.278692 -136.84384 moveto
83.97161 -108.49738 lineto
stroke
newpath
0.0 0.0 0.0 setrgbcolor
1.0 setlinewidth
10.0 setmiterlimit
1 setlinejoin
0 setlinecap
[ 9.0 8.0 ] 0 setdash
newpath
83.97161 -108.49738 moveto
83.97161 -23.458017 lineto
stroke
newpath
0.0 0.0 0.0 setrgbcolor
1.0 setlinewidth
10.0 setmiterlimit
1 setlinejoin
0 setlinecap
[ 9.0 8.0 ] 0 setdash
newpath
83.97161 -108.49738 moveto
169.01099 -108.49738 lineto
stroke
newpath
0.0 0.0 0.0 setrgbcolor
newpath
28.162231 -136.84384 moveto
28.162231 -137.3318 27.766665 -137.72739 27.278692 -137.72739 curveto
26.790733 -137.72739 26.395153 -137.3318 26.395153 -136.84384 curveto
26.395153 -136.35588 26.790733 -135.96031 27.278692 -135.96031 curveto
27.766665 -135.96031 28.162231 -136.35588 28.162231 -136.84384 curveto
closepath
fill
newpath
0.0 0.0 0.0 setrgbcolor
1.0 setlinewidth
10.0 setmiterlimit
1 setlinejoin
1 setlinecap
[ ] 0 setdash
newpath
28.162231 -136.84384 moveto
28.162231 -137.3318 27.766665 -137.72739 27.278692 -137.72739 curveto
26.790733 -137.72739 26.395153 -137.3318 26.395153 -136.84384 curveto
26.395153 -136.35588 26.790733 -135.96031 27.278692 -135.96031 curveto
27.766665 -135.96031 28.162231 -136.35588 28.162231 -136.84384 curveto
closepath
stroke
newpath
0.0 0.0 0.0 setrgbcolor
newpath
19.891731 -142.85393 moveto
18.587128 -139.55101 lineto
17.27735 -142.85393 lineto
closepath
21.041023 -145.7841 moveto
20.207527 -143.66154 lineto
16.961554 -143.66154 lineto
16.117702 -145.7841 lineto
15.10819 -145.7841 lineto
18.147083 -138.12216 lineto
19.223898 -138.12216 lineto
22.2162 -145.7841 lineto
closepath
fill
newpath
0.0 0.0 0.0 setrgbcolor
newpath
113.2016 -136.84384 moveto
113.2016 -137.3318 112.806046 -137.72739 112.31806 -137.72739 curveto
111.8301 -137.72739 111.43452 -137.3318 111.43452 -136.84384 curveto
111.43452 -136.35588 111.8301 -135.96031 112.31806 -135.96031 curveto
112.806046 -135.96031 113.2016 -136.35588 113.2016 -136.84384 curveto
closepath
fill
newpath
0.0 0.0 0.0 setrgbcolor
1.0 setlinewidth
10.0 setmiterlimit
1 setlinejoin
1 setlinecap
[ ] 0 setdash
newpath
113.2016 -136.84384 moveto
113.2016 -137.3318 112.806046 -137.72739 112.31806 -137.72739 curveto
111.8301 -137.72739 111.43452 -137.3318 111.43452 -136.84384 curveto
111.43452 -136.35588 111.8301 -135.96031 112.31806 -135.96031 curveto
112.806046 -135.96031 113.2016 -136.35588 113.2016 -136.84384 curveto
closepath
stroke
newpath
0.0 0.0 0.0 setrgbcolor
newpath
119.38317 -145.7841 moveto
119.38317 -138.12216 lineto
121.37114 -138.12216 lineto
122.13734 -138.12216 122.72492 -138.26712 123.1339 -138.55702 curveto
123.542885 -138.84694 123.747375 -139.26456 123.747375 -139.80986 curveto
123.747375 -140.73827 123.22277 -141.3992 122.17357 -141.79265 curveto
123.4264 -142.17575 124.05282 -142.86774 124.05282 -143.86862 curveto
124.05282 -144.48985 123.84574 -144.96442 123.43158 -145.2923 curveto
123.01742 -145.62016 122.42034 -145.7841 121.64034 -145.7841 curveto
closepath
120.459984 -144.97131 moveto
120.682594 -144.97131 lineto
121.47985 -144.97131 121.99583 -144.92126 122.230515 -144.82118 curveto
122.67919 -144.63136 122.90353 -144.27933 122.90353 -143.76508 curveto
122.90353 -143.3095 122.6999 -142.93071 122.29264 -142.62872 curveto
121.88538 -142.32674 121.37631 -142.17575 120.76543 -142.17575 curveto
120.459984 -142.17575 lineto
closepath
120.459984 -141.4872 moveto
120.80685 -141.4872 lineto
121.38667 -141.4872 121.836205 -141.36295 122.15545 -141.11446 curveto
122.4747 -140.86597 122.63432 -140.51566 122.63432 -140.06354 curveto
122.63432 -139.31114 122.05105 -138.93495 120.8845 -138.93495 curveto
120.459984 -138.93495 lineto
closepath
fill
newpath
0.0 0.0 0.0 setrgbcolor
newpath
169.89452 -108.49738 moveto
169.89452 -108.985344 169.49893 -109.38093 169.01099 -109.38093 curveto
168.52303 -109.38093 168.12744 -108.985344 168.12744 -108.49738 curveto
168.12744 -108.00943 168.52303 -107.613846 169.01099 -107.613846 curveto
169.49893 -107.613846 169.89452 -108.00943 169.89452 -108.49738 curveto
closepath
fill
newpath
0.0 0.0 0.0 setrgbcolor
1.0 setlinewidth
10.0 setmiterlimit
1 setlinejoin
1 setlinecap
[ ] 0 setdash
newpath
169.89452 -108.49738 moveto
169.89452 -108.985344 169.49893 -109.38093 169.01099 -109.38093 curveto
168.52303 -109.38093 168.12744 -108.985344 168.12744 -108.49738 curveto
168.12744 -108.00943 168.52303 -107.613846 169.01099 -107.613846 curveto
169.49893 -107.613846 169.89452 -108.00943 169.89452 -108.49738 curveto
closepath
stroke
newpath
0.0 0.0 0.0 setrgbcolor
newpath
179.21194 -112.40114 moveto
178.02124 -112.40114 177.10146 -112.05169 176.4526 -111.35279 curveto
175.80376 -110.6539 175.47934 -109.66423 175.47934 -108.38379 curveto
175.47934 -107.1068 175.8098 -106.116264 176.47073 -105.41219 curveto
177.13167 -104.70812 178.06265 -104.35609 179.26372 -104.35609 curveto
179.95053 -104.35609 180.7547 -104.468254 181.6762 -104.6926 curveto
181.6762 -105.71246 lineto
180.62698 -105.350075 179.81766 -105.16888 179.24818 -105.16888 curveto
178.41641 -105.16888 177.77275 -105.45016 177.31717 -106.012726 curveto
176.86159 -106.575294 176.6338 -107.369095 176.6338 -108.39414 curveto
176.6338 -109.370865 176.87712 -110.14138 177.36375 -110.70567 curveto
177.8504 -111.269966 178.51479 -111.55211 179.3569 -111.55211 curveto
180.08168 -111.55211 180.85823 -111.3295 181.68655 -110.88428 curveto
181.68655 -111.81613 lineto
180.93071 -112.20614 180.10585 -112.40114 179.21194 -112.40114 curveto
closepath
fill
newpath
0.0 0.0 0.0 setrgbcolor
newpath
84.855156 -108.49738 moveto
84.855156 -108.985344 84.45957 -109.38093 83.97161 -109.38093 curveto
83.48364 -109.38093 83.08807 -108.985344 83.08807 -108.49738 curveto
83.08807 -108.00943 83.48364 -107.613846 83.97161 -107.613846 curveto
84.45957 -107.613846 84.855156 -108.00943 84.855156 -108.49738 curveto
closepath
fill
newpath
0.0 0.0 0.0 setrgbcolor
1.0 setlinewidth
10.0 setmiterlimit
1 setlinejoin
1 setlinecap
[ ] 0 setdash
newpath
84.855156 -108.49738 moveto
84.855156 -108.985344 84.45957 -109.38093 83.97161 -109.38093 curveto
83.48364 -109.38093 83.08807 -108.985344 83.08807 -108.49738 curveto
83.08807 -108.00943 83.48364 -107.613846 83.97161 -107.613846 curveto
84.45957 -107.613846 84.855156 -108.00943 84.855156 -108.49738 curveto
closepath
stroke
newpath
0.0 0.0 0.0 setrgbcolor
newpath
88.45927 -106.90835 moveto
88.45927 -99.2464 lineto
91.00635 -99.2464 lineto
91.76564 -99.2464 92.37911 -99.330956 92.84677 -99.50007 curveto
93.31443 -99.66918 93.71909 -99.95564 94.060776 -100.35945 curveto
94.60264 -101.001396 94.873566 -101.84698 94.873566 -102.89618 curveto
94.873566 -104.169716 94.53706 -105.1568 93.86405 -105.857414 curveto
93.19104 -106.55804 92.24365 -106.90835 91.02188 -106.90835 curveto
closepath
89.54644 -106.09556 moveto
90.93905 -106.09556 lineto
91.93303 -106.09556 92.6371 -105.82808 93.05126 -105.29312 curveto
93.49648 -104.723656 93.71909 -103.95918 93.71909 -102.99972 curveto
93.71909 -102.09892 93.49993 -101.391396 93.061615 -100.87715 curveto
92.79586 -100.56308 92.47834 -100.348236 92.10905 -100.23261 curveto
91.73976 -100.11699 91.1841 -100.05918 90.442055 -100.05918 curveto
89.54644 -100.05918 lineto
closepath
fill
newpath
0.0 0.0 0.0 setrgbcolor
newpath
28.162231 -51.804466 moveto
28.162231 -52.29245 27.766665 -52.688004 27.278692 -52.688004 curveto
26.790733 -52.688004 26.395153 -52.29245 26.395153 -51.804466 curveto
26.395153 -51.316505 26.790733 -50.920925 27.278692 -50.920925 curveto
27.766665 -50.920925 28.162231 -51.316505 28.162231 -51.804466 curveto
closepath
fill
newpath
0.0 0.0 0.0 setrgbcolor
1.0 setlinewidth
10.0 setmiterlimit
1 setlinejoin
1 setlinecap
[ ] 0 setdash
newpath
28.162231 -51.804466 moveto
28.162231 -52.29245 27.766665 -52.688004 27.278692 -52.688004 curveto
26.790733 -52.688004 26.395153 -52.29245 26.395153 -51.804466 curveto
26.395153 -51.316505 26.790733 -50.920925 27.278692 -50.920925 curveto
27.766665 -50.920925 28.162231 -51.316505 28.162231 -51.804466 curveto
closepath
stroke
newpath
0.0 0.0 0.0 setrgbcolor
newpath
15.125446 -52.128864 moveto
15.125446 -44.466915 lineto
19.406818 -44.466915 lineto
19.406818 -45.2797 lineto
16.212614 -45.2797 lineto
16.212614 -47.738773 lineto
18.88912 -47.738773 lineto
18.88912 -48.541206 lineto
16.212614 -48.541206 lineto
16.212614 -51.316074 lineto
19.629429 -51.316074 lineto
19.629429 -52.128864 lineto
closepath
fill
newpath
0.0 0.0 0.0 setrgbcolor
newpath
113.2016 -51.804466 moveto
113.2016 -52.29245 112.806046 -52.688004 112.31806 -52.688004 curveto
111.8301 -52.688004 111.43452 -52.29245 111.43452 -51.804466 curveto
111.43452 -51.316505 111.8301 -50.920925 112.31806 -50.920925 curveto
112.806046 -50.920925 113.2016 -51.316505 113.2016 -51.804466 curveto
closepath
fill
newpath
0.0 0.0 0.0 setrgbcolor
1.0 setlinewidth
10.0 setmiterlimit
1 setlinejoin
1 setlinecap
[ ] 0 setdash
newpath
113.2016 -51.804466 moveto
113.2016 -52.29245 112.806046 -52.688004 112.31806 -52.688004 curveto
111.8301 -52.688004 111.43452 -52.29245 111.43452 -51.804466 curveto
111.43452 -51.316505 111.8301 -50.920925 112.31806 -50.920925 curveto
112.806046 -50.920925 113.2016 -51.316505 113.2016 -51.804466 curveto
closepath
stroke
newpath
0.0 0.0 0.0 setrgbcolor
newpath
122.03379 -60.080723 moveto
122.03379 -52.418774 lineto
126.31516 -52.418774 lineto
126.31516 -53.231564 lineto
123.120964 -53.231564 lineto
123.120964 -55.79935 lineto
125.80264 -55.79935 lineto
125.80264 -56.601784 lineto
123.120964 -56.601784 lineto
123.120964 -60.080723 lineto
closepath
fill
newpath
0.0 0.0 0.0 setrgbcolor
newpath
169.89452 -23.458017 moveto
169.89452 -23.945976 169.49893 -24.341558 169.01099 -24.341558 curveto
168.52303 -24.341558 168.12744 -23.945976 168.12744 -23.458017 curveto
168.12744 -22.970045 168.52303 -22.574478 169.01099 -22.574478 curveto
169.49893 -22.574478 169.89452 -22.970045 169.89452 -23.458017 curveto
closepath
fill
newpath
0.0 0.0 0.0 setrgbcolor
1.0 setlinewidth
10.0 setmiterlimit
1 setlinejoin
1 setlinecap
[ ] 0 setdash
newpath
169.89452 -23.458017 moveto
169.89452 -23.945976 169.49893 -24.341558 169.01099 -24.341558 curveto
168.52303 -24.341558 168.12744 -23.945976 168.12744 -23.458017 curveto
168.12744 -22.970045 168.52303 -22.574478 169.01099 -22.574478 curveto
169.49893 -22.574478 169.89452 -22.970045 169.89452 -23.458017 curveto
closepath
stroke
newpath
0.0 0.0 0.0 setrgbcolor
newpath
179.03593 -21.881422 moveto
178.10753 -22.147175 177.29819 -22.28005 176.60793 -22.28005 curveto
175.3896 -22.28005 174.45515 -21.933191 173.80458 -21.239475 curveto
173.154 -20.545757 172.82872 -19.551775 172.82872 -18.257526 curveto
172.82872 -16.987438 173.15833 -15.9994955 173.81752 -15.293698 curveto
174.47672 -14.587902 175.40167 -14.235003 176.59239 -14.235003 curveto
177.37239 -14.235003 178.18346 -14.350623 179.02557 -14.581862 curveto
179.02557 -15.586199 lineto
177.96947 -15.227261 177.16014 -15.0477915 176.59756 -15.0477915 curveto
175.76924 -15.0477915 175.12643 -15.329075 174.66914 -15.891642 curveto
174.21184 -16.454208 173.98318 -17.246288 173.98318 -18.267881 curveto
173.98318 -19.279121 174.22823 -20.06516 174.71832 -20.626001 curveto
175.2084 -21.186842 175.89522 -21.467262 176.77876 -21.467262 curveto
177.14114 -21.467262 177.53287 -21.403412 177.95393 -21.275713 curveto
177.95393 -18.780403 lineto
179.03593 -18.780403 lineto
closepath
fill
newpath
0.0 0.0 0.0 setrgbcolor
newpath
84.855156 -23.458017 moveto
84.855156 -23.945976 84.45957 -24.341558 83.97161 -24.341558 curveto
83.48364 -24.341558 83.08807 -23.945976 83.08807 -23.458017 curveto
83.08807 -22.970045 83.48364 -22.574478 83.97161 -22.574478 curveto
84.45957 -22.574478 84.855156 -22.970045 84.855156 -23.458017 curveto
closepath
fill
newpath
0.0 0.0 0.0 setrgbcolor
1.0 setlinewidth
10.0 setmiterlimit
1 setlinejoin
1 setlinecap
[ ] 0 setdash
newpath
84.855156 -23.458017 moveto
84.855156 -23.945976 84.45957 -24.341558 83.97161 -24.341558 curveto
83.48364 -24.341558 83.08807 -23.945976 83.08807 -23.458017 curveto
83.08807 -22.970045 83.48364 -22.574478 83.97161 -22.574478 curveto
84.45957 -22.574478 84.855156 -22.970045 84.855156 -23.458017 curveto
closepath
stroke
newpath
0.0 0.0 0.0 setrgbcolor
newpath
81.39095 -14.136641 moveto
81.39095 -6.474692 lineto
82.47812 -6.474692 lineto
82.47812 -9.705135 lineto
86.12272 -9.705135 lineto
86.12272 -6.474692 lineto
87.20989 -6.474692 lineto
87.20989 -14.136641 lineto
86.12272 -14.136641 lineto
86.12272 -10.517923 lineto
82.47812 -10.517923 lineto
82.47812 -14.136641 lineto
closepath
fill
newpath
0.0 0.0 0.0 setrgbcolor
newpath
97.18941 -51.804466 moveto
97.18941 -52.29245 96.79382 -52.688004 96.30586 -52.688004 curveto
95.81791 -52.688004 95.422325 -52.29245 95.422325 -51.804466 curveto
95.422325 -51.316505 95.81791 -50.920925 96.30586 -50.920925 curveto
96.79382 -50.920925 97.18941 -51.316505 97.18941 -51.804466 curveto
closepath
fill
newpath
0.0 0.0 0.0 setrgbcolor
1.0 setlinewidth
10.0 setmiterlimit
1 setlinejoin
1 setlinecap
[ ] 0 setdash
newpath
97.18941 -51.804466 moveto
97.18941 -52.29245 96.79382 -52.688004 96.30586 -52.688004 curveto
95.81791 -52.688004 95.422325 -52.29245 95.422325 -51.804466 curveto
95.422325 -51.316505 95.81791 -50.920925 96.30586 -50.920925 curveto
96.79382 -50.920925 97.18941 -51.316505 97.18941 -51.804466 curveto
closepath
stroke
newpath
0.0 0.0 0.0 setrgbcolor
newpath
95.52759 -48.594704 moveto
95.52759 -40.932755 lineto
96.59405 -40.932755 lineto
100.45091 -46.850056 lineto
100.45091 -40.932755 lineto
101.38277 -40.932755 lineto
101.38277 -48.594704 lineto
100.32149 -48.594704 lineto
96.45945 -42.6774 lineto
96.45945 -48.594704 lineto
closepath
fill
newpath
0.0 0.0 0.0 setrgbcolor
newpath
47.912605 -41.92927 moveto
47.912605 -42.417255 47.51704 -42.81281 47.029068 -42.81281 curveto
46.541107 -42.81281 46.145527 -42.417255 46.145527 -41.92927 curveto
46.145527 -41.44131 46.541107 -41.04573 47.029068 -41.04573 curveto
47.51704 -41.04573 47.912605 -41.44131 47.912605 -41.92927 curveto
closepath
fill
newpath
0.0 0.0 0.0 setrgbcolor
1.0 setlinewidth
10.0 setmiterlimit
1 setlinejoin
1 setlinecap
[ ] 0 setdash
newpath
47.912605 -41.92927 moveto
47.912605 -42.417255 47.51704 -42.81281 47.029068 -42.81281 curveto
46.541107 -42.81281 46.145527 -42.417255 46.145527 -41.92927 curveto
46.145527 -41.44131 46.541107 -41.04573 47.029068 -41.04573 curveto
47.51704 -41.04573 47.912605 -41.44131 47.912605 -41.92927 curveto
closepath
stroke
newpath
0.0 0.0 0.0 setrgbcolor
newpath
41.63165 -32.690983 moveto
41.63165 -25.029034 lineto
43.138153 -25.029034 lineto
45.26072 -30.95669 lineto
47.44541 -25.029034 lineto
48.791428 -25.029034 lineto
48.791428 -32.690983 lineto
47.776737 -32.690983 lineto
47.776737 -26.457882 lineto
45.664524 -32.17846 lineto
44.613594 -32.17846 lineto
42.563507 -26.442352 lineto
42.563507 -32.690983 lineto
closepath
fill
newpath
0.0 0.0 0.0 setrgbcolor
newpath
28.162231 -100.723564 moveto
28.162231 -101.211525 27.766665 -101.60711 27.278692 -101.60711 curveto
26.790733 -101.60711 26.395153 -101.211525 26.395153 -100.723564 curveto
26.395153 -100.2356 26.790733 -99.84003 27.278692 -99.84003 curveto
27.766665 -99.84003 28.162231 -100.2356 28.162231 -100.723564 curveto
closepath
fill
newpath
0.0 0.0 0.0 setrgbcolor
1.0 setlinewidth
10.0 setmiterlimit
1 setlinejoin
1 setlinecap
[ ] 0 setdash
newpath
28.162231 -100.723564 moveto
28.162231 -101.211525 27.766665 -101.60711 27.278692 -101.60711 curveto
26.790733 -101.60711 26.395153 -101.211525 26.395153 -100.723564 curveto
26.395153 -100.2356 26.790733 -99.84003 27.278692 -99.84003 curveto
27.766665 -99.84003 28.162231 -100.2356 28.162231 -100.723564 curveto
closepath
stroke
newpath
0.0 0.0 0.0 setrgbcolor
newpath
13.358366 -98.95648 moveto
13.358366 -91.29453 lineto
15.4446945 -91.29453 lineto
16.36965 -91.29453 17.03403 -91.45071 17.437836 -91.763054 curveto
17.841642 -92.0754 18.043545 -92.58878 18.043545 -93.30321 curveto
18.043545 -94.11772 17.767439 -94.75622 17.215225 -95.2187 curveto
16.663013 -95.681175 15.896819 -95.912415 14.916641 -95.912415 curveto
14.435181 -95.912415 lineto
14.435181 -98.95648 lineto
closepath
14.435181 -95.08927 moveto
14.875225 -95.08927 lineto
15.520623 -95.08927 16.01934 -94.940865 16.371376 -94.64405 curveto
16.723412 -94.34724 16.89943 -93.9279 16.89943 -93.38604 curveto
16.89943 -92.92702 16.761375 -92.59914 16.48527 -92.40241 curveto
16.209164 -92.20569 15.748411 -92.10732 15.103013 -92.10732 curveto
14.435181 -92.10732 lineto
closepath
fill
newpath
grestore
grestore
showpage

%%EOF