%!PS-Adobe-3.0 EPSF-3.0
%%Creator: EpsGraphics2D 0.9.0 by Paul Mutton, http://www.jibble.org/
%%Title: GeoGebra, http://www.geogebra.org
%%CreationDate: Thu Mar 13 16:21:17 CET 2008
%%BoundingBox: 0 0 318 160
%%DocumentData: Clean7Bit
%%DocumentProcessColors: Black
%%ColorUsage: Color
%%Origin: 0 0
%%Pages: 1
%%Page: 1 1
%%EndComments

gsave
-0.0 160.0 translate
1.0 setlinewidth
10.0 setmiterlimit
0 setlinejoin
2 setlinecap
[ ] 0 setdash
gsave
newpath
0.0 -0.0 moveto
318.9159 -0.0 lineto
318.9159 -160.72014 lineto
0.0 -160.72014 lineto
0.0 -0.0 lineto
closepath
clip
newpath
1.0 setlinewidth
10.0 setmiterlimit
0 setlinejoin
2 setlinecap
[ ] 0 setdash
1.0 1.0 1.0 setrgbcolor
newpath
-136.31761 215.41548 moveto
458.59937 215.41548 lineto
458.59937 -306.29388 lineto
-136.31761 -306.29388 lineto
-136.31761 215.41548 lineto
closepath
fill
newpath
0.0 0.0 0.0 setrgbcolor
1.0 setlinewidth
10.0 setmiterlimit
1 setlinejoin
1 setlinecap
[ ] 0 setdash
newpath
21.530176 -131.06348 moveto
106.56954 -131.06348 lineto
stroke
newpath
0.0 0.0 0.0 setrgbcolor
1.0 setlinewidth
10.0 setmiterlimit
1 setlinejoin
1 setlinecap
[ ] 0 setdash
newpath
106.56954 -131.06348 moveto
163.26247 -102.717026 lineto
stroke
newpath
0.0 0.0 0.0 setrgbcolor
1.0 setlinewidth
10.0 setmiterlimit
1 setlinejoin
1 setlinecap
[ ] 0 setdash
newpath
163.26247 -102.717026 moveto
163.26247 -17.677658 lineto
stroke
newpath
0.0 0.0 0.0 setrgbcolor
1.0 setlinewidth
10.0 setmiterlimit
1 setlinejoin
1 setlinecap
[ ] 0 setdash
newpath
163.26247 -17.677658 moveto
106.56954 -46.024105 lineto
stroke
newpath
0.0 0.0 0.0 setrgbcolor
1.0 setlinewidth
10.0 setmiterlimit
1 setlinejoin
1 setlinecap
[ ] 0 setdash
newpath
106.56954 -46.024105 moveto
21.530176 -46.024105 lineto
stroke
newpath
0.0 0.0 0.0 setrgbcolor
1.0 setlinewidth
10.0 setmiterlimit
1 setlinejoin
1 setlinecap
[ ] 0 setdash
newpath
21.530176 -46.024105 moveto
21.530176 -131.06348 lineto
stroke
newpath
0.0 0.0 0.0 setrgbcolor
1.0 setlinewidth
10.0 setmiterlimit
1 setlinejoin
1 setlinecap
[ ] 0 setdash
newpath
21.530176 -46.024105 moveto
78.22308 -17.677658 lineto
stroke
newpath
0.0 0.0 0.0 setrgbcolor
1.0 setlinewidth
10.0 setmiterlimit
1 setlinejoin
1 setlinecap
[ ] 0 setdash
newpath
78.22308 -17.677658 moveto
163.26247 -17.677658 lineto
stroke
newpath
0.0 0.0 0.0 setrgbcolor
1.0 setlinewidth
10.0 setmiterlimit
1 setlinejoin
0 setlinecap
[ 5.0 4.0 ] 0 setdash
newpath
78.22308 -102.717026 moveto
21.530176 -131.06348 lineto
stroke
newpath
0.0 0.0 0.0 setrgbcolor
1.0 setlinewidth
10.0 setmiterlimit
1 setlinejoin
0 setlinecap
[ 5.0 4.0 ] 0 setdash
newpath
78.22308 -102.717026 moveto
163.26247 -102.717026 lineto
stroke
newpath
0.0 0.0 0.0 setrgbcolor
1.0 setlinewidth
10.0 setmiterlimit
1 setlinejoin
0 setlinecap
[ 5.0 4.0 ] 0 setdash
newpath
78.22308 -17.677658 moveto
78.22308 -102.717026 lineto
stroke
newpath
0.0 0.0 0.0 setrgbcolor
1.0 setlinewidth
10.0 setmiterlimit
1 setlinejoin
1 setlinecap
[ ] 0 setdash
newpath
106.56954 -131.06348 moveto
106.56954 -46.024105 lineto
stroke
newpath
0.0 0.0 0.0 setrgbcolor
1.0 setlinewidth
10.0 setmiterlimit
1 setlinejoin
1 setlinecap
[ ] 0 setdash
newpath
163.26247 -102.717026 moveto
276.6483 -102.717026 lineto
stroke
newpath
1.0 1.0 1.0 setrgbcolor
1.0 setlinewidth
10.0 setmiterlimit
1 setlinejoin
1 setlinecap
[ ] 0 setdash
newpath
78.22308 -17.677658 moveto
254.12294 -135.47614 lineto
stroke
newpath
0.0 0.0 0.0 setrgbcolor
1.0 setlinewidth
10.0 setmiterlimit
1 setlinejoin
0 setlinecap
[ 5.0 4.0 ] 0 setdash
newpath
163.26247 -74.370575 moveto
78.22308 -17.677658 lineto
stroke
newpath
0.0 0.0 0.0 setrgbcolor
1.0 setlinewidth
10.0 setmiterlimit
1 setlinejoin
1 setlinecap
[ ] 0 setdash
newpath
163.26247 -74.370575 moveto
254.12294 -135.47614 lineto
stroke
newpath
0.0 0.0 0.0 setrgbcolor
newpath
22.371643 -131.06348 moveto
22.371643 -131.52823 21.994911 -131.90494 21.530176 -131.90494 curveto
21.065454 -131.90494 20.68871 -131.52823 20.68871 -131.06348 curveto
20.68871 -130.59875 21.065454 -130.222 21.530176 -130.222 curveto
21.994911 -130.222 22.371643 -130.59875 22.371643 -131.06348 curveto
closepath
fill
newpath
0.0 0.0 0.0 setrgbcolor
1.0 setlinewidth
10.0 setmiterlimit
1 setlinejoin
1 setlinecap
[ ] 0 setdash
newpath
22.371643 -131.06348 moveto
22.371643 -131.52823 21.994911 -131.90494 21.530176 -131.90494 curveto
21.065454 -131.90494 20.68871 -131.52823 20.68871 -131.06348 curveto
20.68871 -130.59875 21.065454 -130.222 21.530176 -130.222 curveto
21.994911 -130.222 22.371643 -130.59875 22.371643 -131.06348 curveto
closepath
stroke
newpath
0.0 0.0 0.0 setrgbcolor
newpath
12.212771 -138.57576 moveto
10.970294 -135.43013 lineto
9.722885 -138.57576 lineto
closepath
13.307336 -141.36641 moveto
12.513531 -139.34491 lineto
9.422126 -139.34491 lineto
8.61846 -141.36641 lineto
7.657018 -141.36641 lineto
10.551204 -134.06932 lineto
11.576741 -134.06932 lineto
14.426553 -141.36641 lineto
closepath
fill
newpath
0.0 0.0 0.0 setrgbcolor
newpath
107.41101 -131.06348 moveto
107.41101 -131.52823 107.03427 -131.90494 106.56954 -131.90494 curveto
106.10482 -131.90494 105.72808 -131.52823 105.72808 -131.06348 curveto
105.72808 -130.59875 106.10482 -130.222 106.56954 -130.222 curveto
107.03427 -130.222 107.41101 -130.59875 107.41101 -131.06348 curveto
closepath
fill
newpath
0.0 0.0 0.0 setrgbcolor
1.0 setlinewidth
10.0 setmiterlimit
1 setlinejoin
1 setlinecap
[ ] 0 setdash
newpath
107.41101 -131.06348 moveto
107.41101 -131.52823 107.03427 -131.90494 106.56954 -131.90494 curveto
106.10482 -131.90494 105.72808 -131.52823 105.72808 -131.06348 curveto
105.72808 -130.59875 106.10482 -130.222 106.56954 -130.222 curveto
107.03427 -130.222 107.41101 -130.59875 107.41101 -131.06348 curveto
closepath
stroke
newpath
0.0 0.0 0.0 setrgbcolor
newpath
114.53973 -142.20787 moveto
114.53973 -134.91078 lineto
116.43303 -134.91078 lineto
117.162735 -134.91078 117.72234 -135.04883 118.11185 -135.32494 curveto
118.50136 -135.60104 118.69611 -135.99878 118.69611 -136.51811 curveto
118.69611 -137.40231 118.196495 -138.03177 117.19725 -138.40648 curveto
118.39042 -138.77133 118.98701 -139.43037 118.98701 -140.3836 curveto
118.98701 -140.97527 118.78979 -141.42722 118.395355 -141.73949 curveto
118.000916 -142.05174 117.43227 -142.20787 116.68941 -142.20787 curveto
closepath
115.56526 -141.43379 moveto
115.777275 -141.43379 lineto
116.53657 -141.43379 117.02797 -141.38612 117.25148 -141.2908 curveto
117.67879 -141.11003 117.89244 -140.77475 117.89244 -140.28499 curveto
117.89244 -139.8511 117.69851 -139.49037 117.310646 -139.20276 curveto
116.92278 -138.91515 116.43796 -138.77133 115.85616 -138.77133 curveto
115.56526 -138.77133 lineto
closepath
115.56526 -138.11559 moveto
115.89561 -138.11559 lineto
116.447815 -138.11559 116.875946 -137.99725 117.17999 -137.76059 curveto
117.48404 -137.52393 117.63606 -137.19029 117.63606 -136.7597 curveto
117.63606 -136.04314 117.08056 -135.68486 115.96956 -135.68486 curveto
115.56526 -135.68486 lineto
closepath
fill
newpath
0.0 0.0 0.0 setrgbcolor
newpath
164.10393 -102.717026 moveto
164.10393 -103.18175 163.72719 -103.558495 163.26247 -103.558495 curveto
162.79774 -103.558495 162.421 -103.18175 162.421 -102.717026 curveto
162.421 -102.252304 162.79774 -101.87556 163.26247 -101.87556 curveto
163.72719 -101.87556 164.10393 -102.252304 164.10393 -102.717026 curveto
closepath
fill
newpath
0.0 0.0 0.0 setrgbcolor
1.0 setlinewidth
10.0 setmiterlimit
1 setlinejoin
1 setlinecap
[ ] 0 setdash
newpath
164.10393 -102.717026 moveto
164.10393 -103.18175 163.72719 -103.558495 163.26247 -103.558495 curveto
162.79774 -103.558495 162.421 -103.18175 162.421 -102.717026 curveto
162.421 -102.252304 162.79774 -101.87556 163.26247 -101.87556 curveto
163.72719 -101.87556 164.10393 -102.252304 164.10393 -102.717026 curveto
closepath
stroke
newpath
0.0 0.0 0.0 setrgbcolor
newpath
168.15364 -117.98777 moveto
167.01964 -117.98777 166.14366 -117.65496 165.52571 -116.98935 curveto
164.90775 -116.32374 164.59877 -115.381195 164.59877 -114.16172 curveto
164.59877 -112.94554 164.9135 -112.002174 165.54297 -111.331635 curveto
166.17242 -110.661095 167.05908 -110.32582 168.20296 -110.32582 curveto
168.85706 -110.32582 169.62292 -110.43265 170.50055 -110.6463 curveto
170.50055 -111.6176 lineto
169.50131 -111.27247 168.73051 -111.0999 168.18816 -111.0999 curveto
167.396 -111.0999 166.78297 -111.36779 166.34909 -111.903564 curveto
165.9152 -112.43935 165.69827 -113.19535 165.69827 -114.171585 curveto
165.69827 -115.1018 165.93001 -115.83562 166.39346 -116.37304 curveto
166.85693 -116.91046 167.48969 -117.17917 168.2917 -117.17917 curveto
168.98196 -117.17917 169.72154 -116.967155 170.5104 -116.54314 curveto
170.5104 -117.430626 lineto
169.79056 -117.802055 169.00497 -117.98777 168.15364 -117.98777 curveto
closepath
fill
newpath
0.0 0.0 0.0 setrgbcolor
newpath
79.06455 -102.717026 moveto
79.06455 -103.18175 78.68782 -103.558495 78.22308 -103.558495 curveto
77.75836 -103.558495 77.381615 -103.18175 77.381615 -102.717026 curveto
77.381615 -102.252304 77.75836 -101.87556 78.22308 -101.87556 curveto
78.68782 -101.87556 79.06455 -102.252304 79.06455 -102.717026 curveto
closepath
fill
newpath
0.0 0.0 0.0 setrgbcolor
1.0 setlinewidth
10.0 setmiterlimit
1 setlinejoin
1 setlinecap
[ ] 0 setdash
newpath
79.06455 -102.717026 moveto
79.06455 -103.18175 78.68782 -103.558495 78.22308 -103.558495 curveto
77.75836 -103.558495 77.381615 -103.18175 77.381615 -102.717026 curveto
77.381615 -102.252304 77.75836 -101.87556 78.22308 -101.87556 curveto
78.68782 -101.87556 79.06455 -102.252304 79.06455 -102.717026 curveto
closepath
stroke
newpath
0.0 0.0 0.0 setrgbcolor
newpath
63.210255 -100.976006 moveto
63.210255 -93.67891 lineto
65.63605 -93.67891 lineto
66.359184 -93.67891 66.94344 -93.75944 67.38883 -93.9205 curveto
67.83421 -94.081566 68.21961 -94.354385 68.54502 -94.73896 curveto
69.06108 -95.35034 69.31911 -96.15565 69.31911 -97.15489 curveto
69.31911 -98.36779 68.99863 -99.30786 68.357666 -99.97512 curveto
67.716705 -100.64238 66.81443 -100.976006 65.65084 -100.976006 curveto
closepath
64.24565 -100.20192 moveto
65.57195 -100.20192 lineto
66.5186 -100.20192 67.18915 -99.94718 67.58358 -99.4377 curveto
68.0076 -98.89535 68.21961 -98.16728 68.21961 -97.2535 curveto
68.21961 -96.3956 68.01089 -95.72177 67.593445 -95.23201 curveto
67.34035 -94.93289 67.03794 -94.72828 66.68623 -94.618164 curveto
66.334526 -94.50805 65.80533 -94.452995 65.098625 -94.452995 curveto
64.24565 -94.452995 lineto
closepath
fill
newpath
0.0 0.0 0.0 setrgbcolor
newpath
22.371643 -46.024105 moveto
22.371643 -46.488827 21.994911 -46.86557 21.530176 -46.86557 curveto
21.065454 -46.86557 20.68871 -46.488827 20.68871 -46.024105 curveto
20.68871 -45.559383 21.065454 -45.18264 21.530176 -45.18264 curveto
21.994911 -45.18264 22.371643 -45.559383 22.371643 -46.024105 curveto
closepath
fill
newpath
0.0 0.0 0.0 setrgbcolor
1.0 setlinewidth
10.0 setmiterlimit
1 setlinejoin
1 setlinecap
[ ] 0 setdash
newpath
22.371643 -46.024105 moveto
22.371643 -46.488827 21.994911 -46.86557 21.530176 -46.86557 curveto
21.065454 -46.86557 20.68871 -46.488827 20.68871 -46.024105 curveto
20.68871 -45.559383 21.065454 -45.18264 21.530176 -45.18264 curveto
21.994911 -45.18264 22.371643 -45.559383 22.371643 -46.024105 curveto
closepath
stroke
newpath
0.0 0.0 0.0 setrgbcolor
newpath
7.6734533 -50.488003 moveto
7.6734533 -43.19091 lineto
11.750951 -43.19091 lineto
11.750951 -43.964993 lineto
8.708852 -43.964993 lineto
8.708852 -46.306965 lineto
11.257904 -46.306965 lineto
11.257904 -47.071186 lineto
8.708852 -47.071186 lineto
8.708852 -49.71392 lineto
11.962961 -49.71392 lineto
11.962961 -50.488003 lineto
closepath
fill
newpath
0.0 0.0 0.0 setrgbcolor
newpath
107.41101 -46.024105 moveto
107.41101 -46.488827 107.03427 -46.86557 106.56954 -46.86557 curveto
106.10482 -46.86557 105.72808 -46.488827 105.72808 -46.024105 curveto
105.72808 -45.559383 106.10482 -45.18264 106.56954 -45.18264 curveto
107.03427 -45.18264 107.41101 -45.559383 107.41101 -46.024105 curveto
closepath
fill
newpath
0.0 0.0 0.0 setrgbcolor
1.0 setlinewidth
10.0 setmiterlimit
1 setlinejoin
1 setlinecap
[ ] 0 setdash
newpath
107.41101 -46.024105 moveto
107.41101 -46.488827 107.03427 -46.86557 106.56954 -46.86557 curveto
106.10482 -46.86557 105.72808 -46.488827 105.72808 -46.024105 curveto
105.72808 -45.559383 106.10482 -45.18264 106.56954 -45.18264 curveto
107.03427 -45.18264 107.41101 -45.559383 107.41101 -46.024105 curveto
closepath
stroke
newpath
0.0 0.0 0.0 setrgbcolor
newpath
113.69826 -58.902668 moveto
113.69826 -51.605576 lineto
117.77576 -51.605576 lineto
117.77576 -52.379658 lineto
114.73366 -52.379658 lineto
114.73366 -54.825172 lineto
117.28764 -54.825172 lineto
117.28764 -55.589394 lineto
114.73366 -55.589394 lineto
114.73366 -58.902668 lineto
closepath
fill
newpath
0.0 0.0 0.0 setrgbcolor
newpath
164.10393 -17.677658 moveto
164.10393 -18.14238 163.72719 -18.519125 163.26247 -18.519125 curveto
162.79774 -18.519125 162.421 -18.14238 162.421 -17.677658 curveto
162.421 -17.212934 162.79774 -16.836191 163.26247 -16.836191 curveto
163.72719 -16.836191 164.10393 -17.212934 164.10393 -17.677658 curveto
closepath
fill
newpath
0.0 0.0 0.0 setrgbcolor
1.0 setlinewidth
10.0 setmiterlimit
1 setlinejoin
1 setlinecap
[ ] 0 setdash
newpath
164.10393 -17.677658 moveto
164.10393 -18.14238 163.72719 -18.519125 163.26247 -18.519125 curveto
162.79774 -18.519125 162.421 -18.14238 162.421 -17.677658 curveto
162.421 -17.212934 162.79774 -16.836191 163.26247 -16.836191 curveto
163.72719 -16.836191 164.10393 -17.212934 164.10393 -17.677658 curveto
closepath
stroke
newpath
0.0 0.0 0.0 setrgbcolor
newpath
177.24214 -19.156515 moveto
176.35794 -19.409613 175.58714 -19.536161 174.92975 -19.536161 curveto
173.76945 -19.536161 172.8795 -19.20582 172.2599 -18.545137 curveto
171.6403 -17.884455 171.3305 -16.937805 171.3305 -15.705187 curveto
171.3305 -14.495579 171.64441 -13.554681 172.27223 -12.882494 curveto
172.90004 -12.210307 173.78094 -11.874213 174.91496 -11.874213 curveto
175.65782 -11.874213 176.43027 -11.984327 177.23228 -12.204555 curveto
177.23228 -13.161065 lineto
176.22647 -12.81922 175.45567 -12.648296 174.91989 -12.648296 curveto
174.13101 -12.648296 173.51881 -12.916185 173.0833 -13.451962 curveto
172.64777 -13.9877405 172.43001 -14.742103 172.43001 -15.715048 curveto
172.43001 -16.678133 172.66338 -17.426743 173.13013 -17.960876 curveto
173.59688 -18.49501 174.25099 -18.762077 175.09245 -18.762077 curveto
175.43759 -18.762077 175.81065 -18.70127 176.21167 -18.57965 curveto
176.21167 -16.203165 lineto
177.24214 -16.203165 lineto
closepath
fill
newpath
0.0 0.0 0.0 setrgbcolor
newpath
79.06455 -17.677658 moveto
79.06455 -18.14238 78.68782 -18.519125 78.22308 -18.519125 curveto
77.75836 -18.519125 77.381615 -18.14238 77.381615 -17.677658 curveto
77.381615 -17.212934 77.75836 -16.836191 78.22308 -16.836191 curveto
78.68782 -16.836191 79.06455 -17.212934 79.06455 -17.677658 curveto
closepath
fill
newpath
0.0 0.0 0.0 setrgbcolor
1.0 setlinewidth
10.0 setmiterlimit
1 setlinejoin
1 setlinecap
[ ] 0 setdash
newpath
79.06455 -17.677658 moveto
79.06455 -18.14238 78.68782 -18.519125 78.22308 -18.519125 curveto
77.75836 -18.519125 77.381615 -18.14238 77.381615 -17.677658 curveto
77.381615 -17.212934 77.75836 -16.836191 78.22308 -16.836191 curveto
78.68782 -16.836191 79.06455 -17.212934 79.06455 -17.677658 curveto
closepath
stroke
newpath
0.0 0.0 0.0 setrgbcolor
newpath
60.685856 -14.3049345 moveto
60.685856 -7.00784 lineto
61.721256 -7.00784 lineto
61.721256 -10.084453 lineto
65.19231 -10.084453 lineto
65.19231 -7.00784 lineto
66.22771 -7.00784 lineto
66.22771 -14.3049345 lineto
65.19231 -14.3049345 lineto
65.19231 -10.858536 lineto
61.721256 -10.858536 lineto
61.721256 -14.3049345 lineto
closepath
fill
newpath
0.0 0.0 0.0 setrgbcolor
newpath
164.10393 -74.370575 moveto
164.10393 -74.835304 163.72719 -75.21204 163.26247 -75.21204 curveto
162.79774 -75.21204 162.421 -74.835304 162.421 -74.370575 curveto
162.421 -73.90583 162.79774 -73.52911 163.26247 -73.52911 curveto
163.72719 -73.52911 164.10393 -73.90583 164.10393 -74.370575 curveto
closepath
fill
newpath
0.0 0.0 0.0 setrgbcolor
1.0 setlinewidth
10.0 setmiterlimit
1 setlinejoin
1 setlinecap
[ ] 0 setdash
newpath
164.10393 -74.370575 moveto
164.10393 -74.835304 163.72719 -75.21204 163.26247 -75.21204 curveto
162.79774 -75.21204 162.421 -74.835304 162.421 -74.370575 curveto
162.421 -73.90583 162.79774 -73.52911 163.26247 -73.52911 curveto
163.72719 -73.52911 164.10393 -73.90583 164.10393 -74.370575 curveto
closepath
stroke
newpath
0.0 0.0 0.0 setrgbcolor
newpath
167.55212 -72.366135 moveto
167.55212 -65.069046 lineto
168.9869 -65.069046 lineto
171.00839 -70.71443 lineto
173.08905 -65.069046 lineto
174.37097 -65.069046 lineto
174.37097 -72.366135 lineto
173.4046 -72.366135 lineto
173.4046 -66.429855 lineto
171.39296 -71.87802 lineto
170.39207 -71.87802 lineto
168.4396 -66.41506 lineto
168.4396 -72.366135 lineto
closepath
fill
newpath
0.0 0.0 0.0 setrgbcolor
newpath
277.48975 -102.717026 moveto
277.48975 -103.18175 277.113 -103.558495 276.6483 -103.558495 curveto
276.18356 -103.558495 275.80682 -103.18175 275.80682 -102.717026 curveto
275.80682 -102.252304 276.18356 -101.87556 276.6483 -101.87556 curveto
277.113 -101.87556 277.48975 -102.252304 277.48975 -102.717026 curveto
closepath
fill
newpath
0.0 0.0 0.0 setrgbcolor
1.0 setlinewidth
10.0 setmiterlimit
1 setlinejoin
1 setlinecap
[ ] 0 setdash
newpath
277.48975 -102.717026 moveto
277.48975 -103.18175 277.113 -103.558495 276.6483 -103.558495 curveto
276.18356 -103.558495 275.80682 -103.18175 275.80682 -102.717026 curveto
275.80682 -102.252304 276.18356 -101.87556 276.6483 -101.87556 curveto
277.113 -101.87556 277.48975 -102.252304 277.48975 -102.717026 curveto
closepath
stroke
newpath
0.0 0.0 0.0 setrgbcolor
newpath
79.06455 -17.677658 moveto
79.06455 -18.14238 78.68782 -18.519125 78.22308 -18.519125 curveto
77.75836 -18.519125 77.381615 -18.14238 77.381615 -17.677658 curveto
77.381615 -17.212934 77.75836 -16.836191 78.22308 -16.836191 curveto
78.68782 -16.836191 79.06455 -17.212934 79.06455 -17.677658 curveto
closepath
fill
newpath
0.0 0.0 0.0 setrgbcolor
1.0 setlinewidth
10.0 setmiterlimit
1 setlinejoin
1 setlinecap
[ ] 0 setdash
newpath
79.06455 -17.677658 moveto
79.06455 -18.14238 78.68782 -18.519125 78.22308 -18.519125 curveto
77.75836 -18.519125 77.381615 -18.14238 77.381615 -17.677658 curveto
77.381615 -17.212934 77.75836 -16.836191 78.22308 -16.836191 curveto
78.68782 -16.836191 79.06455 -17.212934 79.06455 -17.677658 curveto
closepath
stroke
newpath
0.0 0.0 0.0 setrgbcolor
newpath
254.96442 -135.47614 moveto
254.96442 -135.94086 254.58766 -136.31761 254.12294 -136.31761 curveto
253.65822 -136.31761 253.28148 -135.94086 253.28148 -135.47614 curveto
253.28148 -135.01141 253.65822 -134.63467 254.12294 -134.63467 curveto
254.58766 -134.63467 254.96442 -135.01141 254.96442 -135.47614 curveto
closepath
fill
newpath
0.0 0.0 0.0 setrgbcolor
1.0 setlinewidth
10.0 setmiterlimit
1 setlinejoin
1 setlinecap
[ ] 0 setdash
newpath
254.96442 -135.47614 moveto
254.96442 -135.94086 254.58766 -136.31761 254.12294 -136.31761 curveto
253.65822 -136.31761 253.28148 -135.94086 253.28148 -135.47614 curveto
253.28148 -135.01141 253.65822 -134.63467 254.12294 -134.63467 curveto
254.58766 -134.63467 254.96442 -135.01141 254.96442 -135.47614 curveto
closepath
stroke
newpath
0.2509804 0.2509804 0.2509804 setrgbcolor
newpath
206.0476 -102.717026 moveto
206.0476 -103.18175 205.6709 -103.558495 205.20615 -103.558495 curveto
204.74142 -103.558495 204.36469 -103.18175 204.36469 -102.717026 curveto
204.36469 -102.252304 204.74142 -101.87556 205.20615 -101.87556 curveto
205.6709 -101.87556 206.0476 -102.252304 206.0476 -102.717026 curveto
closepath
fill
newpath
0.0 0.0 0.0 setrgbcolor
1.0 setlinewidth
10.0 setmiterlimit
1 setlinejoin
1 setlinecap
[ ] 0 setdash
newpath
206.0476 -102.717026 moveto
206.0476 -103.18175 205.6709 -103.558495 205.20615 -103.558495 curveto
204.74142 -103.558495 204.36469 -103.18175 204.36469 -102.717026 curveto
204.36469 -102.252304 204.74142 -101.87556 205.20615 -101.87556 curveto
205.6709 -101.87556 206.0476 -102.252304 206.0476 -102.717026 curveto
closepath
stroke
newpath
0.2509804 0.2509804 0.2509804 setrgbcolor
newpath
209.62053 -100.976006 moveto
209.62053 -93.67891 lineto
210.65593 -93.67891 lineto
210.65593 -100.976006 lineto
closepath
fill
newpath
grestore
grestore
showpage

%%EOF