%!PS-Adobe-3.0 EPSF-3.0
%%Creator: EpsGraphics2D 0.9.0 by Paul Mutton, http://www.jibble.org/
%%Title: GeoGebra, http://www.geogebra.org
%%CreationDate: Tue Apr 08 15:42:38 CEST 2008
%%BoundingBox: 0 0 133 137
%%DocumentData: Clean7Bit
%%DocumentProcessColors: Black
%%ColorUsage: Color
%%Origin: 0 0
%%Pages: 1
%%Page: 1 1
%%EndComments

gsave
-0.0 137.0 translate
1.0 setlinewidth
10.0 setmiterlimit
0 setlinejoin
2 setlinecap
[ ] 0 setdash
gsave
newpath
0.0 -0.0 moveto
133.97314 -0.0 lineto
133.97314 -137.71541 lineto
0.0 -137.71541 lineto
0.0 -0.0 lineto
closepath
clip
newpath
1.0 setlinewidth
10.0 setmiterlimit
0 setlinejoin
2 setlinecap
[ ] 0 setdash
1.0 1.0 1.0 setrgbcolor
newpath
-175.13808 80.08451 moveto
354.01843 80.08451 lineto
354.01843 -383.95657 lineto
-175.13808 -383.95657 lineto
-175.13808 80.08451 lineto
closepath
fill
newpath
0.0 0.0 0.0 setrgbcolor
1.0 setlinewidth
10.0 setmiterlimit
1 setlinejoin
1 setlinecap
[ ] 0 setdash
newpath
105.90489 -12.819907 moveto
105.90489 -126.20573 lineto
stroke
newpath
0.0 0.0 0.0 setrgbcolor
1.0 setlinewidth
10.0 setmiterlimit
1 setlinejoin
1 setlinecap
[ ] 0 setdash
newpath
105.90489 -126.20573 moveto
26.195868 -126.48862 lineto
stroke
newpath
0.0 0.0 0.0 setrgbcolor
1.0 setlinewidth
10.0 setmiterlimit
1 setlinejoin
1 setlinecap
[ ] 0 setdash
newpath
105.90489 -12.819907 moveto
26.195868 -126.48862 lineto
stroke
newpath
0.0 0.0 0.0 setrgbcolor
newpath
106.65334 -12.819907 moveto
106.65334 -13.233272 106.31827 -13.56836 105.90489 -13.56836 curveto
105.49154 -13.56836 105.15644 -13.233272 105.15644 -12.819907 curveto
105.15644 -12.4065485 105.49154 -12.071454 105.90489 -12.071454 curveto
106.31827 -12.071454 106.65334 -12.4065485 106.65334 -12.819907 curveto
closepath
fill
newpath
0.0 0.0 0.0 setrgbcolor
1.0 setlinewidth
10.0 setmiterlimit
1 setlinejoin
1 setlinecap
[ ] 0 setdash
newpath
106.65334 -12.819907 moveto
106.65334 -13.233272 106.31827 -13.56836 105.90489 -13.56836 curveto
105.49154 -13.56836 105.15644 -13.233272 105.15644 -12.819907 curveto
105.15644 -12.4065485 105.49154 -12.071454 105.90489 -12.071454 curveto
106.31827 -12.071454 106.65334 -12.4065485 106.65334 -12.819907 curveto
closepath
stroke
newpath
0.0 0.0 0.0 setrgbcolor
newpath
114.24 -11.051381 moveto
113.45354 -11.276503 112.767944 -11.389063 112.18321 -11.389063 curveto
111.15117 -11.389063 110.3596 -11.095237 109.80849 -10.507584 curveto
109.25738 -9.91993 108.98183 -9.077921 108.98183 -7.981553 curveto
108.98183 -6.905651 109.26103 -6.068758 109.81945 -5.4708724 curveto
110.37787 -4.872987 111.1614 -4.5740438 112.17006 -4.5740438 curveto
112.8308 -4.5740438 113.51786 -4.671986 114.23123 -4.8678703 curveto
114.23123 -5.7186513 lineto
113.33659 -5.4145923 112.651 -5.2625628 112.174446 -5.2625628 curveto
111.47277 -5.2625628 110.92824 -5.5008397 110.540855 -5.977394 curveto
110.15347 -6.4539485 109.959785 -7.124925 109.959785 -7.990324 curveto
109.959785 -8.846952 110.167366 -9.512813 110.58252 -9.9879055 curveto
110.99767 -10.462998 111.57948 -10.700544 112.327934 -10.700544 curveto
112.63492 -10.700544 112.96676 -10.646457 113.32344 -10.538281 curveto
113.32344 -8.424485 lineto
114.24 -8.424485 lineto
closepath
fill
newpath
0.0 0.0 0.0 setrgbcolor
newpath
106.65334 -126.20573 moveto
106.65334 -126.6191 106.31827 -126.954185 105.90489 -126.954185 curveto
105.49154 -126.954185 105.15644 -126.6191 105.15644 -126.20573 curveto
105.15644 -125.79237 105.49154 -125.457275 105.90489 -125.457275 curveto
106.31827 -125.457275 106.65334 -125.79237 106.65334 -126.20573 curveto
closepath
fill
newpath
0.0 0.0 0.0 setrgbcolor
1.0 setlinewidth
10.0 setmiterlimit
1 setlinejoin
1 setlinecap
[ ] 0 setdash
newpath
106.65334 -126.20573 moveto
106.65334 -126.6191 106.31827 -126.954185 105.90489 -126.954185 curveto
105.49154 -126.954185 105.15644 -126.6191 105.15644 -126.20573 curveto
105.15644 -125.79237 105.49154 -125.457275 105.90489 -125.457275 curveto
106.31827 -125.457275 106.65334 -125.79237 106.65334 -126.20573 curveto
closepath
stroke
newpath
0.0 0.0 0.0 setrgbcolor
newpath
115.88602 -129.64468 moveto
114.87736 -129.64468 114.098206 -129.34866 113.54856 -128.75664 curveto
112.99892 -128.1646 112.72409 -127.32624 112.72409 -126.24157 curveto
112.72409 -125.15982 113.00403 -124.32073 113.56391 -123.72431 curveto
114.12379 -123.127884 114.91244 -122.82967 115.92987 -122.82967 curveto
116.51167 -122.82967 117.19288 -122.92469 117.973495 -123.11473 curveto
117.973495 -123.97867 lineto
117.08471 -123.671684 116.39911 -123.51819 115.91671 -123.51819 curveto
115.21211 -123.51819 114.666855 -123.75647 114.28093 -124.233025 curveto
113.89501 -124.70958 113.70205 -125.38201 113.70205 -126.250336 curveto
113.70205 -127.07773 113.908165 -127.73043 114.320404 -128.20845 curveto
114.732635 -128.68646 115.29543 -128.92548 116.008804 -128.92548 curveto
116.62277 -128.92548 117.280594 -128.7369 117.98227 -128.35974 curveto
117.98227 -129.14914 lineto
117.34199 -129.4795 116.64324 -129.64468 115.88602 -129.64468 curveto
closepath
fill
newpath
0.0 0.0 0.0 setrgbcolor
newpath
26.94432 -126.48862 moveto
26.94432 -126.90197 26.60922 -127.23707 26.195868 -127.23707 curveto
25.782515 -127.23707 25.447414 -126.90197 25.447414 -126.48862 curveto
25.447414 -126.075264 25.782515 -125.740166 26.195868 -125.740166 curveto
26.60922 -125.740166 26.94432 -126.075264 26.94432 -126.48862 curveto
closepath
fill
newpath
0.0 0.0 0.0 setrgbcolor
1.0 setlinewidth
10.0 setmiterlimit
1 setlinejoin
1 setlinecap
[ ] 0 setdash
newpath
26.94432 -126.48862 moveto
26.94432 -126.90197 26.60922 -127.23707 26.195868 -127.23707 curveto
25.782515 -127.23707 25.447414 -126.90197 25.447414 -126.48862 curveto
25.447414 -126.075264 25.782515 -125.740166 26.195868 -125.740166 curveto
26.60922 -125.740166 26.94432 -126.075264 26.94432 -126.48862 curveto
closepath
stroke
newpath
0.0 0.0 0.0 setrgbcolor
newpath
16.175072 -130.39314 moveto
15.274589 -130.39314 14.550255 -130.08104 14.002071 -129.45685 curveto
13.453887 -128.83266 13.179795 -128.00745 13.179795 -126.98125 curveto
13.179795 -125.9492 13.455349 -125.12401 14.006456 -124.50565 curveto
14.557564 -123.8873 15.2935915 -123.578125 16.21454 -123.578125 curveto
17.132565 -123.578125 17.867863 -123.886566 18.420431 -124.503456 curveto
18.973 -125.120346 19.249285 -125.94336 19.249285 -126.97248 curveto
19.249285 -128.02206 18.973 -128.85457 18.420431 -129.47 curveto
17.867863 -130.08543 17.11941 -130.39314 16.175072 -130.39314 curveto
closepath
16.188227 -129.70462 moveto
16.851894 -129.70462 17.364996 -129.4656 17.727528 -128.9876 curveto
18.09006 -128.50958 18.271324 -127.83496 18.271324 -126.96371 curveto
18.271324 -126.118774 18.089327 -125.45803 17.725334 -124.981476 curveto
17.36134 -124.50492 16.857742 -124.26665 16.21454 -124.26665 curveto
15.568415 -124.26665 15.064086 -124.50565 14.701553 -124.983665 curveto
14.339021 -125.461685 14.157755 -126.12608 14.157755 -126.97687 curveto
14.157755 -127.82473 14.337559 -128.49132 14.697167 -128.97664 curveto
15.056776 -129.46196 15.553796 -129.70462 16.188227 -129.70462 curveto
closepath
fill
newpath
grestore
grestore
showpage

%%EOF