%!PS-Adobe-3.0 EPSF-3.0
%%Creator: EpsGraphics2D 0.9.0 by Paul Mutton, http://www.jibble.org/
%%Title: GeoGebra, http://www.geogebra.org
%%CreationDate: Tue Apr 08 15:40:04 CEST 2008
%%BoundingBox: 0 0 163 110
%%DocumentData: Clean7Bit
%%DocumentProcessColors: Black
%%ColorUsage: Color
%%Origin: 0 0
%%Pages: 1
%%Page: 1 1
%%EndComments

gsave
-0.0 110.0 translate
1.0 setlinewidth
10.0 setmiterlimit
0 setlinejoin
2 setlinecap
[ ] 0 setdash
gsave
newpath
0.0 -0.0 moveto
163.16283 -0.0 lineto
163.16283 -110.771095 lineto
0.0 -110.771095 lineto
0.0 -0.0 lineto
closepath
clip
newpath
1.0 setlinewidth
10.0 setmiterlimit
0 setlinejoin
2 setlinecap
[ ] 0 setdash
1.0 1.0 1.0 setrgbcolor
newpath
-150.43912 71.851524 moveto
378.7174 71.851524 lineto
378.7174 -392.18954 lineto
-150.43912 -392.18954 lineto
-150.43912 71.851524 lineto
closepath
fill
newpath
0.0 0.0 0.0 setrgbcolor
1.0 setlinewidth
10.0 setmiterlimit
1 setlinejoin
1 setlinecap
[ ] 0 setdash
newpath
130.60385 -21.052895 moveto
17.218037 -21.052895 lineto
stroke
newpath
0.0 0.0 0.0 setrgbcolor
1.0 setlinewidth
10.0 setmiterlimit
1 setlinejoin
1 setlinecap
[ ] 0 setdash
newpath
17.218037 -21.052895 moveto
17.214426 -101.0412 lineto
stroke
newpath
0.0 0.0 0.0 setrgbcolor
1.0 setlinewidth
10.0 setmiterlimit
1 setlinejoin
1 setlinecap
[ ] 0 setdash
newpath
130.60385 -21.052895 moveto
17.214426 -101.0412 lineto
stroke
newpath
0.0 0.0 0.0 setrgbcolor
newpath
131.35231 -21.052895 moveto
131.35231 -21.466259 131.01723 -21.801348 130.60385 -21.801348 curveto
130.1905 -21.801348 129.8554 -21.466259 129.8554 -21.052895 curveto
129.8554 -20.639536 130.1905 -20.304441 130.60385 -20.304441 curveto
131.01723 -20.304441 131.35231 -20.639536 131.35231 -21.052895 curveto
closepath
fill
newpath
0.0 0.0 0.0 setrgbcolor
1.0 setlinewidth
10.0 setmiterlimit
1 setlinejoin
1 setlinecap
[ ] 0 setdash
newpath
131.35231 -21.052895 moveto
131.35231 -21.466259 131.01723 -21.801348 130.60385 -21.801348 curveto
130.1905 -21.801348 129.8554 -21.466259 129.8554 -21.052895 curveto
129.8554 -20.639536 130.1905 -20.304441 130.60385 -20.304441 curveto
131.01723 -20.304441 131.35231 -20.639536 131.35231 -21.052895 curveto
closepath
stroke
newpath
0.0 0.0 0.0 setrgbcolor
newpath
138.93896 -19.284369 moveto
138.15251 -19.50949 137.4669 -19.62205 136.88217 -19.62205 curveto
135.85013 -19.62205 135.05855 -19.328222 134.50745 -18.74057 curveto
133.95634 -18.152918 133.68079 -17.310907 133.68079 -16.21454 curveto
133.68079 -15.1386385 133.95999 -14.301745 134.5184 -13.703859 curveto
135.07683 -13.105973 135.86037 -12.807031 136.86902 -12.807031 curveto
137.52977 -12.807031 138.21683 -12.904973 138.93019 -13.100857 curveto
138.93019 -13.951638 lineto
138.03555 -13.647579 137.34996 -13.495549 136.8734 -13.495549 curveto
136.17172 -13.495549 135.6272 -13.733827 135.23982 -14.210381 curveto
134.85243 -14.686934 134.65874 -15.357911 134.65874 -16.22331 curveto
134.65874 -17.079939 134.86632 -17.7458 135.28148 -18.220892 curveto
135.69664 -18.695984 136.27844 -18.93353 137.0269 -18.93353 curveto
137.33388 -18.93353 137.66571 -18.879444 138.0224 -18.771269 curveto
138.0224 -16.657473 lineto
138.93896 -16.657473 lineto
closepath
fill
newpath
0.0 0.0 0.0 setrgbcolor
newpath
17.96649 -21.052895 moveto
17.96649 -21.466259 17.63139 -21.801348 17.218037 -21.801348 curveto
16.80467 -21.801348 16.469582 -21.466259 16.469582 -21.052895 curveto
16.469582 -20.639536 16.80467 -20.304441 17.218037 -20.304441 curveto
17.63139 -20.304441 17.96649 -20.639536 17.96649 -21.052895 curveto
closepath
fill
newpath
0.0 0.0 0.0 setrgbcolor
1.0 setlinewidth
10.0 setmiterlimit
1 setlinejoin
1 setlinecap
[ ] 0 setdash
newpath
17.96649 -21.052895 moveto
17.96649 -21.466259 17.63139 -21.801348 17.218037 -21.801348 curveto
16.80467 -21.801348 16.469582 -21.466259 16.469582 -21.052895 curveto
16.469582 -20.639536 16.80467 -20.304441 17.218037 -20.304441 curveto
17.63139 -20.304441 17.96649 -20.639536 17.96649 -21.052895 curveto
closepath
stroke
newpath
0.0 0.0 0.0 setrgbcolor
newpath
9.819065 -15.717521 moveto
9.819065 -9.227026 lineto
10.740013 -9.227026 lineto
10.740013 -11.963559 lineto
13.827383 -11.963559 lineto
13.827383 -9.227026 lineto
14.748332 -9.227026 lineto
14.748332 -15.717521 lineto
13.827383 -15.717521 lineto
13.827383 -12.652078 lineto
10.740013 -12.652078 lineto
10.740013 -15.717521 lineto
closepath
fill
newpath
0.0 0.0 0.0 setrgbcolor
newpath
17.962881 -101.0412 moveto
17.962881 -101.45457 17.627792 -101.78966 17.214426 -101.78966 curveto
16.801062 -101.78966 16.465973 -101.45457 16.465973 -101.0412 curveto
16.465973 -100.62784 16.801062 -100.29275 17.214426 -100.29275 curveto
17.627792 -100.29275 17.962881 -100.62784 17.962881 -101.0412 curveto
closepath
fill
newpath
0.0 0.0 0.0 setrgbcolor
1.0 setlinewidth
10.0 setmiterlimit
1 setlinejoin
1 setlinecap
[ ] 0 setdash
newpath
17.962881 -101.0412 moveto
17.962881 -101.45457 17.627792 -101.78966 17.214426 -101.78966 curveto
16.801062 -101.78966 16.465973 -101.45457 16.465973 -101.0412 curveto
16.465973 -100.62784 16.801062 -100.29275 17.214426 -100.29275 curveto
17.627792 -100.29275 17.962881 -100.62784 17.962881 -101.0412 curveto
closepath
stroke
newpath
0.0 0.0 0.0 setrgbcolor
newpath
7.1936307 -104.94573 moveto
6.293148 -104.94573 5.5688148 -104.63363 5.020631 -104.00943 curveto
4.4724474 -103.38523 4.1983557 -102.560036 4.1983557 -101.53384 curveto
4.1983557 -100.501785 4.4739094 -99.67659 5.0250163 -99.058235 curveto
5.5761237 -98.43989 6.3121514 -98.130714 7.2331 -98.130714 curveto
8.151125 -98.130714 8.886421 -98.439156 9.438991 -99.056046 curveto
9.99156 -99.672935 10.267844 -100.49594 10.267844 -101.52506 curveto
10.267844 -102.57465 9.99156 -103.407166 9.438991 -104.02259 curveto
8.886421 -104.638016 8.137968 -104.94573 7.1936307 -104.94573 curveto
closepath
7.206787 -104.25721 moveto
7.870455 -104.25721 8.383554 -104.0182 8.746087 -103.54019 curveto
9.108619 -103.06217 9.289885 -102.38754 9.289885 -101.5163 curveto
9.289885 -100.671364 9.107887 -100.01062 8.743894 -99.534065 curveto
8.3799 -99.05751 7.876302 -98.81923 7.2331 -98.81923 curveto
6.586974 -98.81923 6.0826454 -99.058235 5.7201133 -99.536255 curveto
5.357581 -100.014275 5.176315 -100.67867 5.176315 -101.52945 curveto
5.176315 -102.37731 5.356119 -103.0439 5.715728 -103.52922 curveto
6.075336 -104.01455 6.5723557 -104.25721 7.206787 -104.25721 curveto
closepath
11.421223 -100.24012 moveto
11.206335 -97.85881 lineto
12.289545 -97.85881 lineto
12.070272 -100.24012 lineto
closepath
fill
newpath
grestore
grestore
showpage

%%EOF