%!PS-Adobe-3.0 EPSF-3.0
%%Creator: EpsGraphics2D 0.9.0 by Paul Mutton, http://www.jibble.org/
%%Title: GeoGebra, http://www.geogebra.org
%%CreationDate: Tue Mar 11 17:51:54 CET 2008
%%BoundingBox: 0 0 425 330
%%DocumentData: Clean7Bit
%%DocumentProcessColors: Black
%%ColorUsage: Color
%%Origin: 0 0
%%Pages: 1
%%Page: 1 1
%%EndComments

gsave
-0.0 330.0 translate
1.0 setlinewidth
10.0 setmiterlimit
0 setlinejoin
2 setlinecap
[ ] 0 setdash
gsave
newpath
0.0 -0.0 moveto
425.1785 -0.0 lineto
425.1785 -330.6944 lineto
0.0 -330.6944 lineto
0.0 -0.0 lineto
closepath
clip
newpath
1.0 setlinewidth
10.0 setmiterlimit
0 setlinejoin
2 setlinecap
[ ] 0 setdash
1.0 1.0 1.0 setrgbcolor
newpath
-284.92865 208.16031 moveto
758.8255 208.16031 lineto
758.8255 -707.15454 lineto
-284.92865 -707.15454 lineto
-284.92865 208.16031 lineto
closepath
fill
newpath
0.0 0.0 0.0 setrgbcolor
1.5 setlinewidth
10.0 setmiterlimit
1 setlinejoin
1 setlinecap
[ ] 0 setdash
newpath
40.189938 -286.54904 moveto
295.30804 -286.54904 lineto
stroke
newpath
0.0 0.0 0.0 setrgbcolor
1.5 setlinewidth
10.0 setmiterlimit
1 setlinejoin
1 setlinecap
[ ] 0 setdash
newpath
295.30804 -286.54904 moveto
352.00098 -229.85611 lineto
stroke
newpath
0.0 0.0 0.0 setrgbcolor
1.5 setlinewidth
10.0 setmiterlimit
1 setlinejoin
0 setlinecap
[ 5.5 4.0 ] 0 setdash
newpath
352.00098 -229.85611 moveto
96.88285 -229.85611 lineto
stroke
newpath
0.0 0.0 0.0 setrgbcolor
1.5 setlinewidth
10.0 setmiterlimit
1 setlinejoin
0 setlinecap
[ 5.5 4.0 ] 0 setdash
newpath
96.88285 -229.85611 moveto
40.189938 -286.54904 lineto
stroke
newpath
0.0 0.0 0.0 setrgbcolor
1.5 setlinewidth
10.0 setmiterlimit
1 setlinejoin
1 setlinecap
[ ] 0 setdash
newpath
40.189938 -286.54904 moveto
40.189938 -88.12383 lineto
stroke
newpath
0.0 0.0 0.0 setrgbcolor
1.5 setlinewidth
10.0 setmiterlimit
1 setlinejoin
1 setlinecap
[ ] 0 setdash
newpath
40.189938 -88.12383 moveto
96.88285 -31.430923 lineto
stroke
newpath
0.0 0.0 0.0 setrgbcolor
1.5 setlinewidth
10.0 setmiterlimit
1 setlinejoin
0 setlinecap
[ 5.5 4.0 ] 0 setdash
newpath
96.88285 -31.430923 moveto
96.88285 -229.85611 lineto
stroke
newpath
0.0 0.0 0.0 setrgbcolor
1.5 setlinewidth
10.0 setmiterlimit
1 setlinejoin
1 setlinecap
[ ] 0 setdash
newpath
96.88285 -31.430923 moveto
352.00098 -31.430923 lineto
stroke
newpath
0.0 0.0 0.0 setrgbcolor
1.5 setlinewidth
10.0 setmiterlimit
1 setlinejoin
1 setlinecap
[ ] 0 setdash
newpath
352.00098 -229.85611 moveto
352.00098 -31.430923 lineto
stroke
newpath
0.0 0.0 0.0 setrgbcolor
1.5 setlinewidth
10.0 setmiterlimit
1 setlinejoin
1 setlinecap
[ ] 0 setdash
newpath
295.30804 -88.12383 moveto
352.00098 -31.430923 lineto
stroke
newpath
0.0 0.0 0.0 setrgbcolor
1.5 setlinewidth
10.0 setmiterlimit
1 setlinejoin
1 setlinecap
[ ] 0 setdash
newpath
295.30804 -88.12383 moveto
295.30804 -286.54904 lineto
stroke
newpath
0.0 0.0 0.0 setrgbcolor
1.5 setlinewidth
10.0 setmiterlimit
1 setlinejoin
1 setlinecap
[ ] 0 setdash
newpath
40.189938 -88.12383 moveto
295.30804 -88.12383 lineto
stroke
newpath
0.0 0.0 0.0 setrgbcolor
newpath
41.666252 -286.54904 moveto
41.666252 -287.36438 41.005272 -288.02536 40.189938 -288.02536 curveto
39.37458 -288.02536 38.713623 -287.36438 38.713623 -286.54904 curveto
38.713623 -285.7337 39.37458 -285.07272 40.189938 -285.07272 curveto
41.005272 -285.07272 41.666252 -285.7337 41.666252 -286.54904 curveto
closepath
fill
newpath
0.0 0.0 0.0 setrgbcolor
1.0 setlinewidth
10.0 setmiterlimit
1 setlinejoin
1 setlinecap
[ ] 0 setdash
newpath
41.666252 -286.54904 moveto
41.666252 -287.36438 41.005272 -288.02536 40.189938 -288.02536 curveto
39.37458 -288.02536 38.713623 -287.36438 38.713623 -286.54904 curveto
38.713623 -285.7337 39.37458 -285.07272 40.189938 -285.07272 curveto
41.005272 -285.07272 41.666252 -285.7337 41.666252 -286.54904 curveto
closepath
stroke
newpath
0.0 0.0 0.0 setrgbcolor
newpath
42.09514 -316.94043 moveto
39.915268 -311.42157 lineto
37.72675 -316.94043 lineto
closepath
44.015503 -321.8365 moveto
42.622807 -318.2899 lineto
37.19908 -318.2899 lineto
35.789085 -321.8365 lineto
34.102283 -321.8365 lineto
39.179996 -309.0341 lineto
40.97925 -309.0341 lineto
45.979115 -321.8365 lineto
closepath
fill
newpath
0.0 0.0 0.0 setrgbcolor
newpath
296.78433 -286.54904 moveto
296.78433 -287.36438 296.12335 -288.02536 295.30804 -288.02536 curveto
294.4927 -288.02536 293.83173 -287.36438 293.83173 -286.54904 curveto
293.83173 -285.7337 294.4927 -285.07272 295.30804 -285.07272 curveto
296.12335 -285.07272 296.78433 -285.7337 296.78433 -286.54904 curveto
closepath
fill
newpath
0.0 0.0 0.0 setrgbcolor
1.0 setlinewidth
10.0 setmiterlimit
1 setlinejoin
1 setlinecap
[ ] 0 setdash
newpath
296.78433 -286.54904 moveto
296.78433 -287.36438 296.12335 -288.02536 295.30804 -288.02536 curveto
294.4927 -288.02536 293.83173 -287.36438 293.83173 -286.54904 curveto
293.83173 -285.7337 294.4927 -285.07272 295.30804 -285.07272 curveto
296.12335 -285.07272 296.78433 -285.7337 296.78433 -286.54904 curveto
closepath
stroke
newpath
0.0 0.0 0.0 setrgbcolor
newpath
316.10715 -314.45493 moveto
316.10715 -301.65253 lineto
319.42883 -301.65253 lineto
320.70908 -301.65253 321.6909 -301.89474 322.37427 -302.37915 curveto
323.05765 -302.86356 323.39932 -303.56134 323.39932 -304.4725 curveto
323.39932 -306.0238 322.52277 -307.12814 320.76962 -307.78555 curveto
322.863 -308.4257 323.9097 -309.58194 323.9097 -311.25433 curveto
323.9097 -312.29236 323.5637 -313.0853 322.87164 -313.63315 curveto
322.17963 -314.181 321.18198 -314.45493 319.87866 -314.45493 curveto
closepath
317.9064 -313.09683 moveto
318.27835 -313.09683 lineto
319.6105 -313.09683 320.47266 -313.0132 320.86478 -312.84598 curveto
321.61447 -312.5288 321.98932 -311.94058 321.98932 -311.08133 curveto
321.98932 -310.3201 321.64908 -309.6872 320.9686 -309.1826 curveto
320.2881 -308.67798 319.43747 -308.4257 318.41675 -308.4257 curveto
317.9064 -308.4257 lineto
closepath
317.9064 -307.2752 moveto
318.48596 -307.2752 lineto
319.4548 -307.2752 320.20593 -307.0676 320.73935 -306.65237 curveto
321.2728 -306.23718 321.53952 -305.65182 321.53952 -304.89636 curveto
321.53952 -303.6392 320.5649 -303.01062 318.61572 -303.01062 curveto
317.9064 -303.01062 lineto
closepath
fill
newpath
0.0 0.0 0.0 setrgbcolor
newpath
353.4773 -229.85611 moveto
353.4773 -230.67148 352.8163 -231.33241 352.00098 -231.33241 curveto
351.18558 -231.33241 350.52466 -230.67148 350.52466 -229.85611 curveto
350.52466 -229.04077 351.18558 -228.37979 352.00098 -228.37979 curveto
352.8163 -228.37979 353.4773 -229.04077 353.4773 -229.85611 curveto
closepath
fill
newpath
0.0 0.0 0.0 setrgbcolor
1.0 setlinewidth
10.0 setmiterlimit
1 setlinejoin
1 setlinecap
[ ] 0 setdash
newpath
353.4773 -229.85611 moveto
353.4773 -230.67148 352.8163 -231.33241 352.00098 -231.33241 curveto
351.18558 -231.33241 350.52466 -230.67148 350.52466 -229.85611 curveto
350.52466 -229.04077 351.18558 -228.37979 352.00098 -228.37979 curveto
352.8163 -228.37979 353.4773 -229.04077 353.4773 -229.85611 curveto
closepath
stroke
newpath
0.0 0.0 0.0 setrgbcolor
newpath
373.26242 -235.05402 moveto
371.27283 -235.05402 369.73596 -234.47012 368.6518 -233.30234 curveto
367.56763 -232.13455 367.02554 -230.48091 367.02554 -228.3414 curveto
367.02554 -226.20767 367.57773 -224.55258 368.6821 -223.37614 curveto
369.78644 -222.1997 371.34204 -221.6115 373.3489 -221.6115 curveto
374.49652 -221.6115 375.84018 -221.79892 377.37994 -222.17375 curveto
377.37994 -223.87787 lineto
375.6268 -223.27235 374.27448 -222.96959 373.32297 -222.96959 curveto
371.93317 -222.96959 370.85764 -223.43959 370.0964 -224.37958 curveto
369.33517 -225.31956 368.95456 -226.64595 368.95456 -228.3587 curveto
368.95456 -229.99072 369.3611 -231.27817 370.17426 -232.22105 curveto
370.9874 -233.16394 372.0975 -233.63538 373.5046 -233.63538 curveto
374.71564 -233.63538 376.01318 -233.26341 377.39725 -232.51949 curveto
377.39725 -234.07654 lineto
376.1343 -234.7282 374.75604 -235.05402 373.26242 -235.05402 curveto
closepath
fill
newpath
0.0 0.0 0.0 setrgbcolor
newpath
98.35916 -229.85611 moveto
98.35916 -230.67148 97.69818 -231.33241 96.88285 -231.33241 curveto
96.06752 -231.33241 95.40654 -230.67148 95.40654 -229.85611 curveto
95.40654 -229.04077 96.06752 -228.37979 96.88285 -228.37979 curveto
97.69818 -228.37979 98.35916 -229.04077 98.35916 -229.85611 curveto
closepath
fill
newpath
0.0 0.0 0.0 setrgbcolor
1.0 setlinewidth
10.0 setmiterlimit
1 setlinejoin
1 setlinecap
[ ] 0 setdash
newpath
98.35916 -229.85611 moveto
98.35916 -230.67148 97.69818 -231.33241 96.88285 -231.33241 curveto
96.06752 -231.33241 95.40654 -230.67148 95.40654 -229.85611 curveto
95.40654 -229.04077 96.06752 -228.37979 96.88285 -228.37979 curveto
97.69818 -228.37979 98.35916 -229.04077 98.35916 -229.85611 curveto
closepath
stroke
newpath
0.0 0.0 0.0 setrgbcolor
newpath
110.89945 -219.97083 moveto
110.89945 -207.16841 lineto
115.155396 -207.16841 lineto
116.4241 -207.16841 117.44916 -207.3097 118.23057 -207.59227 curveto
119.01198 -207.87485 119.68814 -208.35349 120.259056 -209.02821 curveto
121.16445 -210.10085 121.61715 -211.51372 121.61715 -213.26685 curveto
121.61715 -215.39482 121.05488 -217.04414 119.93034 -218.21481 curveto
118.80581 -219.38548 117.22281 -219.97083 115.18134 -219.97083 curveto
closepath
112.71601 -218.61273 moveto
115.04294 -218.61273 lineto
116.70379 -218.61273 117.880226 -218.1658 118.57225 -217.27193 curveto
119.31618 -216.3204 119.68814 -215.04305 119.68814 -213.43987 curveto
119.68814 -211.93471 119.321945 -210.7525 118.589554 -209.89325 curveto
118.14551 -209.36845 117.61496 -209.00948 116.9979 -208.81628 curveto
116.380844 -208.6231 115.452385 -208.5265 114.21251 -208.5265 curveto
112.71601 -208.5265 lineto
closepath
fill
newpath
0.0 0.0 0.0 setrgbcolor
newpath
41.666252 -88.12383 moveto
41.666252 -88.93917 41.005272 -89.60015 40.189938 -89.60015 curveto
39.37458 -89.60015 38.713623 -88.93917 38.713623 -88.12383 curveto
38.713623 -87.30848 39.37458 -86.64752 40.189938 -86.64752 curveto
41.005272 -86.64752 41.666252 -87.30848 41.666252 -88.12383 curveto
closepath
fill
newpath
0.0 0.0 0.0 setrgbcolor
1.0 setlinewidth
10.0 setmiterlimit
1 setlinejoin
1 setlinecap
[ ] 0 setdash
newpath
41.666252 -88.12383 moveto
41.666252 -88.93917 41.005272 -89.60015 40.189938 -89.60015 curveto
39.37458 -89.60015 38.713623 -88.93917 38.713623 -88.12383 curveto
38.713623 -87.30848 39.37458 -86.64752 40.189938 -86.64752 curveto
41.005272 -86.64752 41.666252 -87.30848 41.666252 -88.12383 curveto
closepath
stroke
newpath
0.0 0.0 0.0 setrgbcolor
newpath
16.415346 -101.865685 moveto
16.415346 -89.06327 lineto
23.569126 -89.06327 lineto
23.569126 -90.421364 lineto
18.231903 -90.421364 lineto
18.231903 -94.53024 lineto
22.704098 -94.53024 lineto
22.704098 -95.87104 lineto
18.231903 -95.87104 lineto
18.231903 -100.50759 lineto
23.941088 -100.50759 lineto
23.941088 -101.865685 lineto
closepath
fill
newpath
0.0 0.0 0.0 setrgbcolor
newpath
98.35916 -31.430923 moveto
98.35916 -32.246258 97.69818 -32.907238 96.88285 -32.907238 curveto
96.06752 -32.907238 95.40654 -32.246258 95.40654 -31.430923 curveto
95.40654 -30.615566 96.06752 -29.954609 96.88285 -29.954609 curveto
97.69818 -29.954609 98.35916 -30.615566 98.35916 -31.430923 curveto
closepath
fill
newpath
0.0 0.0 0.0 setrgbcolor
1.0 setlinewidth
10.0 setmiterlimit
1 setlinejoin
1 setlinecap
[ ] 0 setdash
newpath
98.35916 -31.430923 moveto
98.35916 -32.246258 97.69818 -32.907238 96.88285 -32.907238 curveto
96.06752 -32.907238 95.40654 -32.246258 95.40654 -31.430923 curveto
95.40654 -30.615566 96.06752 -29.954609 96.88285 -29.954609 curveto
97.69818 -29.954609 98.35916 -30.615566 98.35916 -31.430923 curveto
closepath
stroke
newpath
0.0 0.0 0.0 setrgbcolor
newpath
53.3232 -33.955227 moveto
53.3232 -21.152815 lineto
55.13976 -21.152815 lineto
55.13976 -26.550589 lineto
61.229557 -26.550589 lineto
61.229557 -21.152815 lineto
63.046116 -21.152815 lineto
63.046116 -33.955227 lineto
61.229557 -33.955227 lineto
61.229557 -27.908682 lineto
55.13976 -27.908682 lineto
55.13976 -33.955227 lineto
closepath
fill
newpath
0.0 0.0 0.0 setrgbcolor
newpath
353.4773 -31.430923 moveto
353.4773 -32.246258 352.8163 -32.907238 352.00098 -32.907238 curveto
351.18558 -32.907238 350.52466 -32.246258 350.52466 -31.430923 curveto
350.52466 -30.615566 351.18558 -29.954609 352.00098 -29.954609 curveto
352.8163 -29.954609 353.4773 -30.615566 353.4773 -31.430923 curveto
closepath
fill
newpath
0.0 0.0 0.0 setrgbcolor
1.0 setlinewidth
10.0 setmiterlimit
1 setlinejoin
1 setlinecap
[ ] 0 setdash
newpath
353.4773 -31.430923 moveto
353.4773 -32.246258 352.8163 -32.907238 352.00098 -32.907238 curveto
351.18558 -32.907238 350.52466 -32.246258 350.52466 -31.430923 curveto
350.52466 -30.615566 351.18558 -29.954609 352.00098 -29.954609 curveto
352.8163 -29.954609 353.4773 -30.615566 353.4773 -31.430923 curveto
closepath
stroke
newpath
0.0 0.0 0.0 setrgbcolor
newpath
368.53937 -27.703959 moveto
366.98807 -28.148006 365.63574 -28.370031 364.48236 -28.370031 curveto
362.4467 -28.370031 360.8853 -27.790462 359.79825 -26.631325 curveto
358.71118 -25.472187 358.16766 -23.811333 358.16766 -21.648764 curveto
358.16766 -19.526562 358.7184 -17.875801 359.8199 -16.69648 curveto
360.92136 -15.5171585 362.46686 -14.927498 364.45642 -14.927498 curveto
365.75974 -14.927498 367.11493 -15.1206875 368.52206 -15.507066 curveto
368.52206 -17.18522 lineto
366.7574 -16.585468 365.40506 -16.285591 364.4651 -16.285591 curveto
363.08102 -16.285591 362.00696 -16.75559 361.24286 -17.695587 curveto
360.47873 -18.635584 360.09668 -19.959076 360.09668 -21.666065 curveto
360.09668 -23.355753 360.50613 -24.669153 361.325 -25.606266 curveto
362.14392 -26.543379 363.29153 -27.011936 364.76782 -27.011936 curveto
365.37335 -27.011936 366.0279 -26.90525 366.73145 -26.691877 curveto
366.73145 -22.522442 lineto
368.53937 -22.522442 lineto
closepath
fill
newpath
0.0 0.0 0.0 setrgbcolor
newpath
296.78433 -88.12383 moveto
296.78433 -88.93917 296.12335 -89.60015 295.30804 -89.60015 curveto
294.4927 -89.60015 293.83173 -88.93917 293.83173 -88.12383 curveto
293.83173 -87.30848 294.4927 -86.64752 295.30804 -86.64752 curveto
296.12335 -86.64752 296.78433 -87.30848 296.78433 -88.12383 curveto
closepath
fill
newpath
0.0 0.0 0.0 setrgbcolor
1.0 setlinewidth
10.0 setmiterlimit
1 setlinejoin
1 setlinecap
[ ] 0 setdash
newpath
296.78433 -88.12383 moveto
296.78433 -88.93917 296.12335 -89.60015 295.30804 -89.60015 curveto
294.4927 -89.60015 293.83173 -88.93917 293.83173 -88.12383 curveto
293.83173 -87.30848 294.4927 -86.64752 295.30804 -86.64752 curveto
296.12335 -86.64752 296.78433 -87.30848 296.78433 -88.12383 curveto
closepath
stroke
newpath
0.0 0.0 0.0 setrgbcolor
newpath
316.10715 -104.818306 moveto
316.10715 -92.0159 lineto
323.26093 -92.0159 lineto
323.26093 -93.37399 lineto
317.9237 -93.37399 lineto
317.9237 -97.66453 lineto
322.40454 -97.66453 lineto
322.40454 -99.005325 lineto
317.9237 -99.005325 lineto
317.9237 -104.818306 lineto
closepath
fill
newpath
0.0 0.0 0.0 setrgbcolor
newpath
141.38214 -88.12383 moveto
141.38214 -89.754524 140.06023 -91.07646 138.4295 -91.07646 curveto
136.79884 -91.07646 135.47688 -89.754524 135.47688 -88.12383 curveto
135.47688 -86.49314 136.79884 -85.1712 138.4295 -85.1712 curveto
140.06023 -85.1712 141.38214 -86.49314 141.38214 -88.12383 curveto
closepath
fill
newpath
0.0 0.0 0.0 setrgbcolor
1.0 setlinewidth
10.0 setmiterlimit
1 setlinejoin
1 setlinecap
[ ] 0 setdash
newpath
141.38214 -88.12383 moveto
141.38214 -89.754524 140.06023 -91.07646 138.4295 -91.07646 curveto
136.79884 -91.07646 135.47688 -89.754524 135.47688 -88.12383 curveto
135.47688 -86.49314 136.79884 -85.1712 138.4295 -85.1712 curveto
140.06023 -85.1712 141.38214 -86.49314 141.38214 -88.12383 curveto
closepath
stroke
newpath
0.0 0.0 0.0 setrgbcolor
newpath
146.32234 -82.6736 moveto
146.32234 -69.871185 lineto
148.1389 -69.871185 lineto
148.1389 -82.6736 lineto
closepath
fill
newpath
grestore
grestore
showpage

%%EOF