%!PS-Adobe-3.0 EPSF-3.0
%%Creator: EpsGraphics2D 0.9.0 by Paul Mutton, http://www.jibble.org/
%%Title: GeoGebra, http://www.geogebra.org
%%CreationDate: Tue Mar 11 17:56:22 CET 2008
%%BoundingBox: 0 0 301 177
%%DocumentData: Clean7Bit
%%DocumentProcessColors: Black
%%ColorUsage: Color
%%Origin: 0 0
%%Pages: 1
%%Page: 1 1
%%EndComments

gsave
-0.0 177.0 translate
1.0 setlinewidth
10.0 setmiterlimit
0 setlinejoin
2 setlinecap
[ ] 0 setdash
gsave
newpath
0.0 -0.0 moveto
301.7764 -0.0 lineto
301.7764 -177.60797 lineto
0.0 -177.60797 lineto
0.0 -0.0 lineto
closepath
clip
newpath
1.0 setlinewidth
10.0 setmiterlimit
0 setlinejoin
2 setlinecap
[ ] 0 setdash
1.0 1.0 1.0 setrgbcolor
newpath
-120.23903 122.59666 moveto
435.3753 122.59666 lineto
435.3753 -364.64648 lineto
-120.23903 -364.64648 lineto
-120.23903 122.59666 lineto
closepath
fill
newpath
0.0 0.0 0.0 setrgbcolor
1.0 setlinewidth
10.0 setmiterlimit
1 setlinejoin
1 setlinecap
[ ] 0 setdash
newpath
66.796646 -58.24402 moveto
151.83603 -58.24402 lineto
stroke
newpath
0.0 0.0 0.0 setrgbcolor
1.0 setlinewidth
10.0 setmiterlimit
1 setlinejoin
1 setlinecap
[ ] 0 setdash
newpath
123.48957 -29.897572 moveto
66.796646 -58.24402 lineto
stroke
newpath
0.0 0.0 0.0 setrgbcolor
1.0 setlinewidth
10.0 setmiterlimit
1 setlinejoin
1 setlinecap
[ ] 0 setdash
newpath
66.796646 -58.24402 moveto
66.796646 -143.28339 lineto
stroke
newpath
0.0 0.0 0.0 setrgbcolor
1.0 setlinewidth
10.0 setmiterlimit
1 setlinejoin
1 setlinecap
[ ] 0 setdash
newpath
66.796646 -143.28339 moveto
151.83603 -143.28339 lineto
stroke
newpath
0.0 0.0 0.0 setrgbcolor
1.0 setlinewidth
10.0 setmiterlimit
1 setlinejoin
1 setlinecap
[ ] 0 setdash
newpath
151.83603 -143.28339 moveto
208.52895 -114.936935 lineto
stroke
newpath
0.0 0.0 0.0 setrgbcolor
1.0 setlinewidth
10.0 setmiterlimit
1 setlinejoin
1 setlinecap
[ ] 0 setdash
newpath
208.52895 -114.936935 moveto
208.52895 -29.897572 lineto
stroke
newpath
0.0 0.0 0.0 setrgbcolor
1.0 setlinewidth
10.0 setmiterlimit
1 setlinejoin
1 setlinecap
[ ] 0 setdash
newpath
208.52895 -29.897572 moveto
123.48957 -29.897572 lineto
stroke
newpath
0.0 0.0 0.0 setrgbcolor
1.0 setlinewidth
10.0 setmiterlimit
1 setlinejoin
0 setlinecap
[ 5.0 4.0 ] 0 setdash
newpath
123.48957 -29.897572 moveto
123.48957 -114.936935 lineto
stroke
newpath
0.0 0.0 0.0 setrgbcolor
1.0 setlinewidth
10.0 setmiterlimit
1 setlinejoin
0 setlinecap
[ 5.0 4.0 ] 0 setdash
newpath
123.48957 -114.936935 moveto
66.796646 -143.28339 lineto
stroke
newpath
0.0 0.0 0.0 setrgbcolor
1.0 setlinewidth
10.0 setmiterlimit
1 setlinejoin
1 setlinecap
[ ] 0 setdash
newpath
151.83603 -58.24402 moveto
151.83603 -143.28339 lineto
stroke
newpath
0.0 0.0 0.0 setrgbcolor
1.0 setlinewidth
10.0 setmiterlimit
1 setlinejoin
1 setlinecap
[ ] 0 setdash
newpath
151.83603 -58.24402 moveto
208.52895 -29.897572 lineto
stroke
newpath
0.0 0.0 0.0 setrgbcolor
1.0 setlinewidth
10.0 setmiterlimit
1 setlinejoin
0 setlinecap
[ 5.0 4.0 ] 0 setdash
newpath
123.48957 -114.936935 moveto
208.52895 -114.936935 lineto
stroke
newpath
0.0 0.4 1.0 setrgbcolor
2.5 setlinewidth
10.0 setmiterlimit
1 setlinejoin
1 setlinecap
[ ] 0 setdash
newpath
38.4502 -29.897572 moveto
293.5683 -29.897572 lineto
stroke
newpath
0.0 0.4 1.0 setrgbcolor
2.5 setlinewidth
10.0 setmiterlimit
1 setlinejoin
1 setlinecap
[ ] 0 setdash
newpath
95.14311 -171.62985 moveto
265.22183 -86.59048 lineto
stroke
newpath
0.0 0.0 0.0 setrgbcolor
newpath
67.58252 -58.24402 moveto
67.58252 -58.67805 67.230675 -59.029892 66.796646 -59.029892 curveto
66.362625 -59.029892 66.010765 -58.67805 66.010765 -58.24402 curveto
66.010765 -57.809998 66.362625 -57.45814 66.796646 -57.45814 curveto
67.230675 -57.45814 67.58252 -57.809998 67.58252 -58.24402 curveto
closepath
fill
newpath
0.0 0.0 0.0 setrgbcolor
1.0 setlinewidth
10.0 setmiterlimit
1 setlinejoin
1 setlinecap
[ ] 0 setdash
newpath
67.58252 -58.24402 moveto
67.58252 -58.67805 67.230675 -59.029892 66.796646 -59.029892 curveto
66.362625 -59.029892 66.010765 -58.67805 66.010765 -58.24402 curveto
66.010765 -57.809998 66.362625 -57.45814 66.796646 -57.45814 curveto
67.230675 -57.45814 67.58252 -57.809998 67.58252 -58.24402 curveto
closepath
stroke
newpath
0.0 0.0 0.0 setrgbcolor
newpath
46.460316 -53.439568 moveto
46.460316 -46.62455 lineto
50.268436 -46.62455 lineto
50.268436 -47.347496 lineto
47.42731 -47.347496 lineto
47.42731 -49.534748 lineto
49.80796 -49.534748 lineto
49.80796 -50.24848 lineto
47.42731 -50.24848 lineto
47.42731 -52.716625 lineto
50.466442 -52.716625 lineto
50.466442 -53.439568 lineto
closepath
fill
newpath
0.0 0.0 0.0 setrgbcolor
newpath
67.58252 -143.28339 moveto
67.58252 -143.7174 67.230675 -144.06926 66.796646 -144.06926 curveto
66.362625 -144.06926 66.010765 -143.7174 66.010765 -143.28339 curveto
66.010765 -142.84937 66.362625 -142.49751 66.796646 -142.49751 curveto
67.230675 -142.49751 67.58252 -142.84937 67.58252 -143.28339 curveto
closepath
fill
newpath
0.0 0.0 0.0 setrgbcolor
1.0 setlinewidth
10.0 setmiterlimit
1 setlinejoin
1 setlinecap
[ ] 0 setdash
newpath
67.58252 -143.28339 moveto
67.58252 -143.7174 67.230675 -144.06926 66.796646 -144.06926 curveto
66.362625 -144.06926 66.010765 -143.7174 66.010765 -143.28339 curveto
66.010765 -142.84937 66.362625 -142.49751 66.796646 -142.49751 curveto
67.230675 -142.49751 67.58252 -142.84937 67.58252 -143.28339 curveto
closepath
stroke
newpath
0.0 0.0 0.0 setrgbcolor
newpath
53.057377 -158.49829 moveto
51.89698 -155.56047 lineto
50.73198 -158.49829 lineto
closepath
54.079628 -161.10458 moveto
53.338264 -159.21664 lineto
50.45109 -159.21664 lineto
49.70052 -161.10458 lineto
48.802593 -161.10458 lineto
51.505577 -154.28957 lineto
52.463364 -154.28957 lineto
55.124905 -161.10458 lineto
closepath
fill
newpath
0.0 0.0 0.0 setrgbcolor
newpath
152.6219 -58.24402 moveto
152.6219 -58.67805 152.27005 -59.029892 151.83603 -59.029892 curveto
151.40198 -59.029892 151.05016 -58.67805 151.05016 -58.24402 curveto
151.05016 -57.809998 151.40198 -57.45814 151.83603 -57.45814 curveto
152.27005 -57.45814 152.6219 -57.809998 152.6219 -58.24402 curveto
closepath
fill
newpath
0.0 0.0 0.0 setrgbcolor
1.0 setlinewidth
10.0 setmiterlimit
1 setlinejoin
1 setlinecap
[ ] 0 setdash
newpath
152.6219 -58.24402 moveto
152.6219 -58.67805 152.27005 -59.029892 151.83603 -59.029892 curveto
151.40198 -59.029892 151.05016 -58.67805 151.05016 -58.24402 curveto
151.05016 -57.809998 151.40198 -57.45814 151.83603 -57.45814 curveto
152.27005 -57.45814 152.6219 -57.809998 152.6219 -58.24402 curveto
closepath
stroke
newpath
0.0 0.0 0.0 setrgbcolor
newpath
164.34172 -65.22771 moveto
164.34172 -58.41269 lineto
168.14984 -58.41269 lineto
168.14984 -59.135635 lineto
165.30872 -59.135635 lineto
165.30872 -61.419586 lineto
167.69397 -61.419586 lineto
167.69397 -62.133324 lineto
165.30872 -62.133324 lineto
165.30872 -65.22771 lineto
closepath
fill
newpath
0.0 0.0 0.0 setrgbcolor
newpath
152.6219 -143.28339 moveto
152.6219 -143.7174 152.27005 -144.06926 151.83603 -144.06926 curveto
151.40198 -144.06926 151.05016 -143.7174 151.05016 -143.28339 curveto
151.05016 -142.84937 151.40198 -142.49751 151.83603 -142.49751 curveto
152.27005 -142.49751 152.6219 -142.84937 152.6219 -143.28339 curveto
closepath
fill
newpath
0.0 0.0 0.0 setrgbcolor
1.0 setlinewidth
10.0 setmiterlimit
1 setlinejoin
1 setlinecap
[ ] 0 setdash
newpath
152.6219 -143.28339 moveto
152.6219 -143.7174 152.27005 -144.06926 151.83603 -144.06926 curveto
151.40198 -144.06926 151.05016 -143.7174 151.05016 -143.28339 curveto
151.05016 -142.84937 151.40198 -142.49751 151.83603 -142.49751 curveto
152.27005 -142.49751 152.6219 -142.84937 152.6219 -143.28339 curveto
closepath
stroke
newpath
0.0 0.0 0.0 setrgbcolor
newpath
160.41234 -160.31871 moveto
160.41234 -153.5037 lineto
162.18056 -153.5037 lineto
162.86206 -153.5037 163.38469 -153.63263 163.74847 -153.89049 curveto
164.11224 -154.14835 164.29413 -154.5198 164.29413 -155.00484 curveto
164.29413 -155.83063 163.82751 -156.41849 162.89429 -156.76845 curveto
164.00864 -157.10919 164.56581 -157.7247 164.56581 -158.61494 curveto
164.56581 -159.16751 164.38162 -159.58961 164.01324 -159.88126 curveto
163.64487 -160.1729 163.11378 -160.31871 162.42 -160.31871 curveto
closepath
161.37012 -159.59576 moveto
161.56813 -159.59576 lineto
162.27725 -159.59576 162.73619 -159.55125 162.94495 -159.46222 curveto
163.34402 -159.29338 163.54356 -158.98027 163.54356 -158.52286 curveto
163.54356 -158.11763 163.36244 -157.78072 163.0002 -157.51212 curveto
162.63797 -157.24352 162.18517 -157.1092 161.6418 -157.1092 curveto
161.37012 -157.1092 lineto
closepath
161.37012 -156.49677 moveto
161.67863 -156.49677 lineto
162.19437 -156.49677 162.59422 -156.38625 162.87817 -156.16522 curveto
163.16212 -155.9442 163.30411 -155.63261 163.30411 -155.23047 curveto
163.30411 -154.56125 162.78531 -154.22664 161.74771 -154.22664 curveto
161.37012 -154.22664 lineto
closepath
fill
newpath
0.0 0.0 0.0 setrgbcolor
newpath
124.275444 -29.897572 moveto
124.275444 -30.331593 123.92359 -30.683449 123.48957 -30.683449 curveto
123.05553 -30.683449 122.7037 -30.331593 122.7037 -29.897572 curveto
122.7037 -29.46354 123.05553 -29.111696 123.48957 -29.111696 curveto
123.92359 -29.111696 124.275444 -29.46354 124.275444 -29.897572 curveto
closepath
fill
newpath
0.0 0.0 0.0 setrgbcolor
1.0 setlinewidth
10.0 setmiterlimit
1 setlinejoin
1 setlinecap
[ ] 0 setdash
newpath
124.275444 -29.897572 moveto
124.275444 -30.331593 123.92359 -30.683449 123.48957 -30.683449 curveto
123.05553 -30.683449 122.7037 -30.331593 122.7037 -29.897572 curveto
122.7037 -29.46354 123.05553 -29.111696 123.48957 -29.111696 curveto
123.92359 -29.111696 124.275444 -29.46354 124.275444 -29.897572 curveto
closepath
stroke
newpath
0.0 0.0 0.0 setrgbcolor
newpath
126.61967 -20.432775 moveto
126.61967 -13.617758 lineto
127.58666 -13.617758 lineto
127.58666 -16.491117 lineto
130.8284 -16.491117 lineto
130.8284 -13.617758 lineto
131.7954 -13.617758 lineto
131.7954 -20.432775 lineto
130.8284 -20.432775 lineto
130.8284 -17.214062 lineto
127.58666 -17.214062 lineto
127.58666 -20.432775 lineto
closepath
fill
newpath
0.0 0.0 0.0 setrgbcolor
newpath
209.31482 -29.897572 moveto
209.31482 -30.331593 208.96297 -30.683449 208.52895 -30.683449 curveto
208.0949 -30.683449 207.74307 -30.331593 207.74307 -29.897572 curveto
207.74307 -29.46354 208.0949 -29.111696 208.52895 -29.111696 curveto
208.96297 -29.111696 209.31482 -29.46354 209.31482 -29.897572 curveto
closepath
fill
newpath
0.0 0.0 0.0 setrgbcolor
1.0 setlinewidth
10.0 setmiterlimit
1 setlinejoin
1 setlinecap
[ ] 0 setdash
newpath
209.31482 -29.897572 moveto
209.31482 -30.331593 208.96297 -30.683449 208.52895 -30.683449 curveto
208.0949 -30.683449 207.74307 -30.331593 207.74307 -29.897572 curveto
207.74307 -29.46354 208.0949 -29.111696 208.52895 -29.111696 curveto
208.96297 -29.111696 209.31482 -29.46354 209.31482 -29.897572 curveto
closepath
stroke
newpath
0.0 0.0 0.0 setrgbcolor
newpath
221.33 -24.963842 moveto
220.50421 -25.200218 219.78435 -25.318407 219.17038 -25.318407 curveto
218.08673 -25.318407 217.25557 -25.00989 216.67691 -24.392855 curveto
216.09825 -23.77582 215.80891 -22.891708 215.80891 -21.740522 curveto
215.80891 -20.610826 216.10208 -19.732088 216.68843 -19.10431 curveto
217.27477 -18.476528 218.09747 -18.162638 219.15657 -18.162638 curveto
219.85034 -18.162638 220.57176 -18.265476 221.3208 -18.471155 curveto
221.3208 -19.364475 lineto
220.38142 -19.045214 219.66156 -18.885582 219.16118 -18.885582 curveto
218.42441 -18.885582 217.85266 -19.135773 217.4459 -19.636156 curveto
217.03915 -20.136538 216.83578 -20.841063 216.83578 -21.749733 curveto
216.83578 -22.649193 217.05374 -23.348347 217.48965 -23.847193 curveto
217.92557 -24.346039 218.53647 -24.595463 219.32234 -24.595463 curveto
219.64467 -24.595463 219.99309 -24.538671 220.36761 -24.425087 curveto
220.36761 -22.205603 lineto
221.33 -22.205603 lineto
closepath
fill
newpath
0.0 0.0 0.0 setrgbcolor
newpath
209.31482 -114.936935 moveto
209.31482 -115.37096 208.96297 -115.72281 208.52895 -115.72281 curveto
208.0949 -115.72281 207.74307 -115.37096 207.74307 -114.936935 curveto
207.74307 -114.502914 208.0949 -114.151054 208.52895 -114.151054 curveto
208.96297 -114.151054 209.31482 -114.502914 209.31482 -114.936935 curveto
closepath
fill
newpath
0.0 0.0 0.0 setrgbcolor
1.0 setlinewidth
10.0 setmiterlimit
1 setlinejoin
1 setlinecap
[ ] 0 setdash
newpath
209.31482 -114.936935 moveto
209.31482 -115.37096 208.96297 -115.72281 208.52895 -115.72281 curveto
208.0949 -115.72281 207.74307 -115.37096 207.74307 -114.936935 curveto
207.74307 -114.502914 208.0949 -114.151054 208.52895 -114.151054 curveto
208.96297 -114.151054 209.31482 -114.502914 209.31482 -114.936935 curveto
closepath
stroke
newpath
0.0 0.0 0.0 setrgbcolor
newpath
222.27245 -110.97889 moveto
221.21335 -110.97889 220.39525 -110.66807 219.81812 -110.04643 curveto
219.24098 -109.4248 218.95242 -108.544525 218.95242 -107.40562 curveto
218.95242 -106.269775 219.24635 -105.38873 219.83423 -104.76249 curveto
220.4221 -104.136246 221.25018 -103.82312 222.3185 -103.82312 curveto
222.92938 -103.82312 223.64465 -103.92289 224.4643 -104.12243 curveto
224.4643 -105.029564 lineto
223.53107 -104.70723 222.81119 -104.54607 222.30467 -104.54607 curveto
221.56485 -104.54607 220.99232 -104.79626 220.58711 -105.29664 curveto
220.18188 -105.79702 219.97928 -106.50308 219.97928 -107.414825 curveto
219.97928 -108.283585 220.19571 -108.968925 220.62856 -109.47084 curveto
221.0614 -109.972755 221.65234 -110.22372 222.40138 -110.22372 curveto
223.04605 -110.22372 223.73676 -110.02571 224.47351 -109.62971 curveto
224.47351 -110.45856 lineto
223.80122 -110.80544 223.06754 -110.97889 222.27245 -110.97889 curveto
closepath
fill
newpath
0.0 0.0 0.0 setrgbcolor
newpath
124.275444 -114.936935 moveto
124.275444 -115.37096 123.92359 -115.72281 123.48957 -115.72281 curveto
123.05553 -115.72281 122.7037 -115.37096 122.7037 -114.936935 curveto
122.7037 -114.502914 123.05553 -114.151054 123.48957 -114.151054 curveto
123.92359 -114.151054 124.275444 -114.502914 124.275444 -114.936935 curveto
closepath
fill
newpath
0.0 0.0 0.0 setrgbcolor
1.0 setlinewidth
10.0 setmiterlimit
1 setlinejoin
1 setlinecap
[ ] 0 setdash
newpath
124.275444 -114.936935 moveto
124.275444 -115.37096 123.92359 -115.72281 123.48957 -115.72281 curveto
123.05553 -115.72281 122.7037 -115.37096 122.7037 -114.936935 curveto
122.7037 -114.502914 123.05553 -114.151054 123.48957 -114.151054 curveto
123.92359 -114.151054 124.275444 -114.502914 124.275444 -114.936935 curveto
closepath
stroke
newpath
0.0 0.0 0.0 setrgbcolor
newpath
131.33493 -106.09326 moveto
131.33493 -99.278244 lineto
133.60046 -99.278244 lineto
134.27582 -99.278244 134.82147 -99.353455 135.23744 -99.503876 curveto
135.65341 -99.6543 136.01335 -99.909096 136.31726 -100.268265 curveto
136.79922 -100.83926 137.0402 -101.59136 137.0402 -102.52459 curveto
137.0402 -103.65736 136.74089 -104.535324 136.14227 -105.1585 curveto
135.54366 -105.78168 134.70099 -106.09326 133.61427 -106.09326 curveto
closepath
132.30193 -105.370316 moveto
133.54059 -105.370316 lineto
134.4247 -105.370316 135.05095 -105.13241 135.41933 -104.656586 curveto
135.81534 -104.15006 136.01334 -103.47009 136.01334 -102.616684 curveto
136.01334 -101.81545 135.8184 -101.18614 135.42854 -100.72874 curveto
135.19217 -100.44939 134.90974 -100.258286 134.58127 -100.15545 curveto
134.25279 -100.05261 133.75856 -100.00119 133.09854 -100.00119 curveto
132.30193 -100.00119 lineto
closepath
fill
newpath
grestore
grestore
showpage

%%EOF