%!PS-Adobe-3.0 EPSF-3.0
%%Creator: EpsGraphics2D 0.9.0 by Paul Mutton, http://www.jibble.org/
%%Title: GeoGebra, http://www.geogebra.org
%%CreationDate: Thu Mar 13 16:29:26 CET 2008
%%BoundingBox: 0 0 294 153
%%DocumentData: Clean7Bit
%%DocumentProcessColors: Black
%%ColorUsage: Color
%%Origin: 0 0
%%Pages: 1
%%Page: 1 1
%%EndComments

gsave
-0.0 153.0 translate
1.0 setlinewidth
10.0 setmiterlimit
0 setlinejoin
2 setlinecap
[ ] 0 setdash
gsave
newpath
0.0 -0.0 moveto
294.51334 -0.0 lineto
294.51334 -153.9884 lineto
0.0 -153.9884 lineto
0.0 -0.0 lineto
closepath
clip
newpath
1.0 setlinewidth
10.0 setmiterlimit
0 setlinejoin
2 setlinecap
[ ] 0 setdash
1.0 1.0 1.0 setrgbcolor
newpath
-70.683205 211.20815 moveto
524.23376 211.20815 lineto
524.23376 -310.50122 lineto
-70.683205 -310.50122 lineto
-70.683205 211.20815 lineto
closepath
fill
newpath
0.0 0.0 0.0 setrgbcolor
1.0 setlinewidth
10.0 setmiterlimit
1 setlinejoin
1 setlinecap
[ ] 0 setdash
newpath
87.16458 -135.27081 moveto
172.20395 -135.27081 lineto
stroke
newpath
0.0 0.0 0.0 setrgbcolor
1.0 setlinewidth
10.0 setmiterlimit
1 setlinejoin
1 setlinecap
[ ] 0 setdash
newpath
172.20395 -135.27081 moveto
228.89687 -106.92436 lineto
stroke
newpath
0.0 0.0 0.0 setrgbcolor
1.0 setlinewidth
10.0 setmiterlimit
1 setlinejoin
1 setlinecap
[ ] 0 setdash
newpath
228.89687 -106.92436 moveto
228.89687 -21.88499 lineto
stroke
newpath
0.0 0.0 0.0 setrgbcolor
1.0 setlinewidth
10.0 setmiterlimit
1 setlinejoin
1 setlinecap
[ ] 0 setdash
newpath
228.89687 -21.88499 moveto
172.20395 -50.231438 lineto
stroke
newpath
0.0 0.0 0.0 setrgbcolor
1.0 setlinewidth
10.0 setmiterlimit
1 setlinejoin
1 setlinecap
[ ] 0 setdash
newpath
172.20395 -50.231438 moveto
87.16458 -50.231438 lineto
stroke
newpath
0.0 0.0 0.0 setrgbcolor
1.0 setlinewidth
10.0 setmiterlimit
1 setlinejoin
1 setlinecap
[ ] 0 setdash
newpath
87.16458 -50.231438 moveto
87.16458 -135.27081 lineto
stroke
newpath
0.0 0.0 0.0 setrgbcolor
1.0 setlinewidth
10.0 setmiterlimit
1 setlinejoin
1 setlinecap
[ ] 0 setdash
newpath
87.16458 -50.231438 moveto
143.85748 -21.88499 lineto
stroke
newpath
0.0 0.0 0.0 setrgbcolor
1.0 setlinewidth
10.0 setmiterlimit
1 setlinejoin
1 setlinecap
[ ] 0 setdash
newpath
143.85748 -21.88499 moveto
228.89687 -21.88499 lineto
stroke
newpath
0.0 0.0 0.0 setrgbcolor
1.0 setlinewidth
10.0 setmiterlimit
1 setlinejoin
0 setlinecap
[ 5.0 4.0 ] 0 setdash
newpath
143.85748 -106.92436 moveto
87.16458 -135.27081 lineto
stroke
newpath
0.0 0.0 0.0 setrgbcolor
1.0 setlinewidth
10.0 setmiterlimit
1 setlinejoin
0 setlinecap
[ 5.0 4.0 ] 0 setdash
newpath
143.85748 -106.92436 moveto
228.89687 -106.92436 lineto
stroke
newpath
0.0 0.0 0.0 setrgbcolor
1.0 setlinewidth
10.0 setmiterlimit
1 setlinejoin
0 setlinecap
[ 5.0 4.0 ] 0 setdash
newpath
143.85748 -21.88499 moveto
143.85748 -106.92436 lineto
stroke
newpath
0.0 0.0 0.0 setrgbcolor
1.0 setlinewidth
10.0 setmiterlimit
1 setlinejoin
1 setlinecap
[ ] 0 setdash
newpath
172.20395 -135.27081 moveto
172.20395 -50.231438 lineto
stroke
newpath
0.0 0.0 0.0 setrgbcolor
1.0 setlinewidth
10.0 setmiterlimit
1 setlinejoin
1 setlinecap
[ ] 0 setdash
newpath
87.16458 -50.231438 moveto
-54.567703 -50.231438 lineto
stroke
newpath
0.0 0.0 0.0 setrgbcolor
1.0 setlinewidth
10.0 setmiterlimit
1 setlinejoin
1 setlinecap
[ ] 0 setdash
newpath
228.89687 -21.88499 moveto
-57.219738 -63.95147 lineto
stroke
newpath
0.0 0.0 0.0 setrgbcolor
newpath
88.00605 -135.27081 moveto
88.00605 -135.73555 87.62932 -136.11227 87.16458 -136.11227 curveto
86.69986 -136.11227 86.32311 -135.73555 86.32311 -135.27081 curveto
86.32311 -134.80609 86.69986 -134.42934 87.16458 -134.42934 curveto
87.62932 -134.42934 88.00605 -134.80609 88.00605 -135.27081 curveto
closepath
fill
newpath
0.0 0.0 0.0 setrgbcolor
1.0 setlinewidth
10.0 setmiterlimit
1 setlinejoin
1 setlinecap
[ ] 0 setdash
newpath
88.00605 -135.27081 moveto
88.00605 -135.73555 87.62932 -136.11227 87.16458 -136.11227 curveto
86.69986 -136.11227 86.32311 -135.73555 86.32311 -135.27081 curveto
86.32311 -134.80609 86.69986 -134.42934 87.16458 -134.42934 curveto
87.62932 -134.42934 88.00605 -134.80609 88.00605 -135.27081 curveto
closepath
stroke
newpath
0.0 0.0 0.0 setrgbcolor
newpath
77.847176 -142.7831 moveto
76.6047 -139.63745 lineto
75.357285 -142.7831 lineto
closepath
78.94174 -145.57375 moveto
78.147934 -143.55225 lineto
75.056526 -143.55225 lineto
74.25286 -145.57375 lineto
73.29142 -145.57375 lineto
76.18561 -138.27664 lineto
77.21114 -138.27664 lineto
80.06096 -145.57375 lineto
closepath
fill
newpath
0.0 0.0 0.0 setrgbcolor
newpath
173.04541 -135.27081 moveto
173.04541 -135.73555 172.66867 -136.11227 172.20395 -136.11227 curveto
171.73923 -136.11227 171.36249 -135.73555 171.36249 -135.27081 curveto
171.36249 -134.80609 171.73923 -134.42934 172.20395 -134.42934 curveto
172.66867 -134.42934 173.04541 -134.80609 173.04541 -135.27081 curveto
closepath
fill
newpath
0.0 0.0 0.0 setrgbcolor
1.0 setlinewidth
10.0 setmiterlimit
1 setlinejoin
1 setlinecap
[ ] 0 setdash
newpath
173.04541 -135.27081 moveto
173.04541 -135.73555 172.66867 -136.11227 172.20395 -136.11227 curveto
171.73923 -136.11227 171.36249 -135.73555 171.36249 -135.27081 curveto
171.36249 -134.80609 171.73923 -134.42934 172.20395 -134.42934 curveto
172.66867 -134.42934 173.04541 -134.80609 173.04541 -135.27081 curveto
closepath
stroke
newpath
0.0 0.0 0.0 setrgbcolor
newpath
180.17413 -146.4152 moveto
180.17413 -139.11812 lineto
182.06743 -139.11812 lineto
182.79713 -139.11812 183.35674 -139.25616 183.74625 -139.53227 curveto
184.13576 -139.80838 184.33052 -140.2061 184.33052 -140.72545 curveto
184.33052 -141.60965 183.8309 -142.2391 182.83165 -142.61382 curveto
184.02483 -142.97867 184.62141 -143.63771 184.62141 -144.59093 curveto
184.62141 -145.18259 184.4242 -145.63455 184.02975 -145.94681 curveto
183.63531 -146.25908 183.06667 -146.4152 182.3238 -146.4152 curveto
closepath
181.19966 -145.64113 moveto
181.41168 -145.64113 lineto
182.17097 -145.64113 182.66237 -145.59346 182.88588 -145.49814 curveto
183.31319 -145.31735 183.52684 -144.98209 183.52684 -144.49232 curveto
183.52684 -144.05844 183.33292 -143.6977 182.94505 -143.41008 curveto
182.55719 -143.12247 182.07236 -142.97867 181.49057 -142.97867 curveto
181.19966 -142.97867 lineto
closepath
181.19966 -142.32292 moveto
181.53001 -142.32292 lineto
182.08221 -142.32292 182.51035 -142.20459 182.81439 -141.96793 curveto
183.11844 -141.73126 183.27046 -141.39763 183.27046 -140.96704 curveto
183.27046 -140.25047 182.71497 -139.8922 181.60396 -139.8922 curveto
181.19966 -139.8922 lineto
closepath
fill
newpath
0.0 0.0 0.0 setrgbcolor
newpath
229.73834 -106.92436 moveto
229.73834 -107.389084 229.36159 -107.76582 228.89687 -107.76582 curveto
228.43214 -107.76582 228.0554 -107.389084 228.0554 -106.92436 curveto
228.0554 -106.45964 228.43214 -106.08289 228.89687 -106.08289 curveto
229.36159 -106.08289 229.73834 -106.45964 229.73834 -106.92436 curveto
closepath
fill
newpath
0.0 0.0 0.0 setrgbcolor
1.0 setlinewidth
10.0 setmiterlimit
1 setlinejoin
1 setlinecap
[ ] 0 setdash
newpath
229.73834 -106.92436 moveto
229.73834 -107.389084 229.36159 -107.76582 228.89687 -107.76582 curveto
228.43214 -107.76582 228.0554 -107.389084 228.0554 -106.92436 curveto
228.0554 -106.45964 228.43214 -106.08289 228.89687 -106.08289 curveto
229.36159 -106.08289 229.73834 -106.45964 229.73834 -106.92436 curveto
closepath
stroke
newpath
0.0 0.0 0.0 setrgbcolor
newpath
247.25151 -112.938965 moveto
246.11751 -112.938965 245.24153 -112.606155 244.62358 -111.940544 curveto
244.00563 -111.27493 243.69666 -110.33239 243.69666 -109.11292 curveto
243.69666 -107.89674 244.01138 -106.95338 244.64084 -106.28284 curveto
245.2703 -105.61229 246.15695 -105.277016 247.30083 -105.277016 curveto
247.95493 -105.277016 248.7208 -105.38384 249.59842 -105.597496 curveto
249.59842 -106.5688 lineto
248.59918 -106.22367 247.82838 -106.0511 247.28603 -106.0511 curveto
246.49387 -106.0511 245.88084 -106.31899 245.44696 -106.85477 curveto
245.01308 -107.39054 244.79614 -108.146545 244.79614 -109.12278 curveto
244.79614 -110.05299 245.02788 -110.78682 245.49133 -111.32424 curveto
245.9548 -111.861664 246.58755 -112.13037 247.38957 -112.13037 curveto
248.07983 -112.13037 248.81941 -111.91836 249.60828 -111.49434 curveto
249.60828 -112.38182 lineto
248.88843 -112.75325 248.10284 -112.938965 247.25151 -112.938965 curveto
closepath
fill
newpath
0.0 0.0 0.0 setrgbcolor
newpath
144.69896 -106.92436 moveto
144.69896 -107.389084 144.32222 -107.76582 143.85748 -107.76582 curveto
143.39276 -107.76582 143.01602 -107.389084 143.01602 -106.92436 curveto
143.01602 -106.45964 143.39276 -106.08289 143.85748 -106.08289 curveto
144.32222 -106.08289 144.69896 -106.45964 144.69896 -106.92436 curveto
closepath
fill
newpath
0.0 0.0 0.0 setrgbcolor
1.0 setlinewidth
10.0 setmiterlimit
1 setlinejoin
1 setlinecap
[ ] 0 setdash
newpath
144.69896 -106.92436 moveto
144.69896 -107.389084 144.32222 -107.76582 143.85748 -107.76582 curveto
143.39276 -107.76582 143.01602 -107.389084 143.01602 -106.92436 curveto
143.01602 -106.45964 143.39276 -106.08289 143.85748 -106.08289 curveto
144.32222 -106.08289 144.69896 -106.45964 144.69896 -106.92436 curveto
closepath
stroke
newpath
0.0 0.0 0.0 setrgbcolor
newpath
128.84467 -105.18334 moveto
128.84467 -97.886246 lineto
131.27045 -97.886246 lineto
131.99358 -97.886246 132.57785 -97.966774 133.02324 -98.12784 curveto
133.46863 -98.2889 133.85402 -98.56172 134.17943 -98.9463 curveto
134.69548 -99.55768 134.9535 -100.36298 134.9535 -101.36223 curveto
134.9535 -102.57513 134.63303 -103.5152 133.99207 -104.18246 curveto
133.3511 -104.84972 132.44884 -105.18334 131.28525 -105.18334 curveto
closepath
129.88005 -104.409256 moveto
131.20636 -104.409256 lineto
132.153 -104.409256 132.82355 -104.15452 133.21799 -103.645035 curveto
133.64201 -103.102684 133.85402 -102.37462 133.85402 -101.46084 curveto
133.85402 -100.602936 133.6453 -99.9291 133.22784 -99.43934 curveto
132.97475 -99.14023 132.67235 -98.935616 132.32063 -98.8255 curveto
131.96893 -98.715385 131.43973 -98.66033 130.73303 -98.66033 curveto
129.88005 -98.66033 lineto
closepath
fill
newpath
0.0 0.0 0.0 setrgbcolor
newpath
88.00605 -50.231438 moveto
88.00605 -50.69616 87.62932 -51.072906 87.16458 -51.072906 curveto
86.69986 -51.072906 86.32311 -50.69616 86.32311 -50.231438 curveto
86.32311 -49.766716 86.69986 -49.389973 87.16458 -49.389973 curveto
87.62932 -49.389973 88.00605 -49.766716 88.00605 -50.231438 curveto
closepath
fill
newpath
0.0 0.0 0.0 setrgbcolor
1.0 setlinewidth
10.0 setmiterlimit
1 setlinejoin
1 setlinecap
[ ] 0 setdash
newpath
88.00605 -50.231438 moveto
88.00605 -50.69616 87.62932 -51.072906 87.16458 -51.072906 curveto
86.69986 -51.072906 86.32311 -50.69616 86.32311 -50.231438 curveto
86.32311 -49.766716 86.69986 -49.389973 87.16458 -49.389973 curveto
87.62932 -49.389973 88.00605 -49.766716 88.00605 -50.231438 curveto
closepath
stroke
newpath
0.0 0.0 0.0 setrgbcolor
newpath
80.03959 -62.268536 moveto
80.03959 -54.971443 lineto
84.11709 -54.971443 lineto
84.11709 -55.745525 lineto
81.07499 -55.745525 lineto
81.07499 -58.087498 lineto
83.62404 -58.087498 lineto
83.62404 -58.851723 lineto
81.07499 -58.851723 lineto
81.07499 -61.494453 lineto
84.3291 -61.494453 lineto
84.3291 -62.268536 lineto
closepath
fill
newpath
0.0 0.0 0.0 setrgbcolor
newpath
173.04541 -50.231438 moveto
173.04541 -50.69616 172.66867 -51.072906 172.20395 -51.072906 curveto
171.73923 -51.072906 171.36249 -50.69616 171.36249 -50.231438 curveto
171.36249 -49.766716 171.73923 -49.389973 172.20395 -49.389973 curveto
172.66867 -49.389973 173.04541 -49.766716 173.04541 -50.231438 curveto
closepath
fill
newpath
0.0 0.0 0.0 setrgbcolor
1.0 setlinewidth
10.0 setmiterlimit
1 setlinejoin
1 setlinecap
[ ] 0 setdash
newpath
173.04541 -50.231438 moveto
173.04541 -50.69616 172.66867 -51.072906 172.20395 -51.072906 curveto
171.73923 -51.072906 171.36249 -50.69616 171.36249 -50.231438 curveto
171.36249 -49.766716 171.73923 -49.389973 172.20395 -49.389973 curveto
172.66867 -49.389973 173.04541 -49.766716 173.04541 -50.231438 curveto
closepath
stroke
newpath
0.0 0.0 0.0 setrgbcolor
newpath
179.33266 -63.110004 moveto
179.33266 -55.81291 lineto
183.41016 -55.81291 lineto
183.41016 -56.586994 lineto
180.36806 -56.586994 lineto
180.36806 -59.032505 lineto
182.92204 -59.032505 lineto
182.92204 -59.796726 lineto
180.36806 -59.796726 lineto
180.36806 -63.110004 lineto
closepath
fill
newpath
0.0 0.0 0.0 setrgbcolor
newpath
229.73834 -21.88499 moveto
229.73834 -22.349712 229.36159 -22.726458 228.89687 -22.726458 curveto
228.43214 -22.726458 228.0554 -22.349712 228.0554 -21.88499 curveto
228.0554 -21.420269 228.43214 -21.043524 228.89687 -21.043524 curveto
229.36159 -21.043524 229.73834 -21.420269 229.73834 -21.88499 curveto
closepath
fill
newpath
0.0 0.0 0.0 setrgbcolor
1.0 setlinewidth
10.0 setmiterlimit
1 setlinejoin
1 setlinecap
[ ] 0 setdash
newpath
229.73834 -21.88499 moveto
229.73834 -22.349712 229.36159 -22.726458 228.89687 -22.726458 curveto
228.43214 -22.726458 228.0554 -22.349712 228.0554 -21.88499 curveto
228.0554 -21.420269 228.43214 -21.043524 228.89687 -21.043524 curveto
229.36159 -21.043524 229.73834 -21.420269 229.73834 -21.88499 curveto
closepath
stroke
newpath
0.0 0.0 0.0 setrgbcolor
newpath
242.87654 -23.36385 moveto
241.99234 -23.616947 241.22156 -23.743496 240.56416 -23.743496 curveto
239.40385 -23.743496 238.5139 -23.413155 237.8943 -22.752472 curveto
237.27472 -22.091787 236.96492 -21.145138 236.96492 -19.912521 curveto
236.96492 -18.702913 237.27882 -17.762014 237.90663 -17.089827 curveto
238.53445 -16.41764 239.41536 -16.081547 240.54936 -16.081547 curveto
241.29222 -16.081547 242.06467 -16.19166 242.86668 -16.411888 curveto
242.86668 -17.368399 lineto
241.86087 -17.026554 241.09007 -16.85563 240.55429 -16.85563 curveto
239.76543 -16.85563 239.15323 -17.12352 238.7177 -17.659296 curveto
238.28217 -18.195074 238.0644 -18.949436 238.0644 -19.922382 curveto
238.0644 -20.885468 238.29779 -21.634077 238.76454 -22.168211 curveto
239.2313 -22.702345 239.88539 -22.969412 240.72687 -22.969412 curveto
241.072 -22.969412 241.44507 -22.908602 241.84608 -22.786983 curveto
241.84608 -20.410498 lineto
242.87654 -20.410498 lineto
closepath
fill
newpath
0.0 0.0 0.0 setrgbcolor
newpath
144.69896 -21.88499 moveto
144.69896 -22.349712 144.32222 -22.726458 143.85748 -22.726458 curveto
143.39276 -22.726458 143.01602 -22.349712 143.01602 -21.88499 curveto
143.01602 -21.420269 143.39276 -21.043524 143.85748 -21.043524 curveto
144.32222 -21.043524 144.69896 -21.420269 144.69896 -21.88499 curveto
closepath
fill
newpath
0.0 0.0 0.0 setrgbcolor
1.0 setlinewidth
10.0 setmiterlimit
1 setlinejoin
1 setlinecap
[ ] 0 setdash
newpath
144.69896 -21.88499 moveto
144.69896 -22.349712 144.32222 -22.726458 143.85748 -22.726458 curveto
143.39276 -22.726458 143.01602 -22.349712 143.01602 -21.88499 curveto
143.01602 -21.420269 143.39276 -21.043524 143.85748 -21.043524 curveto
144.32222 -21.043524 144.69896 -21.420269 144.69896 -21.88499 curveto
closepath
stroke
newpath
0.0 0.0 0.0 setrgbcolor
newpath
143.99106 -14.3049345 moveto
143.99106 -7.00784 lineto
145.02646 -7.00784 lineto
145.02646 -10.084453 lineto
148.49751 -10.084453 lineto
148.49751 -7.00784 lineto
149.53291 -7.00784 lineto
149.53291 -14.3049345 lineto
148.49751 -14.3049345 lineto
148.49751 -10.858536 lineto
145.02646 -10.858536 lineto
145.02646 -14.3049345 lineto
closepath
fill
newpath
0.0 0.0 0.24705882 setrgbcolor
newpath
110.396515 -39.036217 moveto
110.396515 -39.500942 110.01977 -39.877686 109.555046 -39.877686 curveto
109.09031 -39.877686 108.71358 -39.500942 108.71358 -39.036217 curveto
108.71358 -38.571495 109.09031 -38.19475 109.555046 -38.19475 curveto
110.01977 -38.19475 110.396515 -38.571495 110.396515 -39.036217 curveto
closepath
fill
newpath
0.0 0.0 0.0 setrgbcolor
1.0 setlinewidth
10.0 setmiterlimit
1 setlinejoin
1 setlinecap
[ ] 0 setdash
newpath
110.396515 -39.036217 moveto
110.396515 -39.500942 110.01977 -39.877686 109.555046 -39.877686 curveto
109.09031 -39.877686 108.71358 -39.500942 108.71358 -39.036217 curveto
108.71358 -38.571495 109.09031 -38.19475 109.555046 -38.19475 curveto
110.01977 -38.19475 110.396515 -38.571495 110.396515 -39.036217 curveto
closepath
stroke
newpath
0.0 0.0 0.24705882 setrgbcolor
newpath
106.12506 -30.2928 moveto
106.12506 -22.995707 lineto
107.14073 -22.995707 lineto
110.813934 -28.631233 lineto
110.813934 -22.995707 lineto
111.701416 -22.995707 lineto
111.701416 -30.2928 lineto
110.690674 -30.2928 lineto
107.01254 -24.657276 lineto
107.01254 -30.2928 lineto
closepath
fill
newpath
0.0 0.0 0.24705882 setrgbcolor
newpath
-53.726234 -50.231438 moveto
-53.726234 -50.69616 -54.102974 -51.072906 -54.567703 -51.072906 curveto
-55.032433 -51.072906 -55.40917 -50.69616 -55.40917 -50.231438 curveto
-55.40917 -49.766716 -55.032433 -49.389973 -54.567703 -49.389973 curveto
-54.102974 -49.389973 -53.726234 -49.766716 -53.726234 -50.231438 curveto
closepath
fill
newpath
0.0 0.0 0.0 setrgbcolor
1.0 setlinewidth
10.0 setmiterlimit
1 setlinejoin
1 setlinecap
[ ] 0 setdash
newpath
-53.726234 -50.231438 moveto
-53.726234 -50.69616 -54.102974 -51.072906 -54.567703 -51.072906 curveto
-55.032433 -51.072906 -55.40917 -50.69616 -55.40917 -50.231438 curveto
-55.40917 -49.766716 -55.032433 -49.389973 -54.567703 -49.389973 curveto
-54.102974 -49.389973 -53.726234 -49.766716 -53.726234 -50.231438 curveto
closepath
stroke
newpath
0.0 0.0 0.24705882 setrgbcolor
newpath
-56.37827 -63.95147 moveto
-56.37827 -64.41619 -56.75501 -64.79294 -57.219738 -64.79294 curveto
-57.684467 -64.79294 -58.061203 -64.41619 -58.061203 -63.95147 curveto
-58.061203 -63.486748 -57.684467 -63.110004 -57.219738 -63.110004 curveto
-56.75501 -63.110004 -56.37827 -63.486748 -56.37827 -63.95147 curveto
closepath
fill
newpath
0.0 0.0 0.0 setrgbcolor
1.0 setlinewidth
10.0 setmiterlimit
1 setlinejoin
1 setlinecap
[ ] 0 setdash
newpath
-56.37827 -63.95147 moveto
-56.37827 -64.41619 -56.75501 -64.79294 -57.219738 -64.79294 curveto
-57.684467 -64.79294 -58.061203 -64.41619 -58.061203 -63.95147 curveto
-58.061203 -63.486748 -57.684467 -63.110004 -57.219738 -63.110004 curveto
-56.75501 -63.110004 -56.37827 -63.486748 -56.37827 -63.95147 curveto
closepath
stroke
newpath
0.0 0.0 0.1882353 setrgbcolor
newpath
36.938953 -50.231438 moveto
36.938953 -50.69616 36.562214 -51.072906 36.097485 -51.072906 curveto
35.632755 -51.072906 35.25602 -50.69616 35.25602 -50.231438 curveto
35.25602 -49.766716 35.632755 -49.389973 36.097485 -49.389973 curveto
36.562214 -49.389973 36.938953 -49.766716 36.938953 -50.231438 curveto
closepath
fill
newpath
0.0 0.0 0.0 setrgbcolor
1.0 setlinewidth
10.0 setmiterlimit
1 setlinejoin
1 setlinecap
[ ] 0 setdash
newpath
36.938953 -50.231438 moveto
36.938953 -50.69616 36.562214 -51.072906 36.097485 -51.072906 curveto
35.632755 -51.072906 35.25602 -50.69616 35.25602 -50.231438 curveto
35.25602 -49.766716 35.632755 -49.389973 36.097485 -49.389973 curveto
36.562214 -49.389973 36.938953 -49.766716 36.938953 -50.231438 curveto
closepath
stroke
newpath
0.0 0.0 0.1882353 setrgbcolor
newpath
35.441856 -43.756268 moveto
35.441856 -36.459175 lineto
36.41316 -36.459175 lineto
36.41316 -40.048557 lineto
39.36651 -36.459175 lineto
40.406837 -36.459175 lineto
37.547165 -39.940086 lineto
40.914677 -43.756268 lineto
39.603172 -43.756268 lineto
36.41316 -40.05842 lineto
36.41316 -43.756268 lineto
closepath
fill
newpath
grestore
grestore
showpage

%%EOF