%!PS-Adobe-3.0 EPSF-3.0
%%Creator: EpsGraphics2D 0.9.0 by Paul Mutton, http://www.jibble.org/
%%Title: GeoGebra, http://www.geogebra.org
%%CreationDate: Thu Feb 21 19:06:09 CET 2008
%%BoundingBox: 0 0 144 183
%%DocumentData: Clean7Bit
%%DocumentProcessColors: Black
%%ColorUsage: Color
%%Origin: 0 0
%%Pages: 1
%%Page: 1 1
%%EndComments

gsave
-0.0 183.0 translate
1.0 setlinewidth
10.0 setmiterlimit
0 setlinejoin
2 setlinecap
[ ] 0 setdash
gsave
newpath
0.0 -0.0 moveto
144.74222 -0.0 lineto
144.74222 -183.09271 lineto
0.0 -183.09271 lineto
0.0 -0.0 lineto
closepath
clip
newpath
1.0 setlinewidth
10.0 setmiterlimit
0 setlinejoin
2 setlinecap
[ ] 0 setdash
1.0 1.0 1.0 setrgbcolor
newpath
-149.69067 0.6185565 moveto
144.74222 0.6185565 lineto
144.74222 -183.09271 lineto
-149.69067 -183.09271 lineto
-149.69067 0.6185565 lineto
closepath
fill
newpath
0.6 0.6 0.6 setrgbcolor
1.0 setlinewidth
10.0 setmiterlimit
1 setlinejoin
0 setlinecap
[ 5.0 4.0 ] 0 setdash
newpath
-135.15448 0.6185565 moveto
-135.15448 -183.09271 lineto
stroke
newpath
newpath
-135.15448 0.6185565 moveto
-135.15448 -183.09271 lineto
stroke
newpath
newpath
-106.80803 0.6185565 moveto
-106.80803 -183.09271 lineto
stroke
newpath
newpath
-78.46157 0.6185565 moveto
-78.46157 -183.09271 lineto
stroke
newpath
newpath
-50.11512 0.6185565 moveto
-50.11512 -183.09271 lineto
stroke
newpath
newpath
-21.768656 0.6185565 moveto
-21.768656 -183.09271 lineto
stroke
newpath
newpath
6.5777974 0.6185565 moveto
6.5777974 -183.09271 lineto
stroke
newpath
newpath
34.92426 0.6185565 moveto
34.92426 -183.09271 lineto
stroke
newpath
newpath
63.270714 0.6185565 moveto
63.270714 -183.09271 lineto
stroke
newpath
newpath
91.617165 0.6185565 moveto
91.617165 -183.09271 lineto
stroke
newpath
newpath
119.96362 0.6185565 moveto
119.96362 -183.09271 lineto
stroke
newpath
newpath
-149.69067 0.15560025 moveto
144.74222 0.15560025 lineto
stroke
newpath
newpath
-149.69067 0.15560025 moveto
144.74222 0.15560025 lineto
stroke
newpath
newpath
-149.69067 -28.190857 moveto
144.74222 -28.190857 lineto
stroke
newpath
newpath
-149.69067 -56.537315 moveto
144.74222 -56.537315 lineto
stroke
newpath
newpath
-149.69067 -84.883766 moveto
144.74222 -84.883766 lineto
stroke
newpath
newpath
-149.69067 -113.23023 moveto
144.74222 -113.23023 lineto
stroke
newpath
newpath
-149.69067 -141.57669 moveto
144.74222 -141.57669 lineto
stroke
newpath
newpath
-149.69067 -169.92314 moveto
144.74222 -169.92314 lineto
stroke
newpath
0.2 0.2 0.2 setrgbcolor
newpath
-132.54263 -120.291115 moveto
-132.54263 -119.84411 lineto
-129.86061 -119.84411 lineto
-129.86061 -120.291115 lineto
closepath
-128.48035 -121.85563 moveto
-128.42195 -121.507286 -128.3389 -121.20626 -128.23117 -120.95256 curveto
-128.12344 -120.69885 -127.93266 -120.35051 -127.65882 -119.90754 curveto
-126.43862 -117.94434 lineto
-128.74008 -117.94434 lineto
-128.74008 -117.38559 lineto
-125.87081 -117.38559 lineto
-125.87081 -117.94434 lineto
-127.01651 -119.6337 -127.657814 -120.937454 -127.79474 -121.85563 curveto
closepath
fill
newpath
1.8 setlinewidth
10.0 setmiterlimit
0 setlinejoin
0 setlinecap
[ ] 0 setdash
newpath
-135.15448 -113.23023 moveto
-135.15448 -115.70445 lineto
stroke
newpath
newpath
-104.08904 -120.291115 moveto
-104.08904 -119.84411 lineto
-101.40702 -119.84411 lineto
-101.40702 -120.291115 lineto
closepath
-99.89385 -119.53906 moveto
-99.60994 -119.170586 -99.25254 -118.98634 -98.82165 -118.98634 curveto
-98.43102 -118.98634 -98.111374 -119.115715 -97.8627 -119.37446 curveto
-97.61404 -119.633194 -97.4897 -119.96493 -97.4897 -120.369644 curveto
-97.4897 -120.83477 -97.629135 -121.21734 -97.908005 -121.51736 curveto
-98.18688 -121.81737 -98.54076 -121.96738 -98.96964 -121.96738 curveto
-99.46295 -121.96738 -99.84854 -121.76904 -100.12641 -121.37238 curveto
-100.40428 -120.975716 -100.54321 -120.42501 -100.54321 -119.720276 curveto
-100.54321 -118.94507 -100.383644 -118.343025 -100.0645 -117.91414 curveto
-99.74535 -117.48526 -99.29584 -117.27082 -98.715935 -117.27082 curveto
-98.45015 -117.27082 -98.11792 -117.3272 -97.71924 -117.43996 curveto
-97.71924 -117.95945 lineto
-98.14007 -117.79836 -98.48438 -117.71782 -98.75218 -117.71782 curveto
-99.5133 -117.71782 -99.89385 -118.3249 -99.89385 -119.53906 curveto
closepath
-98.087715 -120.50253 moveto
-98.087715 -120.16426 -98.16373 -119.898476 -98.31575 -119.70518 curveto
-98.467766 -119.51188 -98.67869 -119.41523 -98.9485 -119.41523 curveto
-99.20019 -119.41523 -99.41664 -119.499794 -99.59786 -119.66893 curveto
-99.77908 -119.838066 -99.86969 -120.041435 -99.86969 -120.27903 curveto
-99.86969 -120.65355 -99.783615 -120.95406 -99.61146 -121.18059 curveto
-99.4393 -121.40711 -99.211266 -121.52038 -98.92736 -121.52038 curveto
-98.67164 -121.52038 -98.467766 -121.42826 -98.31575 -121.24402 curveto
-98.16373 -121.05978 -98.087715 -120.812614 -98.087715 -120.50253 curveto
closepath
fill
newpath
1.8 setlinewidth
10.0 setmiterlimit
0 setlinejoin
0 setlinecap
[ ] 0 setdash
newpath
-106.80803 -113.23023 moveto
-106.80803 -115.70445 lineto
stroke
newpath
newpath
-75.635445 -120.291115 moveto
-75.635445 -119.84411 lineto
-72.95342 -119.84411 lineto
-72.95342 -120.291115 lineto
closepath
-71.75134 -121.87375 moveto
-71.75134 -121.34218 lineto
-71.45535 -121.460976 -71.17346 -121.52038 -70.90566 -121.52038 curveto
-70.61169 -121.52038 -70.38063 -121.43379 -70.2125 -121.26063 curveto
-70.04437 -121.08746 -69.96031 -120.84886 -69.96031 -120.54482 curveto
-69.96031 -119.87431 -70.42242 -119.53906 -71.34663 -119.53906 curveto
-71.451324 -119.53906 -71.561066 -119.54611 -71.675835 -119.5602 curveto
-71.675835 -117.38559 lineto
-69.413635 -117.38559 lineto
-69.413635 -117.90508 lineto
-71.15333 -117.90508 lineto
-71.15333 -119.08299 lineto
-70.57947 -119.08299 -70.13146 -119.21488 -69.809296 -119.47865 curveto
-69.48713 -119.742424 -69.32605 -120.10788 -69.32605 -120.57502 curveto
-69.32605 -121.00995 -69.472534 -121.35074 -69.7655 -121.59739 curveto
-70.05847 -121.84405 -70.4647 -121.96738 -70.98419 -121.96738 curveto
-71.20971 -121.96738 -71.46542 -121.936165 -71.75134 -121.87375 curveto
closepath
fill
newpath
1.8 setlinewidth
10.0 setmiterlimit
0 setlinejoin
0 setlinecap
[ ] 0 setdash
newpath
-78.46157 -113.23023 moveto
-78.46157 -115.70445 lineto
stroke
newpath
newpath
-47.800404 -120.291115 moveto
-47.800404 -119.84411 lineto
-45.11838 -119.84411 lineto
-45.11838 -120.291115 lineto
closepath
-42.339706 -121.85563 moveto
-42.339706 -120.590126 lineto
-44.351223 -120.590126 lineto
-44.351223 -120.1401 lineto
-42.339706 -117.38559 lineto
-41.780952 -117.38559 lineto
-41.780952 -120.10386 lineto
-41.182934 -120.10386 lineto
-41.182934 -120.590126 lineto
-41.780952 -120.590126 lineto
-41.780952 -121.85563 lineto
closepath
-43.768307 -120.10386 moveto
-42.300446 -120.10386 lineto
-42.300446 -118.1165 lineto
closepath
fill
newpath
1.8 setlinewidth
10.0 setmiterlimit
0 setlinejoin
0 setlinecap
[ ] 0 setdash
newpath
-50.11512 -113.23023 moveto
-50.11512 -115.70445 lineto
stroke
newpath
newpath
-19.346804 -120.291115 moveto
-19.346804 -119.84411 lineto
-16.664782 -119.84411 lineto
-16.664782 -120.291115 lineto
closepath
-15.586536 -121.8224 moveto
-15.586536 -121.26667 lineto
-15.159668 -121.43581 -14.823408 -121.52038 -14.577758 -121.52038 curveto
-14.29385 -121.52038 -14.062797 -121.43732 -13.8846 -121.2712 curveto
-13.706403 -121.10509 -13.617304 -120.89014 -13.617304 -120.626366 curveto
-13.617304 -119.998146 -14.0572605 -119.68404 -14.937173 -119.68404 curveto
-15.172755 -119.68404 lineto
-15.172755 -119.28233 lineto
-14.964355 -119.27931 lineto
-14.138808 -119.27931 -13.726034 -118.98836 -13.726034 -118.40645 curveto
-13.726034 -117.94938 -13.997861 -117.72084 -14.541513 -117.72084 curveto
-14.839517 -117.72084 -15.167722 -117.804405 -15.52613 -117.97153 curveto
-15.52613 -117.452034 lineto
-15.173762 -117.33324 -14.831462 -117.27384 -14.499229 -117.27384 curveto
-13.585087 -117.27384 -13.1280155 -117.61916 -13.1280155 -118.3098 curveto
-13.1280155 -118.835335 -13.439106 -119.20985 -14.061287 -119.43335 curveto
-13.340444 -119.60047 -12.980021 -119.995125 -12.980021 -120.61731 curveto
-12.980021 -121.03814 -13.118955 -121.368355 -13.396822 -121.60796 curveto
-13.674689 -121.84757 -14.0562525 -121.96738 -14.541513 -121.96738 curveto
-14.817368 -121.96738 -15.165709 -121.91905 -15.586536 -121.8224 curveto
closepath
fill
newpath
1.8 setlinewidth
10.0 setmiterlimit
0 setlinejoin
0 setlinecap
[ ] 0 setdash
newpath
-21.768656 -113.23023 moveto
-21.768656 -115.70445 lineto
stroke
newpath
newpath
9.106794 -120.291115 moveto
9.106794 -119.84411 lineto
11.788816 -119.84411 lineto
11.788816 -120.291115 lineto
closepath
12.752291 -121.85563 moveto
12.752291 -121.333115 lineto
12.925454 -120.9284 13.275808 -120.487434 13.803353 -120.01022 curveto
14.144647 -119.70518 lineto
14.583596 -119.30851 14.803071 -118.91486 14.803071 -118.52424 curveto
14.803071 -118.27457 14.728067 -118.07825 14.578059 -117.93529 curveto
14.428051 -117.79232 14.222168 -117.72084 13.960409 -117.72084 curveto
13.650325 -117.72084 13.284869 -117.840645 12.864042 -118.08026 curveto
12.864042 -117.554726 lineto
13.260707 -117.36747 13.654352 -117.27384 14.044977 -117.27384 curveto
14.463792 -117.27384 14.800051 -117.3866 15.053756 -117.612114 curveto
15.307461 -117.83763 15.434313 -118.136635 15.434313 -118.50914 curveto
15.434313 -118.77694 15.370383 -119.01454 15.242524 -119.22193 curveto
15.114665 -119.42932 14.876565 -119.681015 14.528225 -119.977005 curveto
14.298682 -120.173325 lineto
13.821476 -120.57804 13.545622 -120.96464 13.471121 -121.333115 curveto
15.413171 -121.333115 lineto
15.413171 -121.85563 lineto
closepath
fill
newpath
1.8 setlinewidth
10.0 setmiterlimit
0 setlinejoin
0 setlinecap
[ ] 0 setdash
newpath
6.5777974 -113.23023 moveto
6.5777974 -115.70445 lineto
stroke
newpath
newpath
37.560394 -120.291115 moveto
37.560394 -119.84411 lineto
40.242416 -119.84411 lineto
40.242416 -120.291115 lineto
closepath
41.62269 -121.85563 moveto
41.62269 -121.40862 lineto
42.516697 -121.40862 lineto
42.516697 -117.88092 lineto
41.62269 -118.10442 lineto
41.62269 -117.64533 lineto
43.114716 -117.27384 lineto
43.114716 -121.40862 lineto
44.008724 -121.40862 lineto
44.008724 -121.85563 lineto
closepath
fill
newpath
1.8 setlinewidth
10.0 setmiterlimit
0 setlinejoin
0 setlinecap
[ ] 0 setdash
newpath
34.92426 -113.23023 moveto
34.92426 -115.70445 lineto
stroke
newpath
newpath
68.74313 -121.96738 moveto
68.282036 -121.96738 67.90903 -121.75042 67.62411 -121.316505 curveto
67.339195 -120.88259 67.19674 -120.316284 67.19674 -119.61759 curveto
67.19674 -118.91286 67.3402 -118.34605 67.62713 -117.91716 curveto
67.91406 -117.48828 68.2921 -117.27384 68.76125 -117.27384 curveto
69.23041 -117.27384 69.608444 -117.48828 69.89537 -117.91716 curveto
70.182304 -118.34605 70.32577 -118.909836 70.32577 -119.60853 curveto
70.32577 -120.32535 70.182304 -120.89769 69.89537 -121.32557 curveto
69.608444 -121.75344 69.224365 -121.96738 68.74313 -121.96738 curveto
closepath
68.74917 -121.52038 moveto
69.3794 -121.52038 69.69452 -120.88007 69.69452 -119.599464 curveto
69.69452 -118.347046 69.38343 -117.72084 68.76125 -117.72084 curveto
68.14108 -117.72084 67.831 -118.35309 67.831 -119.61759 curveto
67.831 -120.886116 68.137054 -121.52038 68.74917 -121.52038 curveto
closepath
fill
newpath
1.8 setlinewidth
10.0 setmiterlimit
0 setlinejoin
0 setlinecap
[ ] 0 setdash
newpath
63.270714 -113.23023 moveto
63.270714 -115.70445 lineto
stroke
newpath
newpath
96.8065 -121.85563 moveto
96.8065 -121.40862 lineto
97.700516 -121.40862 lineto
97.700516 -117.88092 lineto
96.8065 -118.10442 lineto
96.8065 -117.64533 lineto
98.29853 -117.27384 lineto
98.29853 -121.40862 lineto
99.192535 -121.40862 lineto
99.192535 -121.85563 lineto
closepath
fill
newpath
1.8 setlinewidth
10.0 setmiterlimit
0 setlinejoin
0 setlinecap
[ ] 0 setdash
newpath
91.617165 -113.23023 moveto
91.617165 -115.70445 lineto
stroke
newpath
newpath
124.22475 -121.85563 moveto
124.22475 -121.333115 lineto
124.39791 -120.9284 124.74826 -120.487434 125.27581 -120.01022 curveto
125.6171 -119.70518 lineto
126.05605 -119.30851 126.27553 -118.91486 126.27553 -118.52424 curveto
126.27553 -118.27457 126.20052 -118.07825 126.050514 -117.93529 curveto
125.900505 -117.79232 125.69462 -117.72084 125.43286 -117.72084 curveto
125.12278 -117.72084 124.757324 -117.840645 124.336494 -118.08026 curveto
124.336494 -117.554726 lineto
124.73316 -117.36747 125.12681 -117.27384 125.51743 -117.27384 curveto
125.93625 -117.27384 126.27251 -117.3866 126.526215 -117.612114 curveto
126.779915 -117.83763 126.90677 -118.136635 126.90677 -118.50914 curveto
126.90677 -118.77694 126.84284 -119.01454 126.71498 -119.22193 curveto
126.58712 -119.42932 126.34902 -119.681015 126.00068 -119.977005 curveto
125.77114 -120.173325 lineto
125.29393 -120.57804 125.01808 -120.96464 124.94358 -121.333115 curveto
126.88563 -121.333115 lineto
126.88563 -121.85563 lineto
closepath
fill
newpath
1.8 setlinewidth
10.0 setmiterlimit
0 setlinejoin
0 setlinecap
[ ] 0 setdash
newpath
119.96362 -113.23023 moveto
119.96362 -115.70445 lineto
stroke
newpath
1.8 setlinewidth
10.0 setmiterlimit
0 setlinejoin
0 setlinecap
[ ] 0 setdash
newpath
-149.69067 -113.23023 moveto
144.74222 -113.23023 lineto
stroke
newpath
newpath
144.12366 -113.23023 moveto
141.64943 -110.756004 lineto
stroke
newpath
newpath
144.12366 -113.23023 moveto
141.64943 -115.70445 lineto
stroke
newpath
newpath
57.53542 -26.564705 moveto
57.53542 -26.00897 lineto
57.962288 -26.178108 58.298546 -26.262676 58.544197 -26.262676 curveto
58.828106 -26.262676 59.05916 -26.179619 59.237354 -26.013502 curveto
59.41555 -25.847385 59.50465 -25.632442 59.50465 -25.36867 curveto
59.50465 -24.740448 59.064693 -24.426336 58.18478 -24.426336 curveto
57.9492 -24.426336 lineto
57.9492 -24.024637 lineto
58.1576 -24.021616 lineto
58.983147 -24.021616 59.39592 -23.730661 59.39592 -23.148752 curveto
59.39592 -22.69168 59.124092 -22.463144 58.58044 -22.463144 curveto
58.28244 -22.463144 57.954235 -22.546705 57.595825 -22.713829 curveto
57.595825 -22.194338 lineto
57.948193 -22.075539 58.29049 -22.01614 58.622723 -22.01614 curveto
59.536865 -22.01614 59.99394 -22.36146 59.99394 -23.052101 curveto
59.99394 -23.577633 59.682846 -23.95215 59.060665 -24.175652 curveto
59.78151 -24.342775 60.141933 -24.737427 60.141933 -25.359608 curveto
60.141933 -25.780436 60.003 -26.110655 59.725132 -26.350266 curveto
59.447266 -26.589876 59.0657 -26.70968 58.58044 -26.70968 curveto
58.30459 -26.70968 57.956245 -26.661356 57.53542 -26.564705 curveto
closepath
fill
newpath
1.8 setlinewidth
10.0 setmiterlimit
0 setlinejoin
0 setlinecap
[ ] 0 setdash
newpath
60.796486 -28.190857 moveto
63.270714 -28.190857 lineto
stroke
newpath
newpath
57.420647 -55.051525 moveto
57.420647 -54.529015 lineto
57.59381 -54.124294 57.944164 -53.683334 58.47171 -53.206127 curveto
58.813004 -52.901077 lineto
59.251953 -52.504414 59.471428 -52.110767 59.471428 -51.720142 curveto
59.471428 -51.470463 59.396423 -51.274143 59.246414 -51.131184 curveto
59.09641 -50.988224 58.890526 -50.916744 58.628765 -50.916744 curveto
58.31868 -50.916744 57.953224 -51.03655 57.5324 -51.276157 curveto
57.5324 -50.750626 lineto
57.92906 -50.563366 58.32271 -50.469738 58.713333 -50.469738 curveto
59.132145 -50.469738 59.468407 -50.582497 59.72211 -50.808014 curveto
59.975815 -51.033527 60.10267 -51.33254 60.10267 -51.70504 curveto
60.10267 -51.97284 60.03874 -52.210434 59.91088 -52.417828 curveto
59.78302 -52.62522 59.544918 -52.876915 59.19658 -53.172905 curveto
58.967037 -53.36922 lineto
58.48983 -53.77394 58.213978 -54.16054 58.139477 -54.529015 curveto
60.081528 -54.529015 lineto
60.081528 -55.051525 lineto
closepath
fill
newpath
1.8 setlinewidth
10.0 setmiterlimit
0 setlinejoin
0 setlinecap
[ ] 0 setdash
newpath
60.796486 -56.537315 moveto
63.270714 -56.537315 lineto
stroke
newpath
newpath
57.83745 -83.50513 moveto
57.83745 -83.05812 lineto
58.731453 -83.05812 lineto
58.731453 -79.53042 lineto
57.83745 -79.75392 lineto
57.83745 -79.29483 lineto
59.32947 -78.92334 lineto
59.32947 -83.05812 lineto
60.22348 -83.05812 lineto
60.22348 -83.50513 lineto
closepath
fill
newpath
1.8 setlinewidth
10.0 setmiterlimit
0 setlinejoin
0 setlinecap
[ ] 0 setdash
newpath
60.796486 -84.883766 moveto
63.270714 -84.883766 lineto
stroke
newpath
newpath
58.846226 -112.07047 moveto
58.385128 -112.07047 58.012123 -111.853516 57.727207 -111.4196 curveto
57.44229 -110.98569 57.299835 -110.41938 57.299835 -109.72069 curveto
57.299835 -109.01595 57.4433 -108.44914 57.73023 -108.020256 curveto
58.017155 -107.59138 58.395195 -107.37694 58.86435 -107.37694 curveto
59.3335 -107.37694 59.71154 -107.59138 59.99847 -108.020256 curveto
60.285397 -108.44914 60.42886 -109.01293 60.42886 -109.711624 curveto
60.42886 -110.428444 60.285397 -111.000786 59.99847 -111.428665 curveto
59.71154 -111.85654 59.32746 -112.07047 58.846226 -112.07047 curveto
closepath
58.85227 -111.623474 moveto
59.482502 -111.623474 59.79762 -110.98317 59.79762 -109.70256 curveto
59.79762 -108.45014 59.48653 -107.82394 58.86435 -107.82394 curveto
58.244183 -107.82394 57.934097 -108.456184 57.934097 -109.72069 curveto
57.934097 -110.98921 58.240154 -111.623474 58.85227 -111.623474 curveto
closepath
fill
newpath
1.8 setlinewidth
10.0 setmiterlimit
0 setlinejoin
0 setlinecap
[ ] 0 setdash
newpath
60.796486 -113.23023 moveto
63.270714 -113.23023 lineto
stroke
newpath
newpath
53.64286 -138.22925 moveto
53.64286 -137.78224 lineto
56.324883 -137.78224 lineto
56.324883 -138.22925 lineto
closepath
57.70516 -139.79376 moveto
57.70516 -139.34676 lineto
58.599167 -139.34676 lineto
58.599167 -135.81906 lineto
57.70516 -136.04256 lineto
57.70516 -135.58348 lineto
59.197186 -135.21198 lineto
59.197186 -139.34676 lineto
60.09119 -139.34676 lineto
60.09119 -139.79376 lineto
closepath
fill
newpath
1.8 setlinewidth
10.0 setmiterlimit
0 setlinejoin
0 setlinecap
[ ] 0 setdash
newpath
60.796486 -141.57669 moveto
63.270714 -141.57669 lineto
stroke
newpath
newpath
53.64286 -166.68285 moveto
53.64286 -166.23584 lineto
56.324883 -166.23584 lineto
56.324883 -166.68285 lineto
closepath
57.288357 -168.24736 moveto
57.288357 -167.72485 lineto
57.46152 -167.32013 57.811874 -166.87917 58.33942 -166.40196 curveto
58.680714 -166.09691 lineto
59.119663 -165.70026 59.339138 -165.30661 59.339138 -164.91599 curveto
59.339138 -164.6663 59.264133 -164.46999 59.11413 -164.32703 curveto
58.96412 -164.18407 58.758236 -164.11258 58.496475 -164.11258 curveto
58.18639 -164.11258 57.820934 -164.23239 57.40011 -164.472 curveto
57.40011 -163.94646 lineto
57.796772 -163.7592 58.19042 -163.66557 58.581043 -163.66557 curveto
58.99986 -163.66557 59.33612 -163.77834 59.589825 -164.00385 curveto
59.84353 -164.22935 59.97038 -164.52837 59.97038 -164.90088 curveto
59.97038 -165.16869 59.90645 -165.40628 59.77859 -165.61366 curveto
59.650734 -165.82106 59.412632 -166.07275 59.064293 -166.36874 curveto
58.834747 -166.56506 lineto
58.35754 -166.96977 58.081688 -167.35637 58.007187 -167.72485 curveto
59.949238 -167.72485 lineto
59.949238 -168.24736 lineto
closepath
fill
newpath
1.8 setlinewidth
10.0 setmiterlimit
0 setlinejoin
0 setlinecap
[ ] 0 setdash
newpath
60.796486 -169.92314 moveto
63.270714 -169.92314 lineto
stroke
newpath
newpath
63.270714 0.6185565 moveto
63.270714 -183.09271 lineto
stroke
newpath
newpath
63.270714 0.6185565 moveto
60.796486 -1.8556695 lineto
stroke
newpath
newpath
63.270714 0.6185565 moveto
65.74494 -1.8556695 lineto
stroke
newpath
0.0 0.0 0.0 setrgbcolor
1.0 setlinewidth
10.0 setmiterlimit
1 setlinejoin
1 setlinecap
[ ] 0 setdash
newpath
144.74222 -138.00882 moveto
6.114843 0.6185565 lineto
stroke
newpath
0.0 0.0 0.0 setrgbcolor
1.0 setlinewidth
10.0 setmiterlimit
1 setlinejoin
1 setlinecap
[ ] 0 setdash
newpath
42.512695 -183.09271 moveto
134.36833 0.6185565 lineto
stroke
newpath
0.0 0.0 1.0 setrgbcolor
newpath
65.12638 -141.57669 moveto
65.12638 -142.60155 64.29558 -143.43236 63.270714 -143.43236 curveto
62.245853 -143.43236 61.415043 -142.60155 61.415043 -141.57669 curveto
61.415043 -140.55182 62.245853 -139.72101 63.270714 -139.72101 curveto
64.29558 -139.72101 65.12638 -140.55182 65.12638 -141.57669 curveto
closepath
fill
newpath
0.0 0.0 0.0 setrgbcolor
1.0 setlinewidth
10.0 setmiterlimit
1 setlinejoin
1 setlinecap
[ ] 0 setdash
newpath
65.12638 -141.57669 moveto
65.12638 -142.60155 64.29558 -143.43236 63.270714 -143.43236 curveto
62.245853 -143.43236 61.415043 -142.60155 61.415043 -141.57669 curveto
61.415043 -140.55182 62.245853 -139.72101 63.270714 -139.72101 curveto
64.29558 -139.72101 65.12638 -140.55182 65.12638 -141.57669 curveto
closepath
stroke
newpath
0.0 0.0 1.0 setrgbcolor
newpath
93.47284 -84.883766 moveto
93.47284 -85.90863 92.64203 -86.73943 91.617165 -86.73943 curveto
90.59231 -86.73943 89.7615 -85.90863 89.7615 -84.883766 curveto
89.7615 -83.85892 90.59231 -83.0281 91.617165 -83.0281 curveto
92.64203 -83.0281 93.47284 -83.85892 93.47284 -84.883766 curveto
closepath
fill
newpath
0.0 0.0 0.0 setrgbcolor
1.0 setlinewidth
10.0 setmiterlimit
1 setlinejoin
1 setlinecap
[ ] 0 setdash
newpath
93.47284 -84.883766 moveto
93.47284 -85.90863 92.64203 -86.73943 91.617165 -86.73943 curveto
90.59231 -86.73943 89.7615 -85.90863 89.7615 -84.883766 curveto
89.7615 -83.85892 90.59231 -83.0281 91.617165 -83.0281 curveto
92.64203 -83.0281 93.47284 -83.85892 93.47284 -84.883766 curveto
closepath
stroke
newpath
0.49019608 0.49019608 1.0 setrgbcolor
newpath
65.12638 -56.537315 moveto
65.12638 -57.562172 64.29558 -58.392982 63.270714 -58.392982 curveto
62.245853 -58.392982 61.415043 -57.562172 61.415043 -56.537315 curveto
61.415043 -55.51246 62.245853 -54.681644 63.270714 -54.681644 curveto
64.29558 -54.681644 65.12638 -55.51246 65.12638 -56.537315 curveto
closepath
fill
newpath
0.0 0.0 0.0 setrgbcolor
1.0 setlinewidth
10.0 setmiterlimit
1 setlinejoin
1 setlinecap
[ ] 0 setdash
newpath
65.12638 -56.537315 moveto
65.12638 -57.562172 64.29558 -58.392982 63.270714 -58.392982 curveto
62.245853 -58.392982 61.415043 -57.562172 61.415043 -56.537315 curveto
61.415043 -55.51246 62.245853 -54.681644 63.270714 -54.681644 curveto
64.29558 -54.681644 65.12638 -55.51246 65.12638 -56.537315 curveto
closepath
stroke
newpath
grestore
grestore
showpage

%%EOF