%!PS-Adobe-3.0 EPSF-3.0
%%Creator: EpsGraphics2D 0.9.0 by Paul Mutton, http://www.jibble.org/
%%Title: GeoGebra, http://www.geogebra.org
%%CreationDate: Tue Apr 08 15:40:32 CEST 2008
%%BoundingBox: 0 0 243 216
%%DocumentData: Clean7Bit
%%DocumentProcessColors: Black
%%ColorUsage: Color
%%Origin: 0 0
%%Pages: 1
%%Page: 1 1
%%EndComments

gsave
-0.0 216.0 translate
1.0 setlinewidth
10.0 setmiterlimit
0 setlinejoin
2 setlinecap
[ ] 0 setdash
gsave
newpath
0.0 -0.0 moveto
243.22595 -0.0 lineto
243.22595 -216.48834 lineto
0.0 -216.48834 lineto
0.0 -0.0 lineto
closepath
clip
newpath
1.0 setlinewidth
10.0 setmiterlimit
0 setlinejoin
2 setlinecap
[ ] 0 setdash
1.0 1.0 1.0 setrgbcolor
newpath
-77.625305 155.25061 moveto
532.1646 155.25061 lineto
532.1646 -379.5015 lineto
-77.625305 -379.5015 lineto
-77.625305 155.25061 lineto
closepath
fill
newpath
0.0 0.0 0.0 setrgbcolor
1.0 setlinewidth
10.0 setmiterlimit
1 setlinejoin
1 setlinecap
[ ] 0 setdash
newpath
147.48808 -14.662558 moveto
125.96851 -21.45231 106.114944 -32.686176 89.213005 -47.63665 curveto
stroke
newpath
0.0 0.0 0.0 setrgbcolor
1.0 setlinewidth
10.0 setmiterlimit
1 setlinejoin
1 setlinecap
[ ] 0 setdash
newpath
146.62558 -51.750202 moveto
129.43073 -35.357742 108.81871 -22.977037 86.27026 -15.497528 curveto
stroke
newpath
0.0 0.0 0.0 setrgbcolor
1.0 setlinewidth
10.0 setmiterlimit
1 setlinejoin
1 setlinecap
[ ] 0 setdash
newpath
37.950134 -138.00053 moveto
33.82146 -159.49316 34.12408 -181.60242 38.839485 -202.97397 curveto
stroke
newpath
0.0 0.0 0.0 setrgbcolor
1.0 setlinewidth
10.0 setmiterlimit
1 setlinejoin
1 setlinecap
[ ] 0 setdash
newpath
195.97331 -168.33224 moveto
35.621616 -168.1876 lineto
stroke
newpath
0.0 0.0 0.0 setrgbcolor
1.5 setlinewidth
10.0 setmiterlimit
1 setlinejoin
1 setlinecap
[ ] 0 setdash
newpath
115.79565 -29.464567 moveto
195.84625 -168.3321 lineto
stroke
newpath
0.0 0.0 0.0 setrgbcolor
1.5 setlinewidth
10.0 setmiterlimit
1 setlinejoin
1 setlinecap
[ ] 0 setdash
newpath
195.84625 -168.3321 moveto
35.621616 -168.1876 lineto
stroke
newpath
0.0 0.0 0.0 setrgbcolor
1.5 setlinewidth
10.0 setmiterlimit
1 setlinejoin
1 setlinecap
[ ] 0 setdash
newpath
35.621616 -168.1876 moveto
115.79565 -29.464567 lineto
stroke
newpath
0.0 0.0 0.0 setrgbcolor
newpath
196.83582 -168.33224 moveto
196.83582 -168.80858 196.44968 -169.19475 195.97331 -169.19475 curveto
195.49696 -169.19475 195.11081 -168.80858 195.11081 -168.33224 curveto
195.11081 -167.85588 195.49696 -167.46974 195.97331 -167.46974 curveto
196.44968 -167.46974 196.83582 -167.85588 196.83582 -168.33224 curveto
closepath
fill
newpath
0.0 0.0 0.0 setrgbcolor
1.0 setlinewidth
10.0 setmiterlimit
1 setlinejoin
1 setlinecap
[ ] 0 setdash
newpath
196.83582 -168.33224 moveto
196.83582 -168.80858 196.44968 -169.19475 195.97331 -169.19475 curveto
195.49696 -169.19475 195.11081 -168.80858 195.11081 -168.33224 curveto
195.11081 -167.85588 195.49696 -167.46974 195.97331 -167.46974 curveto
196.44968 -167.46974 196.83582 -167.85588 196.83582 -168.33224 curveto
closepath
stroke
newpath
0.0 0.0 0.0 setrgbcolor
newpath
211.17014 -171.82516 moveto
210.00778 -171.82516 209.10991 -171.48404 208.4765 -170.80177 curveto
207.8431 -170.11952 207.5264 -169.15341 207.5264 -167.90346 curveto
207.5264 -166.65688 207.849 -165.68993 208.49419 -165.00262 curveto
209.13937 -164.31532 210.0482 -163.97166 211.22067 -163.97166 curveto
211.89113 -163.97166 212.67615 -164.08116 213.57571 -164.30016 curveto
213.57571 -165.29575 lineto
212.5515 -164.94197 211.76143 -164.76509 211.20552 -164.76509 curveto
210.39355 -164.76509 209.7652 -165.03967 209.32048 -165.58885 curveto
208.87575 -166.13803 208.65338 -166.91293 208.65338 -167.91357 curveto
208.65338 -168.86705 208.8909 -169.6192 209.36595 -170.17006 curveto
209.841 -170.72092 210.48958 -170.99635 211.31165 -170.99635 curveto
212.01917 -170.99635 212.77722 -170.77904 213.58582 -170.34442 curveto
213.58582 -171.25409 lineto
212.84798 -171.63481 212.04274 -171.82516 211.17014 -171.82516 curveto
closepath
fill
newpath
0.0 0.0 0.0 setrgbcolor
newpath
36.48412 -168.1876 moveto
36.48412 -168.66397 36.097958 -169.05011 35.621616 -169.05011 curveto
35.145264 -169.05011 34.759113 -168.66397 34.759113 -168.1876 curveto
34.759113 -167.71126 35.145264 -167.3251 35.621616 -167.3251 curveto
36.097958 -167.3251 36.48412 -167.71126 36.48412 -168.1876 curveto
closepath
fill
newpath
0.0 0.0 0.0 setrgbcolor
1.0 setlinewidth
10.0 setmiterlimit
1 setlinejoin
1 setlinecap
[ ] 0 setdash
newpath
36.48412 -168.1876 moveto
36.48412 -168.66397 36.097958 -169.05011 35.621616 -169.05011 curveto
35.145264 -169.05011 34.759113 -168.66397 34.759113 -168.1876 curveto
34.759113 -167.71126 35.145264 -167.3251 35.621616 -167.3251 curveto
36.097958 -167.3251 36.48412 -167.71126 36.48412 -168.1876 curveto
closepath
stroke
newpath
0.0 0.0 0.0 setrgbcolor
newpath
22.527847 -167.32565 moveto
22.527847 -159.84613 lineto
23.58913 -159.84613 lineto
23.58913 -162.99966 lineto
27.146957 -162.99966 lineto
27.146957 -159.84613 lineto
28.20824 -159.84613 lineto
28.20824 -167.32565 lineto
27.146957 -167.32565 lineto
27.146957 -163.79309 lineto
23.58913 -163.79309 lineto
23.58913 -167.32565 lineto
closepath
fill
newpath
0.0 0.0 0.0 setrgbcolor
newpath
116.65815 -29.464567 moveto
116.65815 -29.940907 116.27199 -30.32707 115.79565 -30.32707 curveto
115.31929 -30.32707 114.93314 -29.940907 114.93314 -29.464567 curveto
114.93314 -28.988213 115.31929 -28.602062 115.79565 -28.602062 curveto
116.27199 -28.602062 116.65815 -28.988213 116.65815 -29.464567 curveto
closepath
fill
newpath
0.0 0.0 0.0 setrgbcolor
1.0 setlinewidth
10.0 setmiterlimit
1 setlinejoin
1 setlinecap
[ ] 0 setdash
newpath
116.65815 -29.464567 moveto
116.65815 -29.940907 116.27199 -30.32707 115.79565 -30.32707 curveto
115.31929 -30.32707 114.93314 -29.940907 114.93314 -29.464567 curveto
114.93314 -28.988213 115.31929 -28.602062 115.79565 -28.602062 curveto
116.27199 -28.602062 116.65815 -28.988213 116.65815 -29.464567 curveto
closepath
stroke
newpath
0.0 0.0 0.0 setrgbcolor
newpath
117.7435 -16.977165 moveto
116.46996 -13.752886 lineto
115.19137 -16.977165 lineto
closepath
118.86543 -19.837578 moveto
118.05178 -17.765549 lineto
114.883095 -17.765549 lineto
114.05933 -19.837578 lineto
113.07385 -19.837578 lineto
116.0404 -12.358056 lineto
117.091576 -12.358056 lineto
120.01263 -19.837578 lineto
closepath
fill
newpath
0.2509804 0.2509804 0.2509804 setrgbcolor
newpath
198.43376 -168.3321 moveto
198.43376 -169.76115 197.2753 -170.91962 195.84625 -170.91962 curveto
194.41724 -170.91962 193.25874 -169.76115 193.25874 -168.3321 curveto
193.25874 -166.90309 194.41724 -165.7446 195.84625 -165.7446 curveto
197.2753 -165.7446 198.43376 -166.90309 198.43376 -168.3321 curveto
closepath
fill
newpath
0.0 0.0 0.0 setrgbcolor
1.0 setlinewidth
10.0 setmiterlimit
1 setlinejoin
1 setlinecap
[ ] 0 setdash
newpath
198.43376 -168.3321 moveto
198.43376 -169.76115 197.2753 -170.91962 195.84625 -170.91962 curveto
194.41724 -170.91962 193.25874 -169.76115 193.25874 -168.3321 curveto
193.25874 -166.90309 194.41724 -165.7446 195.84625 -165.7446 curveto
197.2753 -165.7446 198.43376 -166.90309 198.43376 -168.3321 curveto
closepath
stroke
newpath
0.0 0.0 0.0 setrgbcolor
newpath
77.43363 -98.826096 moveto
77.43363 -99.77878 76.661316 -100.55111 75.708626 -100.55111 curveto
74.75593 -100.55111 73.98362 -99.77878 73.98362 -98.826096 curveto
73.98362 -97.87339 74.75593 -97.10109 75.708626 -97.10109 curveto
76.661316 -97.10109 77.43363 -97.87339 77.43363 -98.826096 curveto
closepath
fill
newpath
0.0 0.0 0.0 setrgbcolor
1.0 setlinewidth
10.0 setmiterlimit
1 setlinejoin
1 setlinecap
[ ] 0 setdash
newpath
77.43363 -98.826096 moveto
77.43363 -99.77878 76.661316 -100.55111 75.708626 -100.55111 curveto
74.75593 -100.55111 73.98362 -99.77878 73.98362 -98.826096 curveto
73.98362 -97.87339 74.75593 -97.10109 75.708626 -97.10109 curveto
76.661316 -97.10109 77.43363 -97.87339 77.43363 -98.826096 curveto
closepath
stroke
newpath
0.0 0.0 0.0 setrgbcolor
newpath
63.49002 -93.33736 moveto
62.45232 -93.33736 61.617615 -92.9777 60.985897 -92.258385 curveto
60.35418 -91.53907 60.038322 -90.58813 60.038322 -89.40555 curveto
60.038322 -88.21624 60.355865 -87.2653 60.990948 -86.55272 curveto
61.626034 -85.84014 62.47422 -85.48386 63.535503 -85.48386 curveto
64.593414 -85.48386 65.44076 -85.8393 66.07753 -86.55019 curveto
66.7143 -87.261086 67.032684 -88.2095 67.032684 -89.39544 curveto
67.032684 -90.604965 66.7143 -91.56434 66.07753 -92.273544 curveto
65.44076 -92.98275 64.578255 -93.33736 63.49002 -93.33736 curveto
closepath
63.50518 -92.543915 moveto
64.26997 -92.543915 64.86126 -92.268486 65.27904 -91.71763 curveto
65.696815 -91.16678 65.9057 -90.38934 65.9057 -89.38534 curveto
65.9057 -88.41165 65.69597 -87.65022 65.27651 -87.10105 curveto
64.857056 -86.55188 64.27672 -86.27729 63.535503 -86.27729 curveto
62.79092 -86.27729 62.20974 -86.55272 61.791965 -87.10358 curveto
61.37419 -87.654434 61.165302 -88.420074 61.165302 -89.4005 curveto
61.165302 -90.377556 61.372505 -91.14572 61.78691 -91.704994 curveto
62.201317 -92.264275 62.774075 -92.543915 63.50518 -92.543915 curveto
closepath
68.36182 -87.9147 moveto
68.11418 -85.170525 lineto
69.36246 -85.170525 lineto
69.109764 -87.9147 lineto
closepath
fill
newpath
0.0 0.0 0.0 setrgbcolor
newpath
157.54594 -98.89835 moveto
157.54594 -99.851036 156.77365 -100.62336 155.82094 -100.62336 curveto
154.86826 -100.62336 154.09593 -99.851036 154.09593 -98.89835 curveto
154.09593 -97.94565 154.86826 -97.17335 155.82094 -97.17335 curveto
156.77365 -97.17335 157.54594 -97.94565 157.54594 -98.89835 curveto
closepath
fill
newpath
0.0 0.0 0.0 setrgbcolor
1.0 setlinewidth
10.0 setmiterlimit
1 setlinejoin
1 setlinecap
[ ] 0 setdash
newpath
157.54594 -98.89835 moveto
157.54594 -99.851036 156.77365 -100.62336 155.82094 -100.62336 curveto
154.86826 -100.62336 154.09593 -99.851036 154.09593 -98.89835 curveto
154.09593 -97.94565 154.86826 -97.17335 155.82094 -97.17335 curveto
156.77365 -97.17335 157.54594 -97.94565 157.54594 -98.89835 curveto
closepath
stroke
newpath
0.0 0.0 0.0 setrgbcolor
newpath
163.5404 -95.924866 moveto
162.5027 -95.924866 161.668 -95.56521 161.03629 -94.845894 curveto
160.40457 -94.12658 160.08871 -93.17564 160.08871 -91.99306 curveto
160.08871 -90.80375 160.40625 -89.852806 161.04134 -89.14023 curveto
161.67642 -88.42765 162.52461 -88.071365 163.58589 -88.071365 curveto
164.6438 -88.071365 165.49115 -88.42681 166.12791 -89.1377 curveto
166.76468 -89.848595 167.08307 -90.79701 167.08307 -91.982956 curveto
167.08307 -93.19248 166.76468 -94.15185 166.12791 -94.86105 curveto
165.49115 -95.57026 164.62865 -95.924866 163.5404 -95.924866 curveto
closepath
163.55557 -95.131424 moveto
164.32037 -95.131424 164.91167 -94.855995 165.32944 -94.305145 curveto
165.74721 -93.75429 165.9561 -92.97685 165.9561 -91.97285 curveto
165.9561 -90.99916 165.74637 -90.23773 165.3269 -89.68856 curveto
164.90744 -89.13939 164.3271 -88.8648 163.58589 -88.8648 curveto
162.84131 -88.8648 162.26013 -89.14023 161.84236 -89.691086 curveto
161.42459 -90.24194 161.2157 -91.00758 161.2157 -91.98801 curveto
161.2157 -92.965065 161.4229 -93.73323 161.83731 -94.29251 curveto
162.25171 -94.85178 162.82446 -95.131424 163.55557 -95.131424 curveto
closepath
fill
newpath
grestore
grestore
showpage

%%EOF