%!PS-Adobe-3.0 EPSF-3.0
%%Creator: EpsGraphics2D 0.9.0 by Paul Mutton, http://www.jibble.org/
%%Title: GeoGebra, http://www.geogebra.org
%%CreationDate: Wed Apr 16 17:20:22 CEST 2008
%%BoundingBox: 0 0 296 249
%%DocumentData: Clean7Bit
%%DocumentProcessColors: Black
%%ColorUsage: Color
%%Origin: 0 0
%%Pages: 1
%%Page: 1 1
%%EndComments

gsave
-0.0 249.0 translate
1.0 setlinewidth
10.0 setmiterlimit
0 setlinejoin
2 setlinecap
[ ] 0 setdash
gsave
newpath
0.0 -0.0 moveto
296.92816 -0.0 lineto
296.92816 -249.00291 lineto
0.0 -249.00291 lineto
0.0 -0.0 lineto
closepath
clip
newpath
1.0 setlinewidth
10.0 setmiterlimit
0 setlinejoin
2 setlinecap
[ ] 0 setdash
1.0 1.0 1.0 setrgbcolor
newpath
-84.39011 146.9013 moveto
652.20013 146.9013 lineto
652.20013 -499.04767 lineto
-84.39011 -499.04767 lineto
-84.39011 146.9013 lineto
closepath
fill
newpath
0.0 0.0 0.0 setrgbcolor
1.0 setlinewidth
10.0 setmiterlimit
1 setlinejoin
1 setlinecap
[ ] 0 setdash
newpath
169.23146 -224.75496 moveto
265.63968 -165.30008 lineto
stroke
newpath
0.0 0.0 0.0 setrgbcolor
1.0 setlinewidth
10.0 setmiterlimit
1 setlinejoin
1 setlinecap
[ ] 0 setdash
newpath
185.79819 -25.96883 moveto
112.53855 -168.06204 lineto
stroke
newpath
0.0 0.0 0.0 setrgbcolor
1.0 setlinewidth
10.0 setmiterlimit
1 setlinejoin
1 setlinecap
[ ] 0 setdash
newpath
112.53855 -168.06204 moveto
169.23146 -224.75496 lineto
stroke
newpath
0.0 0.0 0.0 setrgbcolor
1.0 setlinewidth
10.0 setmiterlimit
1 setlinejoin
1 setlinecap
[ ] 0 setdash
newpath
169.23146 -224.75496 moveto
185.79819 -25.96883 lineto
stroke
newpath
0.0 0.0 0.0 setrgbcolor
1.0 setlinewidth
10.0 setmiterlimit
1 setlinejoin
1 setlinecap
[ ] 0 setdash
newpath
185.79819 -25.96883 moveto
265.63968 -165.30008 lineto
stroke
newpath
0.0 0.0 0.0 setrgbcolor
1.0 setlinewidth
10.0 setmiterlimit
1 setlinejoin
0 setlinecap
[ 9.0 8.0 ] 0 setdash
newpath
265.63968 -165.30008 moveto
112.53855 -168.06204 lineto
stroke
newpath
0.0 0.0 0.0 setrgbcolor
newpath
170.27332 -224.75496 moveto
170.27332 -225.33035 169.80685 -225.79681 169.23146 -225.79681 curveto
168.65607 -225.79681 168.18962 -225.33035 168.18962 -224.75496 curveto
168.18962 -224.17958 168.65607 -223.7131 169.23146 -223.7131 curveto
169.80685 -223.7131 170.27332 -224.17958 170.27332 -224.75496 curveto
closepath
fill
newpath
0.0 0.0 0.0 setrgbcolor
1.0 setlinewidth
10.0 setmiterlimit
1 setlinejoin
1 setlinecap
[ ] 0 setdash
newpath
170.27332 -224.75496 moveto
170.27332 -225.33035 169.80685 -225.79681 169.23146 -225.79681 curveto
168.65607 -225.79681 168.18962 -225.33035 168.18962 -224.75496 curveto
168.18962 -224.17958 168.65607 -223.7131 169.23146 -223.7131 curveto
169.80685 -223.7131 170.27332 -224.17958 170.27332 -224.75496 curveto
closepath
stroke
newpath
0.0 0.0 0.0 setrgbcolor
newpath
168.90434 -242.7518 moveto
168.90434 -233.71698 lineto
171.24852 -233.71698 lineto
172.15201 -233.71698 172.84488 -233.88791 173.32713 -234.22977 curveto
173.8094 -234.57162 174.05054 -235.06406 174.05054 -235.70708 curveto
174.05054 -236.80183 173.43193 -237.58119 172.19473 -238.04514 curveto
173.67204 -238.49687 174.4107 -239.31287 174.4107 -240.49309 curveto
174.4107 -241.22565 174.16652 -241.78523 173.67815 -242.17186 curveto
173.18979 -242.55849 172.48572 -242.7518 171.56595 -242.7518 curveto
closepath
170.1741 -241.79337 moveto
170.4366 -241.79337 lineto
171.37671 -241.79337 171.98514 -241.73436 172.26189 -241.61633 curveto
172.79095 -241.3925 173.05548 -240.97739 173.05548 -240.371 curveto
173.05548 -239.83379 172.81537 -239.38713 172.33513 -239.03104 curveto
171.8549 -238.67494 171.25462 -238.49689 170.53427 -238.49689 curveto
170.1741 -238.49689 lineto
closepath
170.1741 -237.68497 moveto
170.58311 -237.68497 lineto
171.26683 -237.68497 171.79692 -237.53845 172.17337 -237.24544 curveto
172.54982 -236.95242 172.73804 -236.53934 172.73804 -236.00621 curveto
172.73804 -235.119 172.05025 -234.6754 170.67468 -234.6754 curveto
170.1741 -234.6754 lineto
closepath
fill
newpath
0.0 0.0 0.0 setrgbcolor
newpath
266.68155 -165.30008 moveto
266.68155 -165.87547 266.2151 -166.34193 265.63968 -166.34193 curveto
265.0643 -166.34193 264.59784 -165.87547 264.59784 -165.30008 curveto
264.59784 -164.72466 265.0643 -164.25822 265.63968 -164.25822 curveto
266.2151 -164.25822 266.68155 -164.72466 266.68155 -165.30008 curveto
closepath
fill
newpath
0.0 0.0 0.0 setrgbcolor
1.0 setlinewidth
10.0 setmiterlimit
1 setlinejoin
1 setlinecap
[ ] 0 setdash
newpath
266.68155 -165.30008 moveto
266.68155 -165.87547 266.2151 -166.34193 265.63968 -166.34193 curveto
265.0643 -166.34193 264.59784 -165.87547 264.59784 -165.30008 curveto
264.59784 -164.72466 265.0643 -164.25822 265.63968 -164.25822 curveto
266.2151 -164.25822 266.68155 -164.72466 266.68155 -165.30008 curveto
closepath
stroke
newpath
0.0 0.0 0.0 setrgbcolor
newpath
275.91812 -161.71312 moveto
274.51407 -161.71312 273.42947 -161.30106 272.66437 -160.47693 curveto
271.89926 -159.65282 271.51672 -158.48581 271.51672 -156.97594 curveto
271.51672 -155.47014 271.9064 -154.30212 272.68573 -153.4719 curveto
273.4651 -152.64168 274.5629 -152.22656 275.9792 -152.22656 curveto
276.78906 -152.22656 277.7373 -152.35883 278.8239 -152.62335 curveto
278.8239 -153.82596 lineto
277.58673 -153.39864 276.6324 -153.18498 275.96088 -153.18498 curveto
274.98007 -153.18498 274.22104 -153.51666 273.68384 -154.18002 curveto
273.14664 -154.8434 272.87805 -155.77943 272.87805 -156.98814 curveto
272.87805 -158.1399 273.16498 -159.04846 273.7388 -159.71385 curveto
274.31262 -160.37926 275.09604 -160.71196 276.08905 -160.71196 curveto
276.9437 -160.71196 277.8594 -160.44946 278.83615 -159.92447 curveto
278.83615 -161.0233 lineto
277.9449 -161.48318 276.9722 -161.71312 275.91812 -161.71312 curveto
closepath
fill
newpath
0.0 0.0 0.0 setrgbcolor
newpath
186.84004 -25.96883 moveto
186.84004 -26.544237 186.37361 -27.010683 185.79819 -27.010683 curveto
185.2228 -27.010683 184.75633 -26.544237 184.75633 -25.96883 curveto
184.75633 -25.393438 185.2228 -24.926977 185.79819 -24.926977 curveto
186.37361 -24.926977 186.84004 -25.393438 186.84004 -25.96883 curveto
closepath
fill
newpath
0.0 0.0 0.0 setrgbcolor
1.0 setlinewidth
10.0 setmiterlimit
1 setlinejoin
1 setlinecap
[ ] 0 setdash
newpath
186.84004 -25.96883 moveto
186.84004 -26.544237 186.37361 -27.010683 185.79819 -27.010683 curveto
185.2228 -27.010683 184.75633 -26.544237 184.75633 -25.96883 curveto
184.75633 -25.393438 185.2228 -24.926977 185.79819 -24.926977 curveto
186.37361 -24.926977 186.84004 -25.393438 186.84004 -25.96883 curveto
closepath
stroke
newpath
0.0 0.0 0.0 setrgbcolor
newpath
182.13507 -17.937374 moveto
181.52867 -17.937374 180.75339 -17.805107 179.8092 -17.540575 curveto
179.8092 -16.270817 lineto
180.82664 -16.742907 181.66298 -16.97895 182.3182 -16.97895 curveto
182.82286 -16.97895 183.2288 -16.846684 183.53607 -16.582151 curveto
183.84334 -16.31762 183.99698 -15.969656 183.99698 -15.538263 curveto
183.99698 -15.184196 183.89626 -14.883036 183.6948 -14.634782 curveto
183.49335 -14.386528 183.12198 -14.109785 182.5807 -13.804555 curveto
181.95804 -13.444383 lineto
181.18886 -13.004851 180.64656 -12.590755 180.33116 -12.202095 curveto
180.01575 -11.813436 179.85805 -11.360677 179.85805 -10.84382 curveto
179.85805 -10.147894 180.11037 -9.575079 180.61502 -9.125373 curveto
181.11967 -8.675667 181.7627 -8.450813 182.54408 -8.450813 curveto
183.24 -8.450813 183.9746 -8.566801 184.74783 -8.798776 curveto
184.74783 -9.9708605 lineto
183.79552 -9.596445 183.08536 -9.409237 182.61732 -9.409237 curveto
182.17374 -9.409237 181.80746 -9.527259 181.51851 -9.763304 curveto
181.22955 -9.999349 181.08507 -10.29644 181.08507 -10.654577 curveto
181.08507 -10.955737 181.19089 -11.222305 181.40251 -11.454281 curveto
181.61414 -11.686255 182.00076 -11.962998 182.5624 -12.284508 curveto
183.20947 -12.650784 lineto
183.99086 -13.094385 184.53621 -13.513568 184.84552 -13.908333 curveto
185.15482 -14.303098 185.30946 -14.777223 185.30946 -15.330707 curveto
185.30946 -16.116165 185.0195 -16.746975 184.43956 -17.223135 curveto
183.85962 -17.699295 183.09146 -17.937374 182.13507 -17.937374 curveto
closepath
fill
newpath
0.0 0.0 0.0 setrgbcolor
newpath
113.58041 -168.06204 moveto
113.58041 -168.63742 113.113945 -169.1039 112.53855 -169.1039 curveto
111.96315 -169.1039 111.496704 -168.63742 111.496704 -168.06204 curveto
111.496704 -167.48665 111.96315 -167.02019 112.53855 -167.02019 curveto
113.113945 -167.02019 113.58041 -167.48665 113.58041 -168.06204 curveto
closepath
fill
newpath
0.0 0.0 0.0 setrgbcolor
1.0 setlinewidth
10.0 setmiterlimit
1 setlinejoin
1 setlinecap
[ ] 0 setdash
newpath
113.58041 -168.06204 moveto
113.58041 -168.63742 113.113945 -169.1039 112.53855 -169.1039 curveto
111.96315 -169.1039 111.496704 -168.63742 111.496704 -168.06204 curveto
111.496704 -167.48665 111.96315 -167.02019 112.53855 -167.02019 curveto
113.113945 -167.02019 113.58041 -167.48665 113.58041 -168.06204 curveto
closepath
stroke
newpath
0.0 0.0 0.0 setrgbcolor
newpath
108.8879 -152.82277 moveto
107.34954 -148.92802 lineto
105.80508 -152.82277 lineto
closepath
110.243126 -156.27798 moveto
109.260284 -153.77509 lineto
105.43269 -153.77509 lineto
104.437645 -156.27798 lineto
103.247246 -156.27798 lineto
106.83065 -147.24316 lineto
108.10041 -147.24316 lineto
111.628876 -156.27798 lineto
closepath
fill
newpath
0.0 0.0 0.0 setrgbcolor
newpath
142.9687 -196.40851 moveto
142.9687 -197.55931 142.0358 -198.4922 140.88501 -198.4922 curveto
139.7342 -198.4922 138.8013 -197.55931 138.8013 -196.40851 curveto
138.8013 -195.25769 139.7342 -194.3248 140.88501 -194.3248 curveto
142.0358 -194.3248 142.9687 -195.25769 142.9687 -196.40851 curveto
closepath
fill
newpath
0.0 0.0 0.0 setrgbcolor
1.0 setlinewidth
10.0 setmiterlimit
1 setlinejoin
1 setlinecap
[ ] 0 setdash
newpath
142.9687 -196.40851 moveto
142.9687 -197.55931 142.0358 -198.4922 140.88501 -198.4922 curveto
139.7342 -198.4922 138.8013 -197.55931 138.8013 -196.40851 curveto
138.8013 -195.25769 139.7342 -194.3248 140.88501 -194.3248 curveto
142.0358 -194.3248 142.9687 -195.25769 142.9687 -196.40851 curveto
closepath
stroke
newpath
0.0 0.0 0.0 setrgbcolor
newpath
137.64264 -214.62177 moveto
137.64264 -205.58694 lineto
138.9246 -205.58694 lineto
138.9246 -214.62177 lineto
closepath
fill
newpath
0.0 0.0 0.0 setrgbcolor
newpath
195.41724 -209.89124 moveto
195.41724 -211.04204 194.48431 -211.97493 193.33353 -211.97493 curveto
192.18271 -211.97493 191.24982 -211.04204 191.24982 -209.89124 curveto
191.24982 -208.74045 192.18271 -207.80753 193.33353 -207.80753 curveto
194.48431 -207.80753 195.41724 -208.74045 195.41724 -209.89124 curveto
closepath
fill
newpath
0.0 0.0 0.0 setrgbcolor
1.0 setlinewidth
10.0 setmiterlimit
1 setlinejoin
1 setlinecap
[ ] 0 setdash
newpath
195.41724 -209.89124 moveto
195.41724 -211.04204 194.48431 -211.97493 193.33353 -211.97493 curveto
192.18271 -211.97493 191.24982 -211.04204 191.24982 -209.89124 curveto
191.24982 -208.74045 192.18271 -207.80753 193.33353 -207.80753 curveto
194.48431 -207.80753 195.41724 -208.74045 195.41724 -209.89124 curveto
closepath
stroke
newpath
0.0 0.0 0.0 setrgbcolor
newpath
209.53662 -223.99844 moveto
209.53662 -214.96362 lineto
210.73923 -214.96362 lineto
210.73923 -219.40778 lineto
214.39589 -214.96362 lineto
215.68396 -214.96362 lineto
212.1433 -219.27347 lineto
216.31273 -223.99844 lineto
214.6889 -223.99844 lineto
210.73923 -219.41998 lineto
210.73923 -223.99844 lineto
closepath
fill
newpath
grestore
grestore
showpage

%%EOF