%!PS-Adobe-3.0 EPSF-3.0
%%Creator: EpsGraphics2D 0.9.0 by Paul Mutton, http://www.jibble.org/
%%Title: GeoGebra, http://www.geogebra.org
%%CreationDate: Sun Mar 16 16:07:16 CET 2008
%%BoundingBox: 0 0 191 222
%%DocumentData: Clean7Bit
%%DocumentProcessColors: Black
%%ColorUsage: Color
%%Origin: 0 0
%%Pages: 1
%%Page: 1 1
%%EndComments

gsave
-0.0 222.0 translate
1.0 setlinewidth
10.0 setmiterlimit
0 setlinejoin
2 setlinecap
[ ] 0 setdash
gsave
newpath
0.0 -0.0 moveto
191.93777 -0.0 lineto
191.93777 -222.76715 lineto
0.0 -222.76715 lineto
0.0 -0.0 lineto
closepath
clip
newpath
1.0 setlinewidth
10.0 setmiterlimit
0 setlinejoin
2 setlinecap
[ ] 0 setdash
1.0 1.0 1.0 setrgbcolor
newpath
-175.03134 97.46063 moveto
528.0775 97.46063 lineto
528.0775 -519.127 lineto
-175.03134 -519.127 lineto
-175.03134 97.46063 lineto
closepath
fill
newpath
0.0 0.0 0.0 setrgbcolor
1.0 setlinewidth
10.0 setmiterlimit
1 setlinejoin
1 setlinecap
[ ] 0 setdash
newpath
52.63757 -8.577545 moveto
24.291105 -178.6563 lineto
stroke
newpath
0.0 0.0 0.0 setrgbcolor
1.0 setlinewidth
10.0 setmiterlimit
1 setlinejoin
1 setlinecap
[ ] 0 setdash
newpath
24.291105 -178.6563 moveto
109.33049 -207.00275 lineto
stroke
newpath
0.0 0.0 0.0 setrgbcolor
1.0 setlinewidth
10.0 setmiterlimit
1 setlinejoin
1 setlinecap
[ ] 0 setdash
newpath
109.33049 -207.00275 moveto
166.02339 -150.30983 lineto
stroke
newpath
0.0 0.0 0.0 setrgbcolor
1.0 setlinewidth
10.0 setmiterlimit
1 setlinejoin
1 setlinecap
[ ] 0 setdash
newpath
166.02339 -150.30983 moveto
52.63757 -8.577545 lineto
stroke
newpath
0.0 0.0 0.0 setrgbcolor
1.0 setlinewidth
10.0 setmiterlimit
1 setlinejoin
1 setlinecap
[ ] 0 setdash
newpath
52.63757 -8.577545 moveto
109.33049 -207.00275 lineto
stroke
newpath
0.0 0.0 0.0 setrgbcolor
1.0 setlinewidth
10.0 setmiterlimit
1 setlinejoin
0 setlinecap
[ 9.0 8.0 ] 0 setdash
newpath
24.291105 -178.6563 moveto
166.02339 -150.30983 lineto
stroke
newpath
0.0 0.0 0.0 setrgbcolor
newpath
53.63207 -8.577545 moveto
53.63207 -9.12679 53.18681 -9.5720415 52.63757 -9.5720415 curveto
52.088318 -9.5720415 51.643074 -9.12679 51.643074 -8.577545 curveto
51.643074 -8.0283 52.088318 -7.583049 52.63757 -7.583049 curveto
53.18681 -7.583049 53.63207 -8.0283 53.63207 -8.577545 curveto
closepath
fill
newpath
0.0 0.0 0.0 setrgbcolor
1.0 setlinewidth
10.0 setmiterlimit
1 setlinejoin
1 setlinecap
[ ] 0 setdash
newpath
53.63207 -8.577545 moveto
53.63207 -9.12679 53.18681 -9.5720415 52.63757 -9.5720415 curveto
52.088318 -9.5720415 51.643074 -9.12679 51.643074 -8.577545 curveto
51.643074 -8.0283 52.088318 -7.583049 52.63757 -7.583049 curveto
53.18681 -7.583049 53.63207 -8.0283 53.63207 -8.577545 curveto
closepath
stroke
newpath
0.0 0.0 0.0 setrgbcolor
newpath
41.28519 -7.641305 moveto
39.816753 -3.9235985 lineto
38.34249 -7.641305 lineto
closepath
42.57881 -10.939459 moveto
41.640644 -8.550337 lineto
37.987038 -8.550337 lineto
37.037216 -10.939459 lineto
35.900925 -10.939459 lineto
39.32145 -2.3153117 lineto
40.533493 -2.3153117 lineto
43.90157 -10.939459 lineto
closepath
fill
newpath
0.0 0.0 0.0 setrgbcolor
newpath
25.2856 -178.6563 moveto
25.2856 -179.20554 24.840357 -179.65079 24.291105 -179.65079 curveto
23.741867 -179.65079 23.296608 -179.20554 23.296608 -178.6563 curveto
23.296608 -178.10703 23.741867 -177.6618 24.291105 -177.6618 curveto
24.840357 -177.6618 25.2856 -178.10703 25.2856 -178.6563 curveto
closepath
fill
newpath
0.0 0.0 0.0 setrgbcolor
1.0 setlinewidth
10.0 setmiterlimit
1 setlinejoin
1 setlinecap
[ ] 0 setdash
newpath
25.2856 -178.6563 moveto
25.2856 -179.20554 24.840357 -179.65079 24.291105 -179.65079 curveto
23.741867 -179.65079 23.296608 -179.20554 23.296608 -178.6563 curveto
23.296608 -178.10703 23.741867 -177.6618 24.291105 -177.6618 curveto
24.840357 -177.6618 25.2856 -178.10703 25.2856 -178.6563 curveto
closepath
stroke
newpath
0.0 0.0 0.0 setrgbcolor
newpath
13.046936 -180.99832 moveto
13.046936 -172.37416 lineto
15.284553 -172.37416 lineto
16.146967 -172.37416 16.808346 -172.53732 17.268688 -172.86365 curveto
17.729033 -173.18996 17.959204 -173.66002 17.959204 -174.27382 curveto
17.959204 -175.31882 17.368721 -176.06274 16.187757 -176.5056 curveto
17.597921 -176.9368 18.303003 -177.7157 18.303003 -178.84229 curveto
18.303003 -179.54153 18.069918 -180.07568 17.603748 -180.44473 curveto
17.137579 -180.8138 16.465517 -180.99832 15.5875635 -180.99832 curveto
closepath
14.258978 -180.08345 moveto
14.509544 -180.08345 lineto
15.406922 -180.08345 15.987693 -180.02713 16.251856 -179.91447 curveto
16.756874 -179.7008 17.009382 -179.30457 17.009382 -178.72574 curveto
17.009382 -178.21295 16.780182 -177.7866 16.321781 -177.44669 curveto
15.86338 -177.10677 15.29038 -176.93681 14.602778 -176.93681 curveto
14.258978 -176.93681 lineto
closepath
14.258978 -176.1618 moveto
14.649396 -176.1618 lineto
15.302034 -176.1618 15.8080225 -176.02196 16.167362 -175.74225 curveto
16.526701 -175.46254 16.706371 -175.06824 16.706371 -174.55934 curveto
16.706371 -173.71246 16.049849 -173.28903 14.736803 -173.28903 curveto
14.258978 -173.28903 lineto
closepath
fill
newpath
0.0 0.0 0.0 setrgbcolor
newpath
110.32498 -207.00275 moveto
110.32498 -207.55199 109.87972 -207.99724 109.33049 -207.99724 curveto
108.78122 -207.99724 108.33599 -207.55199 108.33599 -207.00275 curveto
108.33599 -206.45348 108.78122 -206.00826 109.33049 -206.00826 curveto
109.87972 -206.00826 110.32498 -206.45348 110.32498 -207.00275 curveto
closepath
fill
newpath
0.0 0.0 0.0 setrgbcolor
1.0 setlinewidth
10.0 setmiterlimit
1 setlinejoin
1 setlinecap
[ ] 0 setdash
newpath
110.32498 -207.00275 moveto
110.32498 -207.55199 109.87972 -207.99724 109.33049 -207.99724 curveto
108.78122 -207.99724 108.33599 -207.55199 108.33599 -207.00275 curveto
108.33599 -206.45348 108.78122 -206.00826 109.33049 -206.00826 curveto
109.87972 -206.00826 110.32498 -206.45348 110.32498 -207.00275 curveto
closepath
stroke
newpath
0.0 0.0 0.0 setrgbcolor
newpath
120.168945 -219.99927 moveto
118.828705 -219.99927 117.79342 -219.60594 117.06309 -218.81927 curveto
116.33275 -218.03261 115.96758 -216.91866 115.96758 -215.47742 curveto
115.96758 -214.04005 116.33955 -212.92514 117.08348 -212.13264 curveto
117.82741 -211.34016 118.87532 -210.94392 120.22721 -210.94392 curveto
121.000275 -210.94392 121.905426 -211.07018 122.94266 -211.32268 curveto
122.94266 -212.47063 lineto
121.761696 -212.06273 120.850716 -211.85878 120.20973 -211.85878 curveto
119.273506 -211.85878 118.549 -212.17538 118.03622 -212.8086 curveto
117.52343 -213.44182 117.26704 -214.33531 117.26704 -215.48907 curveto
117.26704 -216.58846 117.54091 -217.45573 118.08866 -218.09088 curveto
118.63641 -218.72604 119.384224 -219.04362 120.3321 -219.04362 curveto
121.1479 -219.04362 122.02197 -218.79306 122.95431 -218.29193 curveto
122.95431 -219.3408 lineto
122.103546 -219.77979 121.175095 -219.99927 120.168945 -219.99927 curveto
closepath
fill
newpath
0.0 0.0 0.0 setrgbcolor
newpath
167.01788 -150.30983 moveto
167.01788 -150.85907 166.57263 -151.30432 166.02339 -151.30432 curveto
165.47415 -151.30432 165.0289 -150.85907 165.0289 -150.30983 curveto
165.0289 -149.76057 165.47415 -149.31534 166.02339 -149.31534 curveto
166.57263 -149.31534 167.01788 -149.76057 167.01788 -150.30983 curveto
closepath
fill
newpath
0.0 0.0 0.0 setrgbcolor
1.0 setlinewidth
10.0 setmiterlimit
1 setlinejoin
1 setlinecap
[ ] 0 setdash
newpath
167.01788 -150.30983 moveto
167.01788 -150.85907 166.57263 -151.30432 166.02339 -151.30432 curveto
165.47415 -151.30432 165.0289 -150.85907 165.0289 -150.30983 curveto
165.0289 -149.76057 165.47415 -149.31534 166.02339 -149.31534 curveto
166.57263 -149.31534 167.01788 -149.76057 167.01788 -150.30983 curveto
closepath
stroke
newpath
0.0 0.0 0.0 setrgbcolor
newpath
171.17184 -148.17995 moveto
171.17184 -139.55579 lineto
174.03879 -139.55579 lineto
174.89343 -139.55579 175.58394 -139.65097 176.11032 -139.84132 curveto
176.6367 -140.03168 177.0922 -140.35411 177.47679 -140.80862 curveto
178.0867 -141.53119 178.39165 -142.48296 178.39165 -143.66391 curveto
178.39165 -145.0974 178.01288 -146.20844 177.25536 -146.99704 curveto
176.49783 -147.78564 175.43146 -148.17995 174.05626 -148.17995 curveto
closepath
172.39554 -147.26508 moveto
173.96303 -147.26508 lineto
175.08185 -147.26508 175.87433 -146.964 176.3405 -146.36188 curveto
176.84163 -145.7209 177.0922 -144.86043 177.0922 -143.78046 curveto
177.0922 -142.76654 176.84552 -141.97017 176.35216 -141.39134 curveto
176.05302 -141.03783 175.69563 -140.796 175.27997 -140.66586 curveto
174.8643 -140.53572 174.23885 -140.47066 173.40363 -140.47066 curveto
172.39554 -140.47066 lineto
closepath
fill
newpath
0.0 0.0 0.0 setrgbcolor
newpath
153.19412 -164.13358 moveto
153.19412 -164.68285 152.74889 -165.12808 152.19963 -165.12808 curveto
151.65039 -165.12808 151.20512 -164.68285 151.20512 -164.13358 curveto
151.20512 -163.58434 151.65039 -163.13908 152.19963 -163.13908 curveto
152.74889 -163.13908 153.19412 -163.58434 153.19412 -164.13358 curveto
closepath
fill
newpath
0.0 0.0 0.0 setrgbcolor
1.0 setlinewidth
10.0 setmiterlimit
1 setlinejoin
1 setlinecap
[ ] 0 setdash
newpath
153.19412 -164.13358 moveto
153.19412 -164.68285 152.74889 -165.12808 152.19963 -165.12808 curveto
151.65039 -165.12808 151.20512 -164.68285 151.20512 -164.13358 curveto
151.20512 -163.58434 151.65039 -163.13908 152.19963 -163.13908 curveto
152.74889 -163.13908 153.19412 -163.58434 153.19412 -164.13358 curveto
closepath
stroke
newpath
0.0 0.0 0.0 setrgbcolor
newpath
163.21587 -173.04234 moveto
163.21587 -164.4182 lineto
164.41626 -164.4182 lineto
168.75746 -171.0786 lineto
168.75746 -164.4182 lineto
169.80635 -164.4182 lineto
169.80635 -173.04234 lineto
168.61179 -173.04234 lineto
164.26476 -166.38194 lineto
164.26476 -173.04234 lineto
closepath
fill
newpath
0.0 0.0 0.0 setrgbcolor
newpath
83.48703 -198.05675 moveto
83.48703 -198.606 83.04177 -199.05124 82.49253 -199.05124 curveto
81.94327 -199.05124 81.49804 -198.606 81.49804 -198.05675 curveto
81.49804 -197.5075 81.94327 -197.06224 82.49253 -197.06224 curveto
83.04177 -197.06224 83.48703 -197.5075 83.48703 -198.05675 curveto
closepath
fill
newpath
0.0 0.0 0.0 setrgbcolor
1.0 setlinewidth
10.0 setmiterlimit
1 setlinejoin
1 setlinecap
[ ] 0 setdash
newpath
83.48703 -198.05675 moveto
83.48703 -198.606 83.04177 -199.05124 82.49253 -199.05124 curveto
81.94327 -199.05124 81.49804 -198.606 81.49804 -198.05675 curveto
81.49804 -197.5075 81.94327 -197.06224 82.49253 -197.06224 curveto
83.04177 -197.06224 83.48703 -197.5075 83.48703 -198.05675 curveto
closepath
stroke
newpath
0.0 0.0 0.0 setrgbcolor
newpath
68.73872 -210.8332 moveto
68.73872 -202.20906 lineto
70.43442 -202.20906 lineto
72.82354 -208.88112 lineto
75.282585 -202.20906 lineto
76.79764 -202.20906 lineto
76.79764 -210.8332 lineto
75.655525 -210.8332 lineto
75.655525 -203.81734 lineto
73.27805 -210.25632 lineto
72.09515 -210.25632 lineto
69.787605 -203.79987 lineto
69.787605 -210.8332 lineto
closepath
fill
newpath
grestore
grestore
showpage

%%EOF