%!PS-Adobe-3.0 EPSF-3.0
%%Creator: EpsGraphics2D 0.9.0 by Paul Mutton, http://www.jibble.org/
%%Title: GeoGebra, http://www.geogebra.org
%%CreationDate: Thu Mar 13 17:24:33 CET 2008
%%BoundingBox: 0 0 364 471
%%DocumentData: Clean7Bit
%%DocumentProcessColors: Black
%%ColorUsage: Color
%%Origin: 0 0
%%Pages: 1
%%Page: 1 1
%%EndComments

gsave
-0.0 471.0 translate
1.0 setlinewidth
10.0 setmiterlimit
0 setlinejoin
2 setlinecap
[ ] 0 setdash
gsave
newpath
0.0 -0.0 moveto
364.78354 -0.0 lineto
364.78354 -471.6798 lineto
0.0 -471.6798 lineto
0.0 -0.0 lineto
closepath
clip
newpath
1.0 setlinewidth
10.0 setmiterlimit
0 setlinejoin
2 setlinecap
[ ] 0 setdash
1.0 1.0 1.0 setrgbcolor
newpath
-212.45634 192.4133 moveto
732.2395 192.4133 lineto
732.2395 -636.03284 lineto
-212.45634 -636.03284 lineto
-212.45634 192.4133 lineto
closepath
fill
newpath
0.0 0.0 0.0 setrgbcolor
1.0 setlinewidth
10.0 setmiterlimit
1 setlinejoin
1 setlinecap
[ ] 0 setdash
newpath
54.36784 -435.017 moveto
252.79303 -435.017 lineto
stroke
newpath
0.0 0.0 0.0 setrgbcolor
1.0 setlinewidth
10.0 setmiterlimit
1 setlinejoin
1 setlinecap
[ ] 0 setdash
newpath
252.79303 -435.017 moveto
337.83243 -349.97766 lineto
stroke
newpath
0.0 0.0 0.0 setrgbcolor
1.0 setlinewidth
10.0 setmiterlimit
1 setlinejoin
0 setlinecap
[ 5.0 4.0 ] 0 setdash
newpath
337.83243 -349.97766 moveto
139.40723 -349.97766 lineto
stroke
newpath
0.0 0.0 0.0 setrgbcolor
1.0 setlinewidth
10.0 setmiterlimit
1 setlinejoin
0 setlinecap
[ 5.0 4.0 ] 0 setdash
newpath
139.40723 -349.97766 moveto
54.36784 -435.017 lineto
stroke
newpath
0.0 0.0 0.0 setrgbcolor
1.0 setlinewidth
10.0 setmiterlimit
1 setlinejoin
1 setlinecap
[ ] 0 setdash
newpath
54.36784 -435.017 moveto
54.36784 -66.513084 lineto
stroke
newpath
0.0 0.0 0.0 setrgbcolor
1.0 setlinewidth
10.0 setmiterlimit
1 setlinejoin
0 setlinecap
[ 5.0 4.0 ] 0 setdash
newpath
54.36784 -66.513084 moveto
139.40723 -349.97766 lineto
stroke
newpath
0.0 0.0 0.0 setrgbcolor
1.0 setlinewidth
10.0 setmiterlimit
1 setlinejoin
1 setlinecap
[ ] 0 setdash
newpath
54.36784 -66.513084 moveto
337.83243 -349.97766 lineto
stroke
newpath
0.0 0.0 0.0 setrgbcolor
1.0 setlinewidth
10.0 setmiterlimit
1 setlinejoin
1 setlinecap
[ ] 0 setdash
newpath
54.36784 -66.513084 moveto
252.79303 -435.017 lineto
stroke
newpath
0.0 0.0 0.0 setrgbcolor
newpath
55.70404 -435.017 moveto
55.70404 -435.755 55.105812 -436.3532 54.36784 -436.3532 curveto
53.629883 -436.3532 53.031635 -435.755 53.031635 -435.017 curveto
53.031635 -434.27905 53.629883 -433.6808 54.36784 -433.6808 curveto
55.105812 -433.6808 55.70404 -434.27905 55.70404 -435.017 curveto
closepath
fill
newpath
0.0 0.0 0.0 setrgbcolor
1.0 setlinewidth
10.0 setmiterlimit
1 setlinejoin
1 setlinecap
[ ] 0 setdash
newpath
55.70404 -435.017 moveto
55.70404 -435.755 55.105812 -436.3532 54.36784 -436.3532 curveto
53.629883 -436.3532 53.031635 -435.755 53.031635 -435.017 curveto
53.031635 -434.27905 53.629883 -433.6808 54.36784 -433.6808 curveto
55.105812 -433.6808 55.70404 -434.27905 55.70404 -435.017 curveto
closepath
stroke
newpath
0.0 0.0 0.0 setrgbcolor
newpath
46.117287 -439.18814 moveto
44.1443 -434.19305 lineto
42.163483 -439.18814 lineto
closepath
47.855396 -443.61954 moveto
46.594875 -440.40952 lineto
41.685894 -440.40952 lineto
40.409714 -443.61954 lineto
38.883 -443.61954 lineto
43.47881 -432.03217 lineto
45.107307 -432.03217 lineto
49.632652 -443.61954 lineto
closepath
fill
newpath
0.0 0.0 0.0 setrgbcolor
newpath
254.12924 -435.017 moveto
254.12924 -435.755 253.53099 -436.3532 252.79303 -436.3532 curveto
252.05508 -436.3532 251.45683 -435.755 251.45683 -435.017 curveto
251.45683 -434.27905 252.05508 -433.6808 252.79303 -433.6808 curveto
253.53099 -433.6808 254.12924 -434.27905 254.12924 -435.017 curveto
closepath
fill
newpath
0.0 0.0 0.0 setrgbcolor
1.0 setlinewidth
10.0 setmiterlimit
1 setlinejoin
1 setlinecap
[ ] 0 setdash
newpath
254.12924 -435.017 moveto
254.12924 -435.755 253.53099 -436.3532 252.79303 -436.3532 curveto
252.05508 -436.3532 251.45683 -435.755 251.45683 -435.017 curveto
251.45683 -434.27905 252.05508 -433.6808 252.79303 -433.6808 curveto
253.53099 -433.6808 254.12924 -434.27905 254.12924 -435.017 curveto
closepath
stroke
newpath
0.0 0.0 0.0 setrgbcolor
newpath
268.73608 -444.95575 moveto
268.73608 -433.36835 lineto
271.74255 -433.36835 lineto
272.90128 -433.36835 273.78992 -433.5876 274.40842 -434.02603 curveto
275.02695 -434.46448 275.3362 -435.09604 275.3362 -435.92072 curveto
275.3362 -437.32477 274.54285 -438.3243 272.9561 -438.91934 curveto
274.85077 -439.49872 275.79813 -440.54523 275.79813 -442.0589 curveto
275.79813 -442.9984 275.48495 -443.7161 274.8586 -444.21198 curveto
274.23227 -444.70782 273.32928 -444.95575 272.1497 -444.95575 curveto
closepath
270.3646 -443.72656 moveto
270.70126 -443.72656 lineto
271.90698 -443.72656 272.6873 -443.65088 273.0422 -443.4995 curveto
273.72076 -443.21243 274.06003 -442.68002 274.06003 -441.9023 curveto
274.06003 -441.21332 273.75208 -440.64047 273.13617 -440.18378 curveto
272.52026 -439.72708 271.75037 -439.49872 270.8265 -439.49872 curveto
270.3646 -439.49872 lineto
closepath
270.3646 -438.45743 moveto
270.88916 -438.45743 lineto
271.76602 -438.45743 272.44586 -438.26953 272.92868 -437.8937 curveto
273.4115 -437.51788 273.6529 -436.9881 273.6529 -436.30435 curveto
273.6529 -435.1665 272.77078 -434.59756 271.0066 -434.59756 curveto
270.3646 -434.59756 lineto
closepath
fill
newpath
0.0 0.0 0.0 setrgbcolor
newpath
339.16864 -349.97766 moveto
339.16864 -350.7156 338.57037 -351.31384 337.83243 -351.31384 curveto
337.09442 -351.31384 336.49622 -350.7156 336.49622 -349.97766 curveto
336.49622 -349.2397 337.09442 -348.64145 337.83243 -348.64145 curveto
338.57037 -348.64145 339.16864 -349.2397 339.16864 -349.97766 curveto
closepath
fill
newpath
0.0 0.0 0.0 setrgbcolor
1.0 setlinewidth
10.0 setmiterlimit
1 setlinejoin
1 setlinecap
[ ] 0 setdash
newpath
339.16864 -349.97766 moveto
339.16864 -350.7156 338.57037 -351.31384 337.83243 -351.31384 curveto
337.09442 -351.31384 336.49622 -350.7156 336.49622 -349.97766 curveto
336.49622 -349.2397 337.09442 -348.64145 337.83243 -348.64145 curveto
338.57037 -348.64145 339.16864 -349.2397 339.16864 -349.97766 curveto
closepath
stroke
newpath
0.0 0.0 0.0 setrgbcolor
newpath
349.86346 -347.70258 moveto
348.0627 -347.70258 346.67172 -347.1741 345.69046 -346.11716 curveto
344.70917 -345.06018 344.21854 -343.56348 344.21854 -341.62704 curveto
344.21854 -339.6958 344.71832 -338.19778 345.71786 -337.133 curveto
346.7174 -336.0682 348.12537 -335.53583 349.94177 -335.53583 curveto
350.98047 -335.53583 352.19662 -335.70547 353.59024 -336.04474 curveto
353.59024 -337.5871 lineto
352.00348 -337.03903 350.7795 -336.765 349.91827 -336.765 curveto
348.66037 -336.765 347.68692 -337.1904 346.99796 -338.0412 curveto
346.30896 -338.892 345.96448 -340.0925 345.96448 -341.6427 curveto
345.96448 -343.11984 346.33246 -344.2851 347.06842 -345.1385 curveto
347.80435 -345.99188 348.8091 -346.41858 350.0827 -346.41858 curveto
351.1788 -346.41858 352.3532 -346.0819 353.6059 -345.4086 curveto
353.6059 -346.81787 lineto
352.4628 -347.40768 351.21533 -347.70258 349.86346 -347.70258 curveto
closepath
fill
newpath
0.0 0.0 0.0 setrgbcolor
newpath
140.74344 -349.97766 moveto
140.74344 -350.7156 140.14519 -351.31384 139.40723 -351.31384 curveto
138.66924 -351.31384 138.07103 -350.7156 138.07103 -349.97766 curveto
138.07103 -349.2397 138.66924 -348.64145 139.40723 -348.64145 curveto
140.14519 -348.64145 140.74344 -349.2397 140.74344 -349.97766 curveto
closepath
fill
newpath
0.0 0.0 0.0 setrgbcolor
1.0 setlinewidth
10.0 setmiterlimit
1 setlinejoin
1 setlinecap
[ ] 0 setdash
newpath
140.74344 -349.97766 moveto
140.74344 -350.7156 140.14519 -351.31384 139.40723 -351.31384 curveto
138.66924 -351.31384 138.07103 -350.7156 138.07103 -349.97766 curveto
138.07103 -349.2397 138.66924 -348.64145 139.40723 -348.64145 curveto
140.14519 -348.64145 140.74344 -349.2397 140.74344 -349.97766 curveto
closepath
stroke
newpath
0.0 0.0 0.0 setrgbcolor
newpath
119.08131 -354.0939 moveto
119.08131 -342.50653 lineto
122.93333 -342.50653 lineto
124.08163 -342.50653 125.0094 -342.6344 125.71665 -342.89017 curveto
126.4239 -343.14594 127.03589 -343.57913 127.55263 -344.18982 curveto
128.3721 -345.16068 128.78183 -346.43945 128.78183 -348.02618 curveto
128.78183 -349.9522 128.27292 -351.445 127.25511 -352.50458 curveto
126.2373 -353.56412 124.804535 -354.0939 122.95682 -354.0939 curveto
closepath
120.725464 -352.86472 moveto
122.83155 -352.86472 lineto
124.33478 -352.86472 125.39956 -352.4602 126.02591 -351.65118 curveto
126.69923 -350.78995 127.03589 -349.63382 127.03589 -348.18277 curveto
127.03589 -346.8205 126.704445 -345.7505 126.041565 -344.97275 curveto
125.63966 -344.49777 125.15947 -344.17285 124.600975 -343.99802 curveto
124.04248 -343.82315 123.20213 -343.73572 122.07993 -343.73572 curveto
120.725464 -343.73572 lineto
closepath
fill
newpath
0.0 0.0 0.0 setrgbcolor
newpath
55.70404 -66.513084 moveto
55.70404 -67.25104 55.105812 -67.84929 54.36784 -67.84929 curveto
53.629883 -67.84929 53.031635 -67.25104 53.031635 -66.513084 curveto
53.031635 -65.775116 53.629883 -65.17688 54.36784 -65.17688 curveto
55.105812 -65.17688 55.70404 -65.775116 55.70404 -66.513084 curveto
closepath
fill
newpath
0.0 0.0 0.0 setrgbcolor
1.0 setlinewidth
10.0 setmiterlimit
1 setlinejoin
1 setlinecap
[ ] 0 setdash
newpath
55.70404 -66.513084 moveto
55.70404 -67.25104 55.105812 -67.84929 54.36784 -67.84929 curveto
53.629883 -67.84929 53.031635 -67.25104 53.031635 -66.513084 curveto
53.031635 -65.775116 53.629883 -65.17688 54.36784 -65.17688 curveto
55.105812 -65.17688 55.70404 -65.775116 55.70404 -66.513084 curveto
closepath
stroke
newpath
0.0 0.0 0.0 setrgbcolor
newpath
57.21404 -55.074028 moveto
56.436325 -55.074028 55.442005 -54.904392 54.23107 -54.56512 curveto
54.23107 -52.936623 lineto
55.535957 -53.542088 56.608574 -53.844822 57.44892 -53.844822 curveto
58.09614 -53.844822 58.61679 -53.675186 59.010868 -53.33592 curveto
59.404945 -52.996647 59.601982 -52.550377 59.601982 -51.997105 curveto
59.601982 -51.543007 59.472797 -51.15676 59.21443 -50.838367 curveto
58.956062 -50.519974 58.47978 -50.165047 57.78558 -49.77358 curveto
56.986988 -49.31165 lineto
56.000496 -48.74794 55.304993 -48.21685 54.90048 -47.718384 curveto
54.495964 -47.219917 54.293705 -46.639244 54.293705 -45.97636 curveto
54.293705 -45.083817 54.617317 -44.349167 55.26454 -43.772408 curveto
55.911762 -43.19565 56.73645 -42.90727 57.738605 -42.90727 curveto
58.631145 -42.90727 59.573273 -43.056026 60.564987 -43.35354 curveto
60.564987 -44.85677 lineto
59.343616 -44.37657 58.432804 -44.13647 57.832558 -44.13647 curveto
57.263626 -44.13647 56.793865 -44.287838 56.42328 -44.590572 curveto
56.052692 -44.893303 55.867397 -45.27433 55.867397 -45.73365 curveto
55.867397 -46.119896 56.003105 -46.461777 56.27452 -46.759293 curveto
56.545937 -47.056805 57.041794 -47.411736 57.762093 -47.824078 curveto
58.592 -48.29384 lineto
59.594154 -48.862766 60.29357 -49.40038 60.690258 -49.906677 curveto
61.086945 -50.412975 61.285286 -51.02105 61.285286 -51.730907 curveto
61.285286 -52.73828 60.91339 -53.54731 60.169605 -54.157997 curveto
59.42582 -54.768684 58.44063 -55.074028 57.21404 -55.074028 curveto
closepath
fill
newpath
0.0 0.0 0.0 setrgbcolor
newpath
57.040245 -190.4587 moveto
57.040245 -191.93462 55.843765 -193.1311 54.36784 -193.1311 curveto
52.89191 -193.1311 51.69543 -191.93462 51.69543 -190.4587 curveto
51.69543 -188.98276 52.89191 -187.7863 54.36784 -187.7863 curveto
55.843765 -187.7863 57.040245 -188.98276 57.040245 -190.4587 curveto
closepath
fill
newpath
0.0 0.0 0.0 setrgbcolor
1.0 setlinewidth
10.0 setmiterlimit
1 setlinejoin
1 setlinecap
[ ] 0 setdash
newpath
57.040245 -190.4587 moveto
57.040245 -191.93462 55.843765 -193.1311 54.36784 -193.1311 curveto
52.89191 -193.1311 51.69543 -191.93462 51.69543 -190.4587 curveto
51.69543 -188.98276 52.89191 -187.7863 54.36784 -187.7863 curveto
55.843765 -187.7863 57.040245 -188.98276 57.040245 -190.4587 curveto
closepath
stroke
newpath
0.0 0.0 0.0 setrgbcolor
newpath
61.624554 -185.73228 moveto
61.624554 -174.1449 lineto
63.902885 -174.1449 lineto
67.11291 -183.10947 lineto
70.41688 -174.1449 lineto
72.4525 -174.1449 lineto
72.4525 -185.73228 lineto
70.91795 -185.73228 lineto
70.91795 -176.30579 lineto
67.723595 -184.95718 lineto
66.13424 -184.95718 lineto
63.033833 -176.28229 lineto
63.033833 -185.73228 lineto
closepath
fill
newpath
0.0 0.0 0.0 setrgbcolor
newpath
161.86836 -406.90155 moveto
161.86836 -408.3775 160.67186 -409.57397 159.19595 -409.57397 curveto
157.72 -409.57397 156.52354 -408.3775 156.52354 -406.90155 curveto
156.52354 -405.4256 157.72 -404.22916 159.19595 -404.22916 curveto
160.67186 -404.22916 161.86836 -405.4256 161.86836 -406.90155 curveto
closepath
fill
newpath
0.0 0.0 0.0 setrgbcolor
1.0 setlinewidth
10.0 setmiterlimit
1 setlinejoin
1 setlinecap
[ ] 0 setdash
newpath
161.86836 -406.90155 moveto
161.86836 -408.3775 160.67186 -409.57397 159.19595 -409.57397 curveto
157.72 -409.57397 156.52354 -408.3775 156.52354 -406.90155 curveto
156.52354 -405.4256 157.72 -404.22916 159.19595 -404.22916 curveto
160.67186 -404.22916 161.86836 -405.4256 161.86836 -406.90155 curveto
closepath
stroke
newpath
0.0 0.0 0.0 setrgbcolor
newpath
165.84842 -402.19724 moveto
165.84842 -390.60986 lineto
167.46126 -390.60986 lineto
173.29411 -399.55875 lineto
173.29411 -390.60986 lineto
174.70338 -390.60986 lineto
174.70338 -402.19724 lineto
173.09837 -402.19724 lineto
167.2577 -393.24832 lineto
167.2577 -402.19724 lineto
closepath
fill
newpath
0.0 0.0 0.0 setrgbcolor
newpath
276.33563 -285.8085 moveto
276.33563 -287.2844 275.13916 -288.4809 273.6632 -288.4809 curveto
272.18732 -288.4809 270.9908 -287.2844 270.9908 -285.8085 curveto
270.9908 -284.33255 272.18732 -283.13608 273.6632 -283.13608 curveto
275.13916 -283.13608 276.33563 -284.33255 276.33563 -285.8085 curveto
closepath
fill
newpath
0.0 0.0 0.0 setrgbcolor
1.0 setlinewidth
10.0 setmiterlimit
1 setlinejoin
1 setlinecap
[ ] 0 setdash
newpath
276.33563 -285.8085 moveto
276.33563 -287.2844 275.13916 -288.4809 273.6632 -288.4809 curveto
272.18732 -288.4809 270.9908 -287.2844 270.9908 -285.8085 curveto
270.9908 -284.33255 272.18732 -283.13608 273.6632 -283.13608 curveto
275.13916 -283.13608 276.33563 -284.33255 276.33563 -285.8085 curveto
closepath
stroke
newpath
0.0 0.0 0.0 setrgbcolor
newpath
280.76193 -280.60272 moveto
280.76193 -269.01535 lineto
283.91714 -269.01535 lineto
285.31598 -269.01535 286.32074 -269.25153 286.93143 -269.72388 curveto
287.5421 -270.19626 287.84744 -270.97266 287.84744 -272.0531 curveto
287.84744 -273.2849 287.42987 -274.25052 286.59476 -274.94995 curveto
285.75964 -275.64938 284.6009 -275.99908 283.11856 -275.99908 curveto
282.3904 -275.99908 lineto
282.3904 -280.60272 lineto
closepath
282.3904 -274.7542 moveto
283.0559 -274.7542 lineto
284.03195 -274.7542 284.7862 -274.5298 285.31857 -274.0809 curveto
285.85098 -273.63202 286.1172 -272.99786 286.1172 -272.17838 curveto
286.1172 -271.4842 285.90842 -270.9883 285.49084 -270.6908 curveto
285.07327 -270.39328 284.37643 -270.24454 283.4004 -270.24454 curveto
282.3904 -270.24454 lineto
closepath
fill
newpath
grestore
grestore
showpage

%%EOF