%!PS-Adobe-3.0 EPSF-3.0
%%Creator: EpsGraphics2D 0.9.0 by Paul Mutton, http://www.jibble.org/
%%Title: GeoGebra, http://www.geogebra.org
%%CreationDate: Fri Mar 14 14:26:43 CET 2008
%%BoundingBox: 0 0 189 194
%%DocumentData: Clean7Bit
%%DocumentProcessColors: Black
%%ColorUsage: Color
%%Origin: 0 0
%%Pages: 1
%%Page: 1 1
%%EndComments

gsave
-0.0 194.0 translate
1.0 setlinewidth
10.0 setmiterlimit
0 setlinejoin
2 setlinecap
[ ] 0 setdash
gsave
newpath
0.0 -0.0 moveto
189.56807 -0.0 lineto
189.56807 -194.83385 lineto
0.0 -194.83385 lineto
0.0 -0.0 lineto
closepath
clip
newpath
1.0 setlinewidth
10.0 setmiterlimit
0 setlinejoin
2 setlinecap
[ ] 0 setdash
1.0 1.0 1.0 setrgbcolor
newpath
-90.10334 119.357666 moveto
323.5529 119.357666 lineto
323.5529 -243.39603 lineto
-90.10334 -243.39603 lineto
-90.10334 119.357666 lineto
closepath
fill
newpath
0.0 0.0 0.0 setrgbcolor
1.0 setlinewidth
10.0 setmiterlimit
1 setlinejoin
0 setlinecap
[ 5.0 4.0 ] 0 setdash
newpath
25.177107 -127.443306 moveto
166.90938 -127.443306 lineto
stroke
newpath
0.0 0.0 0.0 setrgbcolor
1.0 setlinewidth
10.0 setmiterlimit
1 setlinejoin
1 setlinecap
[ ] 0 setdash
newpath
138.56293 -184.13618 moveto
166.90938 -127.443306 lineto
stroke
newpath
0.0 0.0 0.0 setrgbcolor
1.0 setlinewidth
10.0 setmiterlimit
1 setlinejoin
1 setlinecap
[ ] 0 setdash
newpath
25.177107 -127.443306 moveto
138.56293 -184.13618 lineto
stroke
newpath
0.0 0.0 0.0 setrgbcolor
1.0 setlinewidth
10.0 setmiterlimit
1 setlinejoin
1 setlinecap
[ ] 0 setdash
newpath
81.870026 -14.05747 moveto
166.90938 -127.443306 lineto
stroke
newpath
0.0 0.0 0.0 setrgbcolor
1.0 setlinewidth
10.0 setmiterlimit
1 setlinejoin
1 setlinecap
[ ] 0 setdash
newpath
81.870026 -14.05747 moveto
138.56293 -184.13618 lineto
stroke
newpath
0.0 0.0 0.0 setrgbcolor
1.0 setlinewidth
10.0 setmiterlimit
1 setlinejoin
1 setlinecap
[ ] 0 setdash
newpath
81.870026 -14.05747 moveto
25.177107 -127.443306 lineto
stroke
newpath
0.0 0.0 0.0 setrgbcolor
newpath
25.762194 -127.443306 moveto
25.762194 -127.76643 25.500237 -128.0284 25.177107 -128.0284 curveto
24.853968 -128.0284 24.59202 -127.76643 24.59202 -127.443306 curveto
24.59202 -127.120155 24.853968 -126.858215 25.177107 -126.858215 curveto
25.500237 -126.858215 25.762194 -127.120155 25.762194 -127.443306 curveto
closepath
fill
newpath
0.0 0.0 0.0 setrgbcolor
1.0 setlinewidth
10.0 setmiterlimit
1 setlinejoin
1 setlinecap
[ ] 0 setdash
newpath
25.762194 -127.443306 moveto
25.762194 -127.76643 25.500237 -128.0284 25.177107 -128.0284 curveto
24.853968 -128.0284 24.59202 -127.76643 24.59202 -127.443306 curveto
24.59202 -127.120155 24.853968 -126.858215 25.177107 -126.858215 curveto
25.500237 -126.858215 25.762194 -127.120155 25.762194 -127.443306 curveto
closepath
stroke
newpath
0.0 0.0 0.0 setrgbcolor
newpath
15.5127945 -125.6085 moveto
14.648877 -123.42128 lineto
13.781532 -125.6085 lineto
closepath
16.273865 -127.54888 moveto
15.721917 -126.1433 lineto
13.57241 -126.1433 lineto
13.013606 -127.54888 lineto
12.345099 -127.54888 lineto
14.357477 -122.47508 lineto
15.070551 -122.47508 lineto
17.052074 -127.54888 lineto
closepath
fill
newpath
0.0 0.0 0.0 setrgbcolor
newpath
167.49448 -127.443306 moveto
167.49448 -127.76643 167.23251 -128.0284 166.90938 -128.0284 curveto
166.58626 -128.0284 166.3243 -127.76643 166.3243 -127.443306 curveto
166.3243 -127.120155 166.58626 -126.858215 166.90938 -126.858215 curveto
167.23251 -126.858215 167.49448 -127.120155 167.49448 -127.443306 curveto
closepath
fill
newpath
0.0 0.0 0.0 setrgbcolor
1.0 setlinewidth
10.0 setmiterlimit
1 setlinejoin
1 setlinecap
[ ] 0 setdash
newpath
167.49448 -127.443306 moveto
167.49448 -127.76643 167.23251 -128.0284 166.90938 -128.0284 curveto
166.58626 -128.0284 166.3243 -127.76643 166.3243 -127.443306 curveto
166.3243 -127.120155 166.58626 -126.858215 166.90938 -126.858215 curveto
167.23251 -126.858215 167.49448 -127.120155 167.49448 -127.443306 curveto
closepath
stroke
newpath
0.0 0.0 0.0 setrgbcolor
newpath
172.08517 -133.39975 moveto
172.08517 -128.32594 lineto
173.40161 -128.32594 lineto
173.909 -128.32594 174.29811 -128.42194 174.56894 -128.61392 curveto
174.83977 -128.80591 174.97517 -129.08246 174.97517 -129.44356 curveto
174.97517 -130.05835 174.62778 -130.49603 173.933 -130.75658 curveto
174.76263 -131.01027 175.17744 -131.4685 175.17744 -132.1313 curveto
175.17744 -132.5427 175.04031 -132.85695 174.76605 -133.07407 curveto
174.4918 -133.29118 174.0964 -133.39975 173.57988 -133.39975 curveto
closepath
172.79825 -132.86151 moveto
172.94566 -132.86151 lineto
173.4736 -132.86151 173.81529 -132.82837 173.9707 -132.7621 curveto
174.26782 -132.6364 174.41638 -132.40327 174.41638 -132.06273 curveto
174.41638 -131.76105 174.28154 -131.51021 174.01184 -131.31024 curveto
173.74216 -131.11026 173.40504 -131.01027 173.00052 -131.01027 curveto
172.79825 -131.01027 lineto
closepath
172.79825 -130.5543 moveto
173.02794 -130.5543 lineto
173.4119 -130.5543 173.70958 -130.47203 173.92099 -130.30748 curveto
174.1324 -130.14291 174.23811 -129.91093 174.23811 -129.61154 curveto
174.23811 -129.1133 173.85187 -128.86418 173.07936 -128.86418 curveto
172.79825 -128.86418 lineto
closepath
fill
newpath
0.0 0.0 0.0 setrgbcolor
newpath
139.14801 -184.13618 moveto
139.14801 -184.45934 138.88606 -184.72128 138.56293 -184.72128 curveto
138.2398 -184.72128 137.97784 -184.45934 137.97784 -184.13618 curveto
137.97784 -183.81308 138.2398 -183.5511 138.56293 -183.5511 curveto
138.88606 -183.5511 139.14801 -183.81308 139.14801 -184.13618 curveto
closepath
fill
newpath
0.0 0.0 0.0 setrgbcolor
1.0 setlinewidth
10.0 setmiterlimit
1 setlinejoin
1 setlinecap
[ ] 0 setdash
newpath
139.14801 -184.13618 moveto
139.14801 -184.45934 138.88606 -184.72128 138.56293 -184.72128 curveto
138.2398 -184.72128 137.97784 -184.45934 137.97784 -184.13618 curveto
137.97784 -183.81308 138.2398 -183.5511 138.56293 -183.5511 curveto
138.88606 -183.5511 139.14801 -183.81308 139.14801 -184.13618 curveto
closepath
stroke
newpath
0.0 0.0 0.0 setrgbcolor
newpath
148.51486 -190.28 moveto
147.72636 -190.28 147.11728 -190.04858 146.6876 -189.58577 curveto
146.25793 -189.12296 146.0431 -188.46759 146.0431 -187.61967 curveto
146.0431 -186.77405 146.26195 -186.1181 146.69962 -185.65187 curveto
147.13728 -185.18562 147.7538 -184.9525 148.54915 -184.9525 curveto
149.00397 -184.9525 149.53648 -185.02678 150.14671 -185.17534 curveto
150.14671 -185.85071 lineto
149.45192 -185.61073 148.91597 -185.49074 148.53886 -185.49074 curveto
147.98807 -185.49074 147.56181 -185.677 147.26013 -186.04955 curveto
146.95845 -186.42209 146.8076 -186.94775 146.8076 -187.62654 curveto
146.8076 -188.27333 146.96873 -188.78357 147.29099 -189.15724 curveto
147.61324 -189.53091 148.05319 -189.71776 148.61086 -189.71776 curveto
149.09082 -189.71776 149.60506 -189.57034 150.15356 -189.27551 curveto
150.15356 -189.89261 lineto
149.65305 -190.15086 149.10681 -190.28 148.51486 -190.28 curveto
closepath
fill
newpath
0.0 0.0 0.0 setrgbcolor
newpath
82.45511 -14.05747 moveto
82.45511 -14.3806 82.19315 -14.642557 81.870026 -14.642557 curveto
81.546875 -14.642557 81.284935 -14.3806 81.284935 -14.05747 curveto
81.284935 -13.734331 81.546875 -13.4723835 81.870026 -13.4723835 curveto
82.19315 -13.4723835 82.45511 -13.734331 82.45511 -14.05747 curveto
closepath
fill
newpath
0.0 0.0 0.0 setrgbcolor
1.0 setlinewidth
10.0 setmiterlimit
1 setlinejoin
1 setlinecap
[ ] 0 setdash
newpath
82.45511 -14.05747 moveto
82.45511 -14.3806 82.19315 -14.642557 81.870026 -14.642557 curveto
81.546875 -14.642557 81.284935 -14.3806 81.284935 -14.05747 curveto
81.284935 -13.734331 81.546875 -13.4723835 81.870026 -13.4723835 curveto
82.19315 -13.4723835 82.45511 -13.734331 82.45511 -14.05747 curveto
closepath
stroke
newpath
0.0 0.0 0.0 setrgbcolor
newpath
86.07744 -8.776299 moveto
86.07744 -3.7025013 lineto
87.76414 -3.7025013 lineto
88.266945 -3.7025013 88.67319 -3.7584958 88.98287 -3.870485 curveto
89.29256 -3.9824743 89.56053 -4.17217 89.7868 -4.4395733 curveto
90.14562 -4.864675 90.325035 -5.4246216 90.325035 -6.119412 curveto
90.325035 -6.962759 90.102196 -7.6164107 89.656525 -8.080366 curveto
89.21085 -8.544322 88.58348 -8.776299 87.77442 -8.776299 curveto
closepath
86.79737 -8.238065 moveto
87.71957 -8.238065 lineto
88.37779 -8.238065 88.84403 -8.060939 89.11829 -7.706688 curveto
89.41312 -7.3295813 89.56053 -6.823344 89.56053 -6.1879764 curveto
89.56053 -5.591462 89.415405 -5.122936 89.125145 -4.7823973 curveto
88.949165 -4.5744176 88.7389 -4.4321456 88.49435 -4.3555813 curveto
88.2498 -4.279017 87.881836 -4.240735 87.39046 -4.240735 curveto
86.79737 -4.240735 lineto
closepath
fill
newpath
0.0 0.0 0.0 setrgbcolor
newpath
111.97173 -99.09683 moveto
111.97173 -100.06624 111.18588 -100.85209 110.21648 -100.85209 curveto
109.24707 -100.85209 108.46122 -100.06624 108.46122 -99.09683 curveto
108.46122 -98.12744 109.24707 -97.34157 110.21648 -97.34157 curveto
111.18588 -97.34157 111.97173 -98.12744 111.97173 -99.09683 curveto
closepath
fill
newpath
0.0 0.0 0.0 setrgbcolor
1.0 setlinewidth
10.0 setmiterlimit
1 setlinejoin
1 setlinecap
[ ] 0 setdash
newpath
111.97173 -99.09683 moveto
111.97173 -100.06624 111.18588 -100.85209 110.21648 -100.85209 curveto
109.24707 -100.85209 108.46122 -100.06624 108.46122 -99.09683 curveto
108.46122 -98.12744 109.24707 -97.34157 110.21648 -97.34157 curveto
111.18588 -97.34157 111.97173 -98.12744 111.97173 -99.09683 curveto
closepath
stroke
newpath
0.0 0.0 0.0 setrgbcolor
newpath
112.991425 -95.36912 moveto
112.991425 -90.29532 lineto
115.826584 -90.29532 lineto
115.826584 -90.83356 lineto
113.71136 -90.83356 lineto
113.71136 -92.53396 lineto
115.48718 -92.53396 lineto
115.48718 -93.06534 lineto
113.71136 -93.06534 lineto
113.71136 -95.36912 lineto
closepath
fill
newpath
0.2509804 0.2509804 0.2509804 setrgbcolor
newpath
69.45206 -42.403923 moveto
69.45206 -43.37333 68.66618 -44.159184 67.69679 -44.159184 curveto
66.72739 -44.159184 65.941536 -43.37333 65.941536 -42.403923 curveto
65.941536 -41.434517 66.72739 -40.648663 67.69679 -40.648663 curveto
68.66618 -40.648663 69.45206 -41.434517 69.45206 -42.403923 curveto
closepath
fill
newpath
0.0 0.0 0.0 setrgbcolor
1.0 setlinewidth
10.0 setmiterlimit
1 setlinejoin
1 setlinecap
[ ] 0 setdash
newpath
69.45206 -42.403923 moveto
69.45206 -43.37333 68.66618 -44.159184 67.69679 -44.159184 curveto
66.72739 -44.159184 65.941536 -43.37333 65.941536 -42.403923 curveto
65.941536 -41.434517 66.72739 -40.648663 67.69679 -40.648663 curveto
68.66618 -40.648663 69.45206 -41.434517 69.45206 -42.403923 curveto
closepath
stroke
newpath
0.2509804 0.2509804 0.2509804 setrgbcolor
newpath
56.23802 -37.44554 moveto
56.23802 -32.371746 lineto
59.073177 -32.371746 lineto
59.073177 -32.90998 lineto
56.957954 -32.90998 lineto
56.957954 -34.538395 lineto
58.730354 -34.538395 lineto
58.730354 -35.06977 lineto
56.957954 -35.06977 lineto
56.957954 -36.90731 lineto
59.220592 -36.90731 lineto
59.220592 -37.44554 lineto
closepath
fill
newpath
0.2509804 0.2509804 0.2509804 setrgbcolor
newpath
126.144966 -70.750374 moveto
126.144966 -71.71979 125.35911 -72.50564 124.3897 -72.50564 curveto
123.420296 -72.50564 122.634445 -71.71979 122.634445 -70.750374 curveto
122.634445 -69.78097 123.420296 -68.99512 124.3897 -68.99512 curveto
125.35911 -68.99512 126.144966 -69.78097 126.144966 -70.750374 curveto
closepath
fill
newpath
0.0 0.0 0.0 setrgbcolor
1.0 setlinewidth
10.0 setmiterlimit
1 setlinejoin
1 setlinecap
[ ] 0 setdash
newpath
126.144966 -70.750374 moveto
126.144966 -71.71979 125.35911 -72.50564 124.3897 -72.50564 curveto
123.420296 -72.50564 122.634445 -71.71979 122.634445 -70.750374 curveto
122.634445 -69.78097 123.420296 -68.99512 124.3897 -68.99512 curveto
125.35911 -68.99512 126.144966 -69.78097 126.144966 -70.750374 curveto
closepath
stroke
newpath
0.2509804 0.2509804 0.2509804 setrgbcolor
newpath
131.4308 -67.14783 moveto
130.816 -67.323814 130.28004 -67.411804 129.82295 -67.411804 curveto
129.01617 -67.411804 128.39737 -67.18211 127.96655 -66.72273 curveto
127.53574 -66.26334 127.320335 -65.605125 127.320335 -64.74806 curveto
127.320335 -63.907 127.5386 -63.252777 127.97513 -62.785393 curveto
128.41165 -62.31801 129.02417 -62.084316 129.81267 -62.084316 curveto
130.3292 -62.084316 130.86627 -62.16088 131.42393 -62.31401 curveto
131.42393 -62.979088 lineto
130.72458 -62.741398 130.18863 -62.62255 129.81609 -62.62255 curveto
129.26758 -62.62255 128.8419 -62.80882 128.53908 -63.181355 curveto
128.23624 -63.55389 128.08482 -64.078415 128.08482 -64.75492 curveto
128.08482 -65.42457 128.2471 -65.94509 128.57164 -66.31648 curveto
128.89618 -66.687874 129.351 -66.87357 129.93608 -66.87357 curveto
130.17606 -66.87357 130.43547 -66.83129 130.7143 -66.74673 curveto
130.7143 -65.094315 lineto
131.4308 -65.094315 lineto
closepath
fill
newpath
grestore
grestore
showpage

%%EOF