%!PS-Adobe-3.0 EPSF-3.0
%%Creator: EpsGraphics2D 0.9.0 by Paul Mutton, http://www.jibble.org/
%%Title: GeoGebra, http://www.geogebra.org
%%CreationDate: Tue Mar 11 18:28:00 CET 2008
%%BoundingBox: 0 0 289 112
%%DocumentData: Clean7Bit
%%DocumentProcessColors: Black
%%ColorUsage: Color
%%Origin: 0 0
%%Pages: 1
%%Page: 1 1
%%EndComments

gsave
-0.0 112.0 translate
1.0 setlinewidth
10.0 setmiterlimit
0 setlinejoin
2 setlinecap
[ ] 0 setdash
gsave
newpath
0.0 -0.0 moveto
289.27905 -0.0 lineto
289.27905 -112.169426 lineto
0.0 -112.169426 lineto
0.0 -0.0 lineto
closepath
clip
newpath
1.0 setlinewidth
10.0 setmiterlimit
0 setlinejoin
2 setlinecap
[ ] 0 setdash
1.0 1.0 1.0 setrgbcolor
newpath
-107.10915 232.77264 moveto
489.1599 232.77264 lineto
489.1599 -290.12244 lineto
-107.10915 -290.12244 lineto
-107.10915 232.77264 lineto
closepath
fill
newpath
1.0 0.8 0.8392157 setrgbcolor
newpath
37.317314 -45.779263 moveto
207.39606 -45.779263 lineto
264.08896 -17.432787 lineto
94.01022 -17.432787 lineto
closepath
fill
newpath
1.0 0.8 0.8392157 setrgbcolor
newpath
37.317314 -102.47216 moveto
207.39606 -102.47216 lineto
264.08896 -74.12571 lineto
94.01022 -74.12571 lineto
closepath
fill
newpath
0.0 0.0 0.050980393 setrgbcolor
1.5 setlinewidth
10.0 setmiterlimit
1 setlinejoin
1 setlinecap
[ ] 0 setdash
newpath
37.317314 -102.47216 moveto
207.39606 -102.47216 lineto
stroke
newpath
0.0 0.0 0.050980393 setrgbcolor
1.5 setlinewidth
10.0 setmiterlimit
1 setlinejoin
1 setlinecap
[ ] 0 setdash
newpath
94.01022 -74.12571 moveto
264.08896 -74.12571 lineto
stroke
newpath
0.0 0.0 0.050980393 setrgbcolor
1.5 setlinewidth
10.0 setmiterlimit
1 setlinejoin
1 setlinecap
[ ] 0 setdash
newpath
264.08896 -74.12571 moveto
207.39606 -102.47216 lineto
stroke
newpath
0.0 0.0 0.050980393 setrgbcolor
1.5 setlinewidth
10.0 setmiterlimit
1 setlinejoin
1 setlinecap
[ ] 0 setdash
newpath
94.01022 -74.12571 moveto
37.317314 -102.47216 lineto
stroke
newpath
0.0 0.0 0.050980393 setrgbcolor
1.5 setlinewidth
10.0 setmiterlimit
1 setlinejoin
1 setlinecap
[ ] 0 setdash
newpath
37.317314 -45.779263 moveto
207.39606 -45.779263 lineto
stroke
newpath
0.0 0.0 0.050980393 setrgbcolor
1.5 setlinewidth
10.0 setmiterlimit
1 setlinejoin
1 setlinecap
[ ] 0 setdash
newpath
94.01022 -17.432787 moveto
264.08896 -17.432787 lineto
stroke
newpath
0.0 0.0 0.050980393 setrgbcolor
1.5 setlinewidth
10.0 setmiterlimit
1 setlinejoin
1 setlinecap
[ ] 0 setdash
newpath
264.08896 -17.432787 moveto
207.39606 -45.779263 lineto
stroke
newpath
0.0 0.0 0.050980393 setrgbcolor
1.5 setlinewidth
10.0 setmiterlimit
1 setlinejoin
1 setlinecap
[ ] 0 setdash
newpath
94.01022 -17.432787 moveto
37.317314 -45.779263 lineto
stroke
newpath
0.0 0.0 0.050980393 setrgbcolor
1.5 setlinewidth
10.0 setmiterlimit
1 setlinejoin
1 setlinecap
[ ] 0 setdash
newpath
37.317314 -45.779263 moveto
207.39606 -45.779263 lineto
stroke
newpath
0.0 0.0 0.050980393 setrgbcolor
1.5 setlinewidth
10.0 setmiterlimit
1 setlinejoin
1 setlinecap
[ ] 0 setdash
newpath
207.39606 -45.779263 moveto
264.08896 -17.432787 lineto
stroke
newpath
0.0 0.0 0.050980393 setrgbcolor
1.5 setlinewidth
10.0 setmiterlimit
1 setlinejoin
1 setlinecap
[ ] 0 setdash
newpath
264.08896 -17.432787 moveto
94.01022 -17.432787 lineto
stroke
newpath
0.0 0.0 0.050980393 setrgbcolor
1.5 setlinewidth
10.0 setmiterlimit
1 setlinejoin
1 setlinecap
[ ] 0 setdash
newpath
94.01022 -17.432787 moveto
37.317314 -45.779263 lineto
stroke
newpath
0.0 0.0 0.050980393 setrgbcolor
1.5 setlinewidth
10.0 setmiterlimit
1 setlinejoin
1 setlinecap
[ ] 0 setdash
newpath
37.317314 -102.47216 moveto
207.39606 -102.47216 lineto
stroke
newpath
0.0 0.0 0.050980393 setrgbcolor
1.5 setlinewidth
10.0 setmiterlimit
1 setlinejoin
1 setlinecap
[ ] 0 setdash
newpath
207.39606 -102.47216 moveto
264.08896 -74.12571 lineto
stroke
newpath
0.0 0.0 0.050980393 setrgbcolor
1.5 setlinewidth
10.0 setmiterlimit
1 setlinejoin
1 setlinecap
[ ] 0 setdash
newpath
264.08896 -74.12571 moveto
94.01022 -74.12571 lineto
stroke
newpath
0.0 0.0 0.050980393 setrgbcolor
1.5 setlinewidth
10.0 setmiterlimit
1 setlinejoin
1 setlinecap
[ ] 0 setdash
newpath
94.01022 -74.12571 moveto
37.317314 -102.47216 lineto
stroke
newpath
0.0 0.0 0.0 setrgbcolor
newpath
71.787704 -43.012337 moveto
71.787704 -35.698658 lineto
73.779205 -35.698658 lineto
74.66212 -35.698658 75.296295 -35.847733 75.68175 -36.145878 curveto
76.0672 -36.444027 76.259926 -36.93408 76.259926 -37.616028 curveto
76.259926 -38.393517 75.99637 -39.00299 75.46925 -39.444447 curveto
74.94215 -39.885902 74.21078 -40.106632 73.275154 -40.106632 curveto
72.815575 -40.106632 lineto
72.815575 -43.012337 lineto
closepath
72.815575 -39.320904 moveto
73.23562 -39.320904 lineto
73.851685 -39.320904 74.32773 -39.17924 74.663765 -38.89592 curveto
74.9998 -38.6126 75.167816 -38.212322 75.167816 -37.695095 curveto
75.167816 -37.25693 75.03603 -36.94396 74.77248 -36.756176 curveto
74.50892 -36.56839 74.069115 -36.4745 73.45305 -36.4745 curveto
72.815575 -36.4745 lineto
closepath
fill
newpath
0.0 0.0 0.0 setrgbcolor
newpath
80.8112 -99.294716 moveto
79.661446 -98.92244 78.697815 -98.47934 77.92033 -97.96541 curveto
77.61065 -97.99835 77.3718 -98.014824 77.20378 -98.014824 curveto
76.22204 -98.014824 75.42396 -97.65902 74.80954 -96.94742 curveto
74.19512 -96.23582 73.88792 -95.31173 73.88792 -94.17514 curveto
73.88792 -93.0089 74.19842 -92.0774 74.81943 -91.38062 curveto
75.44043 -90.683846 76.269806 -90.33546 77.307556 -90.33546 curveto
78.3486 -90.33546 79.1788 -90.68467 79.798164 -91.383095 curveto
80.41752 -92.08152 80.727196 -93.01714 80.727196 -94.189964 curveto
80.727196 -95.87013 80.1029 -97.03307 78.8543 -97.67879 curveto
79.69438 -98.04777 80.565765 -98.31132 81.468445 -98.46945 curveto
closepath
77.27791 -97.238976 moveto
78.02575 -97.238976 78.60392 -96.97048 79.012436 -96.43349 curveto
79.42095 -95.89649 79.625206 -95.137115 79.625206 -94.15537 curveto
79.625206 -93.20328 79.42095 -92.45791 79.012436 -91.919266 curveto
78.60392 -91.38062 78.03563 -91.111305 77.307556 -91.111305 curveto
76.57948 -91.111305 76.01119 -91.38062 75.60268 -91.919266 curveto
75.19417 -92.45791 74.989914 -93.20657 74.989914 -94.16526 curveto
74.989914 -95.12065 75.19252 -95.87178 75.59774 -96.41866 curveto
76.00296 -96.96554 76.56301 -97.238976 77.27791 -97.238976 curveto
closepath
fill
newpath
grestore
grestore
showpage

%%EOF