%!PS-Adobe-3.0 EPSF-3.0
%%Creator: EpsGraphics2D 0.9.0 by Paul Mutton, http://www.jibble.org/
%%Title: GeoGebra, http://www.geogebra.org
%%CreationDate: Tue Mar 11 19:07:31 CET 2008
%%BoundingBox: 0 0 268 128
%%DocumentData: Clean7Bit
%%DocumentProcessColors: Black
%%ColorUsage: Color
%%Origin: 0 0
%%Pages: 1
%%Page: 1 1
%%EndComments

gsave
-0.0 128.0 translate
1.0 setlinewidth
10.0 setmiterlimit
0 setlinejoin
2 setlinecap
[ ] 0 setdash
gsave
newpath
0.0 -0.0 moveto
268.19458 -0.0 lineto
268.19458 -128.19363 lineto
0.0 -128.19363 lineto
0.0 -0.0 lineto
closepath
clip
newpath
1.0 setlinewidth
10.0 setmiterlimit
0 setlinejoin
2 setlinecap
[ ] 0 setdash
1.0 1.0 1.0 setrgbcolor
newpath
-123.97673 240.36305 moveto
472.29233 240.36305 lineto
472.29233 -282.532 lineto
-123.97673 -282.532 lineto
-123.97673 240.36305 lineto
closepath
fill
newpath
1.0 0.8 0.8 setrgbcolor
newpath
20.44973 -94.88175 moveto
190.52847 -94.88175 lineto
247.22137 -66.5353 lineto
77.14264 -66.5353 lineto
closepath
fill
newpath
0.0 0.0 0.0 setrgbcolor
1.5 setlinewidth
10.0 setmiterlimit
1 setlinejoin
1 setlinecap
[ ] 0 setdash
newpath
20.44973 -94.88175 moveto
190.52847 -94.88175 lineto
stroke
newpath
0.0 0.0 0.0 setrgbcolor
1.5 setlinewidth
10.0 setmiterlimit
1 setlinejoin
1 setlinecap
[ ] 0 setdash
newpath
77.14264 -66.5353 moveto
247.22137 -66.5353 lineto
stroke
newpath
0.0 0.0 0.0 setrgbcolor
1.5 setlinewidth
10.0 setmiterlimit
1 setlinejoin
1 setlinecap
[ ] 0 setdash
newpath
247.22137 -66.5353 moveto
190.52847 -94.88175 lineto
stroke
newpath
0.0 0.0 0.0 setrgbcolor
1.5 setlinewidth
10.0 setmiterlimit
1 setlinejoin
1 setlinecap
[ ] 0 setdash
newpath
77.14264 -66.5353 moveto
20.44973 -94.88175 lineto
stroke
newpath
0.0 0.0 0.0 setrgbcolor
1.5 setlinewidth
10.0 setmiterlimit
1 setlinejoin
1 setlinecap
[ ] 0 setdash
newpath
20.44973 -94.88175 moveto
190.52847 -94.88175 lineto
stroke
newpath
0.0 0.0 0.0 setrgbcolor
1.5 setlinewidth
10.0 setmiterlimit
1 setlinejoin
1 setlinecap
[ ] 0 setdash
newpath
190.52847 -94.88175 moveto
247.22137 -66.5353 lineto
stroke
newpath
0.0 0.0 0.0 setrgbcolor
1.5 setlinewidth
10.0 setmiterlimit
1 setlinejoin
1 setlinecap
[ ] 0 setdash
newpath
247.22137 -66.5353 moveto
77.14264 -66.5353 lineto
stroke
newpath
0.0 0.0 0.0 setrgbcolor
1.5 setlinewidth
10.0 setmiterlimit
1 setlinejoin
1 setlinecap
[ ] 0 setdash
newpath
77.14264 -66.5353 moveto
20.44973 -94.88175 lineto
stroke
newpath
0.0 0.0 0.0 setrgbcolor
newpath
179.74023 -91.92833 moveto
179.74023 -84.61465 lineto
181.73174 -84.61465 lineto
182.61465 -84.61465 183.24883 -84.76372 183.63428 -85.06187 curveto
184.01973 -85.360016 184.21245 -85.85007 184.21245 -86.53202 curveto
184.21245 -87.30951 183.9489 -87.918976 183.42178 -88.360435 curveto
182.89467 -88.801895 182.1633 -89.02262 181.22768 -89.02262 curveto
180.76811 -89.02262 lineto
180.76811 -91.92833 lineto
closepath
180.76811 -88.23689 moveto
181.18814 -88.23689 lineto
181.80421 -88.23689 182.28026 -88.09523 182.61629 -87.81191 curveto
182.95233 -87.52859 183.12035 -87.12831 183.12035 -86.611084 curveto
183.12035 -86.17292 182.98857 -85.85995 182.725 -85.672165 curveto
182.46146 -85.48438 182.02165 -85.39049 181.40558 -85.39049 curveto
180.76811 -85.39049 lineto
closepath
fill
newpath
0.0 0.0 0.0 setrgbcolor
newpath
63.100243 -90.01755 moveto
61.95048 -89.64527 60.986855 -89.20217 60.209362 -88.68823 curveto
59.899685 -88.721176 59.66084 -88.73765 59.49282 -88.73765 curveto
58.511074 -88.73765 57.712994 -88.38185 57.09858 -87.67025 curveto
56.484165 -86.95865 56.176956 -86.03455 56.176956 -84.89797 curveto
56.176956 -83.731735 56.487457 -82.80023 57.108463 -82.103455 curveto
57.729465 -81.40668 58.55884 -81.05829 59.596596 -81.05829 curveto
60.63764 -81.05829 61.467842 -81.4075 62.0872 -82.10593 curveto
62.70656 -82.804344 63.016235 -83.73997 63.016235 -84.912796 curveto
63.016235 -86.592964 62.391937 -87.755905 61.14334 -88.40162 curveto
61.983425 -88.7706 62.854805 -89.03415 63.757484 -89.19228 curveto
closepath
59.566944 -87.96181 moveto
60.314785 -87.96181 60.892963 -87.69331 61.301476 -87.15632 curveto
61.709988 -86.61932 61.91424 -85.85995 61.91424 -84.878204 curveto
61.91424 -83.92611 61.709988 -83.18074 61.301476 -82.6421 curveto
60.892963 -82.103455 60.32467 -81.83413 59.596596 -81.83413 curveto
58.868523 -81.83413 58.300232 -82.103455 57.89172 -82.6421 curveto
57.483208 -83.18074 57.27895 -83.9294 57.27895 -84.888084 curveto
57.27895 -85.843475 57.48156 -86.59461 57.886776 -87.14149 curveto
58.291992 -87.68837 58.85205 -87.96181 59.566944 -87.96181 curveto
closepath
fill
newpath
grestore
grestore
showpage

%%EOF