%!PS-Adobe-3.0 EPSF-3.0
%%Creator: EpsGraphics2D 0.9.0 by Paul Mutton, http://www.jibble.org/
%%Title: GeoGebra, http://www.geogebra.org
%%CreationDate: Tue Mar 11 15:25:05 CET 2008
%%BoundingBox: 0 0 323 164
%%DocumentData: Clean7Bit
%%DocumentProcessColors: Black
%%ColorUsage: Color
%%Origin: 0 0
%%Pages: 1
%%Page: 1 1
%%EndComments

gsave
-0.0 164.0 translate
1.0 setlinewidth
10.0 setmiterlimit
0 setlinejoin
2 setlinecap
[ ] 0 setdash
gsave
newpath
0.0 -0.0 moveto
323.7809 -0.0 lineto
323.7809 -164.2481 lineto
0.0 -164.2481 lineto
0.0 -0.0 lineto
closepath
clip
newpath
1.0 setlinewidth
10.0 setmiterlimit
0 setlinejoin
2 setlinecap
[ ] 0 setdash
1.0 1.0 1.0 setrgbcolor
newpath
-110.80852 129.66954 moveto
444.80582 129.66954 lineto
444.80582 -357.57358 lineto
-110.80852 -357.57358 lineto
-110.80852 129.66954 lineto
closepath
fill
newpath
0.0 0.0 0.0 setrgbcolor
1.0 setlinewidth
10.0 setmiterlimit
1 setlinejoin
1 setlinecap
[ ] 0 setdash
newpath
76.22716 -51.171135 moveto
161.26654 -51.171135 lineto
stroke
newpath
0.0 0.0 0.0 setrgbcolor
1.0 setlinewidth
10.0 setmiterlimit
1 setlinejoin
1 setlinecap
[ ] 0 setdash
newpath
132.92009 -22.824688 moveto
76.22716 -51.171135 lineto
stroke
newpath
0.0 0.0 0.0 setrgbcolor
1.0 setlinewidth
10.0 setmiterlimit
1 setlinejoin
1 setlinecap
[ ] 0 setdash
newpath
76.22716 -51.171135 moveto
76.22716 -136.21051 lineto
stroke
newpath
0.0 0.0 0.0 setrgbcolor
1.0 setlinewidth
10.0 setmiterlimit
1 setlinejoin
1 setlinecap
[ ] 0 setdash
newpath
76.22716 -136.21051 moveto
161.26654 -136.21051 lineto
stroke
newpath
0.0 0.0 0.0 setrgbcolor
1.0 setlinewidth
10.0 setmiterlimit
1 setlinejoin
1 setlinecap
[ ] 0 setdash
newpath
161.26654 -136.21051 moveto
217.95946 -107.86405 lineto
stroke
newpath
0.0 0.0 0.0 setrgbcolor
1.0 setlinewidth
10.0 setmiterlimit
1 setlinejoin
1 setlinecap
[ ] 0 setdash
newpath
217.95946 -107.86405 moveto
217.95946 -22.824688 lineto
stroke
newpath
0.0 0.0 0.0 setrgbcolor
1.0 setlinewidth
10.0 setmiterlimit
1 setlinejoin
1 setlinecap
[ ] 0 setdash
newpath
217.95946 -22.824688 moveto
132.92009 -22.824688 lineto
stroke
newpath
0.0 0.0 0.0 setrgbcolor
1.0 setlinewidth
10.0 setmiterlimit
1 setlinejoin
0 setlinecap
[ 5.0 4.0 ] 0 setdash
newpath
132.92009 -22.824688 moveto
132.92009 -107.86405 lineto
stroke
newpath
0.0 0.0 0.0 setrgbcolor
1.0 setlinewidth
10.0 setmiterlimit
1 setlinejoin
0 setlinecap
[ 5.0 4.0 ] 0 setdash
newpath
132.92009 -107.86405 moveto
76.22716 -136.21051 lineto
stroke
newpath
0.0 0.0 0.0 setrgbcolor
1.0 setlinewidth
10.0 setmiterlimit
1 setlinejoin
1 setlinecap
[ ] 0 setdash
newpath
161.26654 -51.171135 moveto
161.26654 -136.21051 lineto
stroke
newpath
0.0 0.0 0.0 setrgbcolor
1.0 setlinewidth
10.0 setmiterlimit
1 setlinejoin
1 setlinecap
[ ] 0 setdash
newpath
161.26654 -51.171135 moveto
217.95946 -22.824688 lineto
stroke
newpath
0.0 0.0 0.0 setrgbcolor
1.0 setlinewidth
10.0 setmiterlimit
1 setlinejoin
0 setlinecap
[ 5.0 4.0 ] 0 setdash
newpath
132.92009 -107.86405 moveto
217.95946 -107.86405 lineto
stroke
newpath
0.0 0.4 0.8 setrgbcolor
2.5 setlinewidth
10.0 setmiterlimit
1 setlinejoin
1 setlinecap
[ ] 0 setdash
newpath
19.534252 -136.21051 moveto
246.30591 -136.21051 lineto
stroke
newpath
0.0 0.4 1.0 setrgbcolor
2.5 setlinewidth
10.0 setmiterlimit
1 setlinejoin
1 setlinecap
[ ] 0 setdash
newpath
47.88071 -22.824688 moveto
302.9988 -22.824688 lineto
stroke
newpath
0.0 0.0 0.0 setrgbcolor
newpath
77.01303 -51.171135 moveto
77.01303 -51.605167 76.66119 -51.95701 76.22716 -51.95701 curveto
75.79314 -51.95701 75.44128 -51.605167 75.44128 -51.171135 curveto
75.44128 -50.737114 75.79314 -50.385258 76.22716 -50.385258 curveto
76.66119 -50.385258 77.01303 -50.737114 77.01303 -51.171135 curveto
closepath
fill
newpath
0.0 0.0 0.0 setrgbcolor
1.0 setlinewidth
10.0 setmiterlimit
1 setlinejoin
1 setlinecap
[ ] 0 setdash
newpath
77.01303 -51.171135 moveto
77.01303 -51.605167 76.66119 -51.95701 76.22716 -51.95701 curveto
75.79314 -51.95701 75.44128 -51.605167 75.44128 -51.171135 curveto
75.44128 -50.737114 75.79314 -50.385258 76.22716 -50.385258 curveto
76.66119 -50.385258 77.01303 -50.737114 77.01303 -51.171135 curveto
closepath
stroke
newpath
0.0 0.0 0.0 setrgbcolor
newpath
55.890827 -46.366684 moveto
55.890827 -39.551666 lineto
59.698948 -39.551666 lineto
59.698948 -40.274612 lineto
56.857822 -40.274612 lineto
56.857822 -42.461864 lineto
59.238476 -42.461864 lineto
59.238476 -43.1756 lineto
56.857822 -43.1756 lineto
56.857822 -45.64374 lineto
59.896954 -45.64374 lineto
59.896954 -46.366684 lineto
closepath
fill
newpath
0.0 0.0 0.0 setrgbcolor
newpath
77.01303 -136.21051 moveto
77.01303 -136.64453 76.66119 -136.99638 76.22716 -136.99638 curveto
75.79314 -136.99638 75.44128 -136.64453 75.44128 -136.21051 curveto
75.44128 -135.77649 75.79314 -135.42464 76.22716 -135.42464 curveto
76.66119 -135.42464 77.01303 -135.77649 77.01303 -136.21051 curveto
closepath
fill
newpath
0.0 0.0 0.0 setrgbcolor
1.0 setlinewidth
10.0 setmiterlimit
1 setlinejoin
1 setlinecap
[ ] 0 setdash
newpath
77.01303 -136.21051 moveto
77.01303 -136.64453 76.66119 -136.99638 76.22716 -136.99638 curveto
75.79314 -136.99638 75.44128 -136.64453 75.44128 -136.21051 curveto
75.44128 -135.77649 75.79314 -135.42464 76.22716 -135.42464 curveto
76.66119 -135.42464 77.01303 -135.77649 77.01303 -136.21051 curveto
closepath
stroke
newpath
0.0 0.0 0.0 setrgbcolor
newpath
62.48789 -151.42542 moveto
61.32749 -148.4876 lineto
60.16249 -151.42542 lineto
closepath
63.51014 -154.0317 moveto
62.768776 -152.14375 lineto
59.881603 -152.14375 lineto
59.13103 -154.0317 lineto
58.233105 -154.0317 lineto
60.93609 -147.21667 lineto
61.893875 -147.21667 lineto
64.55542 -154.0317 lineto
closepath
fill
newpath
0.0 0.0 0.0 setrgbcolor
newpath
162.05241 -51.171135 moveto
162.05241 -51.605167 161.70056 -51.95701 161.26654 -51.95701 curveto
160.83249 -51.95701 160.48067 -51.605167 160.48067 -51.171135 curveto
160.48067 -50.737114 160.83249 -50.385258 161.26654 -50.385258 curveto
161.70056 -50.385258 162.05241 -50.737114 162.05241 -51.171135 curveto
closepath
fill
newpath
0.0 0.0 0.0 setrgbcolor
1.0 setlinewidth
10.0 setmiterlimit
1 setlinejoin
1 setlinecap
[ ] 0 setdash
newpath
162.05241 -51.171135 moveto
162.05241 -51.605167 161.70056 -51.95701 161.26654 -51.95701 curveto
160.83249 -51.95701 160.48067 -51.605167 160.48067 -51.171135 curveto
160.48067 -50.737114 160.83249 -50.385258 161.26654 -50.385258 curveto
161.70056 -50.385258 162.05241 -50.737114 162.05241 -51.171135 curveto
closepath
stroke
newpath
0.0 0.0 0.0 setrgbcolor
newpath
173.77223 -58.154823 moveto
173.77223 -51.339806 lineto
177.58035 -51.339806 lineto
177.58035 -52.06275 lineto
174.73923 -52.06275 lineto
174.73923 -54.346703 lineto
177.12448 -54.346703 lineto
177.12448 -55.060436 lineto
174.73923 -55.060436 lineto
174.73923 -58.154823 lineto
closepath
fill
newpath
0.0 0.0 0.0 setrgbcolor
newpath
162.05241 -136.21051 moveto
162.05241 -136.64453 161.70056 -136.99638 161.26654 -136.99638 curveto
160.83249 -136.99638 160.48067 -136.64453 160.48067 -136.21051 curveto
160.48067 -135.77649 160.83249 -135.42464 161.26654 -135.42464 curveto
161.70056 -135.42464 162.05241 -135.77649 162.05241 -136.21051 curveto
closepath
fill
newpath
0.0 0.0 0.0 setrgbcolor
1.0 setlinewidth
10.0 setmiterlimit
1 setlinejoin
1 setlinecap
[ ] 0 setdash
newpath
162.05241 -136.21051 moveto
162.05241 -136.64453 161.70056 -136.99638 161.26654 -136.99638 curveto
160.83249 -136.99638 160.48067 -136.64453 160.48067 -136.21051 curveto
160.48067 -135.77649 160.83249 -135.42464 161.26654 -135.42464 curveto
161.70056 -135.42464 162.05241 -135.77649 162.05241 -136.21051 curveto
closepath
stroke
newpath
0.0 0.0 0.0 setrgbcolor
newpath
169.84285 -153.24582 moveto
169.84285 -146.4308 lineto
171.61107 -146.4308 lineto
172.29257 -146.4308 172.8152 -146.55974 173.17899 -146.8176 curveto
173.54276 -147.07547 173.72464 -147.44691 173.72464 -147.93195 curveto
173.72464 -148.75774 173.25803 -149.34561 172.3248 -149.69557 curveto
173.43915 -150.03632 173.99632 -150.65182 173.99632 -151.54207 curveto
173.99632 -152.09464 173.81213 -152.51674 173.44376 -152.80836 curveto
173.07538 -153.1 172.5443 -153.24582 171.85051 -153.24582 curveto
closepath
170.80063 -152.52287 moveto
170.99864 -152.52287 lineto
171.70776 -152.52287 172.1667 -152.47836 172.37546 -152.38934 curveto
172.77454 -152.2205 172.97408 -151.90738 172.97408 -151.44997 curveto
172.97408 -151.04475 172.79295 -150.70784 172.43071 -150.43924 curveto
172.06848 -150.17062 171.61568 -150.03632 171.07231 -150.03632 curveto
170.80063 -150.03632 lineto
closepath
170.80063 -149.42389 moveto
171.10915 -149.42389 lineto
171.62488 -149.42389 172.02473 -149.31337 172.30869 -149.09235 curveto
172.59264 -148.87132 172.73462 -148.55972 172.73462 -148.15758 curveto
172.73462 -147.48836 172.21582 -147.15375 171.17822 -147.15375 curveto
170.80063 -147.15375 lineto
closepath
fill
newpath
0.0 0.0 0.0 setrgbcolor
newpath
133.70596 -22.824688 moveto
133.70596 -23.258709 133.35411 -23.610563 132.92009 -23.610563 curveto
132.48604 -23.610563 132.1342 -23.258709 132.1342 -22.824688 curveto
132.1342 -22.390656 132.48604 -22.038813 132.92009 -22.038813 curveto
133.35411 -22.038813 133.70596 -22.390656 133.70596 -22.824688 curveto
closepath
fill
newpath
0.0 0.0 0.0 setrgbcolor
1.0 setlinewidth
10.0 setmiterlimit
1 setlinejoin
1 setlinecap
[ ] 0 setdash
newpath
133.70596 -22.824688 moveto
133.70596 -23.258709 133.35411 -23.610563 132.92009 -23.610563 curveto
132.48604 -23.610563 132.1342 -23.258709 132.1342 -22.824688 curveto
132.1342 -22.390656 132.48604 -22.038813 132.92009 -22.038813 curveto
133.35411 -22.038813 133.70596 -22.390656 133.70596 -22.824688 curveto
closepath
stroke
newpath
0.0 0.0 0.0 setrgbcolor
newpath
136.05019 -13.359892 moveto
136.05019 -6.5448737 lineto
137.01718 -6.5448737 lineto
137.01718 -9.418233 lineto
140.25891 -9.418233 lineto
140.25891 -6.5448737 lineto
141.2259 -6.5448737 lineto
141.2259 -13.359892 lineto
140.25891 -13.359892 lineto
140.25891 -10.141177 lineto
137.01718 -10.141177 lineto
137.01718 -13.359892 lineto
closepath
fill
newpath
0.0 0.0 0.0 setrgbcolor
newpath
218.74533 -22.824688 moveto
218.74533 -23.258709 218.39348 -23.610563 217.95946 -23.610563 curveto
217.5254 -23.610563 217.17358 -23.258709 217.17358 -22.824688 curveto
217.17358 -22.390656 217.5254 -22.038813 217.95946 -22.038813 curveto
218.39348 -22.038813 218.74533 -22.390656 218.74533 -22.824688 curveto
closepath
fill
newpath
0.0 0.0 0.0 setrgbcolor
1.0 setlinewidth
10.0 setmiterlimit
1 setlinejoin
1 setlinecap
[ ] 0 setdash
newpath
218.74533 -22.824688 moveto
218.74533 -23.258709 218.39348 -23.610563 217.95946 -23.610563 curveto
217.5254 -23.610563 217.17358 -23.258709 217.17358 -22.824688 curveto
217.17358 -22.390656 217.5254 -22.038813 217.95946 -22.038813 curveto
218.39348 -22.038813 218.74533 -22.390656 218.74533 -22.824688 curveto
closepath
stroke
newpath
0.0 0.0 0.0 setrgbcolor
newpath
230.76051 -17.890959 moveto
229.93472 -18.127335 229.21486 -18.245523 228.60089 -18.245523 curveto
227.51724 -18.245523 226.68608 -17.937006 226.10742 -17.319971 curveto
225.52876 -16.702934 225.23943 -15.818824 225.23943 -14.667639 curveto
225.23943 -13.537942 225.5326 -12.6592045 226.11894 -12.0314245 curveto
226.70528 -11.403645 227.52798 -11.089754 228.58708 -11.089754 curveto
229.28085 -11.089754 230.00227 -11.192594 230.75131 -11.398272 curveto
230.75131 -12.291592 lineto
229.81194 -11.972329 229.09207 -11.812698 228.59169 -11.812698 curveto
227.85492 -11.812698 227.28317 -12.062889 226.87642 -12.5632715 curveto
226.46967 -13.063654 226.2663 -13.768179 226.2663 -14.676848 curveto
226.2663 -15.576307 226.48425 -16.275461 226.92017 -16.77431 curveto
227.35608 -17.273155 227.96698 -17.52258 228.75285 -17.52258 curveto
229.07518 -17.52258 229.4236 -17.465788 229.79813 -17.352203 curveto
229.79813 -15.132718 lineto
230.76051 -15.132718 lineto
closepath
fill
newpath
0.0 0.0 0.0 setrgbcolor
newpath
218.74533 -107.86405 moveto
218.74533 -108.29807 218.39348 -108.649925 217.95946 -108.649925 curveto
217.5254 -108.649925 217.17358 -108.29807 217.17358 -107.86405 curveto
217.17358 -107.43003 217.5254 -107.07817 217.95946 -107.07817 curveto
218.39348 -107.07817 218.74533 -107.43003 218.74533 -107.86405 curveto
closepath
fill
newpath
0.0 0.0 0.0 setrgbcolor
1.0 setlinewidth
10.0 setmiterlimit
1 setlinejoin
1 setlinecap
[ ] 0 setdash
newpath
218.74533 -107.86405 moveto
218.74533 -108.29807 218.39348 -108.649925 217.95946 -108.649925 curveto
217.5254 -108.649925 217.17358 -108.29807 217.17358 -107.86405 curveto
217.17358 -107.43003 217.5254 -107.07817 217.95946 -107.07817 curveto
218.39348 -107.07817 218.74533 -107.43003 218.74533 -107.86405 curveto
closepath
stroke
newpath
0.0 0.0 0.0 setrgbcolor
newpath
231.70296 -103.906006 moveto
230.64386 -103.906006 229.82576 -103.595184 229.24863 -102.97355 curveto
228.6715 -102.35191 228.38293 -101.471634 228.38293 -100.332726 curveto
228.38293 -99.19689 228.67686 -98.31585 229.26474 -97.689606 curveto
229.85262 -97.06336 230.6807 -96.75024 231.74901 -96.75024 curveto
232.3599 -96.75024 233.07516 -96.850006 233.8948 -97.049545 curveto
233.8948 -97.95668 lineto
232.96158 -97.634346 232.2417 -97.47318 231.73518 -97.47318 curveto
230.99536 -97.47318 230.42284 -97.72337 230.01762 -98.223755 curveto
229.6124 -98.72414 229.40979 -99.4302 229.40979 -100.34194 curveto
229.40979 -101.2107 229.62622 -101.89604 230.05907 -102.39796 curveto
230.49191 -102.89987 231.08286 -103.15083 231.8319 -103.15083 curveto
232.47656 -103.15083 233.16727 -102.95283 233.90402 -102.556816 curveto
233.90402 -103.38567 lineto
233.23174 -103.73256 232.49805 -103.906006 231.70296 -103.906006 curveto
closepath
fill
newpath
0.0 0.0 0.0 setrgbcolor
newpath
133.70596 -107.86405 moveto
133.70596 -108.29807 133.35411 -108.649925 132.92009 -108.649925 curveto
132.48604 -108.649925 132.1342 -108.29807 132.1342 -107.86405 curveto
132.1342 -107.43003 132.48604 -107.07817 132.92009 -107.07817 curveto
133.35411 -107.07817 133.70596 -107.43003 133.70596 -107.86405 curveto
closepath
fill
newpath
0.0 0.0 0.0 setrgbcolor
1.0 setlinewidth
10.0 setmiterlimit
1 setlinejoin
1 setlinecap
[ ] 0 setdash
newpath
133.70596 -107.86405 moveto
133.70596 -108.29807 133.35411 -108.649925 132.92009 -108.649925 curveto
132.48604 -108.649925 132.1342 -108.29807 132.1342 -107.86405 curveto
132.1342 -107.43003 132.48604 -107.07817 132.92009 -107.07817 curveto
133.35411 -107.07817 133.70596 -107.43003 133.70596 -107.86405 curveto
closepath
stroke
newpath
0.0 0.0 0.0 setrgbcolor
newpath
140.76544 -99.02038 moveto
140.76544 -92.20536 lineto
143.03098 -92.20536 lineto
143.70633 -92.20536 144.25198 -92.28057 144.66795 -92.43099 curveto
145.08392 -92.58141 145.44386 -92.83621 145.74777 -93.19538 curveto
146.22974 -93.766365 146.47072 -94.51847 146.47072 -95.451706 curveto
146.47072 -96.584465 146.1714 -97.46244 145.57278 -98.08562 curveto
144.97417 -98.70879 144.1315 -99.02038 143.04478 -99.02038 curveto
closepath
141.73244 -98.29743 moveto
142.9711 -98.29743 lineto
143.85521 -98.29743 144.48146 -98.05952 144.84984 -97.583694 curveto
145.24585 -97.07717 145.44385 -96.39721 145.44385 -95.5438 curveto
145.44385 -94.74257 145.24892 -94.11326 144.85905 -93.65585 curveto
144.62268 -93.3765 144.34026 -93.1854 144.01178 -93.082565 curveto
143.6833 -92.97973 143.18907 -92.92831 142.52905 -92.92831 curveto
141.73244 -92.92831 lineto
closepath
fill
newpath
grestore
grestore
showpage

%%EOF