%!PS-Adobe-3.0 EPSF-3.0
%%Creator: EpsGraphics2D 0.9.0 by Paul Mutton, http://www.jibble.org/
%%Title: GeoGebra, http://www.geogebra.org
%%CreationDate: Thu Mar 13 16:26:07 CET 2008
%%BoundingBox: 0 0 251 172
%%DocumentData: Clean7Bit
%%DocumentProcessColors: Black
%%ColorUsage: Color
%%Origin: 0 0
%%Pages: 1
%%Page: 1 1
%%EndComments

gsave
-0.0 172.0 translate
1.0 setlinewidth
10.0 setmiterlimit
0 setlinejoin
2 setlinecap
[ ] 0 setdash
gsave
newpath
0.0 -0.0 moveto
251.59854 -0.0 lineto
251.59854 -172.50067 lineto
0.0 -172.50067 lineto
0.0 -0.0 lineto
closepath
clip
newpath
1.0 setlinewidth
10.0 setmiterlimit
0 setlinejoin
2 setlinecap
[ ] 0 setdash
1.0 1.0 1.0 setrgbcolor
newpath
-104.34187 199.42761 moveto
490.5751 199.42761 lineto
490.5751 -322.28174 lineto
-104.34187 -322.28174 lineto
-104.34187 199.42761 lineto
closepath
fill
newpath
0.0 0.0 0.0 setrgbcolor
1.0 setlinewidth
10.0 setmiterlimit
1 setlinejoin
1 setlinecap
[ ] 0 setdash
newpath
53.505913 -147.05135 moveto
138.54527 -147.05135 lineto
stroke
newpath
0.0 0.0 0.0 setrgbcolor
1.0 setlinewidth
10.0 setmiterlimit
1 setlinejoin
1 setlinecap
[ ] 0 setdash
newpath
138.54527 -147.05135 moveto
195.2382 -118.704895 lineto
stroke
newpath
0.0 0.0 0.0 setrgbcolor
1.0 setlinewidth
10.0 setmiterlimit
1 setlinejoin
1 setlinecap
[ ] 0 setdash
newpath
195.2382 -118.704895 moveto
195.2382 -33.665524 lineto
stroke
newpath
0.0 0.0 0.0 setrgbcolor
1.0 setlinewidth
10.0 setmiterlimit
1 setlinejoin
1 setlinecap
[ ] 0 setdash
newpath
195.2382 -33.665524 moveto
138.54527 -62.011974 lineto
stroke
newpath
0.0 0.0 0.0 setrgbcolor
1.0 setlinewidth
10.0 setmiterlimit
1 setlinejoin
1 setlinecap
[ ] 0 setdash
newpath
138.54527 -62.011974 moveto
53.505913 -62.011974 lineto
stroke
newpath
0.0 0.0 0.0 setrgbcolor
1.0 setlinewidth
10.0 setmiterlimit
1 setlinejoin
1 setlinecap
[ ] 0 setdash
newpath
53.505913 -62.011974 moveto
53.505913 -147.05135 lineto
stroke
newpath
0.0 0.0 0.0 setrgbcolor
1.0 setlinewidth
10.0 setmiterlimit
1 setlinejoin
1 setlinecap
[ ] 0 setdash
newpath
53.505913 -62.011974 moveto
110.19882 -33.665524 lineto
stroke
newpath
0.0 0.0 0.0 setrgbcolor
1.0 setlinewidth
10.0 setmiterlimit
1 setlinejoin
1 setlinecap
[ ] 0 setdash
newpath
110.19882 -33.665524 moveto
195.2382 -33.665524 lineto
stroke
newpath
0.0 0.0 0.0 setrgbcolor
1.0 setlinewidth
10.0 setmiterlimit
1 setlinejoin
0 setlinecap
[ 5.0 4.0 ] 0 setdash
newpath
110.19882 -118.704895 moveto
53.505913 -147.05135 lineto
stroke
newpath
0.0 0.0 0.0 setrgbcolor
1.0 setlinewidth
10.0 setmiterlimit
1 setlinejoin
0 setlinecap
[ 5.0 4.0 ] 0 setdash
newpath
110.19882 -118.704895 moveto
195.2382 -118.704895 lineto
stroke
newpath
0.0 0.0 0.0 setrgbcolor
1.0 setlinewidth
10.0 setmiterlimit
1 setlinejoin
0 setlinecap
[ 5.0 4.0 ] 0 setdash
newpath
110.19882 -33.665524 moveto
110.19882 -118.704895 lineto
stroke
newpath
0.0 0.0 0.0 setrgbcolor
1.0 setlinewidth
10.0 setmiterlimit
1 setlinejoin
1 setlinecap
[ ] 0 setdash
newpath
138.54527 -147.05135 moveto
138.54527 -62.011974 lineto
stroke
newpath
0.0 0.0 0.0 setrgbcolor
1.0 setlinewidth
10.0 setmiterlimit
1 setlinejoin
1 setlinecap
[ ] 0 setdash
newpath
-3.1870024 -5.3190646 moveto
195.2382 -203.74426 lineto
stroke
newpath
0.0 0.0 0.0 setrgbcolor
1.0 setlinewidth
10.0 setmiterlimit
1 setlinejoin
0 setlinecap
[ 5.0 4.0 ] 0 setdash
newpath
195.2382 -33.665524 moveto
53.505913 -147.05135 lineto
stroke
newpath
0.0 0.0 0.0 setrgbcolor
1.0 setlinewidth
10.0 setmiterlimit
1 setlinejoin
1 setlinecap
[ ] 0 setdash
newpath
53.505913 -147.05135 moveto
-88.22637 -260.4372 lineto
stroke
newpath
0.0 0.0 0.0 setrgbcolor
1.0 setlinewidth
10.0 setmiterlimit
1 setlinejoin
1 setlinecap
[ ] 0 setdash
newpath
195.2382 -33.665524 moveto
336.9705 79.72031 lineto
stroke
newpath
0.0 0.0 0.0 setrgbcolor
newpath
54.347378 -147.05135 moveto
54.347378 -147.51608 53.970646 -147.8928 53.505913 -147.8928 curveto
53.04119 -147.8928 52.664444 -147.51608 52.664444 -147.05135 curveto
52.664444 -146.58662 53.04119 -146.20987 53.505913 -146.20987 curveto
53.970646 -146.20987 54.347378 -146.58662 54.347378 -147.05135 curveto
closepath
fill
newpath
0.0 0.0 0.0 setrgbcolor
1.0 setlinewidth
10.0 setmiterlimit
1 setlinejoin
1 setlinecap
[ ] 0 setdash
newpath
54.347378 -147.05135 moveto
54.347378 -147.51608 53.970646 -147.8928 53.505913 -147.8928 curveto
53.04119 -147.8928 52.664444 -147.51608 52.664444 -147.05135 curveto
52.664444 -146.58662 53.04119 -146.20987 53.505913 -146.20987 curveto
53.970646 -146.20987 54.347378 -146.58662 54.347378 -147.05135 curveto
closepath
stroke
newpath
0.0 0.0 0.0 setrgbcolor
newpath
44.188507 -154.56363 moveto
42.94603 -151.41798 lineto
41.69862 -154.56363 lineto
closepath
45.28307 -157.35428 moveto
44.489265 -155.33278 lineto
41.39786 -155.33278 lineto
40.594196 -157.35428 lineto
39.63275 -157.35428 lineto
42.52694 -150.05717 lineto
43.552475 -150.05717 lineto
46.402287 -157.35428 lineto
closepath
fill
newpath
0.0 0.0 0.0 setrgbcolor
newpath
139.38675 -147.05135 moveto
139.38675 -147.51608 139.01001 -147.8928 138.54527 -147.8928 curveto
138.08055 -147.8928 137.70381 -147.51608 137.70381 -147.05135 curveto
137.70381 -146.58662 138.08055 -146.20987 138.54527 -146.20987 curveto
139.01001 -146.20987 139.38675 -146.58662 139.38675 -147.05135 curveto
closepath
fill
newpath
0.0 0.0 0.0 setrgbcolor
1.0 setlinewidth
10.0 setmiterlimit
1 setlinejoin
1 setlinecap
[ ] 0 setdash
newpath
139.38675 -147.05135 moveto
139.38675 -147.51608 139.01001 -147.8928 138.54527 -147.8928 curveto
138.08055 -147.8928 137.70381 -147.51608 137.70381 -147.05135 curveto
137.70381 -146.58662 138.08055 -146.20987 138.54527 -146.20987 curveto
139.01001 -146.20987 139.38675 -146.58662 139.38675 -147.05135 curveto
closepath
stroke
newpath
0.0 0.0 0.0 setrgbcolor
newpath
146.51546 -158.19574 moveto
146.51546 -150.89865 lineto
148.40877 -150.89865 lineto
149.13847 -150.89865 149.69807 -151.0367 150.08759 -151.3128 curveto
150.4771 -151.58891 150.67184 -151.98663 150.67184 -152.50598 curveto
150.67184 -153.39018 150.17223 -154.01964 149.17299 -154.39435 curveto
150.36615 -154.7592 150.96274 -155.41824 150.96274 -156.37148 curveto
150.96274 -156.96313 150.76552 -157.41508 150.3711 -157.72734 curveto
149.97665 -158.03961 149.408 -158.19574 148.66515 -158.19574 curveto
closepath
147.541 -157.42166 moveto
147.753 -157.42166 lineto
148.5123 -157.42166 149.00371 -157.374 149.22722 -157.27867 curveto
149.65453 -157.09789 149.86818 -156.76262 149.86818 -156.27286 curveto
149.86818 -155.83897 149.67424 -155.47824 149.28638 -155.19063 curveto
148.89851 -154.90302 148.4137 -154.7592 147.8319 -154.7592 curveto
147.541 -154.7592 lineto
closepath
147.541 -154.10345 moveto
147.87134 -154.10345 lineto
148.42355 -154.10345 148.85168 -153.98512 149.15573 -153.74846 curveto
149.45978 -153.5118 149.6118 -153.17816 149.6118 -152.74757 curveto
149.6118 -152.031 149.0563 -151.67273 147.9453 -151.67273 curveto
147.541 -151.67273 lineto
closepath
fill
newpath
0.0 0.0 0.0 setrgbcolor
newpath
196.07967 -118.704895 moveto
196.07967 -119.16962 195.70293 -119.54636 195.2382 -119.54636 curveto
194.77348 -119.54636 194.39673 -119.16962 194.39673 -118.704895 curveto
194.39673 -118.24017 194.77348 -117.86343 195.2382 -117.86343 curveto
195.70293 -117.86343 196.07967 -118.24017 196.07967 -118.704895 curveto
closepath
fill
newpath
0.0 0.0 0.0 setrgbcolor
1.0 setlinewidth
10.0 setmiterlimit
1 setlinejoin
1 setlinecap
[ ] 0 setdash
newpath
196.07967 -118.704895 moveto
196.07967 -119.16962 195.70293 -119.54636 195.2382 -119.54636 curveto
194.77348 -119.54636 194.39673 -119.16962 194.39673 -118.704895 curveto
194.39673 -118.24017 194.77348 -117.86343 195.2382 -117.86343 curveto
195.70293 -117.86343 196.07967 -118.24017 196.07967 -118.704895 curveto
closepath
stroke
newpath
0.0 0.0 0.0 setrgbcolor
newpath
213.59285 -124.7195 moveto
212.45883 -124.7195 211.58286 -124.38669 210.9649 -123.72108 curveto
210.34695 -123.055466 210.03798 -122.11293 210.03798 -120.893456 curveto
210.03798 -119.67728 210.3527 -118.73391 210.98216 -118.06337 curveto
211.61162 -117.39282 212.49828 -117.05755 213.64215 -117.05755 curveto
214.29626 -117.05755 215.06213 -117.164375 215.93976 -117.37803 curveto
215.93976 -118.349335 lineto
214.9405 -118.0042 214.16971 -117.831635 213.62737 -117.831635 curveto
212.8352 -117.831635 212.22218 -118.099525 211.7883 -118.6353 curveto
211.35442 -119.171074 211.13748 -119.927086 211.13748 -120.90332 curveto
211.13748 -121.833534 211.36922 -122.56735 211.83267 -123.104774 curveto
212.29613 -123.6422 212.92888 -123.910904 213.7309 -123.910904 curveto
214.42116 -123.910904 215.16074 -123.69889 215.94962 -123.27487 curveto
215.94962 -124.16236 lineto
215.22977 -124.53378 214.44418 -124.7195 213.59285 -124.7195 curveto
closepath
fill
newpath
0.0 0.0 0.0 setrgbcolor
newpath
111.04028 -118.704895 moveto
111.04028 -119.16962 110.66355 -119.54636 110.19882 -119.54636 curveto
109.7341 -119.54636 109.35735 -119.16962 109.35735 -118.704895 curveto
109.35735 -118.24017 109.7341 -117.86343 110.19882 -117.86343 curveto
110.66355 -117.86343 111.04028 -118.24017 111.04028 -118.704895 curveto
closepath
fill
newpath
0.0 0.0 0.0 setrgbcolor
1.0 setlinewidth
10.0 setmiterlimit
1 setlinejoin
1 setlinecap
[ ] 0 setdash
newpath
111.04028 -118.704895 moveto
111.04028 -119.16962 110.66355 -119.54636 110.19882 -119.54636 curveto
109.7341 -119.54636 109.35735 -119.16962 109.35735 -118.704895 curveto
109.35735 -118.24017 109.7341 -117.86343 110.19882 -117.86343 curveto
110.66355 -117.86343 111.04028 -118.24017 111.04028 -118.704895 curveto
closepath
stroke
newpath
0.0 0.0 0.0 setrgbcolor
newpath
95.18599 -116.963875 moveto
95.18599 -109.66678 lineto
97.61178 -109.66678 lineto
98.334915 -109.66678 98.91918 -109.74731 99.36456 -109.90837 curveto
99.809944 -110.069435 100.19534 -110.342255 100.52076 -110.72683 curveto
101.03682 -111.33821 101.294846 -112.14352 101.294846 -113.14276 curveto
101.294846 -114.35566 100.974365 -115.29573 100.333405 -115.96299 curveto
99.69244 -116.63025 98.79016 -116.963875 97.62657 -116.963875 curveto
closepath
96.22139 -116.18979 moveto
97.54768 -116.18979 lineto
98.49433 -116.18979 99.16488 -115.93505 99.55932 -115.42557 curveto
99.98334 -114.88322 100.19535 -114.15515 100.19535 -113.24137 curveto
100.19535 -112.38347 99.986626 -111.70963 99.569176 -111.21988 curveto
99.31608 -110.92076 99.01368 -110.71615 98.66197 -110.60603 curveto
98.310265 -110.49592 97.78107 -110.440865 97.07436 -110.440865 curveto
96.22139 -110.440865 lineto
closepath
fill
newpath
0.0 0.0 0.0 setrgbcolor
newpath
54.347378 -62.011974 moveto
54.347378 -62.476696 53.970646 -62.85344 53.505913 -62.85344 curveto
53.04119 -62.85344 52.664444 -62.476696 52.664444 -62.011974 curveto
52.664444 -61.54725 53.04119 -61.170506 53.505913 -61.170506 curveto
53.970646 -61.170506 54.347378 -61.54725 54.347378 -62.011974 curveto
closepath
fill
newpath
0.0 0.0 0.0 setrgbcolor
1.0 setlinewidth
10.0 setmiterlimit
1 setlinejoin
1 setlinecap
[ ] 0 setdash
newpath
54.347378 -62.011974 moveto
54.347378 -62.476696 53.970646 -62.85344 53.505913 -62.85344 curveto
53.04119 -62.85344 52.664444 -62.476696 52.664444 -62.011974 curveto
52.664444 -61.54725 53.04119 -61.170506 53.505913 -61.170506 curveto
53.970646 -61.170506 54.347378 -61.54725 54.347378 -62.011974 curveto
closepath
stroke
newpath
0.0 0.0 0.0 setrgbcolor
newpath
39.64919 -66.47587 moveto
39.64919 -59.178776 lineto
43.726685 -59.178776 lineto
43.726685 -59.952858 lineto
40.684586 -59.952858 lineto
40.684586 -62.294834 lineto
43.23364 -62.294834 lineto
43.23364 -63.059055 lineto
40.684586 -63.059055 lineto
40.684586 -65.70179 lineto
43.938698 -65.70179 lineto
43.938698 -66.47587 lineto
closepath
fill
newpath
0.0 0.0 0.0 setrgbcolor
newpath
139.38675 -62.011974 moveto
139.38675 -62.476696 139.01001 -62.85344 138.54527 -62.85344 curveto
138.08055 -62.85344 137.70381 -62.476696 137.70381 -62.011974 curveto
137.70381 -61.54725 138.08055 -61.170506 138.54527 -61.170506 curveto
139.01001 -61.170506 139.38675 -61.54725 139.38675 -62.011974 curveto
closepath
fill
newpath
0.0 0.0 0.0 setrgbcolor
1.0 setlinewidth
10.0 setmiterlimit
1 setlinejoin
1 setlinecap
[ ] 0 setdash
newpath
139.38675 -62.011974 moveto
139.38675 -62.476696 139.01001 -62.85344 138.54527 -62.85344 curveto
138.08055 -62.85344 137.70381 -62.476696 137.70381 -62.011974 curveto
137.70381 -61.54725 138.08055 -61.170506 138.54527 -61.170506 curveto
139.01001 -61.170506 139.38675 -61.54725 139.38675 -62.011974 curveto
closepath
stroke
newpath
0.0 0.0 0.0 setrgbcolor
newpath
145.674 -74.89053 moveto
145.674 -67.593445 lineto
149.7515 -67.593445 lineto
149.7515 -68.36752 lineto
146.7094 -68.36752 lineto
146.7094 -70.81304 lineto
149.26338 -70.81304 lineto
149.26338 -71.57726 lineto
146.7094 -71.57726 lineto
146.7094 -74.89053 lineto
closepath
fill
newpath
0.0 0.0 0.0 setrgbcolor
newpath
196.07967 -33.665524 moveto
196.07967 -34.13025 195.70293 -34.506992 195.2382 -34.506992 curveto
194.77348 -34.506992 194.39673 -34.13025 194.39673 -33.665524 curveto
194.39673 -33.2008 194.77348 -32.82406 195.2382 -32.82406 curveto
195.70293 -32.82406 196.07967 -33.2008 196.07967 -33.665524 curveto
closepath
fill
newpath
0.0 0.0 0.0 setrgbcolor
1.0 setlinewidth
10.0 setmiterlimit
1 setlinejoin
1 setlinecap
[ ] 0 setdash
newpath
196.07967 -33.665524 moveto
196.07967 -34.13025 195.70293 -34.506992 195.2382 -34.506992 curveto
194.77348 -34.506992 194.39673 -34.13025 194.39673 -33.665524 curveto
194.39673 -33.2008 194.77348 -32.82406 195.2382 -32.82406 curveto
195.70293 -32.82406 196.07967 -33.2008 196.07967 -33.665524 curveto
closepath
stroke
newpath
0.0 0.0 0.0 setrgbcolor
newpath
209.21788 -35.144382 moveto
208.33368 -35.39748 207.56288 -35.52403 206.90549 -35.52403 curveto
205.7452 -35.52403 204.85524 -35.193687 204.23564 -34.533005 curveto
203.61604 -33.872322 203.30624 -32.92567 203.30624 -31.693054 curveto
203.30624 -30.483446 203.62015 -29.54255 204.24797 -28.870361 curveto
204.87578 -28.198174 205.75668 -27.86208 206.8907 -27.86208 curveto
207.63356 -27.86208 208.406 -27.972193 209.20802 -28.192421 curveto
209.20802 -29.148933 lineto
208.20221 -28.807087 207.43141 -28.636164 206.89563 -28.636164 curveto
206.10675 -28.636164 205.49455 -28.904053 205.05902 -29.43983 curveto
204.6235 -29.975607 204.40575 -30.729969 204.40575 -31.702915 curveto
204.40575 -32.666 204.63911 -33.41461 205.10587 -33.948746 curveto
205.57262 -34.48288 206.22673 -34.749947 207.06819 -34.749947 curveto
207.41333 -34.749947 207.78639 -34.689137 208.18741 -34.567516 curveto
208.18741 -32.191032 lineto
209.21788 -32.191032 lineto
closepath
fill
newpath
0.0 0.0 0.0 setrgbcolor
newpath
111.04028 -33.665524 moveto
111.04028 -34.13025 110.66355 -34.506992 110.19882 -34.506992 curveto
109.7341 -34.506992 109.35735 -34.13025 109.35735 -33.665524 curveto
109.35735 -33.2008 109.7341 -32.82406 110.19882 -32.82406 curveto
110.66355 -32.82406 111.04028 -33.2008 111.04028 -33.665524 curveto
closepath
fill
newpath
0.0 0.0 0.0 setrgbcolor
1.0 setlinewidth
10.0 setmiterlimit
1 setlinejoin
1 setlinecap
[ ] 0 setdash
newpath
111.04028 -33.665524 moveto
111.04028 -34.13025 110.66355 -34.506992 110.19882 -34.506992 curveto
109.7341 -34.506992 109.35735 -34.13025 109.35735 -33.665524 curveto
109.35735 -33.2008 109.7341 -32.82406 110.19882 -32.82406 curveto
110.66355 -32.82406 111.04028 -33.2008 111.04028 -33.665524 curveto
closepath
stroke
newpath
0.0 0.0 0.0 setrgbcolor
newpath
92.66159 -30.2928 moveto
92.66159 -22.995707 lineto
93.69699 -22.995707 lineto
93.69699 -26.07232 lineto
97.16804 -26.07232 lineto
97.16804 -22.995707 lineto
98.20344 -22.995707 lineto
98.20344 -30.2928 lineto
97.16804 -30.2928 lineto
97.16804 -26.846403 lineto
93.69699 -26.846403 lineto
93.69699 -30.2928 lineto
closepath
fill
newpath
0.0 0.0 0.05490196 setrgbcolor
newpath
-2.3455358 -5.3190646 moveto
-2.3455358 -5.7837996 -2.7222738 -6.160531 -3.1870024 -6.160531 curveto
-3.6517313 -6.160531 -4.028469 -5.7837996 -4.028469 -5.3190646 curveto
-4.028469 -4.854329 -3.6517313 -4.4775977 -3.1870024 -4.4775977 curveto
-2.7222738 -4.4775977 -2.3455358 -4.854329 -2.3455358 -5.3190646 curveto
closepath
fill
newpath
0.0 0.0 0.0 setrgbcolor
1.0 setlinewidth
10.0 setmiterlimit
1 setlinejoin
1 setlinecap
[ ] 0 setdash
newpath
-2.3455358 -5.3190646 moveto
-2.3455358 -5.7837996 -2.7222738 -6.160531 -3.1870024 -6.160531 curveto
-3.6517313 -6.160531 -4.028469 -5.7837996 -4.028469 -5.3190646 curveto
-4.028469 -4.854329 -3.6517313 -4.4775977 -3.1870024 -4.4775977 curveto
-2.7222738 -4.4775977 -2.3455358 -4.854329 -2.3455358 -5.3190646 curveto
closepath
stroke
newpath
0.0 0.0 0.05490196 setrgbcolor
newpath
196.07967 -203.74426 moveto
196.07967 -204.20898 195.70293 -204.58572 195.2382 -204.58572 curveto
194.77348 -204.58572 194.39673 -204.20898 194.39673 -203.74426 curveto
194.39673 -203.27954 194.77348 -202.9028 195.2382 -202.9028 curveto
195.70293 -202.9028 196.07967 -203.27954 196.07967 -203.74426 curveto
closepath
fill
newpath
0.0 0.0 0.0 setrgbcolor
1.0 setlinewidth
10.0 setmiterlimit
1 setlinejoin
1 setlinecap
[ ] 0 setdash
newpath
196.07967 -203.74426 moveto
196.07967 -204.20898 195.70293 -204.58572 195.2382 -204.58572 curveto
194.77348 -204.58572 194.39673 -204.20898 194.39673 -203.74426 curveto
194.39673 -203.27954 194.77348 -202.9028 195.2382 -202.9028 curveto
195.70293 -202.9028 196.07967 -203.27954 196.07967 -203.74426 curveto
closepath
stroke
newpath
0.0 0.0 0.05490196 setrgbcolor
newpath
-87.3849 -260.4372 moveto
-87.3849 -260.9019 -87.76164 -261.27866 -88.22637 -261.27866 curveto
-88.6911 -261.27866 -89.06784 -260.9019 -89.06784 -260.4372 curveto
-89.06784 -259.97244 -88.6911 -259.5957 -88.22637 -259.5957 curveto
-87.76164 -259.5957 -87.3849 -259.97244 -87.3849 -260.4372 curveto
closepath
fill
newpath
0.0 0.0 0.0 setrgbcolor
1.0 setlinewidth
10.0 setmiterlimit
1 setlinejoin
1 setlinecap
[ ] 0 setdash
newpath
-87.3849 -260.4372 moveto
-87.3849 -260.9019 -87.76164 -261.27866 -88.22637 -261.27866 curveto
-88.6911 -261.27866 -89.06784 -260.9019 -89.06784 -260.4372 curveto
-89.06784 -259.97244 -88.6911 -259.5957 -88.22637 -259.5957 curveto
-87.76164 -259.5957 -87.3849 -259.97244 -87.3849 -260.4372 curveto
closepath
stroke
newpath
0.0 0.0 0.05490196 setrgbcolor
newpath
196.07967 -33.665524 moveto
196.07967 -34.13025 195.70293 -34.506992 195.2382 -34.506992 curveto
194.77348 -34.506992 194.39673 -34.13025 194.39673 -33.665524 curveto
194.39673 -33.2008 194.77348 -32.82406 195.2382 -32.82406 curveto
195.70293 -32.82406 196.07967 -33.2008 196.07967 -33.665524 curveto
closepath
fill
newpath
0.0 0.0 0.0 setrgbcolor
1.0 setlinewidth
10.0 setmiterlimit
1 setlinejoin
1 setlinecap
[ ] 0 setdash
newpath
196.07967 -33.665524 moveto
196.07967 -34.13025 195.70293 -34.506992 195.2382 -34.506992 curveto
194.77348 -34.506992 194.39673 -34.13025 194.39673 -33.665524 curveto
194.39673 -33.2008 194.77348 -32.82406 195.2382 -32.82406 curveto
195.70293 -32.82406 196.07967 -33.2008 196.07967 -33.665524 curveto
closepath
stroke
newpath
0.0 0.0 0.05490196 setrgbcolor
newpath
337.81195 79.72031 moveto
337.81195 79.255585 337.43518 78.87884 336.9705 78.87884 curveto
336.50574 78.87884 336.12903 79.255585 336.12903 79.72031 curveto
336.12903 80.185036 336.50574 80.56177 336.9705 80.56177 curveto
337.43518 80.56177 337.81195 80.185036 337.81195 79.72031 curveto
closepath
fill
newpath
0.0 0.0 0.0 setrgbcolor
1.0 setlinewidth
10.0 setmiterlimit
1 setlinejoin
1 setlinecap
[ ] 0 setdash
newpath
337.81195 79.72031 moveto
337.81195 79.255585 337.43518 78.87884 336.9705 78.87884 curveto
336.50574 78.87884 336.12903 79.255585 336.12903 79.72031 curveto
336.12903 80.185036 336.50574 80.56177 336.9705 80.56177 curveto
337.43518 80.56177 337.81195 80.185036 337.81195 79.72031 curveto
closepath
stroke
newpath
grestore
grestore
showpage

%%EOF