%!PS-Adobe-3.0 EPSF-3.0
%%Creator: EpsGraphics2D 0.9.0 by Paul Mutton, http://www.jibble.org/
%%Title: GeoGebra, http://www.geogebra.org
%%CreationDate: Tue Apr 08 15:42:00 CEST 2008
%%BoundingBox: 0 0 201 162
%%DocumentData: Clean7Bit
%%DocumentProcessColors: Black
%%ColorUsage: Color
%%Origin: 0 0
%%Pages: 1
%%Page: 1 1
%%EndComments

gsave
-0.0 162.0 translate
1.0 setlinewidth
10.0 setmiterlimit
0 setlinejoin
2 setlinecap
[ ] 0 setdash
gsave
newpath
0.0 -0.0 moveto
201.82579 -0.0 lineto
201.82579 -162.15063 lineto
0.0 -162.15063 lineto
0.0 -0.0 lineto
closepath
clip
newpath
1.0 setlinewidth
10.0 setmiterlimit
0 setlinejoin
2 setlinecap
[ ] 0 setdash
1.0 1.0 1.0 setrgbcolor
newpath
-120.75047 183.71323 moveto
489.03943 183.71323 lineto
489.03943 -351.03888 lineto
-120.75047 -351.03888 lineto
-120.75047 183.71323 lineto
closepath
fill
newpath
0.0 0.0 0.0 setrgbcolor
1.0 setlinewidth
10.0 setmiterlimit
1 setlinejoin
1 setlinecap
[ ] 0 setdash
newpath
39.46232 -139.86963 moveto
152.84814 -139.86963 lineto
stroke
newpath
0.0 0.0 0.0 setrgbcolor
1.0 setlinewidth
10.0 setmiterlimit
1 setlinejoin
1 setlinecap
[ ] 0 setdash
newpath
152.84814 -26.483799 moveto
152.84814 -139.86963 lineto
stroke
newpath
0.0 0.0 0.0 setrgbcolor
1.0 setlinewidth
10.0 setmiterlimit
1 setlinejoin
1 setlinecap
[ ] 0 setdash
newpath
39.46232 -26.483799 moveto
152.84814 -26.483799 lineto
stroke
newpath
0.0 0.0 0.0 setrgbcolor
1.0 setlinewidth
10.0 setmiterlimit
1 setlinejoin
1 setlinecap
[ ] 0 setdash
newpath
39.46232 -26.483799 moveto
39.46232 -139.86963 lineto
stroke
newpath
0.0 0.0 0.0 setrgbcolor
1.0 setlinewidth
10.0 setmiterlimit
1 setlinejoin
1 setlinecap
[ ] 0 setdash
newpath
39.46232 -26.483799 moveto
152.84814 -139.86963 lineto
stroke
newpath
0.0 0.0 0.0 setrgbcolor
newpath
40.32482 -139.86963 moveto
40.32482 -140.34598 39.938675 -140.73213 39.46232 -140.73213 curveto
38.98598 -140.73213 38.599815 -140.34598 38.599815 -139.86963 curveto
38.599815 -139.39326 38.98598 -139.00713 39.46232 -139.00713 curveto
39.938675 -139.00713 40.32482 -139.39326 40.32482 -139.86963 curveto
closepath
fill
newpath
0.0 0.0 0.0 setrgbcolor
1.0 setlinewidth
10.0 setmiterlimit
1 setlinejoin
1 setlinecap
[ ] 0 setdash
newpath
40.32482 -139.86963 moveto
40.32482 -140.34598 39.938675 -140.73213 39.46232 -140.73213 curveto
38.98598 -140.73213 38.599815 -140.34598 38.599815 -139.86963 curveto
38.599815 -139.39326 38.98598 -139.00713 39.46232 -139.00713 curveto
39.938675 -139.00713 40.32482 -139.39326 40.32482 -139.86963 curveto
closepath
stroke
newpath
0.0 0.0 0.0 setrgbcolor
newpath
21.665344 -153.5256 moveto
21.665344 -146.04608 lineto
24.15178 -146.04608 lineto
24.892992 -146.04608 25.49186 -146.12863 25.94838 -146.29372 curveto
26.404902 -146.4588 26.799934 -146.73845 27.13348 -147.13263 curveto
27.662437 -147.7593 27.926916 -148.58475 27.926916 -149.60896 curveto
27.926916 -150.85217 27.598423 -151.81575 26.941439 -152.4997 curveto
26.284454 -153.18364 25.359621 -153.5256 24.16694 -153.5256 curveto
closepath
22.726627 -152.73216 moveto
24.08608 -152.73216 lineto
25.056396 -152.73216 25.743704 -152.47105 26.148003 -151.94884 curveto
26.582624 -151.39293 26.799934 -150.64667 26.799934 -149.71004 curveto
26.799934 -148.83069 26.585993 -148.14 26.15811 -147.638 curveto
25.898685 -147.3314 25.588722 -147.12169 25.228224 -147.00882 curveto
24.867725 -146.89595 24.32529 -146.83951 23.600922 -146.83951 curveto
22.726627 -146.83951 lineto
closepath
fill
newpath
0.0 0.0 0.0 setrgbcolor
newpath
153.71065 -139.86963 moveto
153.71065 -140.34598 153.32451 -140.73213 152.84814 -140.73213 curveto
152.3718 -140.73213 151.98564 -140.34598 151.98564 -139.86963 curveto
151.98564 -139.39326 152.3718 -139.00713 152.84814 -139.00713 curveto
153.32451 -139.00713 153.71065 -139.39326 153.71065 -139.86963 curveto
closepath
fill
newpath
0.0 0.0 0.0 setrgbcolor
1.0 setlinewidth
10.0 setmiterlimit
1 setlinejoin
1 setlinecap
[ ] 0 setdash
newpath
153.71065 -139.86963 moveto
153.71065 -140.34598 153.32451 -140.73213 152.84814 -140.73213 curveto
152.3718 -140.73213 151.98564 -140.34598 151.98564 -139.86963 curveto
151.98564 -139.39326 152.3718 -139.00713 152.84814 -139.00713 curveto
153.32451 -139.00713 153.71065 -139.39326 153.71065 -139.86963 curveto
closepath
stroke
newpath
0.0 0.0 0.0 setrgbcolor
newpath
165.45746 -152.85008 moveto
164.2951 -152.85008 163.39723 -152.50896 162.76382 -151.8267 curveto
162.13042 -151.14445 161.81372 -150.17834 161.81372 -148.92839 curveto
161.81372 -147.68181 162.13632 -146.71486 162.78151 -146.02754 curveto
163.4267 -145.34024 164.33553 -144.99658 165.508 -144.99658 curveto
166.17845 -144.99658 166.96347 -145.10608 167.86304 -145.32509 curveto
167.86304 -146.32066 lineto
166.83882 -145.9669 166.04875 -145.79002 165.49283 -145.79002 curveto
164.68086 -145.79002 164.05252 -146.0646 163.60779 -146.61378 curveto
163.16307 -147.16296 162.9407 -147.93787 162.9407 -148.93849 curveto
162.9407 -149.89197 163.17822 -150.64413 163.65327 -151.19499 curveto
164.12833 -151.74585 164.7769 -152.02127 165.59897 -152.02127 curveto
166.30649 -152.02127 167.06454 -151.80396 167.87314 -151.36934 curveto
167.87314 -152.279 lineto
167.1353 -152.65973 166.33006 -152.85008 165.45746 -152.85008 curveto
closepath
fill
newpath
0.0 0.0 0.0 setrgbcolor
newpath
153.71065 -26.483799 moveto
153.71065 -26.96014 153.32451 -27.346302 152.84814 -27.346302 curveto
152.3718 -27.346302 151.98564 -26.96014 151.98564 -26.483799 curveto
151.98564 -26.007446 152.3718 -25.621296 152.84814 -25.621296 curveto
153.32451 -25.621296 153.71065 -26.007446 153.71065 -26.483799 curveto
closepath
fill
newpath
0.0 0.0 0.0 setrgbcolor
1.0 setlinewidth
10.0 setmiterlimit
1 setlinejoin
1 setlinecap
[ ] 0 setdash
newpath
153.71065 -26.483799 moveto
153.71065 -26.96014 153.32451 -27.346302 152.84814 -27.346302 curveto
152.3718 -27.346302 151.98564 -26.96014 151.98564 -26.483799 curveto
151.98564 -26.007446 152.3718 -25.621296 152.84814 -25.621296 curveto
153.32451 -25.621296 153.71065 -26.007446 153.71065 -26.483799 curveto
closepath
stroke
newpath
0.0 0.0 0.0 setrgbcolor
newpath
162.69812 -19.63543 moveto
161.79182 -19.894854 161.00175 -20.024567 160.32793 -20.024567 curveto
159.13861 -20.024567 158.22641 -19.685966 157.59132 -19.008766 curveto
156.95624 -18.331566 156.6387 -17.36125 156.6387 -16.097816 curveto
156.6387 -14.857968 156.96045 -13.893548 157.60396 -13.204556 curveto
158.24747 -12.515564 159.1504 -12.171068 160.31276 -12.171068 curveto
161.07419 -12.171068 161.86595 -12.283935 162.68802 -12.509668 curveto
162.68802 -13.490092 lineto
161.65706 -13.1397 160.86699 -12.964504 160.31781 -12.964504 curveto
159.50922 -12.964504 158.88171 -13.23909 158.4353 -13.788262 curveto
157.98889 -14.337435 157.76569 -15.110655 157.76569 -16.107924 curveto
157.76569 -17.095085 158.0049 -17.862411 158.4833 -18.409899 curveto
158.96173 -18.957386 159.63219 -19.23113 160.49469 -19.23113 curveto
160.84846 -19.23113 161.23087 -19.1688 161.64189 -19.044142 curveto
161.64189 -16.608244 lineto
162.69812 -16.608244 lineto
closepath
fill
newpath
0.0 0.0 0.0 setrgbcolor
newpath
40.32482 -26.483799 moveto
40.32482 -26.96014 39.938675 -27.346302 39.46232 -27.346302 curveto
38.98598 -27.346302 38.599815 -26.96014 38.599815 -26.483799 curveto
38.599815 -26.007446 38.98598 -25.621296 39.46232 -25.621296 curveto
39.938675 -25.621296 40.32482 -26.007446 40.32482 -26.483799 curveto
closepath
fill
newpath
0.0 0.0 0.0 setrgbcolor
1.0 setlinewidth
10.0 setmiterlimit
1 setlinejoin
1 setlinecap
[ ] 0 setdash
newpath
40.32482 -26.483799 moveto
40.32482 -26.96014 39.938675 -27.346302 39.46232 -27.346302 curveto
38.98598 -27.346302 38.599815 -26.96014 38.599815 -26.483799 curveto
38.599815 -26.007446 38.98598 -25.621296 39.46232 -25.621296 curveto
39.938675 -25.621296 40.32482 -26.007446 40.32482 -26.483799 curveto
closepath
stroke
newpath
0.0 0.0 0.0 setrgbcolor
newpath
23.39035 -20.70008 moveto
23.39035 -13.220559 lineto
24.451633 -13.220559 lineto
24.451633 -16.374088 lineto
28.00946 -16.374088 lineto
28.00946 -13.220559 lineto
29.070744 -13.220559 lineto
29.070744 -20.70008 lineto
28.00946 -20.70008 lineto
28.00946 -17.167522 lineto
24.451633 -17.167522 lineto
24.451633 -20.70008 lineto
closepath
fill
newpath
grestore
grestore
showpage

%%EOF