%!PS-Adobe-3.0 EPSF-3.0
%%Creator: EpsGraphics2D 0.9.0 by Paul Mutton, http://www.jibble.org/
%%Title: GeoGebra, http://www.geogebra.org
%%CreationDate: Tue Mar 11 18:57:12 CET 2008
%%BoundingBox: 0 0 182 67
%%DocumentData: Clean7Bit
%%DocumentProcessColors: Black
%%ColorUsage: Color
%%Origin: 0 0
%%Pages: 1
%%Page: 1 1
%%EndComments

gsave
-0.0 67.0 translate
1.0 setlinewidth
10.0 setmiterlimit
0 setlinejoin
2 setlinecap
[ ] 0 setdash
gsave
newpath
0.0 -0.0 moveto
182.18265 -0.0 lineto
182.18265 -67.59718 lineto
0.0 -67.59718 lineto
0.0 -0.0 lineto
closepath
clip
newpath
1.0 setlinewidth
10.0 setmiterlimit
0 setlinejoin
2 setlinecap
[ ] 0 setdash
1.0 1.0 1.0 setrgbcolor
newpath
-66.77283 71.306786 moveto
224.63698 71.306786 lineto
224.63698 -184.24355 lineto
-66.77283 -184.24355 lineto
-66.77283 71.306786 lineto
closepath
fill
newpath
1.0 0.8 0.8117647 setrgbcolor
newpath
33.067287 -7.5436816 moveto
5.8546867 -50.06337 lineto
146.45311 -50.06337 lineto
174.79958 -7.5436816 lineto
closepath
fill
newpath
0.0 0.0 0.007843138 setrgbcolor
1.5 setlinewidth
10.0 setmiterlimit
1 setlinejoin
1 setlinecap
[ ] 0 setdash
newpath
33.067287 -7.5436816 moveto
5.8546867 -50.06337 lineto
stroke
newpath
0.0 0.0 0.007843138 setrgbcolor
1.5 setlinewidth
10.0 setmiterlimit
1 setlinejoin
1 setlinecap
[ ] 0 setdash
newpath
5.8546867 -50.06337 moveto
146.45311 -50.06337 lineto
stroke
newpath
0.0 0.0 0.007843138 setrgbcolor
1.5 setlinewidth
10.0 setmiterlimit
1 setlinejoin
1 setlinecap
[ ] 0 setdash
newpath
146.45311 -50.06337 moveto
174.79958 -7.5436816 lineto
stroke
newpath
0.0 0.0 0.007843138 setrgbcolor
1.5 setlinewidth
10.0 setmiterlimit
1 setlinejoin
1 setlinecap
[ ] 0 setdash
newpath
174.79958 -7.5436816 moveto
33.067287 -7.5436816 lineto
stroke
newpath
0.0 0.0 0.007843138 setrgbcolor
1.5 setlinewidth
10.0 setmiterlimit
1 setlinejoin
1 setlinecap
[ ] 0 setdash
newpath
23.90632 -46.576107 moveto
146.32317 -11.95316 lineto
stroke
newpath
0.0 0.0 0.0 setrgbcolor
newpath
35.49641 -15.662763 moveto
35.49641 -12.088407 lineto
36.4697 -12.088407 lineto
36.9012 -12.088407 37.211136 -12.1612625 37.399513 -12.306973 curveto
37.58789 -12.452684 37.68208 -12.692183 37.68208 -13.025467 curveto
37.68208 -13.405444 37.553276 -13.703307 37.295666 -13.919056 curveto
37.038055 -14.134806 36.68062 -14.242681 36.22336 -14.242681 curveto
35.998753 -14.242681 lineto
35.998753 -15.662763 lineto
closepath
35.998753 -13.858679 moveto
36.204037 -13.858679 lineto
36.50512 -13.858679 36.737774 -13.789446 36.902 -13.65098 curveto
37.066227 -13.512513 37.148342 -13.31689 37.148342 -13.064109 curveto
37.148342 -12.84997 37.08394 -12.697013 36.955135 -12.605239 curveto
36.82633 -12.513465 36.611385 -12.467578 36.310303 -12.467578 curveto
35.998753 -12.467578 lineto
closepath
fill
newpath
0.0 0.0 0.0 setrgbcolor
newpath
139.00218 -21.433254 moveto
139.00218 -20.940573 lineto
138.80898 -21.309278 138.51755 -21.493631 138.12791 -21.493631 curveto
137.81235 -21.493631 137.564 -21.378511 137.38286 -21.148272 curveto
137.20172 -20.918032 137.11116 -20.603262 137.11116 -20.203964 curveto
137.11116 -19.767635 137.2138 -19.416641 137.41908 -19.15098 curveto
137.62436 -18.885319 137.89445 -18.752487 138.22935 -18.752487 curveto
138.5401 -18.752487 138.7977 -18.871632 139.00218 -19.109922 curveto
139.00218 -17.619802 lineto
139.48038 -17.619802 lineto
139.48038 -21.433254 lineto
closepath
139.00218 -19.43596 moveto
138.75584 -19.218601 138.52238 -19.109922 138.3018 -19.109922 curveto
137.84616 -19.109922 137.61833 -19.458502 137.61833 -20.155663 curveto
137.61833 -20.769098 137.8212 -21.075817 138.22693 -21.075817 curveto
138.49098 -21.075817 138.7494 -20.931717 139.00218 -20.643515 curveto
closepath
fill
newpath
grestore
grestore
showpage

%%EOF