%!PS-Adobe-3.0 EPSF-3.0
%%Creator: EpsGraphics2D 0.9.0 by Paul Mutton, http://www.jibble.org/
%%Title: GeoGebra, http://www.geogebra.org
%%CreationDate: Thu Feb 28 11:26:33 CET 2008
%%BoundingBox: 0 0 977 1245
%%DocumentData: Clean7Bit
%%DocumentProcessColors: Black
%%ColorUsage: Color
%%Origin: 0 0
%%Pages: 1
%%Page: 1 1
%%EndComments

gsave
-0.0 1245.0 translate
1.0 setlinewidth
10.0 setmiterlimit
0 setlinejoin
2 setlinecap
[ ] 0 setdash
gsave
newpath
0.0 -0.0 moveto
977.9521 -0.0 lineto
977.9521 -1245.6976 lineto
0.0 -1245.6976 lineto
0.0 -0.0 lineto
closepath
clip
newpath
1.0 setlinewidth
10.0 setmiterlimit
0 setlinejoin
2 setlinecap
[ ] 0 setdash
1.0 1.0 1.0 setrgbcolor
newpath
-603.5621 18.152243 moveto
1000.6424 18.152243 lineto
1000.6424 -1388.6466 lineto
-603.5621 -1388.6466 lineto
-603.5621 18.152243 lineto
closepath
fill
newpath
0.6 0.6 0.6 setrgbcolor
1.0 setlinewidth
10.0 setmiterlimit
1 setlinejoin
0 setlinecap
[ 5.0 4.0 ] 0 setdash
newpath
-579.06335 18.152243 moveto
-579.06335 -1388.6466 lineto
stroke
newpath
newpath
-579.06335 18.152243 moveto
-579.06335 -1388.6466 lineto
stroke
newpath
newpath
-550.7169 18.152243 moveto
-550.7169 -1388.6466 lineto
stroke
newpath
newpath
-522.3705 18.152243 moveto
-522.3705 -1388.6466 lineto
stroke
newpath
newpath
-494.024 18.152243 moveto
-494.024 -1388.6466 lineto
stroke
newpath
newpath
-465.67755 18.152243 moveto
-465.67755 -1388.6466 lineto
stroke
newpath
newpath
-437.3311 18.152243 moveto
-437.3311 -1388.6466 lineto
stroke
newpath
newpath
-408.98462 18.152243 moveto
-408.98462 -1388.6466 lineto
stroke
newpath
newpath
-380.63818 18.152243 moveto
-380.63818 -1388.6466 lineto
stroke
newpath
newpath
-352.29172 18.152243 moveto
-352.29172 -1388.6466 lineto
stroke
newpath
newpath
-323.94525 18.152243 moveto
-323.94525 -1388.6466 lineto
stroke
newpath
newpath
-295.59882 18.152243 moveto
-295.59882 -1388.6466 lineto
stroke
newpath
newpath
-267.25235 18.152243 moveto
-267.25235 -1388.6466 lineto
stroke
newpath
newpath
-238.90588 18.152243 moveto
-238.90588 -1388.6466 lineto
stroke
newpath
newpath
-210.55945 18.152243 moveto
-210.55945 -1388.6466 lineto
stroke
newpath
newpath
-182.21298 18.152243 moveto
-182.21298 -1388.6466 lineto
stroke
newpath
newpath
-153.86652 18.152243 moveto
-153.86652 -1388.6466 lineto
stroke
newpath
newpath
-125.52008 18.152243 moveto
-125.52008 -1388.6466 lineto
stroke
newpath
newpath
-97.17361 18.152243 moveto
-97.17361 -1388.6466 lineto
stroke
newpath
newpath
-68.82714 18.152243 moveto
-68.82714 -1388.6466 lineto
stroke
newpath
newpath
-40.480705 18.152243 moveto
-40.480705 -1388.6466 lineto
stroke
newpath
newpath
-12.134272 18.152243 moveto
-12.134272 -1388.6466 lineto
stroke
newpath
newpath
16.212196 18.152243 moveto
16.212196 -1388.6466 lineto
stroke
newpath
newpath
44.558666 18.152243 moveto
44.558666 -1388.6466 lineto
stroke
newpath
newpath
72.905136 18.152243 moveto
72.905136 -1388.6466 lineto
stroke
newpath
newpath
101.2516 18.152243 moveto
101.2516 -1388.6466 lineto
stroke
newpath
newpath
129.59807 18.152243 moveto
129.59807 -1388.6466 lineto
stroke
newpath
newpath
157.94447 18.152243 moveto
157.94447 -1388.6466 lineto
stroke
newpath
newpath
186.29094 18.152243 moveto
186.29094 -1388.6466 lineto
stroke
newpath
newpath
214.6374 18.152243 moveto
214.6374 -1388.6466 lineto
stroke
newpath
newpath
242.98387 18.152243 moveto
242.98387 -1388.6466 lineto
stroke
newpath
newpath
271.33035 18.152243 moveto
271.33035 -1388.6466 lineto
stroke
newpath
newpath
299.67682 18.152243 moveto
299.67682 -1388.6466 lineto
stroke
newpath
newpath
328.02322 18.152243 moveto
328.02322 -1388.6466 lineto
stroke
newpath
newpath
356.3697 18.152243 moveto
356.3697 -1388.6466 lineto
stroke
newpath
newpath
384.71616 18.152243 moveto
384.71616 -1388.6466 lineto
stroke
newpath
newpath
413.06262 18.152243 moveto
413.06262 -1388.6466 lineto
stroke
newpath
newpath
441.4091 18.152243 moveto
441.4091 -1388.6466 lineto
stroke
newpath
newpath
469.7555 18.152243 moveto
469.7555 -1388.6466 lineto
stroke
newpath
newpath
498.10196 18.152243 moveto
498.10196 -1388.6466 lineto
stroke
newpath
newpath
526.4484 18.152243 moveto
526.4484 -1388.6466 lineto
stroke
newpath
newpath
554.7949 18.152243 moveto
554.7949 -1388.6466 lineto
stroke
newpath
newpath
583.14136 18.152243 moveto
583.14136 -1388.6466 lineto
stroke
newpath
newpath
611.4878 18.152243 moveto
611.4878 -1388.6466 lineto
stroke
newpath
newpath
639.8343 18.152243 moveto
639.8343 -1388.6466 lineto
stroke
newpath
newpath
668.1807 18.152243 moveto
668.1807 -1388.6466 lineto
stroke
newpath
newpath
696.5272 18.152243 moveto
696.5272 -1388.6466 lineto
stroke
newpath
newpath
724.87366 18.152243 moveto
724.87366 -1388.6466 lineto
stroke
newpath
newpath
753.22003 18.152243 moveto
753.22003 -1388.6466 lineto
stroke
newpath
newpath
781.5666 18.152243 moveto
781.5666 -1388.6466 lineto
stroke
newpath
newpath
809.91296 18.152243 moveto
809.91296 -1388.6466 lineto
stroke
newpath
newpath
838.2595 18.152243 moveto
838.2595 -1388.6466 lineto
stroke
newpath
newpath
866.6059 18.152243 moveto
866.6059 -1388.6466 lineto
stroke
newpath
newpath
894.95233 18.152243 moveto
894.95233 -1388.6466 lineto
stroke
newpath
newpath
923.2988 18.152243 moveto
923.2988 -1388.6466 lineto
stroke
newpath
newpath
951.64526 18.152243 moveto
951.64526 -1388.6466 lineto
stroke
newpath
newpath
979.9918 18.152243 moveto
979.9918 -1388.6466 lineto
stroke
newpath
newpath
-603.5621 16.799616 moveto
1000.6424 16.799616 lineto
stroke
newpath
newpath
-603.5621 16.799616 moveto
1000.6424 16.799616 lineto
stroke
newpath
newpath
-603.5621 -11.546842 moveto
1000.6424 -11.546842 lineto
stroke
newpath
newpath
-603.5621 -39.8933 moveto
1000.6424 -39.8933 lineto
stroke
newpath
newpath
-603.5621 -68.23976 moveto
1000.6424 -68.23976 lineto
stroke
newpath
newpath
-603.5621 -96.58621 moveto
1000.6424 -96.58621 lineto
stroke
newpath
newpath
-603.5621 -124.93267 moveto
1000.6424 -124.93267 lineto
stroke
newpath
newpath
-603.5621 -153.27911 moveto
1000.6424 -153.27911 lineto
stroke
newpath
newpath
-603.5621 -181.62558 moveto
1000.6424 -181.62558 lineto
stroke
newpath
newpath
-603.5621 -209.97205 moveto
1000.6424 -209.97205 lineto
stroke
newpath
newpath
-603.5621 -238.3185 moveto
1000.6424 -238.3185 lineto
stroke
newpath
newpath
-603.5621 -266.66495 moveto
1000.6424 -266.66495 lineto
stroke
newpath
newpath
-603.5621 -295.0114 moveto
1000.6424 -295.0114 lineto
stroke
newpath
newpath
-603.5621 -323.35785 moveto
1000.6424 -323.35785 lineto
stroke
newpath
newpath
-603.5621 -351.7043 moveto
1000.6424 -351.7043 lineto
stroke
newpath
newpath
-603.5621 -380.05078 moveto
1000.6424 -380.05078 lineto
stroke
newpath
newpath
-603.5621 -408.39722 moveto
1000.6424 -408.39722 lineto
stroke
newpath
newpath
-603.5621 -436.74368 moveto
1000.6424 -436.74368 lineto
stroke
newpath
newpath
-603.5621 -465.09015 moveto
1000.6424 -465.09015 lineto
stroke
newpath
newpath
-603.5621 -493.43658 moveto
1000.6424 -493.43658 lineto
stroke
newpath
newpath
-603.5621 -521.7831 moveto
1000.6424 -521.7831 lineto
stroke
newpath
newpath
-603.5621 -550.1295 moveto
1000.6424 -550.1295 lineto
stroke
newpath
newpath
-603.5621 -578.47595 moveto
1000.6424 -578.47595 lineto
stroke
newpath
newpath
-603.5621 -606.82245 moveto
1000.6424 -606.82245 lineto
stroke
newpath
newpath
-603.5621 -635.1689 moveto
1000.6424 -635.1689 lineto
stroke
newpath
newpath
-603.5621 -663.5154 moveto
1000.6424 -663.5154 lineto
stroke
newpath
newpath
-603.5621 -691.86176 moveto
1000.6424 -691.86176 lineto
stroke
newpath
newpath
-603.5621 -720.20825 moveto
1000.6424 -720.20825 lineto
stroke
newpath
newpath
-603.5621 -748.5547 moveto
1000.6424 -748.5547 lineto
stroke
newpath
newpath
-603.5621 -776.9012 moveto
1000.6424 -776.9012 lineto
stroke
newpath
newpath
-603.5621 -805.2476 moveto
1000.6424 -805.2476 lineto
stroke
newpath
newpath
-603.5621 -833.5941 moveto
1000.6424 -833.5941 lineto
stroke
newpath
newpath
-603.5621 -861.9405 moveto
1000.6424 -861.9405 lineto
stroke
newpath
newpath
-603.5621 -890.287 moveto
1000.6424 -890.287 lineto
stroke
newpath
newpath
-603.5621 -918.6334 moveto
1000.6424 -918.6334 lineto
stroke
newpath
newpath
-603.5621 -946.9799 moveto
1000.6424 -946.9799 lineto
stroke
newpath
newpath
-603.5621 -975.3264 moveto
1000.6424 -975.3264 lineto
stroke
newpath
newpath
-603.5621 -1003.67285 moveto
1000.6424 -1003.67285 lineto
stroke
newpath
newpath
-603.5621 -1032.0193 moveto
1000.6424 -1032.0193 lineto
stroke
newpath
newpath
-603.5621 -1060.3657 moveto
1000.6424 -1060.3657 lineto
stroke
newpath
newpath
-603.5621 -1088.7122 moveto
1000.6424 -1088.7122 lineto
stroke
newpath
newpath
-603.5621 -1117.0587 moveto
1000.6424 -1117.0587 lineto
stroke
newpath
newpath
-603.5621 -1145.4052 moveto
1000.6424 -1145.4052 lineto
stroke
newpath
newpath
-603.5621 -1173.7516 moveto
1000.6424 -1173.7516 lineto
stroke
newpath
newpath
-603.5621 -1202.098 moveto
1000.6424 -1202.098 lineto
stroke
newpath
newpath
-603.5621 -1230.4445 moveto
1000.6424 -1230.4445 lineto
stroke
newpath
newpath
-603.5621 -1258.7909 moveto
1000.6424 -1258.7909 lineto
stroke
newpath
newpath
-603.5621 -1287.1375 moveto
1000.6424 -1287.1375 lineto
stroke
newpath
newpath
-603.5621 -1315.4838 moveto
1000.6424 -1315.4838 lineto
stroke
newpath
newpath
-603.5621 -1343.8303 moveto
1000.6424 -1343.8303 lineto
stroke
newpath
newpath
-603.5621 -1372.1768 moveto
1000.6424 -1372.1768 lineto
stroke
newpath
0.2 0.2 0.2 setrgbcolor
1.8 setlinewidth
10.0 setmiterlimit
0 setlinejoin
0 setlinecap
[ ] 0 setdash
newpath
-579.06335 -1230.4445 moveto
-579.06335 -1239.5206 lineto
stroke
newpath
1.8 setlinewidth
10.0 setmiterlimit
0 setlinejoin
0 setlinecap
[ ] 0 setdash
newpath
-550.7169 -1230.4445 moveto
-550.7169 -1239.5206 lineto
stroke
newpath
1.8 setlinewidth
10.0 setmiterlimit
0 setlinejoin
0 setlinecap
[ ] 0 setdash
newpath
-522.3705 -1230.4445 moveto
-522.3705 -1239.5206 lineto
stroke
newpath
1.8 setlinewidth
10.0 setmiterlimit
0 setlinejoin
0 setlinecap
[ ] 0 setdash
newpath
-494.024 -1230.4445 moveto
-494.024 -1239.5206 lineto
stroke
newpath
1.8 setlinewidth
10.0 setmiterlimit
0 setlinejoin
0 setlinecap
[ ] 0 setdash
newpath
-465.67755 -1230.4445 moveto
-465.67755 -1239.5206 lineto
stroke
newpath
1.8 setlinewidth
10.0 setmiterlimit
0 setlinejoin
0 setlinecap
[ ] 0 setdash
newpath
-437.3311 -1230.4445 moveto
-437.3311 -1239.5206 lineto
stroke
newpath
1.8 setlinewidth
10.0 setmiterlimit
0 setlinejoin
0 setlinecap
[ ] 0 setdash
newpath
-408.98462 -1230.4445 moveto
-408.98462 -1239.5206 lineto
stroke
newpath
1.8 setlinewidth
10.0 setmiterlimit
0 setlinejoin
0 setlinecap
[ ] 0 setdash
newpath
-380.63818 -1230.4445 moveto
-380.63818 -1239.5206 lineto
stroke
newpath
1.8 setlinewidth
10.0 setmiterlimit
0 setlinejoin
0 setlinecap
[ ] 0 setdash
newpath
-352.29172 -1230.4445 moveto
-352.29172 -1239.5206 lineto
stroke
newpath
1.8 setlinewidth
10.0 setmiterlimit
0 setlinejoin
0 setlinecap
[ ] 0 setdash
newpath
-323.94525 -1230.4445 moveto
-323.94525 -1239.5206 lineto
stroke
newpath
1.8 setlinewidth
10.0 setmiterlimit
0 setlinejoin
0 setlinecap
[ ] 0 setdash
newpath
-295.59882 -1230.4445 moveto
-295.59882 -1239.5206 lineto
stroke
newpath
1.8 setlinewidth
10.0 setmiterlimit
0 setlinejoin
0 setlinecap
[ ] 0 setdash
newpath
-267.25235 -1230.4445 moveto
-267.25235 -1239.5206 lineto
stroke
newpath
1.8 setlinewidth
10.0 setmiterlimit
0 setlinejoin
0 setlinecap
[ ] 0 setdash
newpath
-238.90588 -1230.4445 moveto
-238.90588 -1239.5206 lineto
stroke
newpath
1.8 setlinewidth
10.0 setmiterlimit
0 setlinejoin
0 setlinecap
[ ] 0 setdash
newpath
-210.55945 -1230.4445 moveto
-210.55945 -1239.5206 lineto
stroke
newpath
1.8 setlinewidth
10.0 setmiterlimit
0 setlinejoin
0 setlinecap
[ ] 0 setdash
newpath
-182.21298 -1230.4445 moveto
-182.21298 -1239.5206 lineto
stroke
newpath
1.8 setlinewidth
10.0 setmiterlimit
0 setlinejoin
0 setlinecap
[ ] 0 setdash
newpath
-153.86652 -1230.4445 moveto
-153.86652 -1239.5206 lineto
stroke
newpath
1.8 setlinewidth
10.0 setmiterlimit
0 setlinejoin
0 setlinecap
[ ] 0 setdash
newpath
-125.52008 -1230.4445 moveto
-125.52008 -1239.5206 lineto
stroke
newpath
1.8 setlinewidth
10.0 setmiterlimit
0 setlinejoin
0 setlinecap
[ ] 0 setdash
newpath
-97.17361 -1230.4445 moveto
-97.17361 -1239.5206 lineto
stroke
newpath
1.8 setlinewidth
10.0 setmiterlimit
0 setlinejoin
0 setlinecap
[ ] 0 setdash
newpath
-68.82714 -1230.4445 moveto
-68.82714 -1239.5206 lineto
stroke
newpath
1.8 setlinewidth
10.0 setmiterlimit
0 setlinejoin
0 setlinecap
[ ] 0 setdash
newpath
-40.480705 -1230.4445 moveto
-40.480705 -1239.5206 lineto
stroke
newpath
1.8 setlinewidth
10.0 setmiterlimit
0 setlinejoin
0 setlinecap
[ ] 0 setdash
newpath
-12.134272 -1230.4445 moveto
-12.134272 -1239.5206 lineto
stroke
newpath
1.8 setlinewidth
10.0 setmiterlimit
0 setlinejoin
0 setlinecap
[ ] 0 setdash
newpath
16.212196 -1230.4445 moveto
16.212196 -1239.5206 lineto
stroke
newpath
1.8 setlinewidth
10.0 setmiterlimit
0 setlinejoin
0 setlinecap
[ ] 0 setdash
newpath
44.558666 -1230.4445 moveto
44.558666 -1239.5206 lineto
stroke
newpath
1.8 setlinewidth
10.0 setmiterlimit
0 setlinejoin
0 setlinecap
[ ] 0 setdash
newpath
72.905136 -1230.4445 moveto
72.905136 -1239.5206 lineto
stroke
newpath
1.8 setlinewidth
10.0 setmiterlimit
0 setlinejoin
0 setlinecap
[ ] 0 setdash
newpath
101.2516 -1230.4445 moveto
101.2516 -1239.5206 lineto
stroke
newpath
1.8 setlinewidth
10.0 setmiterlimit
0 setlinejoin
0 setlinecap
[ ] 0 setdash
newpath
129.59807 -1230.4445 moveto
129.59807 -1239.5206 lineto
stroke
newpath
1.8 setlinewidth
10.0 setmiterlimit
0 setlinejoin
0 setlinecap
[ ] 0 setdash
newpath
157.94447 -1230.4445 moveto
157.94447 -1239.5206 lineto
stroke
newpath
1.8 setlinewidth
10.0 setmiterlimit
0 setlinejoin
0 setlinecap
[ ] 0 setdash
newpath
186.29094 -1230.4445 moveto
186.29094 -1239.5206 lineto
stroke
newpath
1.8 setlinewidth
10.0 setmiterlimit
0 setlinejoin
0 setlinecap
[ ] 0 setdash
newpath
214.6374 -1230.4445 moveto
214.6374 -1239.5206 lineto
stroke
newpath
1.8 setlinewidth
10.0 setmiterlimit
0 setlinejoin
0 setlinecap
[ ] 0 setdash
newpath
242.98387 -1230.4445 moveto
242.98387 -1239.5206 lineto
stroke
newpath
1.8 setlinewidth
10.0 setmiterlimit
0 setlinejoin
0 setlinecap
[ ] 0 setdash
newpath
271.33035 -1230.4445 moveto
271.33035 -1239.5206 lineto
stroke
newpath
1.8 setlinewidth
10.0 setmiterlimit
0 setlinejoin
0 setlinecap
[ ] 0 setdash
newpath
299.67682 -1230.4445 moveto
299.67682 -1239.5206 lineto
stroke
newpath
1.8 setlinewidth
10.0 setmiterlimit
0 setlinejoin
0 setlinecap
[ ] 0 setdash
newpath
328.02322 -1230.4445 moveto
328.02322 -1239.5206 lineto
stroke
newpath
1.8 setlinewidth
10.0 setmiterlimit
0 setlinejoin
0 setlinecap
[ ] 0 setdash
newpath
356.3697 -1230.4445 moveto
356.3697 -1239.5206 lineto
stroke
newpath
1.8 setlinewidth
10.0 setmiterlimit
0 setlinejoin
0 setlinecap
[ ] 0 setdash
newpath
384.71616 -1230.4445 moveto
384.71616 -1239.5206 lineto
stroke
newpath
1.8 setlinewidth
10.0 setmiterlimit
0 setlinejoin
0 setlinecap
[ ] 0 setdash
newpath
413.06262 -1230.4445 moveto
413.06262 -1239.5206 lineto
stroke
newpath
1.8 setlinewidth
10.0 setmiterlimit
0 setlinejoin
0 setlinecap
[ ] 0 setdash
newpath
441.4091 -1230.4445 moveto
441.4091 -1239.5206 lineto
stroke
newpath
1.8 setlinewidth
10.0 setmiterlimit
0 setlinejoin
0 setlinecap
[ ] 0 setdash
newpath
469.7555 -1230.4445 moveto
469.7555 -1239.5206 lineto
stroke
newpath
1.8 setlinewidth
10.0 setmiterlimit
0 setlinejoin
0 setlinecap
[ ] 0 setdash
newpath
498.10196 -1230.4445 moveto
498.10196 -1239.5206 lineto
stroke
newpath
1.8 setlinewidth
10.0 setmiterlimit
0 setlinejoin
0 setlinecap
[ ] 0 setdash
newpath
526.4484 -1230.4445 moveto
526.4484 -1239.5206 lineto
stroke
newpath
1.8 setlinewidth
10.0 setmiterlimit
0 setlinejoin
0 setlinecap
[ ] 0 setdash
newpath
554.7949 -1230.4445 moveto
554.7949 -1239.5206 lineto
stroke
newpath
1.8 setlinewidth
10.0 setmiterlimit
0 setlinejoin
0 setlinecap
[ ] 0 setdash
newpath
583.14136 -1230.4445 moveto
583.14136 -1239.5206 lineto
stroke
newpath
1.8 setlinewidth
10.0 setmiterlimit
0 setlinejoin
0 setlinecap
[ ] 0 setdash
newpath
611.4878 -1230.4445 moveto
611.4878 -1239.5206 lineto
stroke
newpath
1.8 setlinewidth
10.0 setmiterlimit
0 setlinejoin
0 setlinecap
[ ] 0 setdash
newpath
639.8343 -1230.4445 moveto
639.8343 -1239.5206 lineto
stroke
newpath
1.8 setlinewidth
10.0 setmiterlimit
0 setlinejoin
0 setlinecap
[ ] 0 setdash
newpath
668.1807 -1230.4445 moveto
668.1807 -1239.5206 lineto
stroke
newpath
1.8 setlinewidth
10.0 setmiterlimit
0 setlinejoin
0 setlinecap
[ ] 0 setdash
newpath
696.5272 -1230.4445 moveto
696.5272 -1239.5206 lineto
stroke
newpath
1.8 setlinewidth
10.0 setmiterlimit
0 setlinejoin
0 setlinecap
[ ] 0 setdash
newpath
724.87366 -1230.4445 moveto
724.87366 -1239.5206 lineto
stroke
newpath
1.8 setlinewidth
10.0 setmiterlimit
0 setlinejoin
0 setlinecap
[ ] 0 setdash
newpath
753.22003 -1230.4445 moveto
753.22003 -1239.5206 lineto
stroke
newpath
1.8 setlinewidth
10.0 setmiterlimit
0 setlinejoin
0 setlinecap
[ ] 0 setdash
newpath
781.5666 -1230.4445 moveto
781.5666 -1239.5206 lineto
stroke
newpath
1.8 setlinewidth
10.0 setmiterlimit
0 setlinejoin
0 setlinecap
[ ] 0 setdash
newpath
809.91296 -1230.4445 moveto
809.91296 -1239.5206 lineto
stroke
newpath
1.8 setlinewidth
10.0 setmiterlimit
0 setlinejoin
0 setlinecap
[ ] 0 setdash
newpath
838.2595 -1230.4445 moveto
838.2595 -1239.5206 lineto
stroke
newpath
1.8 setlinewidth
10.0 setmiterlimit
0 setlinejoin
0 setlinecap
[ ] 0 setdash
newpath
866.6059 -1230.4445 moveto
866.6059 -1239.5206 lineto
stroke
newpath
1.8 setlinewidth
10.0 setmiterlimit
0 setlinejoin
0 setlinecap
[ ] 0 setdash
newpath
894.95233 -1230.4445 moveto
894.95233 -1239.5206 lineto
stroke
newpath
1.8 setlinewidth
10.0 setmiterlimit
0 setlinejoin
0 setlinecap
[ ] 0 setdash
newpath
923.2988 -1230.4445 moveto
923.2988 -1239.5206 lineto
stroke
newpath
1.8 setlinewidth
10.0 setmiterlimit
0 setlinejoin
0 setlinecap
[ ] 0 setdash
newpath
951.64526 -1230.4445 moveto
951.64526 -1239.5206 lineto
stroke
newpath
1.8 setlinewidth
10.0 setmiterlimit
0 setlinejoin
0 setlinecap
[ ] 0 setdash
newpath
-603.5621 -1230.4445 moveto
1000.6424 -1230.4445 lineto
stroke
newpath
newpath
998.37335 -1230.4445 moveto
989.29724 -1221.3684 lineto
stroke
newpath
newpath
998.37335 -1230.4445 moveto
989.29724 -1239.5206 lineto
stroke
newpath
1.8 setlinewidth
10.0 setmiterlimit
0 setlinejoin
0 setlinecap
[ ] 0 setdash
newpath
7.1360755 -11.546842 moveto
16.212196 -11.546842 lineto
stroke
newpath
1.8 setlinewidth
10.0 setmiterlimit
0 setlinejoin
0 setlinecap
[ ] 0 setdash
newpath
7.1360755 -39.8933 moveto
16.212196 -39.8933 lineto
stroke
newpath
1.8 setlinewidth
10.0 setmiterlimit
0 setlinejoin
0 setlinecap
[ ] 0 setdash
newpath
7.1360755 -68.23976 moveto
16.212196 -68.23976 lineto
stroke
newpath
1.8 setlinewidth
10.0 setmiterlimit
0 setlinejoin
0 setlinecap
[ ] 0 setdash
newpath
7.1360755 -96.58621 moveto
16.212196 -96.58621 lineto
stroke
newpath
1.8 setlinewidth
10.0 setmiterlimit
0 setlinejoin
0 setlinecap
[ ] 0 setdash
newpath
7.1360755 -124.93267 moveto
16.212196 -124.93267 lineto
stroke
newpath
1.8 setlinewidth
10.0 setmiterlimit
0 setlinejoin
0 setlinecap
[ ] 0 setdash
newpath
7.1360755 -153.27911 moveto
16.212196 -153.27911 lineto
stroke
newpath
1.8 setlinewidth
10.0 setmiterlimit
0 setlinejoin
0 setlinecap
[ ] 0 setdash
newpath
7.1360755 -181.62558 moveto
16.212196 -181.62558 lineto
stroke
newpath
1.8 setlinewidth
10.0 setmiterlimit
0 setlinejoin
0 setlinecap
[ ] 0 setdash
newpath
7.1360755 -209.97205 moveto
16.212196 -209.97205 lineto
stroke
newpath
1.8 setlinewidth
10.0 setmiterlimit
0 setlinejoin
0 setlinecap
[ ] 0 setdash
newpath
7.1360755 -238.3185 moveto
16.212196 -238.3185 lineto
stroke
newpath
1.8 setlinewidth
10.0 setmiterlimit
0 setlinejoin
0 setlinecap
[ ] 0 setdash
newpath
7.1360755 -266.66495 moveto
16.212196 -266.66495 lineto
stroke
newpath
1.8 setlinewidth
10.0 setmiterlimit
0 setlinejoin
0 setlinecap
[ ] 0 setdash
newpath
7.1360755 -295.0114 moveto
16.212196 -295.0114 lineto
stroke
newpath
1.8 setlinewidth
10.0 setmiterlimit
0 setlinejoin
0 setlinecap
[ ] 0 setdash
newpath
7.1360755 -323.35785 moveto
16.212196 -323.35785 lineto
stroke
newpath
1.8 setlinewidth
10.0 setmiterlimit
0 setlinejoin
0 setlinecap
[ ] 0 setdash
newpath
7.1360755 -351.7043 moveto
16.212196 -351.7043 lineto
stroke
newpath
1.8 setlinewidth
10.0 setmiterlimit
0 setlinejoin
0 setlinecap
[ ] 0 setdash
newpath
7.1360755 -380.05078 moveto
16.212196 -380.05078 lineto
stroke
newpath
1.8 setlinewidth
10.0 setmiterlimit
0 setlinejoin
0 setlinecap
[ ] 0 setdash
newpath
7.1360755 -408.39722 moveto
16.212196 -408.39722 lineto
stroke
newpath
1.8 setlinewidth
10.0 setmiterlimit
0 setlinejoin
0 setlinecap
[ ] 0 setdash
newpath
7.1360755 -436.74368 moveto
16.212196 -436.74368 lineto
stroke
newpath
1.8 setlinewidth
10.0 setmiterlimit
0 setlinejoin
0 setlinecap
[ ] 0 setdash
newpath
7.1360755 -465.09015 moveto
16.212196 -465.09015 lineto
stroke
newpath
1.8 setlinewidth
10.0 setmiterlimit
0 setlinejoin
0 setlinecap
[ ] 0 setdash
newpath
7.1360755 -493.43658 moveto
16.212196 -493.43658 lineto
stroke
newpath
1.8 setlinewidth
10.0 setmiterlimit
0 setlinejoin
0 setlinecap
[ ] 0 setdash
newpath
7.1360755 -521.7831 moveto
16.212196 -521.7831 lineto
stroke
newpath
1.8 setlinewidth
10.0 setmiterlimit
0 setlinejoin
0 setlinecap
[ ] 0 setdash
newpath
7.1360755 -550.1295 moveto
16.212196 -550.1295 lineto
stroke
newpath
1.8 setlinewidth
10.0 setmiterlimit
0 setlinejoin
0 setlinecap
[ ] 0 setdash
newpath
7.1360755 -578.47595 moveto
16.212196 -578.47595 lineto
stroke
newpath
1.8 setlinewidth
10.0 setmiterlimit
0 setlinejoin
0 setlinecap
[ ] 0 setdash
newpath
7.1360755 -606.82245 moveto
16.212196 -606.82245 lineto
stroke
newpath
1.8 setlinewidth
10.0 setmiterlimit
0 setlinejoin
0 setlinecap
[ ] 0 setdash
newpath
7.1360755 -635.1689 moveto
16.212196 -635.1689 lineto
stroke
newpath
1.8 setlinewidth
10.0 setmiterlimit
0 setlinejoin
0 setlinecap
[ ] 0 setdash
newpath
7.1360755 -663.5154 moveto
16.212196 -663.5154 lineto
stroke
newpath
1.8 setlinewidth
10.0 setmiterlimit
0 setlinejoin
0 setlinecap
[ ] 0 setdash
newpath
7.1360755 -691.86176 moveto
16.212196 -691.86176 lineto
stroke
newpath
1.8 setlinewidth
10.0 setmiterlimit
0 setlinejoin
0 setlinecap
[ ] 0 setdash
newpath
7.1360755 -720.20825 moveto
16.212196 -720.20825 lineto
stroke
newpath
1.8 setlinewidth
10.0 setmiterlimit
0 setlinejoin
0 setlinecap
[ ] 0 setdash
newpath
7.1360755 -748.5547 moveto
16.212196 -748.5547 lineto
stroke
newpath
1.8 setlinewidth
10.0 setmiterlimit
0 setlinejoin
0 setlinecap
[ ] 0 setdash
newpath
7.1360755 -776.9012 moveto
16.212196 -776.9012 lineto
stroke
newpath
1.8 setlinewidth
10.0 setmiterlimit
0 setlinejoin
0 setlinecap
[ ] 0 setdash
newpath
7.1360755 -805.2476 moveto
16.212196 -805.2476 lineto
stroke
newpath
1.8 setlinewidth
10.0 setmiterlimit
0 setlinejoin
0 setlinecap
[ ] 0 setdash
newpath
7.1360755 -833.5941 moveto
16.212196 -833.5941 lineto
stroke
newpath
1.8 setlinewidth
10.0 setmiterlimit
0 setlinejoin
0 setlinecap
[ ] 0 setdash
newpath
7.1360755 -861.9405 moveto
16.212196 -861.9405 lineto
stroke
newpath
1.8 setlinewidth
10.0 setmiterlimit
0 setlinejoin
0 setlinecap
[ ] 0 setdash
newpath
7.1360755 -890.287 moveto
16.212196 -890.287 lineto
stroke
newpath
1.8 setlinewidth
10.0 setmiterlimit
0 setlinejoin
0 setlinecap
[ ] 0 setdash
newpath
7.1360755 -918.6334 moveto
16.212196 -918.6334 lineto
stroke
newpath
1.8 setlinewidth
10.0 setmiterlimit
0 setlinejoin
0 setlinecap
[ ] 0 setdash
newpath
7.1360755 -946.9799 moveto
16.212196 -946.9799 lineto
stroke
newpath
1.8 setlinewidth
10.0 setmiterlimit
0 setlinejoin
0 setlinecap
[ ] 0 setdash
newpath
7.1360755 -975.3264 moveto
16.212196 -975.3264 lineto
stroke
newpath
1.8 setlinewidth
10.0 setmiterlimit
0 setlinejoin
0 setlinecap
[ ] 0 setdash
newpath
7.1360755 -1003.67285 moveto
16.212196 -1003.67285 lineto
stroke
newpath
1.8 setlinewidth
10.0 setmiterlimit
0 setlinejoin
0 setlinecap
[ ] 0 setdash
newpath
7.1360755 -1032.0193 moveto
16.212196 -1032.0193 lineto
stroke
newpath
1.8 setlinewidth
10.0 setmiterlimit
0 setlinejoin
0 setlinecap
[ ] 0 setdash
newpath
7.1360755 -1060.3657 moveto
16.212196 -1060.3657 lineto
stroke
newpath
1.8 setlinewidth
10.0 setmiterlimit
0 setlinejoin
0 setlinecap
[ ] 0 setdash
newpath
7.1360755 -1088.7122 moveto
16.212196 -1088.7122 lineto
stroke
newpath
1.8 setlinewidth
10.0 setmiterlimit
0 setlinejoin
0 setlinecap
[ ] 0 setdash
newpath
7.1360755 -1117.0587 moveto
16.212196 -1117.0587 lineto
stroke
newpath
1.8 setlinewidth
10.0 setmiterlimit
0 setlinejoin
0 setlinecap
[ ] 0 setdash
newpath
7.1360755 -1145.4052 moveto
16.212196 -1145.4052 lineto
stroke
newpath
1.8 setlinewidth
10.0 setmiterlimit
0 setlinejoin
0 setlinecap
[ ] 0 setdash
newpath
7.1360755 -1173.7516 moveto
16.212196 -1173.7516 lineto
stroke
newpath
1.8 setlinewidth
10.0 setmiterlimit
0 setlinejoin
0 setlinecap
[ ] 0 setdash
newpath
7.1360755 -1202.098 moveto
16.212196 -1202.098 lineto
stroke
newpath
1.8 setlinewidth
10.0 setmiterlimit
0 setlinejoin
0 setlinecap
[ ] 0 setdash
newpath
7.1360755 -1230.4445 moveto
16.212196 -1230.4445 lineto
stroke
newpath
1.8 setlinewidth
10.0 setmiterlimit
0 setlinejoin
0 setlinecap
[ ] 0 setdash
newpath
7.1360755 -1258.7909 moveto
16.212196 -1258.7909 lineto
stroke
newpath
1.8 setlinewidth
10.0 setmiterlimit
0 setlinejoin
0 setlinecap
[ ] 0 setdash
newpath
7.1360755 -1287.1375 moveto
16.212196 -1287.1375 lineto
stroke
newpath
1.8 setlinewidth
10.0 setmiterlimit
0 setlinejoin
0 setlinecap
[ ] 0 setdash
newpath
7.1360755 -1315.4838 moveto
16.212196 -1315.4838 lineto
stroke
newpath
1.8 setlinewidth
10.0 setmiterlimit
0 setlinejoin
0 setlinecap
[ ] 0 setdash
newpath
7.1360755 -1343.8303 moveto
16.212196 -1343.8303 lineto
stroke
newpath
1.8 setlinewidth
10.0 setmiterlimit
0 setlinejoin
0 setlinecap
[ ] 0 setdash
newpath
7.1360755 -1372.1768 moveto
16.212196 -1372.1768 lineto
stroke
newpath
newpath
16.212196 18.152243 moveto
16.212196 -1388.6466 lineto
stroke
newpath
newpath
16.212196 18.152243 moveto
7.1360755 9.076121 lineto
stroke
newpath
newpath
16.212196 18.152243 moveto
25.288319 9.076121 lineto
stroke
newpath
0.0 0.0 0.0 setrgbcolor
1.0 setlinewidth
10.0 setmiterlimit
1 setlinejoin
1 setlinecap
[ ] 0 setdash
newpath
-23.3383 -1388.6466 moveto
328.36142 18.152243 lineto
stroke
newpath
0.0 0.0 0.0 setrgbcolor
1.0 setlinewidth
10.0 setmiterlimit
1 setlinejoin
1 setlinecap
[ ] 0 setdash
newpath
-567.18677 -1388.6466 moveto
839.6122 18.152243 lineto
stroke
newpath
0.0 0.0 0.0 setrgbcolor
1.0 setlinewidth
10.0 setmiterlimit
1 setlinejoin
1 setlinecap
[ ] 0 setdash
newpath
-603.5621 -96.58621 moveto
1000.6424 -96.58621 lineto
stroke
newpath
0.2509804 0.2509804 0.2509804 setrgbcolor
newpath
23.019289 -1230.4445 moveto
23.019289 -1234.204 19.971664 -1237.2516 16.212196 -1237.2516 curveto
12.4528 -1237.2516 9.405107 -1234.204 9.405107 -1230.4445 curveto
9.405107 -1226.685 12.4528 -1223.6373 16.212196 -1223.6373 curveto
19.971664 -1223.6373 23.019289 -1226.685 23.019289 -1230.4445 curveto
closepath
fill
newpath
0.0 0.0 0.0 setrgbcolor
1.0 setlinewidth
10.0 setmiterlimit
1 setlinejoin
1 setlinecap
[ ] 0 setdash
newpath
23.019289 -1230.4445 moveto
23.019289 -1234.204 19.971664 -1237.2516 16.212196 -1237.2516 curveto
12.4528 -1237.2516 9.405107 -1234.204 9.405107 -1230.4445 curveto
9.405107 -1226.685 12.4528 -1223.6373 16.212196 -1223.6373 curveto
19.971664 -1223.6373 23.019289 -1226.685 23.019289 -1230.4445 curveto
closepath
stroke
newpath
0.0 0.0 1.0 setrgbcolor
newpath
51.365757 -1117.0587 moveto
51.365757 -1120.8181 48.318134 -1123.8657 44.558666 -1123.8657 curveto
40.7992 -1123.8657 37.751575 -1120.8181 37.751575 -1117.0587 curveto
37.751575 -1113.2992 40.7992 -1110.2516 44.558666 -1110.2516 curveto
48.318134 -1110.2516 51.365757 -1113.2992 51.365757 -1117.0587 curveto
closepath
fill
newpath
0.0 0.0 0.0 setrgbcolor
1.0 setlinewidth
10.0 setmiterlimit
1 setlinejoin
1 setlinecap
[ ] 0 setdash
newpath
51.365757 -1117.0587 moveto
51.365757 -1120.8181 48.318134 -1123.8657 44.558666 -1123.8657 curveto
40.7992 -1123.8657 37.751575 -1120.8181 37.751575 -1117.0587 curveto
37.751575 -1113.2992 40.7992 -1110.2516 44.558666 -1110.2516 curveto
48.318134 -1110.2516 51.365757 -1113.2992 51.365757 -1117.0587 curveto
closepath
stroke
newpath
0.49019608 0.49019608 1.0 setrgbcolor
newpath
23.019289 -805.2476 moveto
23.019289 -809.00714 19.971664 -812.05475 16.212196 -812.05475 curveto
12.4528 -812.05475 9.405107 -809.00714 9.405107 -805.2476 curveto
9.405107 -801.48816 12.4528 -798.44055 16.212196 -798.44055 curveto
19.971664 -798.44055 23.019289 -801.48816 23.019289 -805.2476 curveto
closepath
fill
newpath
0.0 0.0 0.0 setrgbcolor
1.0 setlinewidth
10.0 setmiterlimit
1 setlinejoin
1 setlinecap
[ ] 0 setdash
newpath
23.019289 -805.2476 moveto
23.019289 -809.00714 19.971664 -812.05475 16.212196 -812.05475 curveto
12.4528 -812.05475 9.405107 -809.00714 9.405107 -805.2476 curveto
9.405107 -801.48816 12.4528 -798.44055 16.212196 -798.44055 curveto
19.971664 -798.44055 23.019289 -801.48816 23.019289 -805.2476 curveto
closepath
stroke
newpath
0.0 0.0 1.0 setrgbcolor
newpath
51.365757 -776.9012 moveto
51.365757 -780.66064 48.318134 -783.70825 44.558666 -783.70825 curveto
40.7992 -783.70825 37.751575 -780.66064 37.751575 -776.9012 curveto
37.751575 -773.1417 40.7992 -770.09406 44.558666 -770.09406 curveto
48.318134 -770.09406 51.365757 -773.1417 51.365757 -776.9012 curveto
closepath
fill
newpath
0.0 0.0 0.0 setrgbcolor
1.0 setlinewidth
10.0 setmiterlimit
1 setlinejoin
1 setlinecap
[ ] 0 setdash
newpath
51.365757 -776.9012 moveto
51.365757 -780.66064 48.318134 -783.70825 44.558666 -783.70825 curveto
40.7992 -783.70825 37.751575 -780.66064 37.751575 -776.9012 curveto
37.751575 -773.1417 40.7992 -770.09406 44.558666 -770.09406 curveto
48.318134 -770.09406 51.365757 -773.1417 51.365757 -776.9012 curveto
closepath
stroke
newpath
0.49019608 0.49019608 1.0 setrgbcolor
newpath
23.019289 -96.58621 moveto
23.019289 -100.345665 19.971664 -103.3933 16.212196 -103.3933 curveto
12.4528 -103.3933 9.405107 -100.345665 9.405107 -96.58621 curveto
9.405107 -92.82676 12.4528 -89.77912 16.212196 -89.77912 curveto
19.971664 -89.77912 23.019289 -92.82676 23.019289 -96.58621 curveto
closepath
fill
newpath
0.0 0.0 0.0 setrgbcolor
1.0 setlinewidth
10.0 setmiterlimit
1 setlinejoin
1 setlinecap
[ ] 0 setdash
newpath
23.019289 -96.58621 moveto
23.019289 -100.345665 19.971664 -103.3933 16.212196 -103.3933 curveto
12.4528 -103.3933 9.405107 -100.345665 9.405107 -96.58621 curveto
9.405107 -92.82676 12.4528 -89.77912 16.212196 -89.77912 curveto
19.971664 -89.77912 23.019289 -92.82676 23.019289 -96.58621 curveto
closepath
stroke
newpath
0.0 0.0 1.0 setrgbcolor
newpath
51.365757 -96.58621 moveto
51.365757 -100.345665 48.318134 -103.3933 44.558666 -103.3933 curveto
40.7992 -103.3933 37.751575 -100.345665 37.751575 -96.58621 curveto
37.751575 -92.82676 40.7992 -89.77912 44.558666 -89.77912 curveto
48.318134 -89.77912 51.365757 -92.82676 51.365757 -96.58621 curveto
closepath
fill
newpath
0.0 0.0 0.0 setrgbcolor
1.0 setlinewidth
10.0 setmiterlimit
1 setlinejoin
1 setlinecap
[ ] 0 setdash
newpath
51.365757 -96.58621 moveto
51.365757 -100.345665 48.318134 -103.3933 44.558666 -103.3933 curveto
40.7992 -103.3933 37.751575 -100.345665 37.751575 -96.58621 curveto
37.751575 -92.82676 40.7992 -89.77912 44.558666 -89.77912 curveto
48.318134 -89.77912 51.365757 -92.82676 51.365757 -96.58621 curveto
closepath
stroke
newpath
grestore
grestore
showpage

%%EOF