%!PS-Adobe-3.0 EPSF-3.0
%%Creator: EpsGraphics2D 0.9.0 by Paul Mutton, http://www.jibble.org/
%%Title: GeoGebra, http://www.geogebra.org
%%CreationDate: Tue Mar 11 18:55:15 CET 2008
%%BoundingBox: 0 0 192 152
%%DocumentData: Clean7Bit
%%DocumentProcessColors: Black
%%ColorUsage: Color
%%Origin: 0 0
%%Pages: 1
%%Page: 1 1
%%EndComments

gsave
-0.0 152.0 translate
1.0 setlinewidth
10.0 setmiterlimit
0 setlinejoin
2 setlinecap
[ ] 0 setdash
gsave
newpath
0.0 -0.0 moveto
192.07492 -0.0 lineto
192.07492 -152.50584 lineto
0.0 -152.50584 lineto
0.0 -0.0 lineto
closepath
clip
newpath
1.0 setlinewidth
10.0 setmiterlimit
0 setlinejoin
2 setlinecap
[ ] 0 setdash
1.0 1.0 1.0 setrgbcolor
newpath
-53.99531 16.07494 moveto
237.4145 16.07494 lineto
237.4145 -239.47539 lineto
-53.99531 -239.47539 lineto
-53.99531 16.07494 lineto
closepath
fill
newpath
1.0 0.8 0.8 setrgbcolor
newpath
45.844803 -62.775528 moveto
18.632204 -105.29521 lineto
159.23062 -105.29521 lineto
187.57709 -62.775528 lineto
closepath
fill
newpath
0.0 0.0 0.0 setrgbcolor
1.5 setlinewidth
10.0 setmiterlimit
1 setlinejoin
1 setlinecap
[ ] 0 setdash
newpath
45.844803 -62.775528 moveto
18.632204 -105.29521 lineto
stroke
newpath
0.0 0.0 0.0 setrgbcolor
1.5 setlinewidth
10.0 setmiterlimit
1 setlinejoin
1 setlinecap
[ ] 0 setdash
newpath
18.632204 -105.29521 moveto
159.23062 -105.29521 lineto
stroke
newpath
0.0 0.0 0.0 setrgbcolor
1.5 setlinewidth
10.0 setmiterlimit
1 setlinejoin
1 setlinecap
[ ] 0 setdash
newpath
159.23062 -105.29521 moveto
187.57709 -62.775528 lineto
stroke
newpath
0.0 0.0 0.0 setrgbcolor
1.5 setlinewidth
10.0 setmiterlimit
1 setlinejoin
1 setlinecap
[ ] 0 setdash
newpath
187.57709 -62.775528 moveto
45.844803 -62.775528 lineto
stroke
newpath
0.0 0.0 0.0 setrgbcolor
1.5 setlinewidth
10.0 setmiterlimit
1 setlinejoin
0 setlinecap
[ 5.5 4.0 ] 0 setdash
newpath
130.88417 -6.082614 moveto
102.53772 -147.8149 lineto
stroke
newpath
0.0 0.0 0.0 setrgbcolor
1.5 setlinewidth
10.0 setmiterlimit
1 setlinejoin
1 setlinecap
[ ] 0 setdash
newpath
115.13015 -84.85272 moveto
130.88417 -6.082614 lineto
stroke
newpath
0.0 0.0 0.0 setrgbcolor
1.5 setlinewidth
10.0 setmiterlimit
1 setlinejoin
1 setlinecap
[ ] 0 setdash
newpath
111.28805 -105.29521 moveto
102.53772 -147.8149 lineto
stroke
newpath
0.0 0.0 0.0 setrgbcolor
newpath
116.366684 -84.85272 moveto
116.366684 -85.535645 115.81307 -86.08926 115.13015 -86.08926 curveto
114.44723 -86.08926 113.893616 -85.535645 113.893616 -84.85272 curveto
113.893616 -84.16981 114.44723 -83.61619 115.13015 -83.61619 curveto
115.81307 -83.61619 116.366684 -84.16981 116.366684 -84.85272 curveto
closepath
fill
newpath
0.0 0.0 0.0 setrgbcolor
1.0 setlinewidth
10.0 setmiterlimit
1 setlinejoin
1 setlinecap
[ ] 0 setdash
newpath
116.366684 -84.85272 moveto
116.366684 -85.535645 115.81307 -86.08926 115.13015 -86.08926 curveto
114.44723 -86.08926 113.893616 -85.535645 113.893616 -84.85272 curveto
113.893616 -84.16981 114.44723 -83.61619 115.13015 -83.61619 curveto
115.81307 -83.61619 116.366684 -84.16981 116.366684 -84.85272 curveto
closepath
stroke
newpath
0.0 0.0 0.0 setrgbcolor
newpath
29.72592 -100.15924 moveto
29.72592 -96.584885 lineto
30.699207 -96.584885 lineto
31.130705 -96.584885 31.440643 -96.65774 31.629023 -96.80345 curveto
31.817402 -96.949165 31.91159 -97.18866 31.91159 -97.52195 curveto
31.91159 -97.901924 31.782785 -98.19978 31.525173 -98.415535 curveto
31.267561 -98.63129 30.910126 -98.73916 30.452866 -98.73916 curveto
30.228262 -98.73916 lineto
30.228262 -100.15924 lineto
closepath
30.228262 -98.355156 moveto
30.433546 -98.355156 lineto
30.734629 -98.355156 30.967283 -98.28593 31.131512 -98.14746 curveto
31.295738 -98.008995 31.377851 -97.81337 31.377851 -97.56059 curveto
31.377851 -97.34645 31.313448 -97.1935 31.184643 -97.10172 curveto
31.055838 -97.00995 30.840893 -96.96406 30.53981 -96.96406 curveto
30.228262 -96.96406 lineto
closepath
fill
newpath
0.0 0.0 0.0 setrgbcolor
newpath
122.10289 -28.440279 moveto
122.10289 -27.947598 lineto
121.909676 -28.316303 121.618256 -28.500656 121.22862 -28.500656 curveto
120.91305 -28.500656 120.66469 -28.385536 120.48356 -28.155296 curveto
120.30243 -27.925056 120.21186 -27.610289 120.21186 -27.21099 curveto
120.21186 -26.774662 120.3145 -26.423666 120.51978 -26.158005 curveto
120.72507 -25.892344 120.99516 -25.759512 121.330055 -25.759512 curveto
121.6408 -25.759512 121.898415 -25.878656 122.10289 -26.116947 curveto
122.10289 -24.626827 lineto
122.58108 -24.626827 lineto
122.58108 -28.440279 lineto
closepath
122.10289 -26.442987 moveto
121.856544 -26.225628 121.623085 -26.116947 121.402504 -26.116947 curveto
120.94685 -26.116947 120.71903 -26.465527 120.71903 -27.162687 curveto
120.71903 -27.776125 120.9219 -28.082844 121.32764 -28.082844 curveto
121.59169 -28.082844 121.850105 -27.938742 122.10289 -27.65054 curveto
closepath
fill
newpath
grestore
grestore
showpage

%%EOF