%!PS-Adobe-3.0 EPSF-3.0
%%Creator: EpsGraphics2D 0.9.0 by Paul Mutton, http://www.jibble.org/
%%Title: GeoGebra, http://www.geogebra.org
%%CreationDate: Tue Mar 11 15:22:13 CET 2008
%%BoundingBox: 0 0 231 184
%%DocumentData: Clean7Bit
%%DocumentProcessColors: Black
%%ColorUsage: Color
%%Origin: 0 0
%%Pages: 1
%%Page: 1 1
%%EndComments

gsave
-0.0 184.0 translate
1.0 setlinewidth
10.0 setmiterlimit
0 setlinejoin
2 setlinecap
[ ] 0 setdash
gsave
newpath
0.0 -0.0 moveto
231.83342 -0.0 lineto
231.83342 -184.68086 lineto
0.0 -184.68086 lineto
0.0 -0.0 lineto
closepath
clip
newpath
1.0 setlinewidth
10.0 setmiterlimit
0 setlinejoin
2 setlinecap
[ ] 0 setdash
1.0 1.0 1.0 setrgbcolor
newpath
-126.52604 107.665016 moveto
429.0883 107.665016 lineto
429.0883 -379.57812 lineto
-126.52604 -379.57812 lineto
-126.52604 107.665016 lineto
closepath
fill
newpath
1.0 0.6 0.6117647 setrgbcolor
newpath
60.509636 -158.21504 moveto
145.54903 -158.21504 lineto
202.24193 -129.86858 lineto
117.20256 -129.86858 lineto
closepath
fill
newpath
0.0 0.0 0.0 setrgbcolor
1.0 setlinewidth
10.0 setmiterlimit
1 setlinejoin
1 setlinecap
[ ] 0 setdash
newpath
60.509636 -73.17566 moveto
145.54903 -73.17566 lineto
stroke
newpath
0.0 0.0 0.0 setrgbcolor
1.0 setlinewidth
10.0 setmiterlimit
1 setlinejoin
1 setlinecap
[ ] 0 setdash
newpath
117.20256 -44.829216 moveto
60.509636 -73.17566 lineto
stroke
newpath
0.0 0.0 0.0 setrgbcolor
1.0 setlinewidth
10.0 setmiterlimit
1 setlinejoin
1 setlinecap
[ ] 0 setdash
newpath
60.509636 -73.17566 moveto
60.509636 -158.21504 lineto
stroke
newpath
0.0 0.0 0.0 setrgbcolor
1.0 setlinewidth
10.0 setmiterlimit
1 setlinejoin
1 setlinecap
[ ] 0 setdash
newpath
60.509636 -158.21504 moveto
145.54903 -158.21504 lineto
stroke
newpath
0.0 0.0 0.0 setrgbcolor
1.0 setlinewidth
10.0 setmiterlimit
1 setlinejoin
1 setlinecap
[ ] 0 setdash
newpath
145.54903 -158.21504 moveto
202.24193 -129.86858 lineto
stroke
newpath
0.0 0.0 0.0 setrgbcolor
1.0 setlinewidth
10.0 setmiterlimit
1 setlinejoin
1 setlinecap
[ ] 0 setdash
newpath
202.24193 -129.86858 moveto
202.24193 -44.829216 lineto
stroke
newpath
0.0 0.0 0.0 setrgbcolor
1.0 setlinewidth
10.0 setmiterlimit
1 setlinejoin
1 setlinecap
[ ] 0 setdash
newpath
202.24193 -44.829216 moveto
117.20256 -44.829216 lineto
stroke
newpath
0.0 0.0 0.0 setrgbcolor
1.0 setlinewidth
10.0 setmiterlimit
1 setlinejoin
0 setlinecap
[ 5.0 4.0 ] 0 setdash
newpath
117.20256 -44.829216 moveto
117.20256 -129.86858 lineto
stroke
newpath
0.0 0.0 0.0 setrgbcolor
1.0 setlinewidth
10.0 setmiterlimit
1 setlinejoin
0 setlinecap
[ 5.0 4.0 ] 0 setdash
newpath
117.20256 -129.86858 moveto
60.509636 -158.21504 lineto
stroke
newpath
0.0 0.0 0.0 setrgbcolor
1.0 setlinewidth
10.0 setmiterlimit
1 setlinejoin
1 setlinecap
[ ] 0 setdash
newpath
145.54903 -73.17566 moveto
145.54903 -158.21504 lineto
stroke
newpath
0.0 0.0 0.0 setrgbcolor
1.0 setlinewidth
10.0 setmiterlimit
1 setlinejoin
1 setlinecap
[ ] 0 setdash
newpath
145.54903 -73.17566 moveto
202.24193 -44.829216 lineto
stroke
newpath
0.0 0.0 0.0 setrgbcolor
1.0 setlinewidth
10.0 setmiterlimit
1 setlinejoin
0 setlinecap
[ 5.0 4.0 ] 0 setdash
newpath
117.20256 -129.86858 moveto
202.24193 -129.86858 lineto
stroke
newpath
1.0 0.6 0.6117647 setrgbcolor
1.0 setlinewidth
10.0 setmiterlimit
1 setlinejoin
1 setlinecap
[ ] 0 setdash
newpath
60.509636 -158.21504 moveto
145.54903 -158.21504 lineto
stroke
newpath
1.0 0.6 0.6117647 setrgbcolor
1.0 setlinewidth
10.0 setmiterlimit
1 setlinejoin
1 setlinecap
[ ] 0 setdash
newpath
145.54903 -158.21504 moveto
202.24193 -129.86858 lineto
stroke
newpath
1.0 0.6 0.6117647 setrgbcolor
1.0 setlinewidth
10.0 setmiterlimit
1 setlinejoin
1 setlinecap
[ ] 0 setdash
newpath
202.24193 -129.86858 moveto
117.20256 -129.86858 lineto
stroke
newpath
1.0 0.6 0.6117647 setrgbcolor
1.0 setlinewidth
10.0 setmiterlimit
1 setlinejoin
1 setlinecap
[ ] 0 setdash
newpath
117.20256 -129.86858 moveto
60.509636 -158.21504 lineto
stroke
newpath
0.0 0.0 0.007843138 setrgbcolor
2.5 setlinewidth
10.0 setmiterlimit
1 setlinejoin
1 setlinecap
[ ] 0 setdash
newpath
80.94523 -8.644636 moveto
182.32324 -109.23676 lineto
stroke
newpath
0.0 0.0 0.0 setrgbcolor
newpath
61.29551 -73.17566 moveto
61.29551 -73.609695 60.94367 -73.96154 60.509636 -73.96154 curveto
60.075615 -73.96154 59.72376 -73.609695 59.72376 -73.17566 curveto
59.72376 -72.74164 60.075615 -72.389786 60.509636 -72.389786 curveto
60.94367 -72.389786 61.29551 -72.74164 61.29551 -73.17566 curveto
closepath
fill
newpath
0.0 0.0 0.0 setrgbcolor
1.0 setlinewidth
10.0 setmiterlimit
1 setlinejoin
1 setlinecap
[ ] 0 setdash
newpath
61.29551 -73.17566 moveto
61.29551 -73.609695 60.94367 -73.96154 60.509636 -73.96154 curveto
60.075615 -73.96154 59.72376 -73.609695 59.72376 -73.17566 curveto
59.72376 -72.74164 60.075615 -72.389786 60.509636 -72.389786 curveto
60.94367 -72.389786 61.29551 -72.74164 61.29551 -73.17566 curveto
closepath
stroke
newpath
0.0 0.0 0.0 setrgbcolor
newpath
40.173306 -68.371216 moveto
40.173306 -61.556194 lineto
43.98143 -61.556194 lineto
43.98143 -62.27914 lineto
41.1403 -62.27914 lineto
41.1403 -64.46639 lineto
43.520954 -64.46639 lineto
43.520954 -65.18013 lineto
41.1403 -65.18013 lineto
41.1403 -67.64827 lineto
44.179432 -67.64827 lineto
44.179432 -68.371216 lineto
closepath
fill
newpath
0.0 0.0 0.0 setrgbcolor
newpath
61.29551 -158.21504 moveto
61.29551 -158.64906 60.94367 -159.00092 60.509636 -159.00092 curveto
60.075615 -159.00092 59.72376 -158.64906 59.72376 -158.21504 curveto
59.72376 -157.78102 60.075615 -157.42915 60.509636 -157.42915 curveto
60.94367 -157.42915 61.29551 -157.78102 61.29551 -158.21504 curveto
closepath
fill
newpath
0.0 0.0 0.0 setrgbcolor
1.0 setlinewidth
10.0 setmiterlimit
1 setlinejoin
1 setlinecap
[ ] 0 setdash
newpath
61.29551 -158.21504 moveto
61.29551 -158.64906 60.94367 -159.00092 60.509636 -159.00092 curveto
60.075615 -159.00092 59.72376 -158.64906 59.72376 -158.21504 curveto
59.72376 -157.78102 60.075615 -157.42915 60.509636 -157.42915 curveto
60.94367 -157.42915 61.29551 -157.78102 61.29551 -158.21504 curveto
closepath
stroke
newpath
0.0 0.0 0.0 setrgbcolor
newpath
46.770367 -173.42995 moveto
45.609974 -170.49211 lineto
44.444973 -173.42995 lineto
closepath
47.79262 -176.03622 moveto
47.051258 -174.14828 lineto
44.16408 -174.14828 lineto
43.41351 -176.03622 lineto
42.515587 -176.03622 lineto
45.21857 -169.2212 lineto
46.176353 -169.2212 lineto
48.8379 -176.03622 lineto
closepath
fill
newpath
0.0 0.0 0.0 setrgbcolor
newpath
146.3349 -73.17566 moveto
146.3349 -73.609695 145.98305 -73.96154 145.54903 -73.96154 curveto
145.11497 -73.96154 144.76314 -73.609695 144.76314 -73.17566 curveto
144.76314 -72.74164 145.11497 -72.389786 145.54903 -72.389786 curveto
145.98305 -72.389786 146.3349 -72.74164 146.3349 -73.17566 curveto
closepath
fill
newpath
0.0 0.0 0.0 setrgbcolor
1.0 setlinewidth
10.0 setmiterlimit
1 setlinejoin
1 setlinecap
[ ] 0 setdash
newpath
146.3349 -73.17566 moveto
146.3349 -73.609695 145.98305 -73.96154 145.54903 -73.96154 curveto
145.11497 -73.96154 144.76314 -73.609695 144.76314 -73.17566 curveto
144.76314 -72.74164 145.11497 -72.389786 145.54903 -72.389786 curveto
145.98305 -72.389786 146.3349 -72.74164 146.3349 -73.17566 curveto
closepath
stroke
newpath
0.0 0.0 0.0 setrgbcolor
newpath
158.0547 -80.159355 moveto
158.0547 -73.34434 lineto
161.86282 -73.34434 lineto
161.86282 -74.067276 lineto
159.0217 -74.067276 lineto
159.0217 -76.351234 lineto
161.40697 -76.351234 lineto
161.40697 -77.064964 lineto
159.0217 -77.064964 lineto
159.0217 -80.159355 lineto
closepath
fill
newpath
0.0 0.0 0.0 setrgbcolor
newpath
146.3349 -158.21504 moveto
146.3349 -158.64906 145.98305 -159.00092 145.54903 -159.00092 curveto
145.11497 -159.00092 144.76314 -158.64906 144.76314 -158.21504 curveto
144.76314 -157.78102 145.11497 -157.42915 145.54903 -157.42915 curveto
145.98305 -157.42915 146.3349 -157.78102 146.3349 -158.21504 curveto
closepath
fill
newpath
0.0 0.0 0.0 setrgbcolor
1.0 setlinewidth
10.0 setmiterlimit
1 setlinejoin
1 setlinecap
[ ] 0 setdash
newpath
146.3349 -158.21504 moveto
146.3349 -158.64906 145.98305 -159.00092 145.54903 -159.00092 curveto
145.11497 -159.00092 144.76314 -158.64906 144.76314 -158.21504 curveto
144.76314 -157.78102 145.11497 -157.42915 145.54903 -157.42915 curveto
145.98305 -157.42915 146.3349 -157.78102 146.3349 -158.21504 curveto
closepath
stroke
newpath
0.0 0.0 0.0 setrgbcolor
newpath
154.12534 -175.25035 moveto
154.12534 -168.43533 lineto
155.89355 -168.43533 lineto
156.57506 -168.43533 157.09769 -168.56427 157.46146 -168.82213 curveto
157.82524 -169.07999 158.00713 -169.45145 158.00713 -169.93648 curveto
158.00713 -170.76227 157.54051 -171.35013 156.60728 -171.70009 curveto
157.72163 -172.04085 158.27881 -172.65636 158.27881 -173.5466 curveto
158.27881 -174.09917 158.09462 -174.52126 157.72624 -174.8129 curveto
157.35785 -175.10454 156.82677 -175.25035 156.133 -175.25035 curveto
closepath
155.08311 -174.5274 moveto
155.28111 -174.5274 lineto
155.99025 -174.5274 156.44919 -174.4829 156.65794 -174.39388 curveto
157.057 -174.22504 157.25655 -173.91191 157.25655 -173.4545 curveto
157.25655 -173.04929 157.07542 -172.71237 156.7132 -172.44376 curveto
156.35095 -172.17516 155.89815 -172.04085 155.3548 -172.04085 curveto
155.08311 -172.04085 lineto
closepath
155.08311 -171.42842 moveto
155.39163 -171.42842 lineto
155.90736 -171.42842 156.3072 -171.3179 156.59117 -171.09688 curveto
156.87512 -170.87585 157.0171 -170.56425 157.0171 -170.16211 curveto
157.0171 -169.49289 156.4983 -169.15828 155.46071 -169.15828 curveto
155.08311 -169.15828 lineto
closepath
fill
newpath
0.0 0.0 0.0 setrgbcolor
newpath
117.98844 -44.829216 moveto
117.98844 -45.263237 117.63658 -45.615093 117.20256 -45.615093 curveto
116.76852 -45.615093 116.41669 -45.263237 116.41669 -44.829216 curveto
116.41669 -44.395184 116.76852 -44.04334 117.20256 -44.04334 curveto
117.63658 -44.04334 117.98844 -44.395184 117.98844 -44.829216 curveto
closepath
fill
newpath
0.0 0.0 0.0 setrgbcolor
1.0 setlinewidth
10.0 setmiterlimit
1 setlinejoin
1 setlinecap
[ ] 0 setdash
newpath
117.98844 -44.829216 moveto
117.98844 -45.263237 117.63658 -45.615093 117.20256 -45.615093 curveto
116.76852 -45.615093 116.41669 -45.263237 116.41669 -44.829216 curveto
116.41669 -44.395184 116.76852 -44.04334 117.20256 -44.04334 curveto
117.63658 -44.04334 117.98844 -44.395184 117.98844 -44.829216 curveto
closepath
stroke
newpath
0.0 0.0 0.0 setrgbcolor
newpath
120.33266 -35.36442 moveto
120.33266 -28.549402 lineto
121.29965 -28.549402 lineto
121.29965 -31.422762 lineto
124.5414 -31.422762 lineto
124.5414 -28.549402 lineto
125.50839 -28.549402 lineto
125.50839 -35.36442 lineto
124.5414 -35.36442 lineto
124.5414 -32.145706 lineto
121.29965 -32.145706 lineto
121.29965 -35.36442 lineto
closepath
fill
newpath
0.0 0.0 0.0 setrgbcolor
newpath
203.02782 -44.829216 moveto
203.02782 -45.263237 202.67595 -45.615093 202.24193 -45.615093 curveto
201.80789 -45.615093 201.45605 -45.263237 201.45605 -44.829216 curveto
201.45605 -44.395184 201.80789 -44.04334 202.24193 -44.04334 curveto
202.67595 -44.04334 203.02782 -44.395184 203.02782 -44.829216 curveto
closepath
fill
newpath
0.0 0.0 0.0 setrgbcolor
1.0 setlinewidth
10.0 setmiterlimit
1 setlinejoin
1 setlinecap
[ ] 0 setdash
newpath
203.02782 -44.829216 moveto
203.02782 -45.263237 202.67595 -45.615093 202.24193 -45.615093 curveto
201.80789 -45.615093 201.45605 -45.263237 201.45605 -44.829216 curveto
201.45605 -44.395184 201.80789 -44.04334 202.24193 -44.04334 curveto
202.67595 -44.04334 203.02782 -44.395184 203.02782 -44.829216 curveto
closepath
stroke
newpath
0.0 0.0 0.0 setrgbcolor
newpath
215.043 -39.89549 moveto
214.21721 -40.131866 213.49734 -40.250053 212.88338 -40.250053 curveto
211.79973 -40.250053 210.96857 -39.941536 210.38991 -39.324497 curveto
209.81125 -38.707462 209.52191 -37.823353 209.52191 -36.67217 curveto
209.52191 -35.542473 209.81508 -34.663734 210.40141 -34.035954 curveto
210.98776 -33.408173 211.81047 -33.094284 212.86955 -33.094284 curveto
213.56334 -33.094284 214.28474 -33.197124 215.03378 -33.4028 curveto
215.03378 -34.29612 lineto
214.09442 -33.976856 213.37454 -33.817226 212.87416 -33.817226 curveto
212.1374 -33.817226 211.56566 -34.067417 211.1589 -34.5678 curveto
210.75215 -35.068184 210.54877 -35.77271 210.54877 -36.681377 curveto
210.54877 -37.580837 210.76672 -38.27999 211.20264 -38.778835 curveto
211.63857 -39.277683 212.24945 -39.527107 213.03532 -39.527107 curveto
213.35767 -39.527107 213.70609 -39.470314 214.08061 -39.35673 curveto
214.08061 -37.137245 lineto
215.043 -37.137245 lineto
closepath
fill
newpath
0.0 0.0 0.0 setrgbcolor
newpath
203.02782 -129.86858 moveto
203.02782 -130.3026 202.67595 -130.65445 202.24193 -130.65445 curveto
201.80789 -130.65445 201.45605 -130.3026 201.45605 -129.86858 curveto
201.45605 -129.43456 201.80789 -129.0827 202.24193 -129.0827 curveto
202.67595 -129.0827 203.02782 -129.43456 203.02782 -129.86858 curveto
closepath
fill
newpath
0.0 0.0 0.0 setrgbcolor
1.0 setlinewidth
10.0 setmiterlimit
1 setlinejoin
1 setlinecap
[ ] 0 setdash
newpath
203.02782 -129.86858 moveto
203.02782 -130.3026 202.67595 -130.65445 202.24193 -130.65445 curveto
201.80789 -130.65445 201.45605 -130.3026 201.45605 -129.86858 curveto
201.45605 -129.43456 201.80789 -129.0827 202.24193 -129.0827 curveto
202.67595 -129.0827 203.02782 -129.43456 203.02782 -129.86858 curveto
closepath
stroke
newpath
0.0 0.0 0.0 setrgbcolor
newpath
215.98544 -125.91054 moveto
214.92635 -125.91054 214.10825 -125.59972 213.53111 -124.97808 curveto
212.95398 -124.35644 212.66542 -123.476166 212.66542 -122.33726 curveto
212.66542 -121.201416 212.95935 -120.32038 213.54723 -119.69414 curveto
214.1351 -119.067894 214.96318 -118.75477 216.03148 -118.75477 curveto
216.64238 -118.75477 217.35765 -118.85454 218.17729 -119.05408 curveto
218.17729 -119.96121 lineto
217.24406 -119.63888 216.52419 -119.477715 216.01767 -119.477715 curveto
215.27785 -119.477715 214.70532 -119.727905 214.3001 -120.22829 curveto
213.89488 -120.72867 213.69228 -121.43473 213.69228 -122.346466 curveto
213.69228 -123.21523 213.90869 -123.900566 214.34154 -124.40248 curveto
214.77438 -124.904396 215.36533 -125.15536 216.11436 -125.15536 curveto
216.75903 -125.15536 217.44974 -124.95735 218.18651 -124.56135 curveto
218.18651 -125.3902 lineto
217.51422 -125.73709 216.78053 -125.91054 215.98544 -125.91054 curveto
closepath
fill
newpath
0.0 0.0 0.0 setrgbcolor
newpath
117.98844 -129.86858 moveto
117.98844 -130.3026 117.63658 -130.65445 117.20256 -130.65445 curveto
116.76852 -130.65445 116.41669 -130.3026 116.41669 -129.86858 curveto
116.41669 -129.43456 116.76852 -129.0827 117.20256 -129.0827 curveto
117.63658 -129.0827 117.98844 -129.43456 117.98844 -129.86858 curveto
closepath
fill
newpath
0.0 0.0 0.0 setrgbcolor
1.0 setlinewidth
10.0 setmiterlimit
1 setlinejoin
1 setlinecap
[ ] 0 setdash
newpath
117.98844 -129.86858 moveto
117.98844 -130.3026 117.63658 -130.65445 117.20256 -130.65445 curveto
116.76852 -130.65445 116.41669 -130.3026 116.41669 -129.86858 curveto
116.41669 -129.43456 116.76852 -129.0827 117.20256 -129.0827 curveto
117.63658 -129.0827 117.98844 -129.43456 117.98844 -129.86858 curveto
closepath
stroke
newpath
0.0 0.0 0.0 setrgbcolor
newpath
125.04791 -121.0249 moveto
125.04791 -114.209885 lineto
127.313446 -114.209885 lineto
127.98881 -114.209885 128.53447 -114.285095 128.95044 -114.43552 curveto
129.3664 -114.585945 129.72633 -114.84074 130.03024 -115.199905 curveto
130.5122 -115.7709 130.75319 -116.523 130.75319 -117.45623 curveto
130.75319 -118.589 130.45389 -119.466965 129.85527 -120.09014 curveto
129.25665 -120.71332 128.41397 -121.0249 127.32726 -121.0249 curveto
closepath
126.01491 -120.30196 moveto
127.253586 -120.30196 lineto
128.1377 -120.30196 128.76395 -120.06405 129.13232 -119.58823 curveto
129.52834 -119.0817 129.72633 -118.40174 129.72633 -117.548325 curveto
129.72633 -116.7471 129.5314 -116.11778 129.14153 -115.66038 curveto
128.90515 -115.38103 128.62274 -115.189926 128.29427 -115.08709 curveto
127.96579 -114.98425 127.47154 -114.93283 126.81153 -114.93283 curveto
126.01491 -114.93283 lineto
closepath
fill
newpath
0.2509804 0.2509804 0.2509804 setrgbcolor
newpath
174.68135 -144.04181 moveto
174.68135 -144.47583 174.3295 -144.82768 173.89548 -144.82768 curveto
173.46143 -144.82768 173.1096 -144.47583 173.1096 -144.04181 curveto
173.1096 -143.60779 173.46143 -143.25594 173.89548 -143.25594 curveto
174.3295 -143.25594 174.68135 -143.60779 174.68135 -144.04181 curveto
closepath
fill
newpath
0.0 0.0 0.0 setrgbcolor
1.0 setlinewidth
10.0 setmiterlimit
1 setlinejoin
1 setlinecap
[ ] 0 setdash
newpath
174.68135 -144.04181 moveto
174.68135 -144.47583 174.3295 -144.82768 173.89548 -144.82768 curveto
173.46143 -144.82768 173.1096 -144.47583 173.1096 -144.04181 curveto
173.1096 -143.60779 173.46143 -143.25594 173.89548 -143.25594 curveto
174.3295 -143.25594 174.68135 -143.60779 174.68135 -144.04181 curveto
closepath
stroke
newpath
0.2509804 0.2509804 0.2509804 setrgbcolor
newpath
187.12752 -154.81758 moveto
187.12752 -148.00255 lineto
188.09451 -148.00255 lineto
188.09451 -154.81758 lineto
closepath
fill
newpath
grestore
grestore
showpage

%%EOF