%!PS-Adobe-3.0 EPSF-3.0
%%Creator: EpsGraphics2D 0.9.0 by Paul Mutton, http://www.jibble.org/
%%Title: GeoGebra, http://www.geogebra.org
%%CreationDate: Tue Mar 11 15:25:42 CET 2008
%%BoundingBox: 0 0 282 155
%%DocumentData: Clean7Bit
%%DocumentProcessColors: Black
%%ColorUsage: Color
%%Origin: 0 0
%%Pages: 1
%%Page: 1 1
%%EndComments

gsave
-0.0 155.0 translate
1.0 setlinewidth
10.0 setmiterlimit
0 setlinejoin
2 setlinecap
[ ] 0 setdash
gsave
newpath
0.0 -0.0 moveto
282.91537 -0.0 lineto
282.91537 -155.60345 lineto
0.0 -155.60345 lineto
0.0 -0.0 lineto
closepath
clip
newpath
1.0 setlinewidth
10.0 setmiterlimit
0 setlinejoin
2 setlinecap
[ ] 0 setdash
1.0 1.0 1.0 setrgbcolor
newpath
-95.87688 134.3848 moveto
459.73746 134.3848 lineto
459.73746 -352.85834 lineto
-95.87688 -352.85834 lineto
-95.87688 134.3848 lineto
closepath
fill
newpath
0.0 0.0 0.0 setrgbcolor
1.0 setlinewidth
10.0 setmiterlimit
1 setlinejoin
1 setlinecap
[ ] 0 setdash
newpath
91.1588 -46.45588 moveto
176.19818 -46.45588 lineto
stroke
newpath
0.0 0.0 0.0 setrgbcolor
1.0 setlinewidth
10.0 setmiterlimit
1 setlinejoin
1 setlinecap
[ ] 0 setdash
newpath
147.85173 -18.109432 moveto
91.1588 -46.45588 lineto
stroke
newpath
0.0 0.0 0.0 setrgbcolor
1.0 setlinewidth
10.0 setmiterlimit
1 setlinejoin
1 setlinecap
[ ] 0 setdash
newpath
91.1588 -46.45588 moveto
91.1588 -131.49525 lineto
stroke
newpath
0.0 0.0 0.0 setrgbcolor
1.0 setlinewidth
10.0 setmiterlimit
1 setlinejoin
1 setlinecap
[ ] 0 setdash
newpath
91.1588 -131.49525 moveto
176.19818 -131.49525 lineto
stroke
newpath
0.0 0.0 0.0 setrgbcolor
1.0 setlinewidth
10.0 setmiterlimit
1 setlinejoin
1 setlinecap
[ ] 0 setdash
newpath
176.19818 -131.49525 moveto
232.8911 -103.148796 lineto
stroke
newpath
0.0 0.0 0.0 setrgbcolor
1.0 setlinewidth
10.0 setmiterlimit
1 setlinejoin
1 setlinecap
[ ] 0 setdash
newpath
232.8911 -103.148796 moveto
232.8911 -18.109432 lineto
stroke
newpath
0.0 0.0 0.0 setrgbcolor
1.0 setlinewidth
10.0 setmiterlimit
1 setlinejoin
1 setlinecap
[ ] 0 setdash
newpath
232.8911 -18.109432 moveto
147.85173 -18.109432 lineto
stroke
newpath
0.0 0.0 0.0 setrgbcolor
1.0 setlinewidth
10.0 setmiterlimit
1 setlinejoin
0 setlinecap
[ 5.0 4.0 ] 0 setdash
newpath
147.85173 -18.109432 moveto
147.85173 -103.148796 lineto
stroke
newpath
0.0 0.0 0.0 setrgbcolor
1.0 setlinewidth
10.0 setmiterlimit
1 setlinejoin
0 setlinecap
[ 5.0 4.0 ] 0 setdash
newpath
147.85173 -103.148796 moveto
91.1588 -131.49525 lineto
stroke
newpath
0.0 0.0 0.0 setrgbcolor
1.0 setlinewidth
10.0 setmiterlimit
1 setlinejoin
1 setlinecap
[ ] 0 setdash
newpath
176.19818 -46.45588 moveto
176.19818 -131.49525 lineto
stroke
newpath
0.0 0.0 0.0 setrgbcolor
1.0 setlinewidth
10.0 setmiterlimit
1 setlinejoin
1 setlinecap
[ ] 0 setdash
newpath
176.19818 -46.45588 moveto
232.8911 -18.109432 lineto
stroke
newpath
0.0 0.0 0.0 setrgbcolor
1.0 setlinewidth
10.0 setmiterlimit
1 setlinejoin
0 setlinecap
[ 5.0 4.0 ] 0 setdash
newpath
147.85173 -103.148796 moveto
232.8911 -103.148796 lineto
stroke
newpath
0.0 0.4 0.8 setrgbcolor
2.5 setlinewidth
10.0 setmiterlimit
1 setlinejoin
1 setlinecap
[ ] 0 setdash
newpath
34.465897 -131.49525 moveto
261.23755 -131.49525 lineto
stroke
newpath
0.0 0.4 0.8 setrgbcolor
2.5 setlinewidth
10.0 setmiterlimit
1 setlinejoin
1 setlinecap
[ ] 0 setdash
newpath
91.1588 -131.49525 moveto
176.19818 -46.45588 lineto
stroke
newpath
0.0 0.0 0.0 setrgbcolor
newpath
91.94467 -46.45588 moveto
91.94467 -46.88991 91.592834 -47.241753 91.1588 -47.241753 curveto
90.72478 -47.241753 90.372925 -46.88991 90.372925 -46.45588 curveto
90.372925 -46.02186 90.72478 -45.670002 91.1588 -45.670002 curveto
91.592834 -45.670002 91.94467 -46.02186 91.94467 -46.45588 curveto
closepath
fill
newpath
0.0 0.0 0.0 setrgbcolor
1.0 setlinewidth
10.0 setmiterlimit
1 setlinejoin
1 setlinecap
[ ] 0 setdash
newpath
91.94467 -46.45588 moveto
91.94467 -46.88991 91.592834 -47.241753 91.1588 -47.241753 curveto
90.72478 -47.241753 90.372925 -46.88991 90.372925 -46.45588 curveto
90.372925 -46.02186 90.72478 -45.670002 91.1588 -45.670002 curveto
91.592834 -45.670002 91.94467 -46.02186 91.94467 -46.45588 curveto
closepath
stroke
newpath
0.0 0.0 0.0 setrgbcolor
newpath
70.82247 -41.65143 moveto
70.82247 -34.83641 lineto
74.63059 -34.83641 lineto
74.63059 -35.559353 lineto
71.78947 -35.559353 lineto
71.78947 -37.74661 lineto
74.17012 -37.74661 lineto
74.17012 -38.460342 lineto
71.78947 -38.460342 lineto
71.78947 -40.928486 lineto
74.8286 -40.928486 lineto
74.8286 -41.65143 lineto
closepath
fill
newpath
0.0 0.0 0.0 setrgbcolor
newpath
91.94467 -131.49525 moveto
91.94467 -131.92928 91.592834 -132.28113 91.1588 -132.28113 curveto
90.72478 -132.28113 90.372925 -131.92928 90.372925 -131.49525 curveto
90.372925 -131.06123 90.72478 -130.70938 91.1588 -130.70938 curveto
91.592834 -130.70938 91.94467 -131.06123 91.94467 -131.49525 curveto
closepath
fill
newpath
0.0 0.0 0.0 setrgbcolor
1.0 setlinewidth
10.0 setmiterlimit
1 setlinejoin
1 setlinecap
[ ] 0 setdash
newpath
91.94467 -131.49525 moveto
91.94467 -131.92928 91.592834 -132.28113 91.1588 -132.28113 curveto
90.72478 -132.28113 90.372925 -131.92928 90.372925 -131.49525 curveto
90.372925 -131.06123 90.72478 -130.70938 91.1588 -130.70938 curveto
91.592834 -130.70938 91.94467 -131.06123 91.94467 -131.49525 curveto
closepath
stroke
newpath
0.0 0.0 0.0 setrgbcolor
newpath
77.41953 -146.71016 moveto
76.25914 -143.77234 lineto
75.09414 -146.71016 lineto
closepath
78.44179 -149.31644 moveto
77.700424 -147.4285 lineto
74.81325 -147.4285 lineto
74.062675 -149.31644 lineto
73.16475 -149.31644 lineto
75.86774 -142.50142 lineto
76.82552 -142.50142 lineto
79.48706 -149.31644 lineto
closepath
fill
newpath
0.0 0.0 0.0 setrgbcolor
newpath
176.98405 -46.45588 moveto
176.98405 -46.88991 176.6322 -47.241753 176.19818 -47.241753 curveto
175.76414 -47.241753 175.41231 -46.88991 175.41231 -46.45588 curveto
175.41231 -46.02186 175.76414 -45.670002 176.19818 -45.670002 curveto
176.6322 -45.670002 176.98405 -46.02186 176.98405 -46.45588 curveto
closepath
fill
newpath
0.0 0.0 0.0 setrgbcolor
1.0 setlinewidth
10.0 setmiterlimit
1 setlinejoin
1 setlinecap
[ ] 0 setdash
newpath
176.98405 -46.45588 moveto
176.98405 -46.88991 176.6322 -47.241753 176.19818 -47.241753 curveto
175.76414 -47.241753 175.41231 -46.88991 175.41231 -46.45588 curveto
175.41231 -46.02186 175.76414 -45.670002 176.19818 -45.670002 curveto
176.6322 -45.670002 176.98405 -46.02186 176.98405 -46.45588 curveto
closepath
stroke
newpath
0.0 0.0 0.0 setrgbcolor
newpath
188.70387 -53.439568 moveto
188.70387 -46.62455 lineto
192.512 -46.62455 lineto
192.512 -47.347496 lineto
189.67087 -47.347496 lineto
189.67087 -49.631447 lineto
192.05612 -49.631447 lineto
192.05612 -50.34518 lineto
189.67087 -50.34518 lineto
189.67087 -53.439568 lineto
closepath
fill
newpath
0.0 0.0 0.0 setrgbcolor
newpath
176.98405 -131.49525 moveto
176.98405 -131.92928 176.6322 -132.28113 176.19818 -132.28113 curveto
175.76414 -132.28113 175.41231 -131.92928 175.41231 -131.49525 curveto
175.41231 -131.06123 175.76414 -130.70938 176.19818 -130.70938 curveto
176.6322 -130.70938 176.98405 -131.06123 176.98405 -131.49525 curveto
closepath
fill
newpath
0.0 0.0 0.0 setrgbcolor
1.0 setlinewidth
10.0 setmiterlimit
1 setlinejoin
1 setlinecap
[ ] 0 setdash
newpath
176.98405 -131.49525 moveto
176.98405 -131.92928 176.6322 -132.28113 176.19818 -132.28113 curveto
175.76414 -132.28113 175.41231 -131.92928 175.41231 -131.49525 curveto
175.41231 -131.06123 175.76414 -130.70938 176.19818 -130.70938 curveto
176.6322 -130.70938 176.98405 -131.06123 176.98405 -131.49525 curveto
closepath
stroke
newpath
0.0 0.0 0.0 setrgbcolor
newpath
184.77449 -148.53056 moveto
184.77449 -141.71555 lineto
186.54271 -141.71555 lineto
187.22421 -141.71555 187.74686 -141.84448 188.11063 -142.10234 curveto
188.47441 -142.36021 188.6563 -142.73166 188.6563 -143.21669 curveto
188.6563 -144.04248 188.18968 -144.63036 187.25645 -144.98032 curveto
188.37079 -145.32106 188.92796 -145.93657 188.92796 -146.82681 curveto
188.92796 -147.37938 188.74377 -147.80148 188.3754 -148.09311 curveto
188.00702 -148.38475 187.47594 -148.53056 186.78217 -148.53056 curveto
closepath
185.73228 -147.80762 moveto
185.93028 -147.80762 lineto
186.6394 -147.80762 187.09834 -147.7631 187.3071 -147.67409 curveto
187.70618 -147.50525 187.90572 -147.19212 187.90572 -146.73471 curveto
187.90572 -146.3295 187.7246 -145.99258 187.36235 -145.72397 curveto
187.00012 -145.45537 186.54732 -145.32106 186.00395 -145.32106 curveto
185.73228 -145.32106 lineto
closepath
185.73228 -144.70863 moveto
186.0408 -144.70863 lineto
186.55653 -144.70863 186.95638 -144.59811 187.24033 -144.37709 curveto
187.52429 -144.15607 187.66628 -143.84447 187.66628 -143.44232 curveto
187.66628 -142.7731 187.14748 -142.43849 186.10986 -142.43849 curveto
185.73228 -142.43849 lineto
closepath
fill
newpath
0.0 0.0 0.0 setrgbcolor
newpath
148.6376 -18.109432 moveto
148.6376 -18.543453 148.28575 -18.895308 147.85173 -18.895308 curveto
147.41768 -18.895308 147.06586 -18.543453 147.06586 -18.109432 curveto
147.06586 -17.6754 147.41768 -17.323557 147.85173 -17.323557 curveto
148.28575 -17.323557 148.6376 -17.6754 148.6376 -18.109432 curveto
closepath
fill
newpath
0.0 0.0 0.0 setrgbcolor
1.0 setlinewidth
10.0 setmiterlimit
1 setlinejoin
1 setlinecap
[ ] 0 setdash
newpath
148.6376 -18.109432 moveto
148.6376 -18.543453 148.28575 -18.895308 147.85173 -18.895308 curveto
147.41768 -18.895308 147.06586 -18.543453 147.06586 -18.109432 curveto
147.06586 -17.6754 147.41768 -17.323557 147.85173 -17.323557 curveto
148.28575 -17.323557 148.6376 -17.6754 148.6376 -18.109432 curveto
closepath
stroke
newpath
0.0 0.0 0.0 setrgbcolor
newpath
150.98183 -8.644636 moveto
150.98183 -1.8296176 lineto
151.94882 -1.8296176 lineto
151.94882 -4.7029767 lineto
155.19055 -4.7029767 lineto
155.19055 -1.8296176 lineto
156.15755 -1.8296176 lineto
156.15755 -8.644636 lineto
155.19055 -8.644636 lineto
155.19055 -5.4259214 lineto
151.94882 -5.4259214 lineto
151.94882 -8.644636 lineto
closepath
fill
newpath
0.0 0.0 0.0 setrgbcolor
newpath
233.67697 -18.109432 moveto
233.67697 -18.543453 233.32512 -18.895308 232.8911 -18.895308 curveto
232.45706 -18.895308 232.10522 -18.543453 232.10522 -18.109432 curveto
232.10522 -17.6754 232.45706 -17.323557 232.8911 -17.323557 curveto
233.32512 -17.323557 233.67697 -17.6754 233.67697 -18.109432 curveto
closepath
fill
newpath
0.0 0.0 0.0 setrgbcolor
1.0 setlinewidth
10.0 setmiterlimit
1 setlinejoin
1 setlinecap
[ ] 0 setdash
newpath
233.67697 -18.109432 moveto
233.67697 -18.543453 233.32512 -18.895308 232.8911 -18.895308 curveto
232.45706 -18.895308 232.10522 -18.543453 232.10522 -18.109432 curveto
232.10522 -17.6754 232.45706 -17.323557 232.8911 -17.323557 curveto
233.32512 -17.323557 233.67697 -17.6754 233.67697 -18.109432 curveto
closepath
stroke
newpath
0.0 0.0 0.0 setrgbcolor
newpath
245.69217 -13.175702 moveto
244.86638 -13.412079 244.1465 -13.530268 243.53253 -13.530268 curveto
242.44888 -13.530268 241.61774 -13.22175 241.03908 -12.604714 curveto
240.46042 -11.987679 240.17108 -11.103568 240.17108 -9.952383 curveto
240.17108 -8.822686 240.46425 -7.9439483 241.05058 -7.316168 curveto
241.63692 -6.6883883 242.45963 -6.3744984 243.51872 -6.3744984 curveto
244.21251 -6.3744984 244.93391 -6.4773374 245.68295 -6.683016 curveto
245.68295 -7.576336 lineto
244.74358 -7.257074 244.02371 -7.0974426 243.52333 -7.0974426 curveto
242.78658 -7.0974426 242.21481 -7.347634 241.80806 -7.848016 curveto
241.4013 -8.348398 241.19794 -9.052923 241.19794 -9.961593 curveto
241.19794 -10.861052 241.4159 -11.560205 241.8518 -12.059052 curveto
242.28772 -12.557899 242.89862 -12.807323 243.6845 -12.807323 curveto
244.00684 -12.807323 244.35526 -12.750531 244.72977 -12.636948 curveto
244.72977 -10.417462 lineto
245.69217 -10.417462 lineto
closepath
fill
newpath
0.0 0.0 0.0 setrgbcolor
newpath
233.67697 -103.148796 moveto
233.67697 -103.58282 233.32512 -103.93467 232.8911 -103.93467 curveto
232.45706 -103.93467 232.10522 -103.58282 232.10522 -103.148796 curveto
232.10522 -102.714775 232.45706 -102.362915 232.8911 -102.362915 curveto
233.32512 -102.362915 233.67697 -102.714775 233.67697 -103.148796 curveto
closepath
fill
newpath
0.0 0.0 0.0 setrgbcolor
1.0 setlinewidth
10.0 setmiterlimit
1 setlinejoin
1 setlinecap
[ ] 0 setdash
newpath
233.67697 -103.148796 moveto
233.67697 -103.58282 233.32512 -103.93467 232.8911 -103.93467 curveto
232.45706 -103.93467 232.10522 -103.58282 232.10522 -103.148796 curveto
232.10522 -102.714775 232.45706 -102.362915 232.8911 -102.362915 curveto
233.32512 -102.362915 233.67697 -102.714775 233.67697 -103.148796 curveto
closepath
stroke
newpath
0.0 0.0 0.0 setrgbcolor
newpath
246.6346 -99.19075 moveto
245.5755 -99.19075 244.7574 -98.87993 244.18027 -98.25829 curveto
243.60313 -97.63665 243.31458 -96.75638 243.31458 -95.61747 curveto
243.31458 -94.481636 243.60852 -93.60059 244.1964 -92.97435 curveto
244.78427 -92.34811 245.61235 -92.03498 246.68065 -92.03498 curveto
247.29153 -92.03498 248.0068 -92.13475 248.82646 -92.33429 curveto
248.82646 -93.241425 lineto
247.89323 -92.91909 247.17336 -92.75793 246.66684 -92.75793 curveto
245.927 -92.75793 245.35448 -93.00812 244.94926 -93.5085 curveto
244.54405 -94.00888 244.34145 -94.71494 244.34145 -95.626686 curveto
244.34145 -96.495445 244.55786 -97.180786 244.9907 -97.6827 curveto
245.42355 -98.184616 246.0145 -98.43558 246.76353 -98.43558 curveto
247.4082 -98.43558 248.0989 -98.23757 248.83566 -97.84156 curveto
248.83566 -98.67042 lineto
248.16338 -99.0173 247.42969 -99.19075 246.6346 -99.19075 curveto
closepath
fill
newpath
0.0 0.0 0.0 setrgbcolor
newpath
148.6376 -103.148796 moveto
148.6376 -103.58282 148.28575 -103.93467 147.85173 -103.93467 curveto
147.41768 -103.93467 147.06586 -103.58282 147.06586 -103.148796 curveto
147.06586 -102.714775 147.41768 -102.362915 147.85173 -102.362915 curveto
148.28575 -102.362915 148.6376 -102.714775 148.6376 -103.148796 curveto
closepath
fill
newpath
0.0 0.0 0.0 setrgbcolor
1.0 setlinewidth
10.0 setmiterlimit
1 setlinejoin
1 setlinecap
[ ] 0 setdash
newpath
148.6376 -103.148796 moveto
148.6376 -103.58282 148.28575 -103.93467 147.85173 -103.93467 curveto
147.41768 -103.93467 147.06586 -103.58282 147.06586 -103.148796 curveto
147.06586 -102.714775 147.41768 -102.362915 147.85173 -102.362915 curveto
148.28575 -102.362915 148.6376 -102.714775 148.6376 -103.148796 curveto
closepath
stroke
newpath
0.0 0.0 0.0 setrgbcolor
newpath
155.69708 -94.30512 moveto
155.69708 -87.490105 lineto
157.96262 -87.490105 lineto
158.63799 -87.490105 159.18364 -87.565315 159.5996 -87.71574 curveto
160.01556 -87.86616 160.3755 -88.12096 160.67941 -88.480125 curveto
161.16138 -89.05111 161.40236 -89.803215 161.40236 -90.73644 curveto
161.40236 -91.86921 161.10304 -92.747185 160.50443 -93.37036 curveto
159.9058 -93.99354 159.06314 -94.30512 157.97643 -94.30512 curveto
closepath
156.66408 -93.58218 moveto
157.90276 -93.58218 lineto
158.78687 -93.58218 159.4131 -93.34426 159.7815 -92.86844 curveto
160.1775 -92.361916 160.3755 -91.68195 160.3755 -90.828545 curveto
160.3755 -90.02731 160.18057 -89.398 159.7907 -88.9406 curveto
159.55432 -88.66125 159.2719 -88.470146 158.94342 -88.36731 curveto
158.61494 -88.26447 158.12071 -88.21305 157.4607 -88.21305 curveto
156.66408 -88.21305 lineto
closepath
fill
newpath
grestore
grestore
showpage

%%EOF