%!PS-Adobe-3.0 EPSF-3.0
%%Creator: EpsGraphics2D 0.9.0 by Paul Mutton, http://www.jibble.org/
%%Title: GeoGebra, http://www.geogebra.org
%%CreationDate: Thu Feb 28 11:34:31 CET 2008
%%BoundingBox: 0 0 1431 1279
%%DocumentData: Clean7Bit
%%DocumentProcessColors: Black
%%ColorUsage: Color
%%Origin: 0 0
%%Pages: 1
%%Page: 1 1
%%EndComments

gsave
-0.0 1279.0 translate
1.0 setlinewidth
10.0 setmiterlimit
0 setlinejoin
2 setlinecap
[ ] 0 setdash
gsave
newpath
0.0 -0.0 moveto
1431.7582 -0.0 lineto
1431.7582 -1279.7332 lineto
0.0 -1279.7332 lineto
0.0 -0.0 lineto
closepath
clip
newpath
1.0 setlinewidth
10.0 setmiterlimit
0 setlinejoin
2 setlinecap
[ ] 0 setdash
1.0 1.0 1.0 setrgbcolor
newpath
-149.75601 74.878006 moveto
1454.4485 74.878006 lineto
1454.4485 -1331.9209 lineto
-149.75601 -1331.9209 lineto
-149.75601 74.878006 lineto
closepath
fill
newpath
0.6 0.6 0.6 setrgbcolor
1.0 setlinewidth
10.0 setmiterlimit
1 setlinejoin
0 setlinecap
[ 5.0 4.0 ] 0 setdash
newpath
-127.78909 74.878006 moveto
-127.78909 -1331.9209 lineto
stroke
newpath
newpath
-127.78909 74.878006 moveto
-127.78909 -1331.9209 lineto
stroke
newpath
newpath
-99.44264 74.878006 moveto
-99.44264 -1331.9209 lineto
stroke
newpath
newpath
-71.096176 74.878006 moveto
-71.096176 -1331.9209 lineto
stroke
newpath
newpath
-42.74973 74.878006 moveto
-42.74973 -1331.9209 lineto
stroke
newpath
newpath
-14.403267 74.878006 moveto
-14.403267 -1331.9209 lineto
stroke
newpath
newpath
13.943184 74.878006 moveto
13.943184 -1331.9209 lineto
stroke
newpath
newpath
42.289654 74.878006 moveto
42.289654 -1331.9209 lineto
stroke
newpath
newpath
70.6361 74.878006 moveto
70.6361 -1331.9209 lineto
stroke
newpath
newpath
98.98256 74.878006 moveto
98.98256 -1331.9209 lineto
stroke
newpath
newpath
127.32901 74.878006 moveto
127.32901 -1331.9209 lineto
stroke
newpath
newpath
155.67548 74.878006 moveto
155.67548 -1331.9209 lineto
stroke
newpath
newpath
184.02194 74.878006 moveto
184.02194 -1331.9209 lineto
stroke
newpath
newpath
212.36838 74.878006 moveto
212.36838 -1331.9209 lineto
stroke
newpath
newpath
240.71484 74.878006 moveto
240.71484 -1331.9209 lineto
stroke
newpath
newpath
269.06128 74.878006 moveto
269.06128 -1331.9209 lineto
stroke
newpath
newpath
297.40775 74.878006 moveto
297.40775 -1331.9209 lineto
stroke
newpath
newpath
325.7542 74.878006 moveto
325.7542 -1331.9209 lineto
stroke
newpath
newpath
354.10065 74.878006 moveto
354.10065 -1331.9209 lineto
stroke
newpath
newpath
382.4471 74.878006 moveto
382.4471 -1331.9209 lineto
stroke
newpath
newpath
410.79358 74.878006 moveto
410.79358 -1331.9209 lineto
stroke
newpath
newpath
439.14008 74.878006 moveto
439.14008 -1331.9209 lineto
stroke
newpath
newpath
467.48645 74.878006 moveto
467.48645 -1331.9209 lineto
stroke
newpath
newpath
495.83292 74.878006 moveto
495.83292 -1331.9209 lineto
stroke
newpath
newpath
524.1794 74.878006 moveto
524.1794 -1331.9209 lineto
stroke
newpath
newpath
552.5259 74.878006 moveto
552.5259 -1331.9209 lineto
stroke
newpath
newpath
580.8723 74.878006 moveto
580.8723 -1331.9209 lineto
stroke
newpath
newpath
609.2188 74.878006 moveto
609.2188 -1331.9209 lineto
stroke
newpath
newpath
637.5652 74.878006 moveto
637.5652 -1331.9209 lineto
stroke
newpath
newpath
665.9117 74.878006 moveto
665.9117 -1331.9209 lineto
stroke
newpath
newpath
694.2581 74.878006 moveto
694.2581 -1331.9209 lineto
stroke
newpath
newpath
722.6046 74.878006 moveto
722.6046 -1331.9209 lineto
stroke
newpath
newpath
750.95105 74.878006 moveto
750.95105 -1331.9209 lineto
stroke
newpath
newpath
779.29755 74.878006 moveto
779.29755 -1331.9209 lineto
stroke
newpath
newpath
807.6439 74.878006 moveto
807.6439 -1331.9209 lineto
stroke
newpath
newpath
835.9904 74.878006 moveto
835.9904 -1331.9209 lineto
stroke
newpath
newpath
864.3369 74.878006 moveto
864.3369 -1331.9209 lineto
stroke
newpath
newpath
892.68335 74.878006 moveto
892.68335 -1331.9209 lineto
stroke
newpath
newpath
921.02985 74.878006 moveto
921.02985 -1331.9209 lineto
stroke
newpath
newpath
949.3763 74.878006 moveto
949.3763 -1331.9209 lineto
stroke
newpath
newpath
977.7227 74.878006 moveto
977.7227 -1331.9209 lineto
stroke
newpath
newpath
1006.06915 74.878006 moveto
1006.06915 -1331.9209 lineto
stroke
newpath
newpath
1034.4155 74.878006 moveto
1034.4155 -1331.9209 lineto
stroke
newpath
newpath
1062.7621 74.878006 moveto
1062.7621 -1331.9209 lineto
stroke
newpath
newpath
1091.1085 74.878006 moveto
1091.1085 -1331.9209 lineto
stroke
newpath
newpath
1119.4551 74.878006 moveto
1119.4551 -1331.9209 lineto
stroke
newpath
newpath
1147.8014 74.878006 moveto
1147.8014 -1331.9209 lineto
stroke
newpath
newpath
1176.148 74.878006 moveto
1176.148 -1331.9209 lineto
stroke
newpath
newpath
1204.4944 74.878006 moveto
1204.4944 -1331.9209 lineto
stroke
newpath
newpath
1232.8408 74.878006 moveto
1232.8408 -1331.9209 lineto
stroke
newpath
newpath
1261.1873 74.878006 moveto
1261.1873 -1331.9209 lineto
stroke
newpath
newpath
1289.5337 74.878006 moveto
1289.5337 -1331.9209 lineto
stroke
newpath
newpath
1317.8802 74.878006 moveto
1317.8802 -1331.9209 lineto
stroke
newpath
newpath
1346.2267 74.878006 moveto
1346.2267 -1331.9209 lineto
stroke
newpath
newpath
1374.573 74.878006 moveto
1374.573 -1331.9209 lineto
stroke
newpath
newpath
1402.9196 74.878006 moveto
1402.9196 -1331.9209 lineto
stroke
newpath
newpath
1431.266 74.878006 moveto
1431.266 -1331.9209 lineto
stroke
newpath
newpath
-149.75601 67.80353 moveto
1454.4485 67.80353 lineto
stroke
newpath
newpath
-149.75601 67.80353 moveto
1454.4485 67.80353 lineto
stroke
newpath
newpath
-149.75601 39.457073 moveto
1454.4485 39.457073 lineto
stroke
newpath
newpath
-149.75601 11.110619 moveto
1454.4485 11.110619 lineto
stroke
newpath
newpath
-149.75601 -17.235842 moveto
1454.4485 -17.235842 lineto
stroke
newpath
newpath
-149.75601 -45.582294 moveto
1454.4485 -45.582294 lineto
stroke
newpath
newpath
-149.75601 -73.92876 moveto
1454.4485 -73.92876 lineto
stroke
newpath
newpath
-149.75601 -102.27521 moveto
1454.4485 -102.27521 lineto
stroke
newpath
newpath
-149.75601 -130.62167 moveto
1454.4485 -130.62167 lineto
stroke
newpath
newpath
-149.75601 -158.96812 moveto
1454.4485 -158.96812 lineto
stroke
newpath
newpath
-149.75601 -187.31458 moveto
1454.4485 -187.31458 lineto
stroke
newpath
newpath
-149.75601 -215.66103 moveto
1454.4485 -215.66103 lineto
stroke
newpath
newpath
-149.75601 -244.00749 moveto
1454.4485 -244.00749 lineto
stroke
newpath
newpath
-149.75601 -272.35397 moveto
1454.4485 -272.35397 lineto
stroke
newpath
newpath
-149.75601 -300.7004 moveto
1454.4485 -300.7004 lineto
stroke
newpath
newpath
-149.75601 -329.04688 moveto
1454.4485 -329.04688 lineto
stroke
newpath
newpath
-149.75601 -357.3933 moveto
1454.4485 -357.3933 lineto
stroke
newpath
newpath
-149.75601 -385.73978 moveto
1454.4485 -385.73978 lineto
stroke
newpath
newpath
-149.75601 -414.08624 moveto
1454.4485 -414.08624 lineto
stroke
newpath
newpath
-149.75601 -442.43268 moveto
1454.4485 -442.43268 lineto
stroke
newpath
newpath
-149.75601 -470.77914 moveto
1454.4485 -470.77914 lineto
stroke
newpath
newpath
-149.75601 -499.1256 moveto
1454.4485 -499.1256 lineto
stroke
newpath
newpath
-149.75601 -527.4721 moveto
1454.4485 -527.4721 lineto
stroke
newpath
newpath
-149.75601 -555.81854 moveto
1454.4485 -555.81854 lineto
stroke
newpath
newpath
-149.75601 -584.165 moveto
1454.4485 -584.165 lineto
stroke
newpath
newpath
-149.75601 -612.5114 moveto
1454.4485 -612.5114 lineto
stroke
newpath
newpath
-149.75601 -640.8579 moveto
1454.4485 -640.8579 lineto
stroke
newpath
newpath
-149.75601 -669.20435 moveto
1454.4485 -669.20435 lineto
stroke
newpath
newpath
-149.75601 -697.55084 moveto
1454.4485 -697.55084 lineto
stroke
newpath
newpath
-149.75601 -725.8972 moveto
1454.4485 -725.8972 lineto
stroke
newpath
newpath
-149.75601 -754.2437 moveto
1454.4485 -754.2437 lineto
stroke
newpath
newpath
-149.75601 -782.59015 moveto
1454.4485 -782.59015 lineto
stroke
newpath
newpath
-149.75601 -810.93665 moveto
1454.4485 -810.93665 lineto
stroke
newpath
newpath
-149.75601 -839.2831 moveto
1454.4485 -839.2831 lineto
stroke
newpath
newpath
-149.75601 -867.6296 moveto
1454.4485 -867.6296 lineto
stroke
newpath
newpath
-149.75601 -895.97595 moveto
1454.4485 -895.97595 lineto
stroke
newpath
newpath
-149.75601 -924.32245 moveto
1454.4485 -924.32245 lineto
stroke
newpath
newpath
-149.75601 -952.6689 moveto
1454.4485 -952.6689 lineto
stroke
newpath
newpath
-149.75601 -981.0154 moveto
1454.4485 -981.0154 lineto
stroke
newpath
newpath
-149.75601 -1009.3618 moveto
1454.4485 -1009.3618 lineto
stroke
newpath
newpath
-149.75601 -1037.7084 moveto
1454.4485 -1037.7084 lineto
stroke
newpath
newpath
-149.75601 -1066.0547 moveto
1454.4485 -1066.0547 lineto
stroke
newpath
newpath
-149.75601 -1094.4012 moveto
1454.4485 -1094.4012 lineto
stroke
newpath
newpath
-149.75601 -1122.7477 moveto
1454.4485 -1122.7477 lineto
stroke
newpath
newpath
-149.75601 -1151.094 moveto
1454.4485 -1151.094 lineto
stroke
newpath
newpath
-149.75601 -1179.4406 moveto
1454.4485 -1179.4406 lineto
stroke
newpath
newpath
-149.75601 -1207.787 moveto
1454.4485 -1207.787 lineto
stroke
newpath
newpath
-149.75601 -1236.1335 moveto
1454.4485 -1236.1335 lineto
stroke
newpath
newpath
-149.75601 -1264.48 moveto
1454.4485 -1264.48 lineto
stroke
newpath
newpath
-149.75601 -1292.8263 moveto
1454.4485 -1292.8263 lineto
stroke
newpath
newpath
-149.75601 -1321.1729 moveto
1454.4485 -1321.1729 lineto
stroke
newpath
0.2 0.2 0.2 setrgbcolor
1.8 setlinewidth
10.0 setmiterlimit
0 setlinejoin
0 setlinecap
[ ] 0 setdash
newpath
-127.78909 -1264.48 moveto
-127.78909 -1273.556 lineto
stroke
newpath
1.8 setlinewidth
10.0 setmiterlimit
0 setlinejoin
0 setlinecap
[ ] 0 setdash
newpath
-99.44264 -1264.48 moveto
-99.44264 -1273.556 lineto
stroke
newpath
1.8 setlinewidth
10.0 setmiterlimit
0 setlinejoin
0 setlinecap
[ ] 0 setdash
newpath
-71.096176 -1264.48 moveto
-71.096176 -1273.556 lineto
stroke
newpath
1.8 setlinewidth
10.0 setmiterlimit
0 setlinejoin
0 setlinecap
[ ] 0 setdash
newpath
-42.74973 -1264.48 moveto
-42.74973 -1273.556 lineto
stroke
newpath
1.8 setlinewidth
10.0 setmiterlimit
0 setlinejoin
0 setlinecap
[ ] 0 setdash
newpath
-14.403267 -1264.48 moveto
-14.403267 -1273.556 lineto
stroke
newpath
1.8 setlinewidth
10.0 setmiterlimit
0 setlinejoin
0 setlinecap
[ ] 0 setdash
newpath
13.943184 -1264.48 moveto
13.943184 -1273.556 lineto
stroke
newpath
1.8 setlinewidth
10.0 setmiterlimit
0 setlinejoin
0 setlinecap
[ ] 0 setdash
newpath
42.289654 -1264.48 moveto
42.289654 -1273.556 lineto
stroke
newpath
1.8 setlinewidth
10.0 setmiterlimit
0 setlinejoin
0 setlinecap
[ ] 0 setdash
newpath
70.6361 -1264.48 moveto
70.6361 -1273.556 lineto
stroke
newpath
1.8 setlinewidth
10.0 setmiterlimit
0 setlinejoin
0 setlinecap
[ ] 0 setdash
newpath
98.98256 -1264.48 moveto
98.98256 -1273.556 lineto
stroke
newpath
1.8 setlinewidth
10.0 setmiterlimit
0 setlinejoin
0 setlinecap
[ ] 0 setdash
newpath
127.32901 -1264.48 moveto
127.32901 -1273.556 lineto
stroke
newpath
1.8 setlinewidth
10.0 setmiterlimit
0 setlinejoin
0 setlinecap
[ ] 0 setdash
newpath
155.67548 -1264.48 moveto
155.67548 -1273.556 lineto
stroke
newpath
1.8 setlinewidth
10.0 setmiterlimit
0 setlinejoin
0 setlinecap
[ ] 0 setdash
newpath
184.02194 -1264.48 moveto
184.02194 -1273.556 lineto
stroke
newpath
1.8 setlinewidth
10.0 setmiterlimit
0 setlinejoin
0 setlinecap
[ ] 0 setdash
newpath
212.36838 -1264.48 moveto
212.36838 -1273.556 lineto
stroke
newpath
1.8 setlinewidth
10.0 setmiterlimit
0 setlinejoin
0 setlinecap
[ ] 0 setdash
newpath
240.71484 -1264.48 moveto
240.71484 -1273.556 lineto
stroke
newpath
1.8 setlinewidth
10.0 setmiterlimit
0 setlinejoin
0 setlinecap
[ ] 0 setdash
newpath
269.06128 -1264.48 moveto
269.06128 -1273.556 lineto
stroke
newpath
1.8 setlinewidth
10.0 setmiterlimit
0 setlinejoin
0 setlinecap
[ ] 0 setdash
newpath
297.40775 -1264.48 moveto
297.40775 -1273.556 lineto
stroke
newpath
1.8 setlinewidth
10.0 setmiterlimit
0 setlinejoin
0 setlinecap
[ ] 0 setdash
newpath
325.7542 -1264.48 moveto
325.7542 -1273.556 lineto
stroke
newpath
1.8 setlinewidth
10.0 setmiterlimit
0 setlinejoin
0 setlinecap
[ ] 0 setdash
newpath
354.10065 -1264.48 moveto
354.10065 -1273.556 lineto
stroke
newpath
1.8 setlinewidth
10.0 setmiterlimit
0 setlinejoin
0 setlinecap
[ ] 0 setdash
newpath
382.4471 -1264.48 moveto
382.4471 -1273.556 lineto
stroke
newpath
1.8 setlinewidth
10.0 setmiterlimit
0 setlinejoin
0 setlinecap
[ ] 0 setdash
newpath
410.79358 -1264.48 moveto
410.79358 -1273.556 lineto
stroke
newpath
1.8 setlinewidth
10.0 setmiterlimit
0 setlinejoin
0 setlinecap
[ ] 0 setdash
newpath
439.14008 -1264.48 moveto
439.14008 -1273.556 lineto
stroke
newpath
1.8 setlinewidth
10.0 setmiterlimit
0 setlinejoin
0 setlinecap
[ ] 0 setdash
newpath
467.48645 -1264.48 moveto
467.48645 -1273.556 lineto
stroke
newpath
1.8 setlinewidth
10.0 setmiterlimit
0 setlinejoin
0 setlinecap
[ ] 0 setdash
newpath
495.83292 -1264.48 moveto
495.83292 -1273.556 lineto
stroke
newpath
1.8 setlinewidth
10.0 setmiterlimit
0 setlinejoin
0 setlinecap
[ ] 0 setdash
newpath
524.1794 -1264.48 moveto
524.1794 -1273.556 lineto
stroke
newpath
1.8 setlinewidth
10.0 setmiterlimit
0 setlinejoin
0 setlinecap
[ ] 0 setdash
newpath
552.5259 -1264.48 moveto
552.5259 -1273.556 lineto
stroke
newpath
1.8 setlinewidth
10.0 setmiterlimit
0 setlinejoin
0 setlinecap
[ ] 0 setdash
newpath
580.8723 -1264.48 moveto
580.8723 -1273.556 lineto
stroke
newpath
1.8 setlinewidth
10.0 setmiterlimit
0 setlinejoin
0 setlinecap
[ ] 0 setdash
newpath
609.2188 -1264.48 moveto
609.2188 -1273.556 lineto
stroke
newpath
1.8 setlinewidth
10.0 setmiterlimit
0 setlinejoin
0 setlinecap
[ ] 0 setdash
newpath
637.5652 -1264.48 moveto
637.5652 -1273.556 lineto
stroke
newpath
1.8 setlinewidth
10.0 setmiterlimit
0 setlinejoin
0 setlinecap
[ ] 0 setdash
newpath
665.9117 -1264.48 moveto
665.9117 -1273.556 lineto
stroke
newpath
1.8 setlinewidth
10.0 setmiterlimit
0 setlinejoin
0 setlinecap
[ ] 0 setdash
newpath
694.2581 -1264.48 moveto
694.2581 -1273.556 lineto
stroke
newpath
1.8 setlinewidth
10.0 setmiterlimit
0 setlinejoin
0 setlinecap
[ ] 0 setdash
newpath
722.6046 -1264.48 moveto
722.6046 -1273.556 lineto
stroke
newpath
1.8 setlinewidth
10.0 setmiterlimit
0 setlinejoin
0 setlinecap
[ ] 0 setdash
newpath
750.95105 -1264.48 moveto
750.95105 -1273.556 lineto
stroke
newpath
1.8 setlinewidth
10.0 setmiterlimit
0 setlinejoin
0 setlinecap
[ ] 0 setdash
newpath
779.29755 -1264.48 moveto
779.29755 -1273.556 lineto
stroke
newpath
1.8 setlinewidth
10.0 setmiterlimit
0 setlinejoin
0 setlinecap
[ ] 0 setdash
newpath
807.6439 -1264.48 moveto
807.6439 -1273.556 lineto
stroke
newpath
1.8 setlinewidth
10.0 setmiterlimit
0 setlinejoin
0 setlinecap
[ ] 0 setdash
newpath
835.9904 -1264.48 moveto
835.9904 -1273.556 lineto
stroke
newpath
1.8 setlinewidth
10.0 setmiterlimit
0 setlinejoin
0 setlinecap
[ ] 0 setdash
newpath
864.3369 -1264.48 moveto
864.3369 -1273.556 lineto
stroke
newpath
1.8 setlinewidth
10.0 setmiterlimit
0 setlinejoin
0 setlinecap
[ ] 0 setdash
newpath
892.68335 -1264.48 moveto
892.68335 -1273.556 lineto
stroke
newpath
1.8 setlinewidth
10.0 setmiterlimit
0 setlinejoin
0 setlinecap
[ ] 0 setdash
newpath
921.02985 -1264.48 moveto
921.02985 -1273.556 lineto
stroke
newpath
1.8 setlinewidth
10.0 setmiterlimit
0 setlinejoin
0 setlinecap
[ ] 0 setdash
newpath
949.3763 -1264.48 moveto
949.3763 -1273.556 lineto
stroke
newpath
1.8 setlinewidth
10.0 setmiterlimit
0 setlinejoin
0 setlinecap
[ ] 0 setdash
newpath
977.7227 -1264.48 moveto
977.7227 -1273.556 lineto
stroke
newpath
1.8 setlinewidth
10.0 setmiterlimit
0 setlinejoin
0 setlinecap
[ ] 0 setdash
newpath
1006.06915 -1264.48 moveto
1006.06915 -1273.556 lineto
stroke
newpath
1.8 setlinewidth
10.0 setmiterlimit
0 setlinejoin
0 setlinecap
[ ] 0 setdash
newpath
1034.4155 -1264.48 moveto
1034.4155 -1273.556 lineto
stroke
newpath
1.8 setlinewidth
10.0 setmiterlimit
0 setlinejoin
0 setlinecap
[ ] 0 setdash
newpath
1062.7621 -1264.48 moveto
1062.7621 -1273.556 lineto
stroke
newpath
1.8 setlinewidth
10.0 setmiterlimit
0 setlinejoin
0 setlinecap
[ ] 0 setdash
newpath
1091.1085 -1264.48 moveto
1091.1085 -1273.556 lineto
stroke
newpath
1.8 setlinewidth
10.0 setmiterlimit
0 setlinejoin
0 setlinecap
[ ] 0 setdash
newpath
1119.4551 -1264.48 moveto
1119.4551 -1273.556 lineto
stroke
newpath
1.8 setlinewidth
10.0 setmiterlimit
0 setlinejoin
0 setlinecap
[ ] 0 setdash
newpath
1147.8014 -1264.48 moveto
1147.8014 -1273.556 lineto
stroke
newpath
1.8 setlinewidth
10.0 setmiterlimit
0 setlinejoin
0 setlinecap
[ ] 0 setdash
newpath
1176.148 -1264.48 moveto
1176.148 -1273.556 lineto
stroke
newpath
1.8 setlinewidth
10.0 setmiterlimit
0 setlinejoin
0 setlinecap
[ ] 0 setdash
newpath
1204.4944 -1264.48 moveto
1204.4944 -1273.556 lineto
stroke
newpath
1.8 setlinewidth
10.0 setmiterlimit
0 setlinejoin
0 setlinecap
[ ] 0 setdash
newpath
1232.8408 -1264.48 moveto
1232.8408 -1273.556 lineto
stroke
newpath
1.8 setlinewidth
10.0 setmiterlimit
0 setlinejoin
0 setlinecap
[ ] 0 setdash
newpath
1261.1873 -1264.48 moveto
1261.1873 -1273.556 lineto
stroke
newpath
1.8 setlinewidth
10.0 setmiterlimit
0 setlinejoin
0 setlinecap
[ ] 0 setdash
newpath
1289.5337 -1264.48 moveto
1289.5337 -1273.556 lineto
stroke
newpath
1.8 setlinewidth
10.0 setmiterlimit
0 setlinejoin
0 setlinecap
[ ] 0 setdash
newpath
1317.8802 -1264.48 moveto
1317.8802 -1273.556 lineto
stroke
newpath
1.8 setlinewidth
10.0 setmiterlimit
0 setlinejoin
0 setlinecap
[ ] 0 setdash
newpath
1346.2267 -1264.48 moveto
1346.2267 -1273.556 lineto
stroke
newpath
1.8 setlinewidth
10.0 setmiterlimit
0 setlinejoin
0 setlinecap
[ ] 0 setdash
newpath
1374.573 -1264.48 moveto
1374.573 -1273.556 lineto
stroke
newpath
1.8 setlinewidth
10.0 setmiterlimit
0 setlinejoin
0 setlinecap
[ ] 0 setdash
newpath
1402.9196 -1264.48 moveto
1402.9196 -1273.556 lineto
stroke
newpath
1.8 setlinewidth
10.0 setmiterlimit
0 setlinejoin
0 setlinecap
[ ] 0 setdash
newpath
1431.266 -1264.48 moveto
1431.266 -1273.556 lineto
stroke
newpath
1.8 setlinewidth
10.0 setmiterlimit
0 setlinejoin
0 setlinecap
[ ] 0 setdash
newpath
-149.75601 -1264.48 moveto
1454.4485 -1264.48 lineto
stroke
newpath
newpath
1452.1794 -1264.48 moveto
1443.1034 -1255.4038 lineto
stroke
newpath
newpath
1452.1794 -1264.48 moveto
1443.1034 -1273.556 lineto
stroke
newpath
1.8 setlinewidth
10.0 setmiterlimit
0 setlinejoin
0 setlinecap
[ ] 0 setdash
newpath
4.8670626 39.457073 moveto
13.943184 39.457073 lineto
stroke
newpath
1.8 setlinewidth
10.0 setmiterlimit
0 setlinejoin
0 setlinecap
[ ] 0 setdash
newpath
4.8670626 11.110619 moveto
13.943184 11.110619 lineto
stroke
newpath
1.8 setlinewidth
10.0 setmiterlimit
0 setlinejoin
0 setlinecap
[ ] 0 setdash
newpath
4.8670626 -17.235842 moveto
13.943184 -17.235842 lineto
stroke
newpath
1.8 setlinewidth
10.0 setmiterlimit
0 setlinejoin
0 setlinecap
[ ] 0 setdash
newpath
4.8670626 -45.582294 moveto
13.943184 -45.582294 lineto
stroke
newpath
1.8 setlinewidth
10.0 setmiterlimit
0 setlinejoin
0 setlinecap
[ ] 0 setdash
newpath
4.8670626 -73.92876 moveto
13.943184 -73.92876 lineto
stroke
newpath
1.8 setlinewidth
10.0 setmiterlimit
0 setlinejoin
0 setlinecap
[ ] 0 setdash
newpath
4.8670626 -102.27521 moveto
13.943184 -102.27521 lineto
stroke
newpath
1.8 setlinewidth
10.0 setmiterlimit
0 setlinejoin
0 setlinecap
[ ] 0 setdash
newpath
4.8670626 -130.62167 moveto
13.943184 -130.62167 lineto
stroke
newpath
1.8 setlinewidth
10.0 setmiterlimit
0 setlinejoin
0 setlinecap
[ ] 0 setdash
newpath
4.8670626 -158.96812 moveto
13.943184 -158.96812 lineto
stroke
newpath
1.8 setlinewidth
10.0 setmiterlimit
0 setlinejoin
0 setlinecap
[ ] 0 setdash
newpath
4.8670626 -187.31458 moveto
13.943184 -187.31458 lineto
stroke
newpath
1.8 setlinewidth
10.0 setmiterlimit
0 setlinejoin
0 setlinecap
[ ] 0 setdash
newpath
4.8670626 -215.66103 moveto
13.943184 -215.66103 lineto
stroke
newpath
1.8 setlinewidth
10.0 setmiterlimit
0 setlinejoin
0 setlinecap
[ ] 0 setdash
newpath
4.8670626 -244.00749 moveto
13.943184 -244.00749 lineto
stroke
newpath
1.8 setlinewidth
10.0 setmiterlimit
0 setlinejoin
0 setlinecap
[ ] 0 setdash
newpath
4.8670626 -272.35397 moveto
13.943184 -272.35397 lineto
stroke
newpath
1.8 setlinewidth
10.0 setmiterlimit
0 setlinejoin
0 setlinecap
[ ] 0 setdash
newpath
4.8670626 -300.7004 moveto
13.943184 -300.7004 lineto
stroke
newpath
1.8 setlinewidth
10.0 setmiterlimit
0 setlinejoin
0 setlinecap
[ ] 0 setdash
newpath
4.8670626 -329.04688 moveto
13.943184 -329.04688 lineto
stroke
newpath
1.8 setlinewidth
10.0 setmiterlimit
0 setlinejoin
0 setlinecap
[ ] 0 setdash
newpath
4.8670626 -357.3933 moveto
13.943184 -357.3933 lineto
stroke
newpath
1.8 setlinewidth
10.0 setmiterlimit
0 setlinejoin
0 setlinecap
[ ] 0 setdash
newpath
4.8670626 -385.73978 moveto
13.943184 -385.73978 lineto
stroke
newpath
1.8 setlinewidth
10.0 setmiterlimit
0 setlinejoin
0 setlinecap
[ ] 0 setdash
newpath
4.8670626 -414.08624 moveto
13.943184 -414.08624 lineto
stroke
newpath
1.8 setlinewidth
10.0 setmiterlimit
0 setlinejoin
0 setlinecap
[ ] 0 setdash
newpath
4.8670626 -442.43268 moveto
13.943184 -442.43268 lineto
stroke
newpath
1.8 setlinewidth
10.0 setmiterlimit
0 setlinejoin
0 setlinecap
[ ] 0 setdash
newpath
4.8670626 -470.77914 moveto
13.943184 -470.77914 lineto
stroke
newpath
1.8 setlinewidth
10.0 setmiterlimit
0 setlinejoin
0 setlinecap
[ ] 0 setdash
newpath
4.8670626 -499.1256 moveto
13.943184 -499.1256 lineto
stroke
newpath
1.8 setlinewidth
10.0 setmiterlimit
0 setlinejoin
0 setlinecap
[ ] 0 setdash
newpath
4.8670626 -527.4721 moveto
13.943184 -527.4721 lineto
stroke
newpath
1.8 setlinewidth
10.0 setmiterlimit
0 setlinejoin
0 setlinecap
[ ] 0 setdash
newpath
4.8670626 -555.81854 moveto
13.943184 -555.81854 lineto
stroke
newpath
1.8 setlinewidth
10.0 setmiterlimit
0 setlinejoin
0 setlinecap
[ ] 0 setdash
newpath
4.8670626 -584.165 moveto
13.943184 -584.165 lineto
stroke
newpath
1.8 setlinewidth
10.0 setmiterlimit
0 setlinejoin
0 setlinecap
[ ] 0 setdash
newpath
4.8670626 -612.5114 moveto
13.943184 -612.5114 lineto
stroke
newpath
1.8 setlinewidth
10.0 setmiterlimit
0 setlinejoin
0 setlinecap
[ ] 0 setdash
newpath
4.8670626 -640.8579 moveto
13.943184 -640.8579 lineto
stroke
newpath
1.8 setlinewidth
10.0 setmiterlimit
0 setlinejoin
0 setlinecap
[ ] 0 setdash
newpath
4.8670626 -669.20435 moveto
13.943184 -669.20435 lineto
stroke
newpath
1.8 setlinewidth
10.0 setmiterlimit
0 setlinejoin
0 setlinecap
[ ] 0 setdash
newpath
4.8670626 -697.55084 moveto
13.943184 -697.55084 lineto
stroke
newpath
1.8 setlinewidth
10.0 setmiterlimit
0 setlinejoin
0 setlinecap
[ ] 0 setdash
newpath
4.8670626 -725.8972 moveto
13.943184 -725.8972 lineto
stroke
newpath
1.8 setlinewidth
10.0 setmiterlimit
0 setlinejoin
0 setlinecap
[ ] 0 setdash
newpath
4.8670626 -754.2437 moveto
13.943184 -754.2437 lineto
stroke
newpath
1.8 setlinewidth
10.0 setmiterlimit
0 setlinejoin
0 setlinecap
[ ] 0 setdash
newpath
4.8670626 -782.59015 moveto
13.943184 -782.59015 lineto
stroke
newpath
1.8 setlinewidth
10.0 setmiterlimit
0 setlinejoin
0 setlinecap
[ ] 0 setdash
newpath
4.8670626 -810.93665 moveto
13.943184 -810.93665 lineto
stroke
newpath
1.8 setlinewidth
10.0 setmiterlimit
0 setlinejoin
0 setlinecap
[ ] 0 setdash
newpath
4.8670626 -839.2831 moveto
13.943184 -839.2831 lineto
stroke
newpath
1.8 setlinewidth
10.0 setmiterlimit
0 setlinejoin
0 setlinecap
[ ] 0 setdash
newpath
4.8670626 -867.6296 moveto
13.943184 -867.6296 lineto
stroke
newpath
1.8 setlinewidth
10.0 setmiterlimit
0 setlinejoin
0 setlinecap
[ ] 0 setdash
newpath
4.8670626 -895.97595 moveto
13.943184 -895.97595 lineto
stroke
newpath
1.8 setlinewidth
10.0 setmiterlimit
0 setlinejoin
0 setlinecap
[ ] 0 setdash
newpath
4.8670626 -924.32245 moveto
13.943184 -924.32245 lineto
stroke
newpath
1.8 setlinewidth
10.0 setmiterlimit
0 setlinejoin
0 setlinecap
[ ] 0 setdash
newpath
4.8670626 -952.6689 moveto
13.943184 -952.6689 lineto
stroke
newpath
1.8 setlinewidth
10.0 setmiterlimit
0 setlinejoin
0 setlinecap
[ ] 0 setdash
newpath
4.8670626 -981.0154 moveto
13.943184 -981.0154 lineto
stroke
newpath
1.8 setlinewidth
10.0 setmiterlimit
0 setlinejoin
0 setlinecap
[ ] 0 setdash
newpath
4.8670626 -1009.3618 moveto
13.943184 -1009.3618 lineto
stroke
newpath
1.8 setlinewidth
10.0 setmiterlimit
0 setlinejoin
0 setlinecap
[ ] 0 setdash
newpath
4.8670626 -1037.7084 moveto
13.943184 -1037.7084 lineto
stroke
newpath
1.8 setlinewidth
10.0 setmiterlimit
0 setlinejoin
0 setlinecap
[ ] 0 setdash
newpath
4.8670626 -1066.0547 moveto
13.943184 -1066.0547 lineto
stroke
newpath
1.8 setlinewidth
10.0 setmiterlimit
0 setlinejoin
0 setlinecap
[ ] 0 setdash
newpath
4.8670626 -1094.4012 moveto
13.943184 -1094.4012 lineto
stroke
newpath
1.8 setlinewidth
10.0 setmiterlimit
0 setlinejoin
0 setlinecap
[ ] 0 setdash
newpath
4.8670626 -1122.7477 moveto
13.943184 -1122.7477 lineto
stroke
newpath
1.8 setlinewidth
10.0 setmiterlimit
0 setlinejoin
0 setlinecap
[ ] 0 setdash
newpath
4.8670626 -1151.094 moveto
13.943184 -1151.094 lineto
stroke
newpath
1.8 setlinewidth
10.0 setmiterlimit
0 setlinejoin
0 setlinecap
[ ] 0 setdash
newpath
4.8670626 -1179.4406 moveto
13.943184 -1179.4406 lineto
stroke
newpath
1.8 setlinewidth
10.0 setmiterlimit
0 setlinejoin
0 setlinecap
[ ] 0 setdash
newpath
4.8670626 -1207.787 moveto
13.943184 -1207.787 lineto
stroke
newpath
1.8 setlinewidth
10.0 setmiterlimit
0 setlinejoin
0 setlinecap
[ ] 0 setdash
newpath
4.8670626 -1236.1335 moveto
13.943184 -1236.1335 lineto
stroke
newpath
1.8 setlinewidth
10.0 setmiterlimit
0 setlinejoin
0 setlinecap
[ ] 0 setdash
newpath
4.8670626 -1264.48 moveto
13.943184 -1264.48 lineto
stroke
newpath
1.8 setlinewidth
10.0 setmiterlimit
0 setlinejoin
0 setlinecap
[ ] 0 setdash
newpath
4.8670626 -1292.8263 moveto
13.943184 -1292.8263 lineto
stroke
newpath
1.8 setlinewidth
10.0 setmiterlimit
0 setlinejoin
0 setlinecap
[ ] 0 setdash
newpath
4.8670626 -1321.1729 moveto
13.943184 -1321.1729 lineto
stroke
newpath
newpath
13.943184 74.878006 moveto
13.943184 -1331.9209 lineto
stroke
newpath
newpath
13.943184 74.878006 moveto
4.8670626 65.80188 lineto
stroke
newpath
newpath
13.943184 74.878006 moveto
23.019306 65.80188 lineto
stroke
newpath
0.0 0.0 0.0 setrgbcolor
1.0 setlinewidth
10.0 setmiterlimit
1 setlinejoin
1 setlinecap
[ ] 0 setdash
newpath
-2.9170454 -1331.9209 moveto
348.78268 74.878006 lineto
stroke
newpath
0.0 0.0 0.0 setrgbcolor
1.0 setlinewidth
10.0 setmiterlimit
1 setlinejoin
1 setlinecap
[ ] 0 setdash
newpath
-149.75601 -1002.9823 moveto
928.10425 74.878006 lineto
stroke
newpath
0.0 0.0 0.0 setrgbcolor
1.0 setlinewidth
10.0 setmiterlimit
1 setlinejoin
1 setlinecap
[ ] 0 setdash
newpath
-149.75601 -130.62167 moveto
1454.4485 -130.62167 lineto
stroke
newpath
0.2509804 0.2509804 0.2509804 setrgbcolor
newpath
20.750275 -1264.48 moveto
20.750275 -1268.2394 17.702633 -1271.287 13.943184 -1271.287 curveto
10.183735 -1271.287 7.136093 -1268.2394 7.136093 -1264.48 curveto
7.136093 -1260.7205 10.183735 -1257.6729 13.943184 -1257.6729 curveto
17.702633 -1257.6729 20.750275 -1260.7205 20.750275 -1264.48 curveto
closepath
fill
newpath
0.0 0.0 0.0 setrgbcolor
1.0 setlinewidth
10.0 setmiterlimit
1 setlinejoin
1 setlinecap
[ ] 0 setdash
newpath
20.750275 -1264.48 moveto
20.750275 -1268.2394 17.702633 -1271.287 13.943184 -1271.287 curveto
10.183735 -1271.287 7.136093 -1268.2394 7.136093 -1264.48 curveto
7.136093 -1260.7205 10.183735 -1257.6729 13.943184 -1257.6729 curveto
17.702633 -1257.6729 20.750275 -1260.7205 20.750275 -1264.48 curveto
closepath
stroke
newpath
0.0 0.0 1.0 setrgbcolor
newpath
49.096745 -1151.094 moveto
49.096745 -1154.8535 46.049103 -1157.9011 42.289654 -1157.9011 curveto
38.530186 -1157.9011 35.482563 -1154.8535 35.482563 -1151.094 curveto
35.482563 -1147.3347 38.530186 -1144.287 42.289654 -1144.287 curveto
46.049103 -1144.287 49.096745 -1147.3347 49.096745 -1151.094 curveto
closepath
fill
newpath
0.0 0.0 0.0 setrgbcolor
1.0 setlinewidth
10.0 setmiterlimit
1 setlinejoin
1 setlinecap
[ ] 0 setdash
newpath
49.096745 -1151.094 moveto
49.096745 -1154.8535 46.049103 -1157.9011 42.289654 -1157.9011 curveto
38.530186 -1157.9011 35.482563 -1154.8535 35.482563 -1151.094 curveto
35.482563 -1147.3347 38.530186 -1144.287 42.289654 -1144.287 curveto
46.049103 -1144.287 49.096745 -1147.3347 49.096745 -1151.094 curveto
closepath
stroke
newpath
0.49019608 0.49019608 1.0 setrgbcolor
newpath
20.750275 -839.2831 moveto
20.750275 -843.04254 17.702633 -846.0902 13.943184 -846.0902 curveto
10.183735 -846.0902 7.136093 -843.04254 7.136093 -839.2831 curveto
7.136093 -835.5236 10.183735 -832.476 13.943184 -832.476 curveto
17.702633 -832.476 20.750275 -835.5236 20.750275 -839.2831 curveto
closepath
fill
newpath
0.0 0.0 0.0 setrgbcolor
1.0 setlinewidth
10.0 setmiterlimit
1 setlinejoin
1 setlinecap
[ ] 0 setdash
newpath
20.750275 -839.2831 moveto
20.750275 -843.04254 17.702633 -846.0902 13.943184 -846.0902 curveto
10.183735 -846.0902 7.136093 -843.04254 7.136093 -839.2831 curveto
7.136093 -835.5236 10.183735 -832.476 13.943184 -832.476 curveto
17.702633 -832.476 20.750275 -835.5236 20.750275 -839.2831 curveto
closepath
stroke
newpath
0.0 0.0 1.0 setrgbcolor
newpath
53.634804 -810.93665 moveto
53.634804 -817.2024 48.5554 -822.2818 42.289654 -822.2818 curveto
36.023888 -822.2818 30.944502 -817.2024 30.944502 -810.93665 curveto
30.944502 -804.6709 36.023888 -799.5915 42.289654 -799.5915 curveto
48.5554 -799.5915 53.634804 -804.6709 53.634804 -810.93665 curveto
closepath
fill
newpath
0.0 0.0 1.0 setrgbcolor
newpath
49.096745 -810.93665 moveto
49.096745 -814.6961 46.049103 -817.7437 42.289654 -817.7437 curveto
38.530186 -817.7437 35.482563 -814.6961 35.482563 -810.93665 curveto
35.482563 -807.1772 38.530186 -804.1295 42.289654 -804.1295 curveto
46.049103 -804.1295 49.096745 -807.1772 49.096745 -810.93665 curveto
closepath
fill
newpath
0.0 0.0 0.0 setrgbcolor
1.0 setlinewidth
10.0 setmiterlimit
1 setlinejoin
1 setlinecap
[ ] 0 setdash
newpath
49.096745 -810.93665 moveto
49.096745 -814.6961 46.049103 -817.7437 42.289654 -817.7437 curveto
38.530186 -817.7437 35.482563 -814.6961 35.482563 -810.93665 curveto
35.482563 -807.1772 38.530186 -804.1295 42.289654 -804.1295 curveto
46.049103 -804.1295 49.096745 -807.1772 49.096745 -810.93665 curveto
closepath
stroke
newpath
0.49019608 0.49019608 1.0 setrgbcolor
newpath
20.750275 -130.62167 moveto
20.750275 -134.38112 17.702633 -137.42877 13.943184 -137.42877 curveto
10.183735 -137.42877 7.136093 -134.38112 7.136093 -130.62167 curveto
7.136093 -126.862206 10.183735 -123.81458 13.943184 -123.81458 curveto
17.702633 -123.81458 20.750275 -126.862206 20.750275 -130.62167 curveto
closepath
fill
newpath
0.0 0.0 0.0 setrgbcolor
1.0 setlinewidth
10.0 setmiterlimit
1 setlinejoin
1 setlinecap
[ ] 0 setdash
newpath
20.750275 -130.62167 moveto
20.750275 -134.38112 17.702633 -137.42877 13.943184 -137.42877 curveto
10.183735 -137.42877 7.136093 -134.38112 7.136093 -130.62167 curveto
7.136093 -126.862206 10.183735 -123.81458 13.943184 -123.81458 curveto
17.702633 -123.81458 20.750275 -126.862206 20.750275 -130.62167 curveto
closepath
stroke
newpath
0.0 0.0 1.0 setrgbcolor
newpath
49.096745 -130.62167 moveto
49.096745 -134.38112 46.049103 -137.42877 42.289654 -137.42877 curveto
38.530186 -137.42877 35.482563 -134.38112 35.482563 -130.62167 curveto
35.482563 -126.862206 38.530186 -123.81458 42.289654 -123.81458 curveto
46.049103 -123.81458 49.096745 -126.862206 49.096745 -130.62167 curveto
closepath
fill
newpath
0.0 0.0 0.0 setrgbcolor
1.0 setlinewidth
10.0 setmiterlimit
1 setlinejoin
1 setlinecap
[ ] 0 setdash
newpath
49.096745 -130.62167 moveto
49.096745 -134.38112 46.049103 -137.42877 42.289654 -137.42877 curveto
38.530186 -137.42877 35.482563 -134.38112 35.482563 -130.62167 curveto
35.482563 -126.862206 38.530186 -123.81458 42.289654 -123.81458 curveto
46.049103 -123.81458 49.096745 -126.862206 49.096745 -130.62167 curveto
closepath
stroke
newpath
grestore
grestore
showpage

%%EOF