%!PS-Adobe-3.0 EPSF-3.0
%%Creator: EpsGraphics2D 0.9.0 by Paul Mutton, http://www.jibble.org/
%%Title: GeoGebra, http://www.geogebra.org
%%CreationDate: Tue Mar 11 18:58:17 CET 2008
%%BoundingBox: 0 0 204 77
%%DocumentData: Clean7Bit
%%DocumentProcessColors: Black
%%ColorUsage: Color
%%Origin: 0 0
%%Pages: 1
%%Page: 1 1
%%EndComments

gsave
-0.0 77.0 translate
1.0 setlinewidth
10.0 setmiterlimit
0 setlinejoin
2 setlinecap
[ ] 0 setdash
gsave
newpath
0.0 -0.0 moveto
204.85245 -0.0 lineto
204.85245 -77.901634 lineto
0.0 -77.901634 lineto
0.0 -0.0 lineto
closepath
clip
newpath
1.0 setlinewidth
10.0 setmiterlimit
0 setlinejoin
2 setlinecap
[ ] 0 setdash
1.0 1.0 1.0 setrgbcolor
newpath
-66.77283 56.880558 moveto
224.63698 56.880558 lineto
224.63698 -198.66977 lineto
-66.77283 -198.66977 lineto
-66.77283 56.880558 lineto
closepath
fill
newpath
1.0 0.8 0.8509804 setrgbcolor
newpath
33.067287 -21.96991 moveto
5.8546867 -64.4896 lineto
146.45311 -64.4896 lineto
174.79958 -21.96991 lineto
closepath
fill
newpath
0.0 0.0 0.05490196 setrgbcolor
1.5 setlinewidth
10.0 setmiterlimit
1 setlinejoin
1 setlinecap
[ ] 0 setdash
newpath
33.067287 -21.96991 moveto
5.8546867 -64.4896 lineto
stroke
newpath
0.0 0.0 0.05490196 setrgbcolor
1.5 setlinewidth
10.0 setmiterlimit
1 setlinejoin
1 setlinecap
[ ] 0 setdash
newpath
5.8546867 -64.4896 moveto
146.45311 -64.4896 lineto
stroke
newpath
0.0 0.0 0.05490196 setrgbcolor
1.5 setlinewidth
10.0 setmiterlimit
1 setlinejoin
1 setlinecap
[ ] 0 setdash
newpath
146.45311 -64.4896 moveto
174.79958 -21.96991 lineto
stroke
newpath
0.0 0.0 0.05490196 setrgbcolor
1.5 setlinewidth
10.0 setmiterlimit
1 setlinejoin
1 setlinecap
[ ] 0 setdash
newpath
174.79958 -21.96991 moveto
33.067287 -21.96991 lineto
stroke
newpath
0.0 0.0 0.05490196 setrgbcolor
1.5 setlinewidth
10.0 setmiterlimit
1 setlinejoin
1 setlinecap
[ ] 0 setdash
newpath
78.31381 -5.3583136 moveto
199.08195 -52.758778 lineto
stroke
newpath
0.0 0.0 0.0 setrgbcolor
newpath
15.299691 -60.59016 moveto
15.299691 -57.015804 lineto
16.272978 -57.015804 lineto
16.704477 -57.015804 17.014416 -57.08866 17.202795 -57.23437 curveto
17.391172 -57.38008 17.485361 -57.61958 17.485361 -57.952866 curveto
17.485361 -58.33284 17.356556 -58.630703 17.098946 -58.846455 curveto
16.841333 -59.062202 16.483898 -59.17008 16.026638 -59.17008 curveto
15.802033 -59.17008 lineto
15.802033 -60.59016 lineto
closepath
15.802033 -58.786076 moveto
16.007317 -58.786076 lineto
16.308401 -58.786076 16.541056 -58.716843 16.705282 -58.578377 curveto
16.86951 -58.43991 16.951624 -58.244286 16.951624 -57.991505 curveto
16.951624 -57.777367 16.88722 -57.62441 16.758415 -57.532635 curveto
16.62961 -57.44086 16.414665 -57.394974 16.113583 -57.394974 curveto
15.802033 -57.394974 lineto
closepath
fill
newpath
0.0 0.0 0.0 setrgbcolor
newpath
100.66963 -7.4192033 moveto
100.66963 -6.926522 lineto
100.476425 -7.295228 100.185005 -7.479581 99.795364 -7.479581 curveto
99.47979 -7.479581 99.23144 -7.364461 99.05031 -7.1342206 curveto
98.86918 -6.9039807 98.77861 -6.589212 98.77861 -6.1899147 curveto
98.77861 -5.7535853 98.88125 -5.4025903 99.08653 -5.1369286 curveto
99.29182 -4.871267 99.561905 -4.738436 99.8968 -4.738436 curveto
100.20754 -4.738436 100.46516 -4.8575816 100.66963 -5.095872 curveto
100.66963 -3.605752 lineto
101.14783 -3.605752 lineto
101.14783 -7.4192033 lineto
closepath
100.66963 -5.4219112 moveto
100.423294 -5.2045517 100.189835 -5.095872 99.96925 -5.095872 curveto
99.5136 -5.095872 99.28578 -5.4444523 99.28578 -6.1416125 curveto
99.28578 -6.755049 99.48865 -7.0617676 99.89439 -7.0617676 curveto
100.15844 -7.0617676 100.416855 -6.9176664 100.66963 -6.6294637 curveto
closepath
fill
newpath
grestore
grestore
showpage

%%EOF