%!PS-Adobe-3.0 EPSF-3.0
%%Creator: EpsGraphics2D 0.9.0 by Paul Mutton, http://www.jibble.org/
%%Title: GeoGebra, http://www.geogebra.org
%%CreationDate: Tue Mar 11 19:03:54 CET 2008
%%BoundingBox: 0 0 289 240
%%DocumentData: Clean7Bit
%%DocumentProcessColors: Black
%%ColorUsage: Color
%%Origin: 0 0
%%Pages: 1
%%Page: 1 1
%%EndComments

gsave
-0.0 240.0 translate
1.0 setlinewidth
10.0 setmiterlimit
0 setlinejoin
2 setlinecap
[ ] 0 setdash
gsave
newpath
0.0 -0.0 moveto
289.68314 -0.0 lineto
289.68314 -240.0426 lineto
0.0 -240.0426 lineto
0.0 -0.0 lineto
closepath
clip
newpath
1.0 setlinewidth
10.0 setmiterlimit
0 setlinejoin
2 setlinecap
[ ] 0 setdash
1.0 1.0 1.0 setrgbcolor
newpath
-56.440613 70.04076 moveto
424.3246 70.04076 lineto
424.3246 -351.5638 lineto
-56.440613 -351.5638 lineto
-56.440613 70.04076 lineto
closepath
fill
newpath
1.0 0.8 0.8 setrgbcolor
newpath
52.752834 -150.39348 moveto
279.52448 -150.39348 lineto
251.17802 -93.70058 lineto
24.406378 -93.70058 lineto
closepath
fill
newpath
0.0 0.0 0.0 setrgbcolor
1.5 setlinewidth
10.0 setmiterlimit
1 setlinejoin
1 setlinecap
[ ] 0 setdash
newpath
52.752834 -150.39348 moveto
279.52448 -150.39348 lineto
stroke
newpath
0.0 0.0 0.0 setrgbcolor
1.5 setlinewidth
10.0 setmiterlimit
1 setlinejoin
1 setlinecap
[ ] 0 setdash
newpath
251.17802 -93.70058 moveto
279.52448 -150.39348 lineto
stroke
newpath
0.0 0.0 0.0 setrgbcolor
1.5 setlinewidth
10.0 setmiterlimit
1 setlinejoin
1 setlinecap
[ ] 0 setdash
newpath
24.406378 -93.70058 moveto
52.752834 -150.39348 lineto
stroke
newpath
0.0 0.0 0.0 setrgbcolor
1.5 setlinewidth
10.0 setmiterlimit
1 setlinejoin
1 setlinecap
[ ] 0 setdash
newpath
52.752834 -150.39348 moveto
279.52448 -150.39348 lineto
stroke
newpath
0.0 0.0 0.0 setrgbcolor
1.5 setlinewidth
10.0 setmiterlimit
1 setlinejoin
1 setlinecap
[ ] 0 setdash
newpath
279.52448 -150.39348 moveto
251.17802 -93.70058 lineto
stroke
newpath
0.0 0.0 0.0 setrgbcolor
1.5 setlinewidth
10.0 setmiterlimit
1 setlinejoin
1 setlinecap
[ ] 0 setdash
newpath
24.406378 -93.70058 moveto
52.752834 -150.39348 lineto
stroke
newpath
0.0 0.0 0.0 setrgbcolor
1.5 setlinewidth
10.0 setmiterlimit
1 setlinejoin
1 setlinecap
[ ] 0 setdash
newpath
137.7922 -93.70058 moveto
166.13866 -150.39348 lineto
stroke
newpath
0.0 0.0 0.0 setrgbcolor
1.5 setlinewidth
10.0 setmiterlimit
1 setlinejoin
1 setlinecap
[ ] 0 setdash
newpath
194.48512 -8.6612015 moveto
222.83157 -65.35412 lineto
stroke
newpath
0.0 0.0 0.0 setrgbcolor
1.5 setlinewidth
10.0 setmiterlimit
1 setlinejoin
1 setlinecap
[ ] 0 setdash
newpath
222.83157 -65.35412 moveto
166.13866 -150.39348 lineto
stroke
newpath
0.0 0.0 0.0 setrgbcolor
1.5 setlinewidth
10.0 setmiterlimit
1 setlinejoin
1 setlinecap
[ ] 0 setdash
newpath
194.48512 -8.6612015 moveto
137.7922 -93.70058 lineto
stroke
newpath
0.0 0.0 0.0 setrgbcolor
1.5 setlinewidth
10.0 setmiterlimit
1 setlinejoin
1 setlinecap
[ ] 0 setdash
newpath
166.13866 -150.39348 moveto
109.44574 -235.43286 lineto
stroke
newpath
0.0 0.0 0.0 setrgbcolor
1.5 setlinewidth
10.0 setmiterlimit
1 setlinejoin
1 setlinecap
[ ] 0 setdash
newpath
81.0993 -178.73994 moveto
109.44574 -235.43286 lineto
stroke
newpath
0.0 0.0 0.0 setrgbcolor
1.5 setlinewidth
10.0 setmiterlimit
1 setlinejoin
1 setlinecap
[ ] 0 setdash
newpath
99.99693 -150.39348 moveto
81.0993 -178.73994 lineto
stroke
newpath
0.0 0.0 0.0 setrgbcolor
1.5 setlinewidth
10.0 setmiterlimit
1 setlinejoin
0 setlinecap
[ 5.5 4.0 ] 0 setdash
newpath
137.7922 -93.70058 moveto
99.99693 -150.39348 lineto
stroke
newpath
0.0 0.0 0.0 setrgbcolor
1.5 setlinewidth
10.0 setmiterlimit
1 setlinejoin
1 setlinecap
[ ] 0 setdash
newpath
24.406378 -93.70058 moveto
137.7922 -93.70058 lineto
stroke
newpath
0.0 0.0 0.0 setrgbcolor
1.5 setlinewidth
10.0 setmiterlimit
1 setlinejoin
1 setlinecap
[ ] 0 setdash
newpath
203.93393 -93.70058 moveto
251.17802 -93.70058 lineto
stroke
newpath
0.0 0.0 0.0 setrgbcolor
1.5 setlinewidth
10.0 setmiterlimit
1 setlinejoin
0 setlinecap
[ 5.5 4.0 ] 0 setdash
newpath
137.7922 -93.70058 moveto
203.93393 -93.70058 lineto
stroke
newpath
0.0 0.0 0.0 setrgbcolor
newpath
33.40138 -102.681114 moveto
33.40138 -96.78417 lineto
35.0071 -96.78417 lineto
35.71898 -96.78417 36.230312 -96.904366 36.5411 -97.14476 curveto
36.851883 -97.385155 37.007275 -97.78028 37.007275 -98.330124 curveto
37.007275 -98.95701 36.794773 -99.44842 36.36977 -99.80436 curveto
35.944763 -100.1603 35.355072 -100.33827 34.60069 -100.33827 curveto
34.230137 -100.33827 lineto
34.230137 -102.681114 lineto
closepath
34.230137 -99.70475 moveto
34.568813 -99.70475 lineto
35.065536 -99.70475 35.44937 -99.59053 35.72031 -99.36209 curveto
35.99125 -99.13365 36.12672 -98.81091 36.12672 -98.393875 curveto
36.12672 -98.040596 36.02047 -97.788246 35.807964 -97.63684 curveto
35.595463 -97.485435 35.24085 -97.40973 34.744125 -97.40973 curveto
34.230137 -97.40973 lineto
closepath
fill
newpath
0.0 0.0 0.0 setrgbcolor
newpath
196.3986 -31.099712 moveto
195.47157 -30.799553 194.69461 -30.442284 194.06773 -30.027903 curveto
193.81804 -30.054466 193.62546 -30.067747 193.48999 -30.067747 curveto
192.69841 -30.067747 192.05493 -29.780869 191.55954 -29.207113 curveto
191.06413 -28.633358 190.81644 -27.888271 190.81644 -26.971855 curveto
190.81644 -26.031532 191.06679 -25.28047 191.5675 -24.718666 curveto
192.06822 -24.156862 192.73694 -23.875961 193.57365 -23.875961 curveto
194.41304 -23.875961 195.08243 -24.157528 195.5818 -24.72066 curveto
196.08118 -25.28379 196.33087 -26.038174 196.33087 -26.983809 curveto
196.33087 -28.33851 195.82751 -29.276176 194.82079 -29.796806 curveto
195.49814 -30.094309 196.20071 -30.306812 196.92854 -30.434315 curveto
closepath
193.54976 -29.442194 moveto
194.15273 -29.442194 194.6189 -29.225708 194.94829 -28.792734 curveto
195.27766 -28.35976 195.44235 -27.747488 195.44235 -26.955917 curveto
195.44235 -26.188253 195.27766 -25.587269 194.94829 -25.152967 curveto
194.6189 -24.718666 194.16069 -24.501514 193.57365 -24.501514 curveto
192.98662 -24.501514 192.52841 -24.718666 192.19904 -25.152967 curveto
191.86966 -25.587269 191.70497 -26.190908 191.70497 -26.963886 curveto
191.70497 -27.734207 191.86833 -28.339838 192.19505 -28.78078 curveto
192.52177 -29.221724 192.97334 -29.442194 193.54976 -29.442194 curveto
closepath
fill
newpath
grestore
grestore
showpage

%%EOF