<?xml version="1.0" standalone="no"?>
<!DOCTYPE svg PUBLIC "-//W3C//DTD SVG 1.1//EN" "http://www.w3.org/Graphics/SVG/1.1/DTD/svg11.dtd" >
<svg xmlns="http://www.w3.org/2000/svg">
<metadata>Generated by IcoMoon</metadata>
<defs>
<font id="icomoon" horiz-adv-x="1024">
<font-face units-per-em="1024" ascent="960" descent="-64" />
<missing-glyph horiz-adv-x="1024" />
<glyph unicode="&#x20;" horiz-adv-x="512" d="" />
<glyph unicode="&#x22;" glyph-name="remove" d="M128 0c0-35.346 28.654-64 64-64h640c35.348 0 64 28.654 64 64v704h-768v-704zM640 576h128v-512h-128v512zM448 576h128v-512h-128v512zM256 576h128v-512h-128v512zM896 896h-256v64h-256v-64h-256c-70.692 0-128-57.308-128-128h1024c0 70.692-57.306 128-128 128z" />
<glyph unicode="&#x24;" glyph-name="arrow-down" d="M256 576l256-256 256 256z" />
<glyph unicode="&#x25;" glyph-name="file-excel" d="M743.028 576h-135.294l-95.732-141.032-95.74 141.032h-135.288l162.162-242.464-182.974-269.536h262.24v91.576h-60.556l50.156 74.994 111.396-166.57h140.442l-182.976 269.536zM903.432 760.57l-142.864 142.862c-31.112 31.112-92.568 56.568-136.568 56.568h-480c-44 0-80-36-80-80v-864c0-44 36-80 80-80h736c44 0 80 36 80 80v608c0 44-25.456 105.458-56.568 136.57zM858.178 715.314c3.13-3.13 6.25-6.974 9.28-11.314h-163.458v163.456c4.34-3.030 8.184-6.15 11.314-9.28l142.864-142.862zM896 16c0-8.672-7.328-16-16-16h-736c-8.672 0-16 7.328-16 16v864c0 8.672 7.328 16 16 16h480c4.832 0 10.254-0.61 16-1.704v-254.296h254.296c1.094-5.746 1.704-11.166 1.704-16v-608z" />
<glyph unicode="&#x26;" glyph-name="rulers" d="M512 832v128h-384v-128h-128v-384h128v-512h384v512h512v384h-512zM128 512h-64v256h64v-256zM448 832h-128v-64h128v-64h-128v-64h128v-64h-128v-64h128v-64h-128v-64h128v-64h-128v-64h128v-64h-128v-64h128v-128h-256v896h256v-64zM960 512h-64v128h-64v-128h-64v128h-64v-128h-64v128h-64v-128h-64v256h448v-256z" />
<glyph unicode="&#x27;" glyph-name="undo" d="M761.862-64c113.726 206.032 132.888 520.306-313.862 509.824v-253.824l-384 384 384 384v-248.372c534.962 13.942 594.57-472.214 313.862-775.628z" />
<glyph unicode="&#x29;" glyph-name="upload" d="M448 384h128v256h192l-256 256-256-256h192zM640 528v-98.712l293.066-109.288-421.066-157.018-421.066 157.018 293.066 109.288v98.712l-384-144v-256l512-192 512 192v256z" />
<glyph unicode="&#x2a;" glyph-name="type" d="M64 960v-320l128 192h256v-832h-128l-64-64h512l-64 64h-128v832h256l128-192v320z" />
<glyph unicode="&#x2b;" glyph-name="shield" d="M263.702 676.286c5.418-170.784 46.464-312.54 122.378-422.16 34.686-50.086 76.898-93.556 125.92-129.746 49.022 36.19 91.236 79.66 125.918 129.746 75.914 109.622 116.96 251.376 122.378 422.16-80.45 19.29-159.504 50.9-248.298 98.99-88.806-48.098-167.842-79.7-248.296-98.99zM917.746 813.818c-142.874 9.936-257.908 55.918-405.742 146.182-147.844-90.264-262.878-136.246-405.75-146.182-39.352-622.682 299.538-820.138 405.75-877.818 106.206 57.68 445.096 255.136 405.742 877.818zM716.844 199.47c-70.938-102.438-154.096-160.062-204.842-190.052-50.748 29.99-133.904 87.614-204.844 190.052-99.014 142.978-145.856 329.954-139.506 556.354 112.788 15.55 215.782 54.542 344.35 129.624 128.562-75.082 231.554-114.074 344.346-129.624 6.352-226.4-40.49-413.374-139.504-556.354z" />
<glyph unicode="&#x2c;" glyph-name="loop" d="M874.022 810.020c-92.652 92.656-220.636 149.98-362.022 149.98-219.488 0-406.69-138.128-479.498-332.188l119.876-44.954c54.604 145.546 195.006 249.142 359.622 249.142 106.040 0 202.020-43 271.506-112.494l-143.506-143.506h384v384l-149.978-149.98zM512 64c-106.040 0-202.026 42.992-271.512 112.488l143.512 143.512h-384v-384l149.994 149.994c92.646-92.662 220.618-149.994 362.006-149.994 219.49 0 406.692 138.128 479.5 332.188l-119.876 44.954c-54.604-145.546-195.006-249.142-359.624-249.142z" />
<glyph unicode="&#x2d;" glyph-name="plus" d="M1024 640h-320v320h-384v-320h-320v-384h320v-320h384v320h320z" />
<glyph unicode="&#x2e;" glyph-name="edit" d="M456-24h568v16h-552zM488 8h536v16h-520zM424-56h600v16h-584zM584 104h440v16h-424zM552 72h472v16h-456zM520 40h504v16h-488zM938.972 874.972c-51.938 51.94-111.056 85.028-168.826 85.028-39.528 0-78.422-15.49-113.958-51.028l-495.742-492.522-160.446-416.45 64-64 416.446 160.45 492.53 495.74c87.474 87.476 53.474 195.306-34.004 282.782zM480.298 187.106l-229.196 229.194 403.608 400.988 226.574-226.576-400.986-403.606z" />
<glyph unicode="&#x2f;" glyph-name="font-size" d="M128 960v-320l128 192h256v-832h-128v-64h384v64h-128v832h256l128-192v320zM256 384h128l64-96v160h-448v-160l64 96h128v-384h-64v-64h192v64h-64z" />
<glyph unicode="&#x30;" glyph-name="copy" d="M896 704h-256v128l-128 128h-512v-768h384v-256h640v640l-128 128zM64 256v640h384l128-128v-64h-192v-448h-320zM960 0h-512v640h384l128-128v-512z" />
<glyph unicode="&#x31;" glyph-name="image" d="M0 832v-768h1024v768h-1024zM960 128h-64l-192 288-128-96-256 320-192-512h-64v640h896v-640zM704 608c0-53.019 42.981-96 96-96s96 42.981 96 96c0 53.019-42.981 96-96 96s-96-42.981-96-96z" />
<glyph unicode="&#x32;" glyph-name="file-download" d="M576 512h-192v-320h-160l256-256 256 256h-160zM640 960h-576v-384l32-640 32 640v320h512v-192h192v-128l32-640 32 640v128z" />
<glyph unicode="&#x33;" glyph-name="settings" d="M933.79 349.75c-53.726 93.054-21.416 212.304 72.152 266.488l-100.626 174.292c-28.75-16.854-62.176-26.518-97.846-26.518-107.536 0-194.708 87.746-194.708 195.99h-201.258c0.266-33.41-8.074-67.282-25.958-98.252-53.724-93.056-173.156-124.702-266.862-70.758l-100.624-174.292c28.97-16.472 54.050-40.588 71.886-71.478 53.638-92.908 21.512-211.92-71.708-266.224l100.626-174.292c28.65 16.696 61.916 26.254 97.4 26.254 107.196 0 194.144-87.192 194.7-194.958h201.254c-0.086 33.074 8.272 66.57 25.966 97.218 53.636 92.906 172.776 124.594 266.414 71.012l100.626 174.29c-28.78 16.466-53.692 40.498-71.434 71.228zM512 240.668c-114.508 0-207.336 92.824-207.336 207.334 0 114.508 92.826 207.334 207.336 207.334 114.508 0 207.332-92.826 207.332-207.334-0.002-114.51-92.824-207.334-207.332-207.334z" />
<glyph unicode="&#x34;" glyph-name="arrow-up" d="M512.002 960l-512.002-512h320v-511.998l384-0.002v512h320z" />
<glyph unicode="&#x35;" glyph-name="grid" d="M0 960v-1024h1024v1024h-1024zM960 640h-256v256h256v-256zM384 320v256h256v-256h-256zM640 256v-256h-256v256h256zM320 320h-256v256h256v-256zM384 640v256h256v-256h-256zM704 576h256v-256h-256v256zM320 896v-256h-256v256h256zM64 256h256v-256h-256v256zM704 0v256h256v-256h-256z" />
<glyph unicode="&#x37;" glyph-name="search" d="M42.554 88.604l242.552 206.294c25.074 22.566 51.89 32.926 73.552 31.926-57.256 67.068-91.842 154.078-91.842 249.176 0 212.078 171.922 384 384 384 212.076 0 384-171.922 384-384s-171.922-384-384-384c-95.098 0-182.108 34.586-249.176 91.844 1-21.662-9.36-48.478-31.926-73.552l-206.294-242.552c-35.322-39.246-93.022-42.554-128.22-7.356s-31.892 92.898 7.354 128.22zM650.816 320c141.384 0 256 114.616 256 256s-114.616 256-256 256-256-114.616-256-256 114.614-256 256-256z" />
<glyph unicode="&#x38;" glyph-name="key-A" d="M896 960h-768c-70.4 0-128-57.6-128-128v-768c0-70.4 57.6-128 128-128h768c70.4 0 128 57.6 128 128v768c0 70.4-57.6 128-128 128zM976 88h-156.028c-0.002 0-0.002-0.002-0.004-0.002 7.622 4.734 14.81 10.098 21.516 16.004l-0.002-0.002h134.518v-16zM815.058 144.942c-21.242-21.242-49.318-32.942-79.058-32.942h-448c-29.74 0-57.816 11.7-79.058 32.942-21.244 21.242-32.942 49.318-32.942 79.058v448c0 29.74 11.698 57.816 32.942 79.058 21.242 21.244 49.318 32.942 79.058 32.942h448c29.74 0 57.816-11.698 79.058-32.942 21.242-21.242 32.942-49.318 32.942-79.058v-448c0-29.74-11.7-57.816-32.942-79.058zM976 120h-118.714c-0.002-0.002-0.002-0.004-0.004-0.004 4.368 5.082 8.432 10.428 12.146 16.030-0.006-0.010-0.010-0.018-0.016-0.026h106.588v-16zM976 152h-97.274c2.632 5.184 5.008 10.516 7.074 16h90.2v-16zM976 184h-85.098c-0.018-0.066-0.042-0.13-0.058-0.2 1.384 5.3 2.504 10.706 3.34 16.2h81.816v-16zM976 216h-80.204c0-0.006-0.002-0.014-0.002-0.020 0.132 2.658 0.206 5.33 0.206 8.020v8h80v-16zM976 248h-80v16h80v-16zM976 280h-80v16h80v-16zM976 312h-80v16h80v-16zM976 344h-80v16h80v-16zM976 376h-80v16h80v-16zM976 408h-80v16h80v-16zM976 440h-80v16h80v-16zM976 472h-80v16h80v-16zM976 504h-80v16h80v-16zM976 536h-80v16h80v-16zM976 568h-80v16h80v-16zM976 600h-80v16h80v-16zM976 632h-80v16h80v-16zM976 664h-80v8c0 2.69-0.072 5.362-0.206 8.020 0-0.006 0.002-0.012 0.002-0.020h80.204v-16zM976 696h-81.816c-0.836 5.494-1.956 10.898-3.34 16.198 0.018-0.066 0.042-0.132 0.058-0.198h85.098v-16zM976 728h-90.2c-2.066 5.484-4.442 10.816-7.074 16h97.274v-16zM976 760h-106.588c0.006-0.008 0.010-0.016 0.016-0.024-3.712 5.6-7.776 10.944-12.142 16.024h118.714v-16zM976 824h-88l-16-16h104v-16h-120l-7-7c-29 29-69 47-113 47h-448c-88 0-160-72-160-160v-448c0-44 18-84 47-113l-7-7h14.516c6.706-5.906 13.894-11.268 21.514-16.002 0 0-0.002 0.002-0.004 0.002h-52.026l-16-16h102.278c15.672-5.166 32.378-8 49.722-8h448c17.344 0 34.050 2.834 49.722 8h190.278v-8c0-4.064-0.312-8.084-0.914-12.038 0.206 1.338 0.376 2.684 0.512 4.038h-855.598l-16-16h868.286c-2.76-8.698-7.024-16.882-12.66-24.252 2.026 2.65 3.876 5.404 5.542 8.252h-877.168l-16-16h880.896c-0.148-0.15-0.288-0.308-0.438-0.458-6.886-6.888-14.786-12.356-23.334-16.292h-834.248c-8.548 3.936-16.446 9.402-23.334 16.292-15.182 15.178-23.542 35.232-23.542 56.458v768c0 21.228 8.36 41.278 23.542 56.458s35.23 23.542 56.458 23.542h768c21.226 0 41.28-8.36 56.458-23.542 0.15-0.15 0.29-0.308 0.438-0.458h-0.896l-16-16h29.166c-1.666 2.848-3.516 5.602-5.542 8.252 5.636-7.37 9.9-15.556 12.66-24.252h-52.284l-16-16h71.598c-0.134 1.354-0.306 2.7-0.512 4.040 0.602-3.954 0.914-7.974 0.914-12.040v-8zM972.288 40.004c0.804 2.54 1.48 5.122 2.030 7.736-0.546-2.616-1.226-5.198-2.030-7.736zM974.358 47.92c0.252 1.214 0.468 2.438 0.662 3.666-0.194-1.228-0.412-2.452-0.662-3.666zM952.898 8.002c1.13 1.148 2.214 2.328 3.268 3.53-1.052-1.202-2.136-2.382-3.268-3.53zM956.594 12.028c0.988 1.146 1.946 2.312 2.862 3.504-0.916-1.192-1.872-2.36-2.862-3.504zM952.898 887.998c1.13-1.148 2.216-2.33 3.27-3.53-1.052 1.2-2.138 2.38-3.27 3.53zM956.594 883.974c0.988-1.148 1.946-2.316 2.864-3.508-0.916 1.194-1.876 2.362-2.864 3.508zM972.286 855.998c0.808-2.544 1.49-5.132 2.036-7.754-0.55 2.62-1.228 5.208-2.036 7.754zM974.358 848.084c0.252-1.222 0.47-2.452 0.666-3.688-0.196 1.236-0.414 2.466-0.666 3.688zM690.274 192h96.798l-235.072 512.998h-80l-235.072-512.998h96.798l58.654 128h239.24l58.654-128zM421.708 384l90.292 197.046 90.292-197.046h-180.584z" />
<glyph unicode="&#x39;" glyph-name="stack-plus" d="M320 896v-73.896l-167.616-23.556 10.888-77.48-163.272-46.818 211.69-738.25 652.066 186.976 35.74 5.024h124.504v768h-704zM251.456 7.74l-179.716 626.742 99.686 28.584 87.844-625.044 191.794 26.956-199.608-57.238zM308.632 103.53l-90.74 645.656 102.108 14.348v-635.534h162.75l-174.118-24.47zM960 192h-576v640h576v-640zM832 448h-128v-128h-64v128h-128v64h128v128h64v-128h128z" />
<glyph unicode="&#x3a;" glyph-name="stack-minus" d="M320 896v-73.896l-167.616-23.556 10.888-77.48-163.272-46.818 211.69-738.25 652.066 186.976 35.74 5.024h124.504v768h-704zM251.456 7.74l-179.716 626.742 99.686 28.584 87.844-625.044 191.794 26.956-199.608-57.238zM308.632 103.53l-90.74 645.656 102.108 14.348v-635.534h162.75l-174.118-24.47zM960 192h-576v640h576v-640zM512 512h320v-64h-320z" />
<glyph unicode="&#x3b;" glyph-name="close" d="M761.256 289.256l-90.512-90.512-158.744 158.746-158.746-158.744-90.51 90.51 158.746 158.744-158.744 158.746 90.508 90.508 158.746-158.744 158.744 158.746 90.512-90.51-158.746-158.746 158.746-158.744zM512 812c-97.228 0-188.636-37.862-257.386-106.614-68.752-68.75-106.614-160.158-106.614-257.386s37.864-188.636 106.614-257.386c68.75-68.75 160.158-106.614 257.386-106.614s188.636 37.864 257.386 106.614c68.75 68.75 106.614 160.158 106.614 257.386s-37.864 188.636-106.614 257.386c-68.75 68.752-160.158 106.614-257.386 106.614zM512 896v0c247.424 0 448-200.576 448-448s-200.576-448-448-448c-247.422 0-448 200.576-448 448s200.578 448 448 448z" />
<glyph unicode="&#x3c;" glyph-name="clipboard" d="M576 864c0 53.020-42.98 96-96 96-53.018 0-96-42.98-96-96 0-96-192-32-192-160h576c0 128-192 64-192 160zM480 817.6c-25.626 0-46.4 20.774-46.4 46.4s20.774 46.4 46.4 46.4c25.624 0 46.4-20.774 46.4-46.4s-20.776-46.4-46.4-46.4zM896 768h-64v-128h-704v128h-64c-35.346 0-64-28.654-64-64v-704c0-35.348 28.652-64 64-64h832c35.344 0 64 28.652 64 64v704c0 35.346-28.656 64-64 64zM832 64h-704v64h704v-64zM832 256h-704v64h704v-64zM832 448h-704v64h704v-64z" />
<glyph unicode="&#x3e;" glyph-name="mobile" d="M736 960h-448c-52.8 0-96-43.2-96-96v-832c0-52.8 43.2-96 96-96h448c52.8 0 96 43.2 96 96v832c0 52.8-43.2 96-96 96zM384 912h256v-32h-256v32zM512 0c-35.346 0-64 28.654-64 64s28.654 64 64 64 64-28.654 64-64-28.654-64-64-64zM768 192h-512v640h512v-640z" />
<glyph unicode="&#x3f;" glyph-name="user-reading" d="M352 800c0 88.366 71.634 160 160 160s160-71.634 160-160c0-88.366-71.634-160-160-160s-160 71.634-160 160zM1009.976 231.98l-256 320c-12.63 15.788-31.212 23.994-49.968 24.008l-0.008 0.012-384.008-0.014c-18.756-0.014-37.338-8.22-49.968-24.004l-256-320c-16.804-21.004-18.68-50.276-4.696-73.254 11.762-19.326 32.628-30.73 54.658-30.73 4.164 0 8.372 0.408 12.564 1.246l179.45 35.888v-229.132h512v229.132l179.45-35.89c4.194-0.838 8.398-1.246 12.562-1.246 22.030 0 42.898 11.406 54.658 30.73 13.986 22.978 12.11 52.25-4.694 73.254zM704 308.466l-51.45 10.292c-34.65 6.936-68.376-15.544-75.308-50.208-6.932-34.66 15.546-68.376 50.208-75.308l76.55-15.31v-49.932l-192-64-192 64v49.932l76.552 15.31c34.66 6.932 57.138 40.648 50.206 75.308-6.932 34.662-40.652 57.128-75.308 50.208l-51.45-10.292v139.534l192-64 192 64v-139.534z" />
<glyph unicode="&#x40;" glyph-name="medal" d="M896 544c0 212.078-171.922 384-384 384s-384-171.922-384-384c0-124.542 59.308-235.218 151.206-305.378l-151.206-302.622 192 128 64-128 89.646 225.902c12.616-1.252 25.408-1.902 38.354-1.902s25.738 0.65 38.356 1.902l89.644-225.902 64 128 192-128-151.206 302.622c91.898 70.16 151.206 180.836 151.206 305.378zM693.020 362.98c-48.352-48.352-112.642-74.98-181.020-74.98-68.38 0-132.668 26.628-181.020 74.98s-74.98 112.64-74.98 181.020 26.628 132.666 74.98 181.020c48.354 48.352 112.64 74.98 181.020 74.98 68.378 0 132.668-26.628 181.020-74.98s74.98-112.64 74.98-181.020-26.628-132.668-74.98-181.020z" />
<glyph unicode="&#x41;" glyph-name="star" d="M1024 562.95l-353.78 51.408-158.22 320.582-158.216-320.582-353.784-51.408 256-249.538-60.432-352.352 316.432 166.358 316.432-166.358-60.434 352.352 256.002 249.538z" />
<glyph unicode="&#x42;" glyph-name="ticket" d="M575.996 640l127.998-127.998-255.994-255.994-127.998 127.998zM1001.526 662.496l-73.516 73.516-32.008-32.008c-16.378-16.38-39.010-26.51-64-26.51-49.988 0-90.514 40.522-90.514 90.51 0 25.002 10.14 47.638 26.534 64.018l31.988 31.986-73.518 73.516c-29.968 29.968-79.008 29.968-108.976 0l-595.040-595.038c-29.966-29.968-29.966-79.010 0-108.976l73.52-73.518 31.962 31.964c16.382 16.406 39.030 26.552 64.044 26.552 49.988 0 90.51-40.524 90.51-90.51 0-25.006-10.14-47.64-26.534-64.022l-31.984-31.986 73.516-73.518c29.966-29.966 79.008-29.966 108.976 0l595.040 595.040c29.964 29.976 29.964 79.016 0 108.984zM448.002 128.004l-256 256 384 384 256-256-384-384z" />
<glyph unicode="&#x44;" glyph-name="eye" d="M512 768c-223.318 0-416.882-130.042-512-320 95.118-189.958 288.682-320 512-320 223.314 0 416.878 130.042 512 320-95.116 189.958-288.686 320-512 320zM764.45 598.296c60.162-38.374 111.142-89.774 149.434-150.296-38.292-60.522-89.274-111.922-149.436-150.298-75.594-48.216-162.89-73.702-252.448-73.702-89.56 0-176.856 25.486-252.45 73.704-60.16 38.372-111.14 89.772-149.434 150.296 38.292 60.524 89.274 111.924 149.434 150.296 3.918 2.5 7.876 4.922 11.858 7.3-9.958-27.328-15.408-56.822-15.408-87.596 0-141.384 114.616-256 256-256s256 114.616 256 256c0 30.774-5.45 60.268-15.408 87.598 3.98-2.378 7.938-4.802 11.858-7.302zM512 550c0-53.020-42.98-96-96-96s-96 42.98-96 96 42.98 96 96 96 96-42.98 96-96z" />
<glyph unicode="&#x45;" glyph-name="bookmark" d="M192 960v-1024l320 320 320-320v1024z" />
<glyph unicode="&#x46;" glyph-name="arrow-right" d="M0 640h64v-384h-64zM128 640h64v-384h-64zM256 640h64v-384h-64zM1024 448l-448 448v-256h-192v-384h192v-256z" />
<glyph unicode="&#x47;" glyph-name="users" d="M576 316.156v29.536c38.258 33.2 64 95.242 64 166.308 0 106.040-57.306 192-128 192-70.692 0-128-85.96-128-192 0-71.070 25.744-133.116 64.006-166.312v-29.532c-146.062-17.79-256-95.268-256-188.156h639.994c0 92.888-109.938 170.368-256 188.156zM321.68 350.388c-26.708 16.316-60.376 27.628-97.678 31.804v14.682c19.124 16.602 32 47.598 32 83.126 0 53.020-28.654 96-64 96s-64-42.98-64-96c0-35.528 12.876-66.524 32-83.126v-14.654c-90.804-10.158-160-62.794-160-126.218h179.426c34.042 39.226 83.22 71.884 142.252 94.386zM864 382.22v14.654c19.126 16.602 32 47.598 32 83.126 0 53.020-28.654 96-64 96s-64-42.98-64-96c0-35.528 12.876-66.524 32-83.126v-14.682c-37.3-4.176-70.97-15.488-97.68-31.804 59.032-22.502 108.208-55.16 142.254-94.386h179.426c0 63.424-69.194 116.060-160 126.218z" />
<glyph unicode="&#x48;" glyph-name="user" d="M673.576 299.398c-46.75-35.788-101.802-56.64-161.568-56.64-59.784 0-114.836 20.854-161.594 56.64-203.496-41.764-350.414-159.896-350.414-299.398h1024c0 139.502-146.92 257.634-350.424 299.398zM301.506 608c0 159.058 94.241 288 210.494 288s210.494-128.942 210.494-288c0-159.058-94.241-288-210.494-288s-210.494 128.942-210.494 288z" />
<glyph unicode="&#x49;" glyph-name="bullhorn" d="M1024 530.744c0 200.926-58.792 363.938-131.482 365.226 0.292 0.006 0.578 0.030 0.872 0.030h-82.942c0 0-194.8-146.336-475.23-203.754-8.56-45.292-14.030-99.274-14.030-161.502s5.466-116.208 14.030-161.5c280.428-57.418 475.23-203.756 475.23-203.756h82.942c-0.292 0-0.578 0.024-0.872 0.032 72.696 1.288 131.482 164.298 131.482 365.224zM864.824 220.748c-9.382 0-19.532 9.742-24.746 15.548-12.63 14.064-24.792 35.96-35.188 63.328-23.256 61.232-36.066 143.31-36.066 231.124 0 87.81 12.81 169.89 36.066 231.122 10.394 27.368 22.562 49.266 35.188 63.328 5.214 5.812 15.364 15.552 24.746 15.552 9.38 0 19.536-9.744 24.744-15.552 12.634-14.064 24.796-35.958 35.188-63.328 23.258-61.23 36.068-143.312 36.068-231.122 0-87.804-12.81-169.888-36.068-231.124-10.39-27.368-22.562-49.264-35.188-63.328-5.208-5.806-15.36-15.548-24.744-15.548zM251.812 530.744c0 51.95 3.81 102.43 11.052 149.094-47.372-6.554-88.942-10.324-140.34-10.324-67.058 0-67.058 0-67.058 0l-55.466-94.686v-88.17l55.46-94.686c0 0 0 0 67.060 0 51.398 0 92.968-3.774 140.34-10.324-7.236 46.664-11.048 97.146-11.048 149.096zM368.15 317.828l-127.998 24.51 81.842-321.544c4.236-16.634 20.744-25.038 36.686-18.654l118.556 47.452c15.944 6.376 22.328 23.964 14.196 39.084l-123.282 229.152zM864.824 411.27c-3.618 0-7.528 3.754-9.538 5.992-4.87 5.42-9.556 13.86-13.562 24.408-8.962 23.6-13.9 55.234-13.9 89.078s4.938 65.478 13.9 89.078c4.006 10.548 8.696 18.988 13.562 24.408 2.010 2.24 5.92 5.994 9.538 5.994 3.616 0 7.53-3.756 9.538-5.994 4.87-5.42 9.556-13.858 13.56-24.408 8.964-23.598 13.902-55.234 13.902-89.078 0-33.842-4.938-65.478-13.902-89.078-4.004-10.548-8.696-18.988-13.56-24.408-2.008-2.238-5.92-5.992-9.538-5.992z" />
<glyph unicode="&#x4a;" glyph-name="filter" d="M0 832l384-384v-384l256 64v320l384 384z" />
<glyph unicode="&#x4b;" glyph-name="prev" d="M640-64l192 192-320 320 320 320-192 192-512-512z" />
<glyph unicode="&#x4c;" glyph-name="next" d="M384 960l-192-192 320-320-320-320 192-192 512 512z" />
<glyph unicode="&#x61;" glyph-name="file-pdf" d="M842.012 370.52c-13.648 13.446-43.914 20.566-89.972 21.172-31.178 0.344-68.702-2.402-108.17-7.928-17.674 10.198-35.892 21.294-50.188 34.658-38.462 35.916-70.568 85.772-90.576 140.594 1.304 5.12 2.414 9.62 3.448 14.212 0 0 21.666 123.060 15.93 164.666-0.79 5.706-1.274 7.362-2.808 11.796l-1.882 4.834c-5.896 13.592-17.448 27.994-35.566 27.208l-10.916 0.344c-20.2 0-36.664-10.332-40.986-25.774-13.138-48.434 0.418-120.892 24.982-214.738l-6.288-15.286c-17.588-42.876-39.63-86.060-59.078-124.158l-2.528-4.952c-20.46-40.038-39.024-74.026-55.854-102.822l-17.376-9.188c-1.264-0.668-31.044-16.418-38.028-20.644-59.256-35.382-98.522-75.54-105.036-107.416-2.072-10.17-0.53-23.186 10.014-29.214l16.806-8.458c7.29-3.652 14.978-5.502 22.854-5.502 42.204 0 91.2 52.572 158.696 170.366 77.93 25.368 166.654 46.456 244.414 58.090 59.258-33.368 132.142-56.546 178.142-56.546 8.168 0 15.212 0.778 20.932 2.296 8.822 2.336 16.258 7.366 20.792 14.192 8.926 13.432 10.734 31.932 8.312 50.876-0.722 5.624-5.212 12.576-10.070 17.322zM211.646 145.952c7.696 21.042 38.16 62.644 83.204 99.556 2.832 2.296 9.808 8.832 16.194 14.902-47.102-75.124-78.646-105.066-99.398-114.458zM478.434 760.314c13.566 0 21.284-34.194 21.924-66.254s-6.858-54.56-16.158-71.208c-7.702 24.648-11.426 63.5-11.426 88.904 0 0-0.566 48.558 5.66 48.558zM398.852 322.506c9.45 16.916 19.282 34.756 29.33 53.678 24.492 46.316 39.958 82.556 51.478 112.346 22.91-41.684 51.444-77.12 84.986-105.512 4.184-3.542 8.618-7.102 13.274-10.65-68.21-13.496-127.164-29.91-179.068-49.862zM828.904 326.348c-4.154-2.598-16.054-4.1-23.708-4.1-24.706 0-55.272 11.294-98.126 29.666 16.468 1.218 31.562 1.838 45.1 1.838 24.782 0 32.12 0.108 56.35-6.072s24.538-18.734 20.384-21.332zM903.432 760.57l-142.864 142.862c-31.112 31.112-92.568 56.568-136.568 56.568h-480c-44 0-80-36-80-80v-864c0-44 36-80 80-80h736c44 0 80 36 80 80v608c0 44-25.456 105.458-56.568 136.57zM858.178 715.314c3.13-3.13 6.25-6.974 9.28-11.314h-163.458v163.456c4.34-3.030 8.184-6.15 11.314-9.28l142.864-142.862zM896 16c0-8.672-7.328-16-16-16h-736c-8.672 0-16 7.328-16 16v864c0 8.672 7.328 16 16 16h480c4.832 0 10.254-0.61 16-1.704v-254.296h254.296c1.094-5.746 1.704-11.166 1.704-16v-608z" />
<glyph unicode="&#x63;" glyph-name="user-chairperson" d="M320 768c0-106.039 85.961-192 192-192s192 85.961 192 192c0 106.039-85.961 192-192 192s-192-85.961-192-192zM768.078 512h-35.424l-199.104-404.244 74.45 372.244-96 96-96-96 74.45-372.244-199.102 404.244h-35.424c-127.924 0-127.924-85.986-127.924-192v-320h768v320c0 106.014 0 192-127.922 192z" />
<glyph unicode="&#x64;" glyph-name="package-download" d="M832 896h-640l-192-192v-672c0-17.674 14.326-32 32-32h960c17.672 0 32 14.326 32 32v672l-192 192zM512 128l-320 256h192v192h256v-192h192l-320-256zM154.51 768l64 64h586.978l64-64h-714.978z" />
<glyph unicode="&#x69;" glyph-name="info" d="M512 960c-282.77 0-512-229.23-512-512s229.228-512 512-512c282.77 0 512 229.23 512 512s-229.23 512-512 512zM512 832c70.694 0 128-57.308 128-128s-57.306-128-128-128-128 57.308-128 128 57.308 128 128 128zM704 64h-384v64h64v320h-64v64h320v-384h64v-64z" />
<glyph unicode="&#x6d;" glyph-name="mail" d="M0 768v-640h1024v640h-1024zM885.334 704l-373.334-280-373.334 280h746.668zM64 192v488l448-336 448 336v-488h-896z" />
<glyph unicode="&#x70;" glyph-name="phone" d="M914.306 752.704c-126.7 72.028-307.86 79.296-402.164 79.296-0.054-0.048-0.096-0.112-0.132-0.156-0.058 0.046-0.098 0.106-0.154 0.156-94.302 0-275.46-7.276-402.16-79.296-106.534-60.568-109.694-125.418-109.694-170.698v-6.794c0-10.364 8.938-18.836 19.852-18.836h240.292c10.914 0 19.852 8.472 19.852 18.836v22.906c0 57.214 54.712 66.356 84.898 71.21s105.236 9.554 146.96 9.554c0.056 0 0.096 0 0.154 0 0.040 0 0.080 0 0.132 0 41.726 0 116.768-4.702 146.96-9.554 30.188-4.86 84.898-14 84.898-71.21v-22.906c0-10.364 8.938-18.836 19.856-18.836h240.29c10.918 0 19.856 8.472 19.856 18.836v6.794c-0.002 45.28-3.162 110.13-109.696 170.698zM512.012 563.584c-56.748 0-174.896 8.164-234.922-64.622-60.044-72.768-210.18-434.962-76.294-434.962 133.912 0 250.916 0 311.212 0 60.272 0 177.296 0 311.19 0 133.89 0-16.25 362.194-76.274 434.962-60.036 72.786-178.19 64.622-234.912 64.622zM512 160c-88.366 0-160 71.634-160 160s71.634 160 160 160 160-71.634 160-160-71.634-160-160-160z" />
<glyph unicode="&#x74;" glyph-name="alarm" d="M512 768c-212.076 0-384-171.922-384-384s171.922-384 384-384c212.074 0 384 171.922 384 384s-171.926 384-384 384zM715.644 180.354c-54.392-54.396-126.716-84.354-203.644-84.354s-149.25 29.958-203.646 84.354c-54.396 54.394-84.354 126.718-84.354 203.646s29.958 149.25 84.354 203.646c54.396 54.396 126.718 84.354 203.646 84.354s149.252-29.958 203.642-84.354c54.402-54.396 84.358-126.718 84.358-203.646s-29.958-149.252-84.356-203.646zM325.93 756.138l-42.94 85.878c-98.874-49.536-179.47-130.132-229.006-229.008l85.876-42.94c40.248 80.336 105.732 145.822 186.070 186.070zM884.134 570.070l85.878 42.938c-49.532 98.876-130.126 179.472-229.004 229.008l-42.944-85.878c80.338-40.248 145.824-105.732 186.070-186.068zM512 576h-64v-192c0-10.11 4.7-19.11 12.022-24.972l-0.012-0.016 160-128 39.976 49.976-147.986 118.39v176.622z" />
<glyph unicode="&#x77;" glyph-name="wrench" d="M83.402 228.278l372.786 304.226c12.366 10.090 24.366 19.102 35.812 26.99-14.682 34.564-22.808 72.586-22.808 112.506 0 159.058 128.942 288 288 288 29.094 0 57.172-4.332 83.646-12.354l-179.646-179.646v-192h192l179.646 179.646c8.022-26.474 12.354-54.552 12.354-83.646 0-159.058-128.942-288-288-288-39.92 0-77.94 8.126-112.504 22.808-7.888-11.448-16.898-23.448-26.988-35.812l-304.228-372.788c-63.29-77.552-172.672-83.404-243.072-13.004s-64.55 179.784 13.002 243.074zM181.192 0l96 96-96 96-96-96 96-96z" />
<glyph unicode="&#xe000;" glyph-name="textarea" d="M0 832v-128h64v64h64v-192h-64v-64h192v64h-64v192h64v-64h64v128h-320zM448 768v-128h448v-448h-768v192h-128v-320h1024v704h-576z" />
<glyph unicode="&#xe001;" glyph-name="handle" d="M384 768c0 70.692 57.308 128 128 128s128-57.308 128-128c0-70.692-57.308-128-128-128s-128 57.308-128 128zM384 448c0 70.692 57.308 128 128 128s128-57.308 128-128c0-70.692-57.308-128-128-128s-128 57.308-128 128zM384 128c0 70.692 57.308 128 128 128s128-57.308 128-128c0-70.692-57.308-128-128-128s-128 57.308-128 128z" />
<glyph unicode="&#xe002;" glyph-name="location" d="M738.24 866.24c-124.992 124.992-327.488 124.992-452.512 0-124.992-124.928-124.992-327.616 0-452.48 0.032 0 226.272-221.76 226.272-477.76 0 256 226.24 477.76 226.24 477.76 125.024 124.864 125.024 327.552 0 452.48zM512 512c-70.752 0-128 57.248-128 128s57.248 128 128 128 128-57.248 128-128-57.248-128-128-128z" />
<glyph unicode="&#xe003;" glyph-name="calendar" d="M320 576h128v-128h-128zM512 576h128v-128h-128zM704 576h128v-128h-128zM128 192h128v-128h-128zM320 192h128v-128h-128zM512 192h128v-128h-128zM320 384h128v-128h-128zM512 384h128v-128h-128zM704 384h128v-128h-128zM128 384h128v-128h-128zM832 960v-64h-128v64h-448v-64h-128v64h-128v-1024h960v1024h-128zM896 0h-832v704h832v-704z" />
<glyph unicode="&#xe004;" glyph-name="time" d="M658.744 210.744l-210.744 210.746v282.51h128v-229.49l173.256-173.254zM512 960c-282.77 0-512-229.23-512-512s229.23-512 512-512 512 229.23 512 512-229.23 512-512 512zM512 64c-212.078 0-384 171.922-384 384s171.922 384 384 384c212.078 0 384-171.922 384-384s-171.922-384-384-384z" />
<glyph unicode="&#xe005;" glyph-name="broadcast" d="M1024 448c0 282.77-229.23 512-512 512s-512-229.23-512-512c0-220.054 138.836-407.664 333.686-480.068l-13.686-31.932h384l-13.686 31.932c194.85 72.404 333.686 260.014 333.686 480.068zM486.79 325.174c-22.808 9.788-38.79 32.436-38.79 58.826 0 35.346 28.654 64 64 64s64-28.654 64-64c0-26.39-15.978-49.044-38.786-58.834l-25.214 58.834-25.21-58.826zM538.268 322.708c58.092 12.118 101.732 63.602 101.732 125.292 0 70.694-57.306 128-128 128-70.692 0-128-57.306-128-128 0-61.692 43.662-113.122 101.76-125.228l-74.624-174.122c-91.23 39.15-155.136 129.784-155.136 235.35 0 141.384 114.616 268 256 268s256-126.616 256-268c0-105.566-63.906-196.2-155.136-235.35l-74.596 174.058zM688.448-27.708l-73.924 172.486c126.446 42.738 217.476 162.346 217.476 303.222 0 176.73-143.268 320-320 320-176.73 0-320-143.27-320-320 0-140.876 91.030-260.484 217.476-303.222l-73.924-172.486c-159.594 68.488-271.386 227.034-271.386 411.708 0 247.332 200.502 459.834 447.834 459.834s447.834-212.502 447.834-459.834c0-184.674-111.792-343.22-271.386-411.708z" />
<glyph unicode="&#xe006;" glyph-name="mic" d="M480 256c88.366 0 160 71.634 160 160v384c0 88.366-71.634 160-160 160s-160-71.634-160-160v-384c0-88.366 71.636-160 160-160zM704 512v-96c0-123.71-100.29-224-224-224-123.712 0-224 100.29-224 224v96h-64v-96c0-148.238 112.004-270.3 256-286.22v-129.78h-128v-64h320v64h-128v129.78c143.994 15.92 256 137.982 256 286.22v96h-64z" />
<glyph unicode="&#xe007;" glyph-name="camera" d="M978.84 703.748c-10.588 0-21.458-3.722-31.436-10.766l-179.404-126.614v105.632c0 52.8-43.2 96-96 96h-576c-52.8 0-96-43.2-96-96v-448c0-52.8 43.2-96 96-96h576c52.8 0 96 43.2 96 96v105.63l179.402-126.614c9.978-7.042 20.848-10.764 31.434-10.766 0.002 0 0.002 0 0.006 0 14.088 0 26.954 6.496 35.292 17.822 6.456 8.77 9.868 20.054 9.868 32.636v410.582c-0.002 33.126-22.72 50.458-45.162 50.458z" />
<glyph unicode="&#xe008;" glyph-name="lock" d="M592 512h-16v192c0 105.87-86.13 192-192 192h-128c-105.87 0-192-86.13-192-192v-192h-16c-26.4 0-48-21.6-48-48v-480c0-26.4 21.6-48 48-48h544c26.4 0 48 21.6 48 48v480c0 26.4-21.6 48-48 48zM384 64h-128l27.84 139.2c-16.808 11.532-27.84 30.874-27.84 52.8 0 35.346 28.654 64 64 64s64-28.654 64-64c0-21.926-11.032-41.268-27.84-52.8l27.84-139.2zM448 512h-256v192c0 35.29 28.71 64 64 64h128c35.29 0 64-28.71 64-64v-192z" />
<glyph unicode="&#xe009;" glyph-name="unlocked" d="M768 896h-128c-105.87 0-192-86.13-192-192v-192h-400c-26.4 0-48-21.6-48-48v-480c0-26.4 21.6-48 48-48h544c26.4 0 48 21.6 48 48v480c0 26.4-21.6 48-48 48h-16v192c0 35.29 28.71 64 64 64h128c35.29 0 64-28.71 64-64v-192h128v192c0 105.87-86.13 192-192 192zM384 64h-128l27.84 139.2c-16.808 11.532-27.84 30.874-27.84 52.8 0 35.346 28.654 64 64 64s64-28.654 64-64c0-21.926-11.032-41.268-27.84-52.8l27.84-139.2z" />
<glyph unicode="&#xe00a;" glyph-name="disable" d="M0 448c0-282.77 229.23-512 512-512 282.772 0 512 229.23 512 512s-229.228 512-512 512c-282.77 0-512-229.23-512-512zM896 448c0-73.236-20.512-141.68-56.088-199.912l-527.822 527.824c58.23 35.578 126.674 56.088 199.91 56.088 212.076 0 384-171.922 384-384zM128 448c0 73.236 20.512 141.678 56.090 199.912l527.822-527.824c-58.234-35.578-126.676-56.088-199.912-56.088-212.076 0-384 171.922-384 384z" />
<glyph unicode="&#xe00b;" glyph-name="expand" d="M1024 576l-192 192-320-320-320 320-192-192 512-511.998z" />
<glyph unicode="&#xe00c;" glyph-name="play" d="M192 832l640-384-640-384z" />
<glyph unicode="&#xe00d;" glyph-name="stop" d="M128 832h768v-768h-768z" />
<glyph unicode="&#xe00e;" glyph-name="sort" d="M416 256h224v704h128v-704h224l-288-288-288 288zM384 640v-704h-128v704h-224l288 288 288-288h-224z" />
<glyph unicode="&#xe07b;" glyph-name="file-content" d="M892.118 771.882l-120.234 120.236c-37.338 37.336-111.084 67.882-163.884 67.882h-448c-52.8 0-96-43.2-96-96v-832c0-52.8 43.2-96 96-96h704c52.8 0 96 43.2 96 96v576c0 52.8-30.546 126.546-67.882 163.882zM640 824.438c2.196-0.804 4.452-1.68 6.758-2.636 18.060-7.482 30.598-16.176 34.616-20.194l120.236-120.238c4.018-4.018 12.712-16.554 20.194-34.614 0.956-2.306 1.832-4.562 2.636-6.756h-184.44v184.438zM832 64h-640v768h384v-256h256v-512zM256 448h512v-64h-512zM256 320h512v-64h-512zM256 192h512v-64h-512z" />
<glyph unicode="&#xe08d;" glyph-name="file" d="M903.432 760.57l-142.864 142.862c-31.112 31.112-92.568 56.568-136.568 56.568h-480c-44 0-80-36-80-80v-864c0-44 36-80 80-80h736c44 0 80 36 80 80v608c0 44-25.456 105.458-56.568 136.57zM858.178 715.314c3.13-3.13 6.25-6.974 9.28-11.314h-163.458v163.456c4.34-3.030 8.184-6.15 11.314-9.28l142.864-142.862zM896 16c0-8.672-7.328-16-16-16h-736c-8.672 0-16 7.328-16 16v864c0 8.672 7.328 16 16 16h480c4.832 0 10.254-0.61 16-1.704v-254.296h254.296c1.094-5.746 1.704-11.166 1.704-16v-608z" />
<glyph unicode="&#xe097;" glyph-name="stack" d="M512 384l-512 256 512 256 512-256zM921.444 499.278l102.556-51.278-512-256-512 256 102.556 51.278 409.444-204.722zM921.444 307.278l102.556-51.278-512-256-512 256 102.556 51.278 409.444-204.722z" />
<glyph unicode="&#xe0b9;" glyph-name="tag" d="M895.75 831.748h-256.5c-5.696 0-20.738-2.722-38.836-10.218-18.094-7.496-30.652-16.206-34.68-20.232l-424.32-424.32 299.566-299.564 424.318 424.318c4.026 4.028 12.738 16.586 20.234 34.684 7.5 18.098 10.218 33.138 10.218 38.832v256.502zM927.812 960v0c52.902 0 96.188-43.286 96.188-96.188v-288.564c0-52.902-30.606-126.792-68.014-164.204l-446.99-446.988c-18.704-18.704-43.362-28.056-68.016-28.056s-49.31 9.35-68.014 28.056l-344.91 344.906c-37.408 37.408-37.408 98.624 0 136.032l446.99 446.99c37.408 37.408 111.298 68.016 164.204 68.016h288.562zM640 672c0 53.019 42.981 96 96 96s96-42.981 96-96c0-53.019-42.981-96-96-96s-96 42.981-96 96z" />
<glyph unicode="&#xe0d4;" glyph-name="coins" d="M670.666 642.666c-23.296 0-46.060-2.28-68.098-6.584-1.746 1.318-3.526 2.628-5.388 3.916 27.228 18.828 42.82 40.684 42.82 64v64.002c0 70.692-143.268 128-320 128s-320-57.308-320-128v-64c0-23.316 15.592-45.172 42.82-64-27.228-18.828-42.82-40.684-42.82-64v-64c0-23.316 15.592-45.172 42.822-64-27.23-18.828-42.822-40.686-42.822-64v-64c0-23.316 15.592-45.172 42.82-64-27.228-18.828-42.82-40.686-42.82-64v-64c0-70.694 143.268-128 320-128 47.232 0 92.042 4.114 132.4 11.46 60.088-47.264 135.886-75.46 218.266-75.46 195.142 0 353.334 158.194 353.334 353.334s-158.192 353.332-353.334 353.332zM32 768c0 19.046 28.894 42.912 73.61 60.798 56.75 22.7 132.89 35.202 214.39 35.202s157.64-12.502 214.39-35.202c44.716-17.886 73.61-41.752 73.61-60.798s-28.894-42.912-73.61-60.798c-18.46-7.384-38.984-13.682-61.066-18.828-45.798-10.674-98.334-16.374-153.324-16.374s-107.526 5.7-153.326 16.374c-22.082 5.146-42.604 11.444-61.064 18.828-44.716 17.886-73.61 41.752-73.61 60.798zM32 384c0 14.134 15.922 30.92 42.406 45.95 58.7-28.082 146.926-45.95 245.594-45.95 3.42 0 6.812 0.046 10.204 0.094-8.376-30.16-12.872-61.934-12.872-94.76 0-0.44 0.014-0.876 0.016-1.316-54.026 0.18-105.616 5.854-150.678 16.356-22.080 5.146-42.602 11.444-61.062 18.826-44.714 17.886-73.608 41.754-73.608 60.8zM320 96c-81.5 0-157.64 12.5-214.39 35.2-44.716 17.886-73.61 41.754-73.61 60.8 0 14.134 15.922 30.92 42.406 45.95 58.7-28.082 146.926-45.95 245.594-45.95 3.648 0 7.27 0.046 10.886 0.1 9.64-33.746 24.176-65.426 42.782-94.228-17.522-1.226-35.452-1.872-53.668-1.872zM320 480c-54.988 0-107.526 5.7-153.324 16.374-22.082 5.146-42.606 11.444-61.066 18.828-44.716 17.886-73.61 41.752-73.61 60.798 0 14.134 15.922 30.92 42.404 45.95 58.7-28.082 146.926-45.95 245.596-45.95 65.922 0 127.138 8.002 178.044 21.672-49.976-28.040-92.44-67.87-123.622-115.73-17.762-1.262-35.94-1.942-54.422-1.942zM670.666 0.242c-159.66 0-289.090 129.43-289.090 289.092 0 159.66 129.43 289.090 289.090 289.090 159.662 0 289.092-129.43 289.092-289.090 0-159.662-129.43-289.092-289.092-289.092zM704 512h-64v-64h-128v-192h128v-64h-128v-64h128v-64h64v64h128v192h-128v64h128v64h-128v64zM640 320h-64v64h64v-64zM768 256v-64h-64v64h64z" />
<glyph unicode="&#xe134;" glyph-name="floppy" d="M896 960h-896v-1024h1024v896l-128 128zM512 832h128v-256h-128v256zM896 64h-768v768h64v-320h576v320h74.978l53.022-53.018v-714.982z" />
<glyph unicode="&#xe14c;" glyph-name="redo" d="M576 711.628v248.372l384-384-384-384v253.824c-446.75 10.482-427.588-303.792-313.86-509.824-280.712 303.414-221.1 789.57 313.86 775.628z" />
<glyph unicode="&#xe16d;" glyph-name="bubble-quote" d="M928 960h-832c-52.8 0-96-43.2-96-96v-576c0-52.8 43.2-96 96-96h160v-256l307.2 256h364.8c52.8 0 96 43.2 96 96v576c0 52.8-43.2 96-96 96zM448 689.23c-59.642-13.7-110.378-56.014-140.976-113.882 4.268 0.43 8.596 0.652 12.976 0.652 70.692 0 128-57.308 128-128s-57.308-128-128-128-128 57.308-128 128c0 87.224 30.396 169.458 85.59 231.55 46.494 52.304 105.89 85.226 170.41 95.208v-85.528zM832 689.23c-59.64-13.7-110.378-56.014-140.976-113.882 4.268 0.43 8.596 0.652 12.976 0.652 70.692 0 128-57.308 128-128s-57.308-128-128-128-128 57.308-128 128c0 87.224 30.396 169.458 85.59 231.55 46.492 52.304 105.89 85.226 170.41 95.208v-85.528z" />
<glyph unicode="&#xe24e;" glyph-name="lamp" d="M382.152 161.554c23.754-25.858 63.058-34.668 135.496-33.476 65.306 1.090 101.884 6.746 124.2 27.29v-75.048c-39.902-12.972-83.784-20.172-129.842-20.172-46.062 0-89.954 7.2-129.854 20.176v81.23zM383.506 29.888c57.648-17.63 83.95-18.582 128.5-18.582 44.544 0 70.848 0.952 128.5 18.582-5.016-27.41-26.602-93.888-128.5-93.888-101.9 0-123.486 66.478-128.5 93.888zM512.006 884c-128.654 0-233.322-102.764-233.322-229.080 0-62.814 43.798-140.778 96.712-228.792 21.116-35.122 31.242-69.83 39.378-97.718 6.308-21.626 12.266-42.052 20.014-49.29 3.602-3.368 19.68-14.354 75.266-14.354 2.13 0 4.29 0.014 6.492 0.048 61.634 0.906 76.314 12.090 77.784 13.362 4.728 4.090 9.844 22.53 14.36 38.8 7.25 26.128 16.274 58.648 36.232 93.576 39.982 69.942 100.396 175.62 100.396 244.37 0 60.948-24.148 118.332-67.998 161.58-44.13 43.528-102.84 67.498-165.314 67.498zM512.006 960v0c170.736 0 309.314-136.676 309.312-305.080 0-84.202-55.832-186.606-110.41-282.078-54.558-95.474-6.024-181.27-193.258-184.022-2.576-0.036-5.104-0.056-7.596-0.056-186.566 0-143.15 103.988-199.794 198.204-57.398 95.474-107.576 183.748-107.576 267.952 0 168.402 138.574 305.080 309.322 305.080z" />
<glyph unicode="&#xe26e;" glyph-name="puzzle" d="M958.33 703.75h-168.45c-43.43 0.066-86.696 3.006-44.504 77.458 42.276 74.6 72.118 179.042-97.604 179.042-169.714 0-139.87-104.442-97.594-179.042 42.192-74.452-1.076-77.388-44.51-77.458h-183.876c-36.12 0-65.67-29.556-65.67-65.668v-204.378c0-43.512 11.808-87.026-62.786-44.756-74.592 42.274-193.336 72.114-193.336-97.604 0-169.708 118.74-139.87 193.34-97.596 74.594 42.274 62.786-1.24 62.786-44.76v-147.566c0-36.124 29.554-65.67 65.67-65.67h183.622c43.52 0 87.034 17.412 44.764 92.008-42.274 74.59-72.122 179.038 97.594 179.038s139.876-104.442 97.6-179.038c-42.27-74.598 1.246-92.010 44.762-92.010h168.192c36.124 0 65.674 29.554 65.674 65.67v636.664c0 36.114-29.55 65.666-65.674 65.666z" />
<glyph unicode="&#xe299;" glyph-name="list" d="M0 960h256v-256h-256zM384 896h640v-128h-640zM0 576h256v-256h-256zM384 512h640v-128h-640zM0 192h256v-256h-256zM384 128h640v-128h-640z" />
<glyph unicode="&#xe29c;" glyph-name="numbered-list" d="M384 128h640v-128h-640zM384 512h640v-128h-640zM384 896h640v-128h-640zM192 960v-256h-64v192h-64v64zM128 434v-50h128v-64h-192v146l128 60v50h-128v64h192v-146zM256 256v-320h-192v64h128v64h-128v64h128v64h-128v64z" />
<glyph unicode="&#xe2ab;" glyph-name="circle-small" d="M320 448c0 106.039 85.961 192 192 192s192-85.961 192-192c0-106.039-85.961-192-192-192s-192 85.961-192 192z" />
<glyph unicode="&#xe2cd;" glyph-name="link" d="M953.396 885.358l-4.028 4.042c-94.148 94.134-248.194 94.134-342.326 0l-218.106-218.136c-94.134-94.132-94.134-248.176 0-342.31l4.026-4.026c7.832-7.848 16.146-14.924 24.736-21.458l79.848 79.85c-9.302 5.494-18.126 12.072-26.116 20.060l-4.042 4.042c-51.114 51.098-51.114 134.272 0 185.39l218.128 218.112c51.116 51.118 134.274 51.118 185.386 0l4.042-4.024c51.1-51.116 51.1-134.292 0-185.39l-98.686-98.686c17.132-42.308 25.248-87.4 24.538-132.386l152.604 152.604c94.134 94.136 94.134 248.178-0.004 342.316zM631.042 571.066c-7.832 7.832-16.146 14.922-24.736 21.44l-79.848-79.832c9.304-5.496 18.126-12.074 26.116-20.062l4.042-4.040c51.116-51.116 51.116-134.272 0-185.388l-218.13-218.134c-51.118-51.102-134.276-51.102-185.388 0l-4.042 4.042c-51.098 51.12-51.098 134.276 0 185.388l98.688 98.686c-17.134 42.306-25.246 87.402-24.538 132.386l-152.602-152.598c-94.136-94.132-94.136-248.178 0-342.324l4.026-4.032c94.152-94.128 248.192-94.128 342.328 0l218.11 218.118c94.134 94.132 94.134 248.194 0 342.326l-4.026 4.024z" />
<glyph unicode="&#xe35c;" glyph-name="question" d="M512 960c-282.77 0-512-229.23-512-512s229.226-512 512-512c282.77 0 512 229.23 512 512s-229.23 512-512 512zM576 128h-128v128h128v-128zM768 512c0-70.58-57.42-128-128-128h-63.884c-0.040-0.034-0.082-0.076-0.116-0.116v-63.884h-128v64c0 70.58 57.42 128 128 128h63.884c0.040 0.034 0.082 0.076 0.116 0.114v127.77c-0.034 0.040-0.074 0.082-0.116 0.116h-319.884v128h320c70.58 0 128-57.42 128-128v-128z" />
<glyph unicode="&#xe372;" glyph-name="checkmark" d="M983.058 896c-334.5-253.166-655.302-591.8-655.302-591.8l-231.18 207.8-96.576-98.378c95.016-89.302 315.162-325.198 389.632-413.622 209.59 350.18 427.478 611.336 634.368 850.154l-40.942 45.846z" />
<glyph unicode="&#xe37b;" glyph-name="enter" d="M960 960v-1024h-768v320h64v-192h448v768h-448v-192h-64v320zM384 384h-384v128h384v192l256-256-256-256z" />
<glyph unicode="&#xe37c;" glyph-name="exit" d="M768 384h-448v128h448v192l256-256-256-256zM640 320v-384h-640v1024h640v-384h-64v256h-320v-768h320v256z" />
<glyph unicode="&#xe3b0;" glyph-name="collapse" d="M0 320l192-192 320 320 320-320 192 192-511.998 512z" />
<glyph unicode="&#xe3bf;" glyph-name="arrow-left" d="M0 448l512-512v320h511.998l0.002 384h-512v320z" />
<glyph unicode="&#xe432;" glyph-name="checkbox-checked" d="M412.594 419.278l-202.994 180.878-84.82-84.796c83.44-78.414 276.76-281.25 342.16-358.894 184.040 307.498 375.374 532.522 557.060 742.236l-35.946 35.948c-293.742-222.318-575.46-515.372-575.46-515.372zM768 0h-704v704h503.552c22.28 20.632 45.736 42.060 70.172 64h-637.724v-832h832v582c-21.492-27.556-42.816-55.516-64-84.026v-433.974z" />
<glyph unicode="&#xe433;" glyph-name="checkbox-unchecked" d="M768 704v-704h-704v704h704zM832 768h-832v-832h832v832z" />
<glyph unicode="&#xe454;" glyph-name="bold" d="M707.88 475.348c37.498 44.542 60.12 102.008 60.12 164.652 0 141.16-114.842 256-256 256h-320v-896h384c141.158 0 256 114.842 256 256 0 92.956-49.798 174.496-124.12 219.348zM384 768h101.5c55.968 0 101.5-57.42 101.5-128s-45.532-128-101.5-128h-101.5v256zM543 128h-159v256h159c58.45 0 106-57.42 106-128s-47.55-128-106-128z" />
<glyph unicode="&#xe456;" glyph-name="italic" d="M896 896v-64h-128l-320-768h128v-64h-448v64h128l320 768h-128v64z" />
<glyph unicode="&#xe463;" glyph-name="pagebreak" d="M256 576v384h768v-384h-64v320h-640v-320zM1024 384v-448h-768v448h64v-384h640v384zM512 512h128v-64h-128zM320 512h128v-64h-128zM704 512h128v-64h-128zM896 512h128v-64h-128zM0 672l192-192-192-192z" />
<glyph unicode="&#xe480;" glyph-name="code" d="M128 448l256 256h-128l-256-256 256-256h128zM768 704h-128l256-256-256-256h128l256 256zM544 832l-160-768h96l160 768z" />
<glyph unicode="&#xe48b;" glyph-name="seven-segment9" d="M256 896l64 64h384l64-64-64-64h-384zM768 480l-64 64v256l64 64 64-64v-256zM256 479.998l-64 64v256.002l64 64 64-64v-256.002zM768 32l-64 64v256l64 64 64-64v-256zM256 448l64 64h384l64-64-64-64h-384zM256 0l64 64h384l64-64-64-64h-384z" />
<glyph unicode="&#xe600;" glyph-name="earth" d="M874.040 810.038c96.702-96.704 149.96-225.28 149.96-362.040s-53.258-265.334-149.96-362.038c-96.706-96.702-225.28-149.96-362.040-149.96s-265.334 53.258-362.040 149.96c-96.702 96.704-149.96 225.278-149.96 362.038s53.254 265.336 149.96 362.040c96.706 96.704 225.28 149.962 362.040 149.962s265.334-53.258 362.040-149.962zM828.784 131.214c63.058 63.060 104.986 141.608 122.272 227.062-13.474-19.836-26.362-27.194-34.344 17.206-8.22 72.39-74.708 26.148-116.516 51.86-44.004-29.658-142.906 57.662-126.098-40.824 25.934-44.422 140.008 59.45 83.148-34.542-36.274-65.616-132.642-210.932-120.106-286.258 1.582-109.744-112.134-22.884-151.314 13.52-26.356 72.92-8.982 200.374-77.898 236.086-74.802 3.248-139.004 10.046-167.994 93.67-17.446 59.828 18.564 148.894 82.678 162.644 93.85 58.966 127.374-69.054 215.39-71.434 27.328 28.594 101.816 37.686 107.992 69.75-57.75 10.19 73.268 48.558-5.528 70.382-43.47-5.112-71.478-45.074-48.368-78.958-84.238-19.642-86.936 121.904-167.91 77.258-2.058-70.59-132.222-22.886-45.036-8.572 29.956 13.088-48.86 51.016-6.28 44.124 20.916 1.136 91.332 25.812 72.276 42.402 39.21 24.34 72.16-58.29 110.538 1.882 27.708 46.266-11.62 54.808-46.35 31.356-19.58 21.924 34.57 69.276 82.332 89.738 15.918 6.82 31.122 10.536 42.746 9.484 24.058-27.792 68.55-32.606 70.878 3.342-59.582 28.534-125.276 43.608-193.292 43.608-97.622 0-190.47-31.024-267.308-88.39 20.65-9.46 32.372-21.238 12.478-36.296-15.456-46.054-78.17-107.876-133.224-99.124-28.586-49.296-47.412-103.606-55.46-160.528 46.112-15.256 56.744-45.45 46.836-55.55-23.496-20.488-37.936-49.53-45.376-81.322 15.010-91.836 58.172-176.476 125.27-243.576 84.616-84.614 197.118-131.214 316.784-131.214 119.664 0 232.168 46.6 316.784 131.214z" />
<glyph unicode="&#xe601;" glyph-name="switchon" d="M896 64h-768q-53 0-90.5 37.5t-37.5 90.5v512q0 53 37.5 90.5t90.5 37.5h768q53 0 90.5-37.5t37.5-90.5v-512q0-53-37.5-90.5t-90.5-37.5zM896 640q0 27-19 45.5t-45 18.5h-640q-27 0-45.5-18.5t-18.5-45.5v-384q0-26 18.5-45t45.5-19h640q26 0 45 19t19 45v384zM448 256h-192q-27 0-45.5 19t-18.5 45v256q0 27 18.5 45.5t45.5 18.5h192q26 0 45-18.5t19-45.5v-256q0-26-19-45t-45-19z" />
<glyph unicode="&#xe602;" glyph-name="switchoff" d="M896 64h-768q-53 0-90.5 37.5t-37.5 90.5v512q0 53 37.5 90.5t90.5 37.5h768q53 0 90.5-37.5t37.5-90.5v-512q0-53-37.5-90.5t-90.5-37.5zM896 640q0 27-19 45.5t-45 18.5h-640q-27 0-45.5-18.5t-18.5-45.5v-384q0-26 18.5-45t45.5-19h640q26 0 45 19t19 45v384zM768 256h-192q-27 0-45.5 19t-18.5 45v256q0 27 18.5 45.5t45.5 18.5h192q26 0 45-18.5t19-45.5v-256q0-26-19-45t-45-19z" />
<glyph unicode="&#xe603;" glyph-name="warning" d="M512 801.276l-344.834-737.276h689.668l-344.834 737.276zM512 960v0c22.070 0 44.14-14.882 60.884-44.648l437.072-871.112c33.49-59.532 5-108.24-63.302-108.24h-869.308c-68.304 0-96.79 48.708-63.304 108.24l437.074 871.112c16.744 29.766 38.814 44.648 60.884 44.648zM448 192c0 35.346 28.654 64 64 64s64-28.654 64-64c0-35.346-28.654-64-64-64s-64 28.654-64 64zM512 576c35.346 0 64-28.654 64-64l-20-192h-88l-20 192c0 35.346 28.654 64 64 64z" />
<glyph unicode="&#xe604;" glyph-name="projector" d="M1009.94 604.59h5.765v67.953c0 16.404-13.425 29.819-29.819 29.819h-132.721c-48.046 61.839-123.085 101.683-207.442 101.683-84.367 0-159.396-39.844-207.442-101.683h-400.159c-16.404 0-29.819-13.425-29.819-29.819v-67.953h269.763c11.192 0 20.255-9.073 20.255-20.255s-9.062-20.255-20.255-20.255h-269.763v-72.53h269.763c11.192 0 20.255-9.073 20.255-20.255s-9.062-20.255-20.255-20.255h-269.763v-72.55h269.763c11.192 0 20.255-9.073 20.255-20.265s-9.062-20.255-20.255-20.255h-269.763v-67.973c0-16.404 13.425-29.819 29.819-29.819h947.773c16.404 0 29.819 13.425 29.819 29.819v67.973h-5.765c-11.203 0-20.265 9.062-20.265 20.255s9.062 20.265 20.265 20.265h5.765v72.55h-5.765c-11.203 0-20.265 9.073-20.265 20.255s9.062 20.255 20.265 20.255h5.765v72.53h-5.765c-11.203 0-20.265 9.073-20.265 20.255s9.052 20.255 20.255 20.255zM645.734 378.030c-90.255 0-163.42 73.165-163.42 163.41 0 90.266 73.165 163.42 163.42 163.42 90.245 0 163.41-73.155 163.41-163.42 0-90.245-73.165-163.41-163.41-163.41zM651.131 615.598c26.747 0 50.135-14.254 63.181-35.512l51.159 31.283c-23.572 38.492-65.905 64.246-114.34 64.246v-60.017zM88.33 198.595h847.35v-59.976h-847.35v59.976z" />
<glyph unicode="&#xe605;" glyph-name="agreement" d="M913.156 943.154h-780.146c-19.252 0-35.009-15.755-35.009-35.009v-915.651c0-19.252 15.755-35.009 35.009-35.009h780.146c19.241 0 35.009 15.755 35.009 35.009v915.651c-0.012 19.252-15.769 35.009-35.009 35.009zM883.778 20.575h-721.385v858.198h721.385v-858.198zM741.052 281.586c0-8.476-6.865-15.34-15.34-15.34h-51.594c-8.464 0-15.34 6.865-15.34 15.34v0c0 8.485 6.875 15.348 15.34 15.348h51.605c8.464-0.012 15.327-6.875 15.327-15.348v0zM816.95 513.28c0-16.113-13.056-29.169-29.169-29.169h-529.732c-16.105 0-29.169 13.056-29.169 29.169v0c0 16.113 13.069 29.169 29.169 29.169h529.732c16.113 0 29.169-13.056 29.169-29.169v0zM816.95 641.652c0-16.113-13.056-29.169-29.169-29.169h-529.732c-16.105 0-29.169 13.056-29.169 29.169v0c0 16.113 13.069 29.181 29.169 29.181h529.732c16.113 0 29.169-13.069 29.169-29.181v0zM456.309 770.044c0-16.113-13.056-29.181-29.169-29.181h-169.093c-16.105 0-29.169 13.069-29.169 29.181v0c0 16.113 13.069 29.169 29.169 29.169h169.104c16.105 0 29.162-13.056 29.162-29.169v0zM826.482 214.812c-28.166-3.453-47.135-24.955-65.089-42.637-5.89-6.066-11.531-11.919-16.668-16.814 3.589 6.634 7.407 13.958 10.547 21.2 3.715 8.977 5.84 16.617 5.882 24.389 0.125 7.084-2.396 15.318-8.497 20.697-6.026 5.411-13.205 6.78-19.011 6.78-17.003-0.565-32.143-9.154-44.72-20.047-12.462-11.363-25.142-24.682-36.203-34.758-5.482-5.011-10.619-9.178-14.502-11.655-1.947-1.255-3.568-2.071-4.562-2.47-0.231-0.093-0.429-0.167-0.596-0.219-1.309 0.314-2.555 0.607-3.725 0.869 5.095 7.847 14.692 21.242 29.087 40.043 4.959 5.911 9.229 11.216 12.577 15.475 2.396 3.066 4.321 5.566 5.714 7.471 0.7 0.951 1.267 1.727 1.789 2.48 0.26 0.397 0.502 0.733 0.848 1.318 0.189 0.292 0.366 0.638 0.713 1.297 1.277 2.229 1.394 3.828 1.444 4.802 0.033 0.272 0.063 0.565 0.093 0.869 0.019 0.052 0.052 0.105 0.084 0.147 0.084 1.142 0.041 1.202 0.063 1.235 0 1.463-0.21 2.909-0.618 4.311-0.47 1.685-1.235 3.284-2.251 4.731-0.524 0.733-1.099 1.444-1.737 2.071-0.649 0.649-1.339 1.225-2.071 1.737-0.679 0.481-1.394 0.91-2.134 1.267-0.093 0.052-0.219 0.115-0.366 0.189 0-0.012 0.012-0.012 0.019-0.019-0.063 0.033-0.125 0.063-0.189 0.084 0.063-0.019 0.115-0.041 0.167-0.063-0.285 0.189-0.804 0.45-1.894 0.7 0.219-0.063 0.441-0.167 0.659-0.24-0.292 0.105-0.596 0.219-0.89 0.292 0.074-0.012 0.158-0.033 0.219-0.052-0.7 0.219-1.435 0.387-2.166 0.502-0.89 0.167-1.769 0.252-2.49 0.199-0.199 0-0.377-0.012-0.565-0.012-1.35 0.125-2.857-0.199-4.394-0.784 0.158 0.052 0.304 0.093 0.47 0.135-0.304-0.093-0.618-0.199-0.91-0.304 0.147 0.063 0.292 0.125 0.441 0.177-1.402-0.397-2.178-0.848-2.741-1.225-0.377-0.219-0.733-0.441-1.088-0.669-0.033-0.012-0.052-0.019-0.074-0.033-0.135-0.093-0.252-0.189-0.366-0.272-0.292-0.219-0.576-0.429-0.848-0.659-1.58-1.267-1.35-1.318-1.947-1.841-2.311-2.596-6.518-7.887-15.34-19.493-1.402-1.841-2.772-3.642-4.1-5.388-7.513-8.967-16.699-19.503-26.324-29.569-11.143-11.676-23.050-22.956-33.543-30.844-10.265-8.139-19.94-11.793-21.282-11.3h-0.135c-1.529 0.252-2.666 0.565-3.411 0.837 0.231 2.251 1.925 6.969 4.885 13.215 15.38 18.686 30.572 42.689 42.732 63.594 6.78 11.667 12.537 22.351 16.668 30.469 2.061 4.079 3.725 7.533 4.99 10.297 0.627 1.413 1.142 2.638 1.622 3.892 0.387 1.685 1.076 1.612 1.402 6.977-0.063 1.789-0.093 4.27-2.134 7.994-1.685 3.775-8.139 8.277-13.666 7.908-5.859-0.26-7.701-2.094-9.094-2.866-4.060-3.181-3.703-3.703-4.908-5.031-2.374-3.327-5.337-8.255-10.244-16.865-14.607-25.539-29.82-48.288-41.738-67.789-4.583-7.775-8.811-14.795-12.315-21.534-3.453-4.027-6.739-7.523-9.722-10.274-3.066-2.835-5.797-4.857-7.628-5.882-0.869-0.493-1.517-0.764-1.841-0.869-0.019 0-0.033 0-0.033-0.012-0.105 0-0.199 0.012-0.285 0.012-0.167 0.784-0.335 2.061-0.325 3.808-0.135 5.723 1.841 15.36 5.827 27.781 6.916 9.825 13.518 19.787 19.764 29.643 19.303 30.74 34.969 60.802 45.911 84.752 5.493 11.98 9.793 22.411 12.817 30.803 2.983 8.819 4.949 13.738 5.254 21.282-0.084 1.799 0.019 3.975-1.663 7.868-1.099 3.82-8.277 9.951-14.795 9.458-10.683-1.183-11.11-4.802-13.507-6.351-5.063-5.618-9.522-13.089-17.044-26.743-21.951-40.23-40.138-75.899-53.008-105.698-4.772-11.163-8.852-21.419-12.128-30.887-3.243-4.521-6.54-8.989-9.908-13.393-31.673-41.716-69.443-76.943-105.26-88.579-8.236-2.751-12.702-11.626-9.961-19.839 2.178-6.591 8.297-10.766 14.878-10.766 1.643 0 3.307 0.26 4.959 0.804 37.007 12.619 70.259 40.324 99.305 73.514 1.129-2.823 2.689-5.556 4.793-8.16 6.112-7.585 16.073-10.911 24.715-10.703 4.759 0.314 8.945 1.328 12.754 2.857 1.339-2.563 3.088-4.959 5.262-6.969 4.625-4.373 10.014-6.843 15.728-8.37h-49.983c-8.464 0-15.34-6.865-15.34-15.348 0-8.476 6.875-15.34 15.34-15.34h308.658c8.476 0 15.34 6.865 15.34 15.34 0 8.485-6.865 15.348-15.34 15.348h-51.52c2.596 1.789 5.075 3.703 7.523 5.662 13.456 11.28 26.314 26.284 39.121 38.326 12.66 12.294 25.227 20.245 32.571 20.509 8.622 0.796 15.004 8.423 14.21 17.044-0.774 8.601-8.391 14.963-17.023 14.189zM654.387 245.804c-0.743-0.837-1.402-1.756-1.956-2.732-0.105-0.147-0.219-0.325-0.366-0.524 0.387 1.017 1.225 2.145 2.323 3.255zM563.941 119.055c11.342 2.95 21.124 9.722 31.568 17.483 1.194 0.931 2.396 1.882 3.589 2.847 0.26-0.26 0.524-0.532 0.796-0.774 11.615-9.229 17.974-7.084 26.702-10.085 2.386-0.586 4.541-0.753 6.394-0.753 17.974 1.202 28.019 11.834 40.87 22.63 12.272 11.196 24.912 24.506 36.212 34.758 4.908 4.877 13.381 9.197 18.907 11.008-0.524-1.986-1.361-4.509-2.615-7.481-3.609-8.548-9.248-18.363-14.272-27.549-4.844-9.678-9.939-16.846-10.609-29.181-0.177-3.556 1.017-8.673 4.049-12.901h-141.586zM332.311 399.255l29.799 19.107 16.258-31.453 35.355 1.653-1.643-35.365 31.44-16.258-19.095-29.809 19.095-29.799-31.44-16.25 1.643-35.365-35.355 1.653-16.258-31.453-29.799 19.107-29.809-19.107-16.258 31.453-35.355-1.653 1.653 35.365-31.453 16.25 19.095 29.799-19.095 29.809 31.453 16.258-1.653 35.365 35.355-1.653 16.258 31.453z" />
<glyph unicode="&#xe91b;" glyph-name="quill" d="M0-64c0 146.61 24.154 300.694 71.788 426.418 46.046 121.534 112.876 228.736 198.634 318.626 84.922 89.014 185.74 158.31 299.652 205.966 115.772 48.432 241.578 72.99 373.926 72.99 5.44 0 10.508-2.764 13.454-7.338s3.364-10.332 1.114-15.284c-33.392-73.464-118.486-141.56-252.914-202.398-19.080-8.636-37.99-16.58-56.262-23.826 12.48 0.442 25.158 0.664 38.032 0.664 75.258 0 128.65-7.662 130.886-7.988 5.372-0.782 9.976-4.234 12.238-9.168 2.26-4.932 1.866-10.676-1.048-15.254-48.312-75.92-153.852-146.008-313.688-208.318-13.156-5.128-26.166-9.994-38.886-14.584 9.356 0.274 18.704 0.412 28.042 0.412 74.416 0 120.208-8.844 122.124-9.22 5.518-1.086 10.060-4.99 11.964-10.284 1.904-5.292 0.89-11.196-2.672-15.546-145.89-178.31-245.564-229.868-444.384-229.868-45.278 0-80.514-39.288-104.728-116.772-19.202-61.444-23.272-139.228-23.272-139.228z" />
<glyph unicode="&#xe964;" glyph-name="no-camera" d="M96 768c-52.8 0-96-43.2-96-96v-448c0-23.126 8.29-44.412 22.042-61.032l403.354 605.032h-329.396zM978.84 703.748c-10.588 0-21.458-3.722-31.438-10.766l-179.402-126.614v105.632c0 52.8-43.202 96-96 96h-16.978l88.916 133.374-79.876 53.252-640-960 79.876-53.25 124.418 186.624h443.644c52.798 0 96 43.2 96 96v105.628l179.4-126.614c9.978-7.042 20.85-10.764 31.436-10.766 0.002 0 0.002 0 0.006 0 14.088 0 26.954 6.496 35.292 17.822 6.458 8.77 9.87 20.052 9.87 32.634v410.586c-0.004 33.126-22.722 50.458-45.164 50.458z" />
<glyph unicode="&#xe97b;" glyph-name="new" d="M896 768h-768c-70.4 0-128-57.6-128-128v-448c0-70.4 57.6-128 128-128h768c70.398 0 128 57.6 128 128v448c0 70.4-57.602 128-128 128zM320 256h-64l-128 213.334v-213.334h-64v320h64l128-213.334v213.334h64v-320zM576 512h-128v-64h128v-64h-128v-64h128v-63.998l-192-0.002v320h192v-64zM960 256h-95.998l-64.002 128-64-128h-96v320h64v-256l64 128h64.002l63.998-127.996v255.996h64v-320z" />
<glyph unicode="&#xe99e;" glyph-name="file-filled" d="M704 704h232.118c-5.008 8.070-11.036 17-18.312 26.924-22.21 30.292-53.174 65.7-87.178 99.704s-69.412 64.964-99.704 87.178c-9.924 7.276-18.854 13.304-26.924 18.312v-232.118zM640 672v288h-496c-44.112 0-80-35.888-80-80v-864c0-44.112 35.886-80 80-80h736c44.112 0 80 35.888 80 80v624h-288c-17.674 0-32 14.328-32 32z" />
<glyph unicode="&#xe9ad;" glyph-name="file-text" d="M917.806 730.924c-22.212 30.292-53.174 65.7-87.178 99.704s-69.412 64.964-99.704 87.178c-51.574 37.82-76.592 42.194-90.924 42.194h-496c-44.112 0-80-35.888-80-80v-864c0-44.112 35.888-80 80-80h736c44.112 0 80 35.888 80 80v624c0 14.332-4.372 39.35-42.194 90.924zM785.374 785.374c30.7-30.7 54.8-58.398 72.58-81.374h-153.954v153.946c22.984-17.78 50.678-41.878 81.374-72.572zM896 16c0-8.672-7.328-16-16-16h-736c-8.672 0-16 7.328-16 16v864c0 8.672 7.328 16 16 16 0 0 495.956 0.002 496 0v-224c0-17.672 14.326-32 32-32h224v-624zM736 128h-448c-17.672 0-32 14.326-32 32s14.328 32 32 32h448c17.674 0 32-14.326 32-32s-14.326-32-32-32zM736 256h-448c-17.672 0-32 14.326-32 32s14.328 32 32 32h448c17.674 0 32-14.326 32-32s-14.326-32-32-32zM736 384h-448c-17.672 0-32 14.326-32 32s14.328 32 32 32h448c17.674 0 32-14.326 32-32s-14.326-32-32-32z" />
<glyph unicode="&#xe9af;" glyph-name="file-image" d="M832 64h-640v128l192 320 263-320 185 128v-256zM832 480c0-53.020-42.98-96-96-96-53.022 0-96 42.98-96 96s42.978 96 96 96c53.020 0 96-42.98 96-96zM917.806 730.924c-22.212 30.292-53.174 65.7-87.178 99.704s-69.412 64.964-99.704 87.178c-51.574 37.82-76.592 42.194-90.924 42.194h-496c-44.112 0-80-35.888-80-80v-864c0-44.112 35.888-80 80-80h736c44.112 0 80 35.888 80 80v624c0 14.332-4.372 39.35-42.194 90.924zM785.374 785.374c30.7-30.7 54.8-58.398 72.58-81.374h-153.954v153.946c22.984-17.78 50.678-41.878 81.374-72.572zM896 16c0-8.672-7.328-16-16-16h-736c-8.672 0-16 7.328-16 16v864c0 8.672 7.328 16 16 16 0 0 495.956 0.002 496 0v-224c0-17.672 14.326-32 32-32h224v-624z" />
<glyph unicode="&#xe9b1;" glyph-name="file-music" d="M917.806 730.924c-22.21 30.292-53.174 65.7-87.178 99.704s-69.412 64.964-99.704 87.178c-51.574 37.82-76.592 42.194-90.924 42.194h-496c-44.112 0-80-35.888-80-80v-864c0-44.112 35.886-80 80-80h736c44.112 0 80 35.888 80 80v624c0 14.332-4.372 39.35-42.194 90.924v0zM785.374 785.374c30.7-30.7 54.8-58.398 72.58-81.374h-153.954v153.946c22.982-17.78 50.678-41.878 81.374-72.572v0zM896 16c0-8.672-7.328-16-16-16h-736c-8.672 0-16 7.328-16 16v864c0 8.672 7.328 16 16 16 0 0 495.956 0.002 496 0v-224c0-17.672 14.324-32 32-32h224v-624zM756.288 568.748c-7.414 6.080-17.164 8.514-26.562 6.632l-320-64c-14.958-2.994-25.726-16.126-25.726-31.38v-236.876c-18.832 8.174-40.678 12.876-64 12.876-70.692 0-128-42.98-128-96s57.308-96 128-96 128 42.98 128 96v229.766l256 51.202v-133.842c-18.832 8.174-40.678 12.876-64 12.876-70.692 0-128-42.98-128-96s57.308-96 128-96 128 42.98 128 96v319.998c0 9.586-4.298 18.668-11.712 24.748z" />
<glyph unicode="&#xe9b3;" glyph-name="file-play" d="M384 576l320-224-320-224v448zM917.806 730.924c-22.212 30.292-53.174 65.7-87.178 99.704s-69.412 64.964-99.704 87.178c-51.574 37.82-76.592 42.194-90.924 42.194h-496c-44.112 0-80-35.888-80-80v-864c0-44.112 35.888-80 80-80h736c44.112 0 80 35.888 80 80v624c0 14.332-4.372 39.35-42.194 90.924zM785.374 785.374c30.7-30.7 54.8-58.398 72.58-81.374h-153.954v153.946c22.984-17.78 50.678-41.878 81.374-72.572zM896 16c0-8.672-7.328-16-16-16h-736c-8.672 0-16 7.328-16 16v864c0 8.672 7.328 16 16 16 0 0 495.956 0.002 496 0v-224c0-17.672 14.326-32 32-32h224v-624z" />
<glyph unicode="&#xe9b5;" glyph-name="file-video" d="M917.806 730.924c-22.208 30.292-53.174 65.7-87.178 99.704s-69.412 64.964-99.704 87.178c-51.574 37.82-76.594 42.194-90.924 42.194h-496c-44.112 0-80-35.888-80-80v-864c0-44.112 35.882-80 80-80h736c44.112 0 80 35.888 80 80v624c0 14.332-4.372 39.35-42.194 90.924v0 0zM785.374 785.374c30.7-30.7 54.8-58.398 72.58-81.374h-153.954v153.946c22.98-17.78 50.678-41.878 81.374-72.572v0 0zM896 16c0-8.672-7.328-16-16-16h-736c-8.672 0-16 7.328-16 16v864c0 8.672 7.328 16 16 16 0 0 495.956 0.002 496 0v-224c0-17.672 14.32-32 32-32h224v-624zM256 448h320v-320h-320v320zM576 320l192 128v-320l-192 128z" />
<glyph unicode="&#xe9b9;" glyph-name="file-zip" d="M917.806 730.924c-22.208 30.292-53.174 65.7-87.178 99.704s-69.412 64.964-99.704 87.178c-51.574 37.82-76.592 42.194-90.924 42.194h-496c-44.112 0-80-35.888-80-80v-864c0-44.112 35.884-80 80-80h736c44.112 0 80 35.888 80 80v624c0 14.332-4.372 39.35-42.194 90.924v0 0zM785.374 785.374c30.7-30.7 54.8-58.398 72.58-81.374h-153.954v153.946c22.98-17.78 50.678-41.878 81.374-72.572v0 0zM896 16c0-8.672-7.328-16-16-16h-736c-8.672 0-16 7.328-16 16v864c0 8.672 7.328 16 16 16 0 0 495.956 0.002 496 0v-224c0-17.672 14.322-32 32-32h224v-624zM256 896h128v-64h-128v64zM384 832h128v-64h-128v64zM256 768h128v-64h-128v64zM384 704h128v-64h-128v64zM256 640h128v-64h-128v64zM384 576h128v-64h-128v64zM256 512h128v-64h-128v64zM384 448h128v-64h-128v64zM256 112c0-26.4 21.6-48 48-48h160c26.4 0 48 21.6 48 48v160c0 26.4-21.6 48-48 48h-80v64h-128v-272zM448 192v-64h-128v64h128z" />
<glyph unicode="&#xe9bb;" glyph-name="file-xml" d="M480 384l-64 64-192-192 192-192 64 64-128 128 128 128zM544 128l64-64 192 192-192 192-64-64 128-128-128-128zM917.806 730.924c-22.21 30.292-53.174 65.7-87.178 99.704s-69.412 64.964-99.704 87.178c-51.574 37.82-76.592 42.194-90.924 42.194h-496c-44.112 0-80-35.888-80-80v-864c0-44.112 35.886-80 80-80h736c44.112 0 80 35.888 80 80v624c0 14.332-4.372 39.35-42.194 90.924v0zM785.374 785.374c30.7-30.7 54.8-58.398 72.58-81.374h-153.954v153.946c22.982-17.78 50.678-41.878 81.374-72.572v0zM896 16c0-8.672-7.328-16-16-16h-736c-8.672 0-16 7.328-16 16v864c0 8.672 7.328 16 16 16 0 0 495.956 0.002 496 0v-224c0-17.672 14.324-32 32-32h224v-624z" />
<glyph unicode="&#xe9bd;" glyph-name="file-css" d="M917.806 730.924c-22.21 30.292-53.174 65.7-87.178 99.704s-69.412 64.964-99.704 87.178c-51.574 37.82-76.592 42.194-90.924 42.194h-496c-44.112 0-80-35.888-80-80v-864c0-44.112 35.886-80 80-80h736c44.112 0 80 35.888 80 80v624c0 14.332-4.372 39.35-42.194 90.924v0zM785.374 785.374c30.7-30.7 54.8-58.398 72.58-81.374h-153.954v153.946c22.982-17.78 50.678-41.878 81.374-72.572v0zM896 16c0-8.672-7.328-16-16-16h-736c-8.672 0-16 7.328-16 16v864c0 8.672 7.328 16 16 16 0 0 495.956 0.002 496 0v-224c0-17.672 14.324-32 32-32h224v-624zM416 128c-17.644 0-32 14.356-32 32v80c0 17.996-5.976 34.62-16.044 48 10.068 13.38 16.044 30.004 16.044 48v80c0 17.644 14.356 32 32 32 17.672 0 32 14.328 32 32s-14.328 32-32 32c-52.934 0-96-43.066-96-96v-80c0-8.822-7.178-16-16-16h-16c-17.672 0-32-14.326-32-32s14.328-32 32-32h16c8.822 0 16-7.178 16-16v-80c0-52.936 43.066-96 96-96 17.672 0 32 14.326 32 32s-14.326 32-32 32zM608 128c17.644 0 32 14.356 32 32v80c0 17.996 5.976 34.62 16.042 48-10.066 13.38-16.042 30.004-16.042 48v80c0 17.644-14.356 32-32 32-17.674 0-32 14.328-32 32s14.326 32 32 32c52.934 0 96-43.066 96-96v-80c0-8.822 7.176-16 16-16h16c17.672 0 32-14.326 32-32s-14.328-32-32-32h-16c-8.824 0-16-7.178-16-16v-80c0-52.936-43.066-96-96-96-17.674 0-32 14.326-32 32s14.326 32 32 32z" />
<glyph unicode="&#xe9bf;" glyph-name="file-presentation" d="M192 448h192v-64h-192v64zM192 320h192v-64h-192v64zM192 192h192v-64h-192v64zM576 256h188.792c-14.826-73.032-79.386-128-156.792-128-88.368 0-160 71.632-160 160 0 77.406 54.968 141.964 128 156.792v-188.792zM672 512c88.366 0 160-71.632 160-160 0-10.958-1.11-21.66-3.208-32h-188.792v188.792c10.34 2.1 21.042 3.208 32 3.208zM917.806 730.924c-22.21 30.292-53.174 65.7-87.178 99.704s-69.412 64.964-99.704 87.178c-51.574 37.82-76.592 42.194-90.924 42.194h-496c-44.112 0-80-35.888-80-80v-864c0-44.112 35.886-80 80-80h736c44.112 0 80 35.888 80 80v624c0 14.332-4.372 39.35-42.194 90.924v0zM785.374 785.374c30.7-30.7 54.8-58.398 72.58-81.374h-153.954v153.946c22.982-17.78 50.678-41.878 81.374-72.572v0zM896 16c0-8.672-7.328-16-16-16h-736c-8.672 0-16 7.328-16 16v864c0 8.672 7.328 16 16 16 0 0 495.956 0.002 496 0v-224c0-17.672 14.324-32 32-32h224v-624z" />
<glyph unicode="&#xe9c5;" glyph-name="file-spreadsheet" d="M917.806 730.924c-22.208 30.292-53.174 65.7-87.178 99.704s-69.412 64.964-99.704 87.178c-51.574 37.82-76.592 42.194-90.924 42.194h-496c-44.112 0-80-35.888-80-80v-864c0-44.112 35.884-80 80-80h736c44.112 0 80 35.888 80 80v624c0 14.332-4.372 39.35-42.194 90.924v0 0zM785.374 785.374c30.7-30.7 54.8-58.398 72.58-81.374h-153.954v153.946c22.98-17.78 50.678-41.878 81.374-72.572v0 0zM896 16c0-8.672-7.328-16-16-16h-736c-8.672 0-16 7.328-16 16v864c0 8.672 7.328 16 16 16 0 0 495.956 0.002 496 0v-224c0-17.672 14.322-32 32-32h224v-624zM192 512v-448h640v448h-640zM384 128h-128v128h128v-128zM384 320h-128v128h128v-128zM576 128h-128v128h128v-128zM576 320h-128v128h128v-128zM768 128h-128v128h128v-128zM768 320h-128v128h128v-128z" />
<glyph unicode="&#xe9d1;" glyph-name="eye-blocked" d="M945.942 945.942c-18.746 18.744-49.136 18.744-67.882 0l-202.164-202.164c-51.938 15.754-106.948 24.222-163.896 24.222-223.318 0-416.882-130.042-512-320 41.122-82.124 100.648-153.040 173.022-207.096l-158.962-158.962c-18.746-18.746-18.746-49.136 0-67.882 9.372-9.374 21.656-14.060 33.94-14.060s24.568 4.686 33.942 14.058l864 864c18.744 18.746 18.744 49.138 0 67.884zM416 640c42.24 0 78.082-27.294 90.92-65.196l-121.724-121.724c-37.902 12.838-65.196 48.68-65.196 90.92 0 53.020 42.98 96 96 96zM110.116 448c38.292 60.524 89.274 111.924 149.434 150.296 3.918 2.5 7.876 4.922 11.862 7.3-9.962-27.328-15.412-56.822-15.412-87.596 0-54.89 17.286-105.738 46.7-147.418l-60.924-60.924c-52.446 36.842-97.202 83.882-131.66 138.342zM768 518c0 27.166-4.256 53.334-12.102 77.898l-321.808-321.808c24.568-7.842 50.742-12.090 77.91-12.090 141.382 0 256 114.618 256 256zM830.026 670.026l-69.362-69.362c1.264-0.786 2.53-1.568 3.786-2.368 60.162-38.374 111.142-89.774 149.434-150.296-38.292-60.522-89.274-111.922-149.436-150.296-75.594-48.218-162.89-73.704-252.448-73.704-38.664 0-76.902 4.76-113.962 14.040l-76.894-76.894c59.718-21.462 123.95-33.146 190.856-33.146 223.31 0 416.876 130.042 512 320-45.022 89.916-112.118 166.396-193.974 222.026z" />
<glyph unicode="&#xe9db;" glyph-name="folder" d="M448 832l128-128h448v-704h-1024v832z" />
<glyph unicode="&#xe9dc;" glyph-name="folder-open" d="M832 0l192 512h-832l-192-512zM128 576l-128-576v832h288l128-128h416v-128z" />
<glyph unicode="&#xe9df;" glyph-name="folder-plus" d="M576 704l-128 128h-448v-832h1024v704h-448zM704 256h-128v-128h-128v128h-128v128h128v128h128v-128h128v-128z" />
<glyph unicode="&#xeb4e;" glyph-name="lock-center" d="M832 512h-64v192c0 141.384-114.616 256-256 256s-256-114.616-256-256v-192h-64c-35.2 0-64-28.8-64-64v-448c0-35.2 28.8-64 64-64h640c35.2 0 64 28.8 64 64v448c0 35.2-28.8 64-64 64zM512 128c-35.346 0-64 28.654-64 64s28.654 64 64 64 64-28.654 64-64-28.654-64-64-64zM640 512h-256v192c0 70.58 57.42 128 128 128s128-57.42 128-128v-192z" />
<glyph unicode="&#xeca9;" glyph-name="attachment" d="M665.832 632.952l-64.952 64.922-324.81-324.742c-53.814-53.792-53.814-141.048 0-194.844 53.804-53.792 141.060-53.792 194.874 0l389.772 389.708c89.714 89.662 89.714 235.062 0 324.726-89.666 89.704-235.112 89.704-324.782 0l-409.23-409.178c-0.29-0.304-0.612-0.576-0.876-0.846-125.102-125.096-125.102-327.856 0-452.906 125.054-125.056 327.868-125.056 452.988 0 0.274 0.274 0.516 0.568 0.82 0.876l0.032-0.034 279.332 279.292-64.986 64.92-279.33-279.262c-0.296-0.268-0.564-0.57-0.846-0.844-89.074-89.058-233.98-89.058-323.076 0-89.062 89.042-89.062 233.922 0 322.978 0.304 0.304 0.604 0.582 0.888 0.846l-0.046 0.060 409.28 409.166c53.712 53.738 141.144 53.738 194.886 0 53.712-53.734 53.712-141.148 0-194.84l-389.772-389.7c-17.936-17.922-47.054-17.922-64.972 0-17.894 17.886-17.894 47.032 0 64.92l324.806 324.782z" />
<glyph unicode="&#xef37;" glyph-name="file-openoffice" d="M690.22 488.318c-60.668 28.652-137.97 34.42-194.834-6.048 69.14 6.604 144.958-4.838 195.106-57.124 48 55.080 124.116 65.406 192.958 59.732-57.488 38.144-133.22 33.024-193.23 3.44v0zM665.646 354.25c-68.376 1.578-134.434-23.172-191.1-60.104-107.176 45.588-242.736 37.124-334.002-38.982 26.33 0.934 52.006 7.446 78.056 10.792 95.182 9.488 196.588-14.142 268.512-79.824 29.772 43.542 71.644 78.242 119.652 99.922 63.074 30.52 134.16 33.684 202.82 34.52-41.688 28.648-94.614 33.954-143.938 33.676zM917.806 730.924c-22.21 30.292-53.174 65.7-87.178 99.704s-69.412 64.964-99.704 87.178c-51.574 37.82-76.592 42.194-90.924 42.194h-496c-44.112 0-80-35.888-80-80v-864c0-44.112 35.886-80 80-80h736c44.112 0 80 35.888 80 80v624c0 14.332-4.372 39.35-42.194 90.924v0zM785.374 785.374c30.7-30.7 54.8-58.398 72.58-81.374h-153.954v153.946c22.982-17.78 50.678-41.878 81.374-72.572v0zM896 16c0-8.672-7.328-16-16-16h-736c-8.672 0-16 7.328-16 16v864c0 8.672 7.328 16 16 16 0 0 495.956 0.002 496 0v-224c0-17.672 14.324-32 32-32h224v-624z" />
<glyph unicode="&#xef38;" glyph-name="file-word" d="M639.778 484.108h44.21l-51.012-226.178-66.324 318.010h-106.55l-77.114-318.010-57.816 318.010h-111.394l113.092-511.88h108.838l76.294 302.708 68.256-302.708h100.336l129.628 511.88h-170.446v-91.832zM917.806 730.924c-22.21 30.292-53.174 65.7-87.178 99.704s-69.412 64.964-99.704 87.178c-51.574 37.82-76.592 42.194-90.924 42.194h-496c-44.112 0-80-35.888-80-80v-864c0-44.112 35.886-80 80-80h736c44.112 0 80 35.888 80 80v624c0 14.332-4.372 39.35-42.194 90.924v0zM785.374 785.374c30.7-30.7 54.8-58.398 72.58-81.374h-153.954v153.946c22.982-17.78 50.678-41.878 81.374-72.572v0zM896 16c0-8.672-7.328-16-16-16h-736c-8.672 0-16 7.328-16 16v864c0 8.672 7.328 16 16 16 0 0 495.956 0.002 496 0v-224c0-17.672 14.324-32 32-32h224v-624z" />
<glyph unicode="&#xf0a5;" glyph-name="dropmenu" d="M896-64h-640q-53 0-90.5 37.5t-37.5 90.5v512q-53 0-90.5 37.5t-37.5 90.5v128q0 53 37.5 90.5t90.5 37.5h768q53 0 90.5-37.5t37.5-90.5v-768q0-53-37.5-90.5t-90.5-37.5zM884 864h-296q-8 0-11-14.5t5-23.5l135-177q8-9 19-9t19 9l135 177q8 9 5 23.5t-11 14.5zM896 576h-640v-128h640v128zM896 384h-640v-128h640v128zM896 192h-640v-96q0-13 9.5-22.5t22.5-9.5h576q13 0 22.5 9.5t9.5 22.5v96z" />
<glyph unicode="&#xf5d5;" glyph-name="textfield" d="M960 192h-448v-64h96q13 0 22.5-9.5t9.5-22.5-9.5-22.5-22.5-9.5h-256q-13 0-22.5 9.5t-9.5 22.5 9.5 22.5 22.5 9.5h96v64h-384q-27 0-45.5 18.5t-18.5 45.5v320q0 26 18.5 45t45.5 19h384v64h-96q-13 0-22.5 9.5t-9.5 22.5 9.5 22.5 22.5 9.5h256q13 0 22.5-9.5t9.5-22.5-9.5-22.5-22.5-9.5h-96v-64h448q27 0 45.5-19t18.5-45v-320q0-27-19-45.5t-45-18.5zM448 576h-384v-320h384v320zM960 576h-448v-320h448v320zM160 512q13 0 22.5-9.5t9.5-22.5v-128q0-13-9.5-22.5t-22.5-9.5-22.5 9.5-9.5 22.5v128q0 13 9.5 22.5t22.5 9.5z" />
</font></defs></svg>