/* scvaluer1.i */
/* selection combo for a Valuer */

{inc/selcmb/scpmst1.i &IntTable="{1}"
                      &IntCode ="{2}"
                      &ExtTable="Contact"
                      &ExtField="PersonCode"
                      &Clause  ="Contact.ContactType = 'VLUR'"}
