/* scvaluer2.i */
/* selection combo for a Valuer */

{inc/selcmb/scpmst2.i &IntTable="{1}"
                      &IntCode ="{2}"
                      &ExtTable="Contact"
                      &ExtField="PersonCode"}
