/* sclty2.i */
/* selection combo for a Lease Type */

{inc/selcmb/scmst2.i &IntTable="{1}"
                     &IntCode ="{2}"
                     &ExtTable="LeaseType"
                     &ExtKey  ="LeaseType"}
