/* cdpsn.i */
/* Code fill-in for Person records */

{inc/selcde/cdmst.i &ExtTable="Person"
                    &ExtKey  ="PersonCode"
                    &ConvFn  ="INT"
                    &FillIn  ="{1}"}
