/* scmths2.i */
/* selection combo for a Month Starts */

{inc/selcmb/scmst2.i &IntTable="{1}"
                     &IntCode ="{2}"
                     &ExtTable="Month"
                     &ExtKey  ="MonthCode"}
