/* sfpbj3.i */
/* selection fill-in for a Project Budget */

{inc/selfil/sfmst3.i &IntTable="{1}"
                     &IntCode ="{2}"
                     &ExtTable="ProjectBudget"
                     &ExtKey  ="AccountCode"}
