/* sfclient2.i */
/* selection fill-in for a Client */

{inc/selfil/sfmst2.i &IntTable ="{1}"
                     &IntCode  ="{2}"
                     &ExtTable="Client"
                     &ExtKey  ="ClientCode"
                     &ExtField="Name"}
