/* sfprj2.i */
/* selection fill-in for a Project */

{inc/selfil/sfmst2.i &IntTable ="{1}"
                     &IntCode  ="{2}"
                     &ExtTable="Project"
                     &ExtKey  ="ProjectCode"
                     &ExtField="Name"}
