/* cdtnt.i */
/* Code fill-in for Tenant records */

{inc/selcde/cdmst.i &ExtTable="Tenant"
                    &ExtKey  ="TenantCode"
                    &ConvFn  ="INT"
                    &FillIn  ="{1}"}
