/* scpbdg2.i */
/* selection combo for an ProjectBudget */

{inc/selcmb/scmst2.i &IntTable="{1}"
                     &IntCode ="{2}"
                     &ExtTable="ProjectBudget"
                     &ExtKey  ="AccountCode"}
