/* scFwRlType2.i */
/* selection combo for an FlowRuleType */

{inc/selcmb/scmst2.i &IntTable="{1}"
                     &IntCode ="{2}"
                     &ExtTable="FlowRuleType"
                     &ExtKey  ="FlowRuleType"}
