/* sfcmp3.i */
/* selection fill-in for a Company */

{inc/selfil/sfmst3.i &IntTable="{1}"
                     &IntCode ="{2}"
                     &ExtTable="Company"
                     &ExtKey  ="CompanyCode"}
