/* scsst2.i */
/* selection combo for an ScenarioStatus */

{inc/selcmb/scmst2.i &IntTable="{1}"
                     &IntCode ="{2}"
                     &ExtTable="ScenarioStatus"
                     &ExtKey  ="ScenarioStatus"}
