/* scinsp2.i */
/* selection combo for a Inspector */

{inc/selcmb/scmst2.i &IntTable="{1}"
                     &IntCode ="{2}"
                     &ExtTable="Inspector"
                     &ExtKey  ="InspectorCode"}
