/* sfcoa2.i */
/* selection fill-in for a ChartOfAccount */

{inc/selfil/sfmst2.i &IntTable="{1}"
                     &IntCode ="{2}"
                     &ExtTable="ChartOfAccount"
                     &ExtKey  ="AccountCode"
                     &ExtField="Name"}
