/* scivt2.i */
/* selection combo for an Invoice Terms */

{inc/selcmb/scmst2.i &IntTable="{1}"
                     &IntCode ="{2}"
                     &ExtTable="InvoiceTerms"
                     &ExtKey  ="TermsCode"}
