/* sccfct2.i */
/* selection combo for an CFChangeType */

{inc/selcmb/scmst2.i &IntTable="{1}"
                     &IntCode ="{2}"
                     &ExtTable="CFChangeType"
                     &ExtKey  ="CFChangeType"}
