/* cdcoa.i */
/* Code fill-in for ChartOfAccount records */

{inc/selcde/cdmst.i &ExtTable="ChartOfAccount"
                    &ExtKey  ="AccountCode"
                    &ConvFn  ="DEC"
                    &FillIn  ="{1}"}
