/* scast2.i */
/* selection combo for an AreaStatus */

{inc/selcmb/scmst2.i &IntTable="{1}"
                     &IntCode ="{2}"
                     &ExtTable="AreaStatus"
                     &ExtKey  ="AreaStatus"}
