/* cdscn.i */
/* Code fill-in for Scenario records */

{inc/selcde/cdmst.i &ExtTable="Scenario"
                    &ExtKey  ="ScenarioCode"
                    &ConvFn  ="INT"
                    &FillIn  ="{1}"}
