/* Generic topic description preprocessors for Property */

&GLOBAL-DEFINE TOPIC-TABLE  Property
&GLOBAL-DEFINE TOPIC-FIELD  (Property.Name + " (P" + STRING(Property.PropertyCode) + ")")
&GLOBAL-DEFINE TOPIC-PREFIX ""
