/* scvty2.i */
/* selection combo for an VariationType */

{inc/selcmb/scmst2.i &IntTable="{1}"
                     &IntCode ="{2}"
                     &ExtTable="VariationType"
                     &ExtKey  ="VariationType"}
