/* sftnt3.i */
/* selection fill-in for a Tenant */

{inc/selfil/sfmst3.i &IntTable="{1}"
                     &IntCode ="{2}"
                     &ExtTable="Tenant"
                     &ExtKey  ="TenantCode"}
