/* scprop2.i */
/* selection combo for a Property */

{inc/selcmb/scmst2.i &IntTable="{1}"
                     &IntCode ="{2}"
                     &ExtTable="Property"
                     &ExtKey  ="PropertyCode"}
