/* scpjt2.i */
/* selection combo for a ProjectType */

{inc/selcmb/scmst2.i &IntTable="{1}"
                     &IntCode ="{2}"
                     &ExtTable="ProjectType"
                     &ExtKey  ="ProjectType"}
