/* cdinv.i */
/* Code fill-in for Invoice records */

{inc/selcde/cdmst.i &ExtTable="Invoice"
                    &ExtKey  ="InvoiceNo"
                    &ConvFn  ="INT"
                    &FillIn  ="{1}"}
