/* sfcoa3.i */
/* selection fill-in for a Chart Of Account */

{inc/selfil/sfmst3.i &IntTable="{1}"
                     &IntCode ="{2}"
                     &ExtTable="ChartOfAccount"
                     &ExtKey  ="AccountCode"}
