/* scpdt2.i */
/* selection combo for a PostalType */

{inc/selcmb/scmst2.i &IntTable="{1}"
                     &IntCode ="{2}"
                     &ExtTable="PostalType"
                     &ExtKey  ="PostalType"}
