/* scfty2.i */
/* selection combo for an FrequencyTypes */

{inc/selcmb/scmst2.i &IntTable="{1}"
                     &IntCode ="{2}"
                     &ExtTable="Frequencytype"
                     &ExtKey  ="FrequencyCode"}

