/* sccls2.i */
/* selection combo for an ConsolidationList */

{inc/selcmb/scmst2.i &IntTable="{1}"
                     &IntCode ="{2}"
                     &ExtTable="ConsolidationList"
                     &ExtKey  ="Name"}
