/* scpmgr2.i */
/* selection combo for a Property Manager */

{inc/selcmb/scpmst2.i &IntTable="{1}"
                      &IntCode ="{2}"
                      &ExtTable="Property"
                      &ExtField="Manager"}
