/* sfclient3.i */
/* selection fill-in for a Client */

{inc/selfil/sfmst3.i &IntTable="{1}"
                     &IntCode ="{2}"
                     &ExtTable="Client"
                     &ExtKey  ="ClientCode"}
