/* sfvou3.i */
/* selection fill-in for a Voucher */

{inc/selfil/sfmst3.i &IntTable ="{1}"
                     &IntCode  ="{2}"
                     &ExtTable="Voucher"
                     &ExtKey  ="VoucherSeq"}
