/* sfprj3.i */
/* selection fill-in for a Project */

{inc/selfil/sfmst3.i &IntTable ="{1}"
                     &IntCode  ="{2}"
                     &ExtTable="Project"
                     &ExtKey  ="ProjectCode"}
