/* scFwTskTyp2.i */
/* selection combo for an FlowTaskType */

{inc/selcmb/scmst2.i &IntTable="{1}"
                     &IntCode ="{2}"
                     &ExtTable="FlowTaskType"
                     &ExtKey  ="FlowTaskType"}
