/* cdcmp.i */
/* Code fill-in for Company records */

{inc/selcde/cdmst.i &ExtTable="Company"
                    &ExtKey  ="CompanyCode"
                    &ConvFn  ="INT"
                    &FillIn  ="{1}"}
