/* sccft2.i */
/* selection combo for an CashFlowTypes */

{inc/selcmb/scmst2.i &IntTable="{1}"
                     &IntCode ="{2}"
                     &ExtTable="CashFlowType"
                     &ExtKey  ="CashFlowType"}
