/* scsty2.i */
/* selection combo for an ServiceType */

{inc/selcmb/scmst2.i &IntTable="{1}"
                     &IntCode ="{2}"
                     &ExtTable="ServiceType"
                     &ExtKey  ="ServiceType"}

