/* scFwStType2.i */
/* selection combo for an FlowStepType */

{inc/selcmb/scmst2.i &IntTable="{1}"
                     &IntCode ="{2}"
                     &ExtTable="FlowStepType"
                     &ExtKey  ="FlowStepType"}
