/* sfpsn3.i */
/* selection fill-in for an Person */

{inc/selfil/sfmst3.i &IntTable="{1}"
                     &IntCode ="{2}"
                     &ExtTable="Contact"
                     &ExtKey  ="PersonCode"}
