/* scpmgr1.i */
/* selection combo for a Property Manager */

{inc/selcmb/scpmst1.i &IntTable="{1}"
                      &IntCode ="{2}"
                      &ExtTable="Property"
                      &ExtField="Manager"
                      &Clause  ="Active" }
