/* scimgtyp2.i */
/* selection combo for ImageType */

{inc/selcmb/scmst2.i &IntTable="{1}"
                     &IntCode ="{2}"
                     &ExtTable="ImageType"
                     &ExtKey  ="ImageType"}
