/* sclst2.i */
/* selection combo for a Lease Status */

{inc/selcmb/scmst2.i &IntTable="{1}"
                     &IntCode ="{2}"
                     &ExtTable="LeaseStatus"
                     &ExtKey  ="LeaseStatus"}
