/* sel-acct2.i */
/* selection list for an ChartOfAccount */

{inc/selcmb/sel-mst2.i &IntTable="{1}"
                       &IntCode ="{2}"
                       &ExtTable="ChartOfAccount"
                       &ExtKey  ="AccountCode"}
