/* sel-acg2.i */
/* selection list for an AccountGroup */

{inc/selcmb/sel-mst2.i &IntTable="{1}"
                       &IntCode ="{2}"
                       &ExtTable="AccountGroup"
                       &ExtKey  ="AccountGroupCode"}
