/* cdapp.i */
/* Code fill-in for Approver records */

{inc/selcde/cdmst.i &ExtTable="Approver"
                    &ExtKey  ="ApproverCode"
                    &ConvFn  ="STRING"
                    &FillIn  ="{1}"}
