/* scectyp2.i */
/* selection list for an EntityContactType */

{inc/selcmb/sel-mst2.i &IntTable="{1}"
                     &IntCode ="{2}"
                     &ExtTable="EntityContactType"
                     &ExtKey  ="EntityContactType"}

