/* scrcht2.i */
/* selection combo for a Rent RentCharge Type */

{inc/selcmb/scmst2.i &IntTable="{1}"
                     &IntCode ="{2}"
                     &ExtTable="RentChargeType"
                     &ExtKey  ="RentChargeType"}
