/* scacg2.i */
/* selection combo for an AccountGroups */

{inc/selcmb/scmst2.i &IntTable="{1}"
                     &IntCode ="{2}"
                     &ExtTable="AccountGroup"
                     &ExtKey  ="AccountGroupCode"}
