/* scpsty2.i */
/* selection combo for a Payment Style */

{inc/selcmb/scmst2.i &IntTable="{1}"
                     &IntCode ="{2}"
                     &ExtTable="PaymentStyle"
                     &ExtKey  ="PaymentStyle"}
