/* sfpro3.i */
/* selection fill-in for an Property */

{inc/selfil/sfmst3.i &IntTable="{1}"
                     &IntCode ="{2}"
                     &ExtTable="Property"
                     &ExtKey  ="PropertyCode"}
