/* Generic topic description preprocessors for Project Trees */

&GLOBAL-DEFINE TOPIC-TABLE  Hierarchy
&GLOBAL-DEFINE TOPIC-FIELD  ("(J" + STRING(Hierarchy.ProjectCode) + ")")
&GLOBAL-DEFINE TOPIC-PREFIX Hierarchy.Name
