/* sfscn3.i */
/* selection fill-in for a Scenario */

{inc/selfil/sfmst3.i &IntTable ="{1}"
                     &IntCode  ="{2}"
                     &ExtTable="Scenario"
                     &ExtKey  ="ScenarioCode"}
