/* scclient2.i */
/* selection combo for Clients */

{inc/selcmb/scmst2.i &IntTable="{1}"
                     &IntCode ="{2}"
                     &ExtTable="Client"
                     &ExtKey  ="ClientCode"}
