/* scbty2.i */
/* selection combo for a Building Type */

{inc/selcmb/scmst2.i &IntTable="{1}"
                     &IntCode ="{2}"
                     &ExtTable="BuildingType"
                     &ExtKey  ="BuildingType"}
