/* scaty2.i */
/* selection combo for an AreaType */

{inc/selcmb/scmst2.i &IntTable="{1}"
                     &IntCode ="{2}"
                     &ExtTable="AreaType"
                     &ExtKey  ="AreaType"}
