/* scrrt2.i */
/* selection combo for a Rent Review Type */

{inc/selcmb/scmst2.i &IntTable="{1}"
                     &IntCode ="{2}"
                     &ExtTable="ReviewType"
                     &ExtKey  ="ReviewType"}
