/* Generic topic description preprocessors for Projects */

&GLOBAL-DEFINE TOPIC-TABLE  Project
&GLOBAL-DEFINE TOPIC-FIELD  ("(J" + STRING(Project.ProjectCode) + ")")
&GLOBAL-DEFINE TOPIC-PREFIX Project.Name
