/* Generic topic description preprocessors for Scenario */

&GLOBAL-DEFINE TOPIC-TABLE  Scenario
&GLOBAL-DEFINE TOPIC-FIELD  (Scenario.Name + " (" + STRING(Scenario.ScenarioCode) + ")")
&GLOBAL-DEFINE TOPIC-PREFIX ""
