/* scpdtyp2.i */
/* selection combo for an PersonDetailType */

{inc/selcmb/scmst2.i &IntTable="{1}"
                     &IntCode ="{2}"
                     &ExtTable="PersonDetailType"
                     &ExtKey  ="PersonDetailType"}

