/* cdmtr.i */
/* Code fill-in for Supply Meters */

{inc/selcde/cdmst.i &ExtTable="SupplyMeter"
                    &ExtKey  ="MeterCode"
                    &ConvFn  ="INT"
                    &FillIn  ="{1}"}
