/* scectyp2.i */
/* selection combo for an EntityContactType */

{inc/selcmb/scmst2.i &IntTable="{1}"
                     &IntCode ="{2}"
                     &ExtTable="EntityContactType"
                     &ExtKey  ="EntityContactType"}

