/* sfcrd3.i */
/* selection fill-in for a Creditor */

{inc/selfil/sfmst3.i &IntTable="{1}"
                     &IntCode ="{2}"
                     &ExtTable="Creditor"
                     &ExtKey  ="CreditorCode"}
