/* scels2.i */
/* selection combo for an EntityList */

{inc/selcmb/scmst2.i &IntTable="{1}"
                     &IntCode ="{2}"
                     &ExtTable="EntityList"
                     &ExtKey  ="ListCode"}
