/* sfpbj2.i */
/* selection fill-in for a ProjectBudget */

{inc/selfil/sfmst2.i &IntTable="{1}"
                     &IntCode ="{2}"
                     &ExtTable="ProjectBudget"
                     &ExtKey  ="AccountCode"
                     &ExtField="Description"}
