/* scety2.i */
/* selection combo for an EntityType */

{inc/selcmb/scmst2.i &IntTable="{1}"
                     &IntCode ="{2}"
                     &ExtTable="EntityType"
                     &ExtKey  ="EntityType"}

