/* scpxct2.i */
/* selection combo for an ProjectExpenseCategory */

{inc/selcmb/scmst2.i &IntTable="{1}"
                     &IntCode ="{2}"
                     &ExtTable="ProjectExpenseCategory"
                     &ExtKey  ="ProjectExpenseCategory"}
