/* cdpro.i */
/* Code fill-in for Property records */

{inc/selcde/cdmst.i &ExtTable="Property"
                    &ExtKey  ="PropertyCode"
                    &ConvFn  ="INT"
                    &FillIn  ="{1}"}
