/* scdebtcls2.i */
/* selection combo for an DebtClassification */

{inc/selcmb/scmst2.i &IntTable="{1}"
                     &IntCode ="{2}"
                     &ExtTable="DebtClassification"
                     &ExtKey  ="DebtClassification"}
