/* scrgn2.i */
/* selection combo for a Region */

{inc/selcmb/scmst2.i &IntTable="{1}"
                     &IntCode ="{2}"
                     &ExtTable="Region"
                     &ExtKey  ="Region"}
