/* cdprj.i */
/* Code fill-in for Project records */

{inc/selcde/cdmst.i &ExtTable="Project"
                    &ExtKey  ="ProjectCode"
                    &ConvFn  ="INT"
                    &FillIn  ="{1}"}
