/* scvarcls2.i */
/* selection combo for an VarianceClassification */

{inc/selcmb/scmst2.i &IntTable="{1}"
                     &IntCode ="{2}"
                     &ExtTable="VarianceClassification"
                     &ExtKey  ="VarianceClassification"}
