/* scrclst2.i */
/* selection combo for a RentChargeLine Status */

{inc/selcmb/scmst2.i &IntTable="{1}"
                     &IntCode ="{2}"
                     &ExtTable="RentChargeLineStatus"
                     &ExtKey  ="RentChargeLineStatus"}
