/* sfpbj1.i */
/* selection fill-in for a ProjectBudget */

{inc/selfil/sfmst1.i &IntTable="{1}"
                     &IntCode ="{2}"
                     &ExtTable="ProjectBudget"
                     &ExtKey  ="AccountCode"
                     &ExtField="Description"}
