/* scdebtcls1.i */
/* selection combo for an DebtClassification */

{inc/selcmb/scmst1.i &IntTable="{1}"
                     &IntCode ="{2}"
                     &ExtTable="DebtClassification"
                     &ExtKey  ="DebtClassification"
                     &DV      ="DebtClassification.DebtClassification + ' - ' + DebtClassification.Description"}
