/* scvaltyp2.i */
/* selection combo for an ValuationType */

{inc/selcmb/scmst2.i &IntTable="{1}"
                     &IntCode ="{2}"
                     &ExtTable="ValuationType"
                     &ExtKey  ="ValuationType"}
