/* sffyr3.i */
/* selection fill-in for a FinancialYear */

{inc/selfil/sfmst3.i &IntTable="{1}"
                     &IntCode ="{2}"
                     &ExtTable="FinancialYear"
                     &ExtKey  ="FinancialYearCode"}
