/* cdvou.i */
/* Code fill-in for Voucher records */

{inc/selcde/cdmst.i &ExtTable="Voucher"
                    &ExtKey  ="VoucherSeq"
                    &ConvFn  ="INT"
                    &FillIn  ="{1}"}
