/* scrrst2.i */
/* selection combo for a Rent Review Status */

{inc/selcmb/scmst2.i &IntTable="{1}"
                     &IntCode ="{2}"
                     &ExtTable="ReviewStatus"
                     &ExtKey  ="ReviewStatus"}
