StartFontMetrics 2.0
Comment Converted at Wed Jul 12 17:52:31 2006 by ttf2afm from font file `ZapfHumanist601BT-Bold.ttf'
FontName ZapfHumanist601BT-Bold
FullName Zapf Humanist 601 Bold BT
FamilyName ZapfHumnst BT
Weight Bold
ItalicAngle 0
IsFixedPitch false
FontBBox -166 -272 1169 961
UnderlinePosition -136
UnderlineThickness 84
Version mfgpctt-v1.52 Monday, January 25, 1993 11:58:28 am (EST)
Notice Copyright 1990-1993 Bitstream Inc.  All rights reserved.
EncodingScheme FontSpecific
CapHeight 683
XHeight 479
Ascender 961
Descender -272
StartCharMetrics 260
C -1 ; WX 600 ; N .notdef ; B 49 -176 549 705 ;
C -1 ; WX 0 ; N .null ; B 83 -13 246 695 ;
C -1 ; WX 273 ; N CR ; B 83 -13 246 695 ;
C -1 ; WX 273 ; N space ; B 83 -13 246 695 ;
C -1 ; WX 326 ; N exclam ; B 83 -13 246 695 ;
C -1 ; WX 313 ; N quotedbl ; B 41 429 272 701 ;
C -1 ; WX 769 ; N numbersign ; B 34 -2 734 712 ;
C -1 ; WX 548 ; N dollar ; B 45 -101 508 730 ;
C -1 ; WX 810 ; N percent ; B 25 -92 784 743 ;
C -1 ; WX 712 ; N ampersand ; B 36 -15 684 683 ;
C -1 ; WX 163 ; N quotesingle ; B 41 429 122 701 ;
C -1 ; WX 330 ; N parenleft ; B 67 -138 296 695 ;
C -1 ; WX 330 ; N parenright ; B 30 -138 259 695 ;
C -1 ; WX 500 ; N asterisk ; B 76 326 425 695 ;
C -1 ; WX 833 ; N plus ; B 124 0 708 596 ;
C -1 ; WX 273 ; N comma ; B 23 -184 227 151 ;
C -1 ; WX 333 ; N hyphen ; B 43 191 290 298 ;
C -1 ; WX 273 ; N period ; B 56 -12 217 149 ;
C -1 ; WX 280 ; N slash ; B -23 -92 299 750 ;
C -1 ; WX 548 ; N zero ; B 30 -16 517 666 ;
C -1 ; WX 548 ; N one ; B 60 0 365 681 ;
C -1 ; WX 548 ; N two ; B 37 0 501 666 ;
C -1 ; WX 548 ; N three ; B 30 -15 481 666 ;
C -1 ; WX 548 ; N four ; B 34 0 516 666 ;
C -1 ; WX 548 ; N five ; B 33 -15 479 649 ;
C -1 ; WX 548 ; N six ; B 41 -15 517 666 ;
C -1 ; WX 548 ; N seven ; B 88 0 544 649 ;
C -1 ; WX 548 ; N eight ; B 36 -15 512 666 ;
C -1 ; WX 548 ; N nine ; B 33 -16 509 665 ;
C -1 ; WX 330 ; N colon ; B 81 -12 244 475 ;
C -1 ; WX 330 ; N semicolon ; B 41 -188 247 475 ;
C -1 ; WX 833 ; N less ; B 128 22 704 574 ;
C -1 ; WX 833 ; N equal ; B 124 157 708 439 ;
C -1 ; WX 833 ; N greater ; B 128 22 704 574 ;
C -1 ; WX 439 ; N question ; B 67 -12 375 695 ;
C -1 ; WX 1000 ; N at ; B 47 -146 952 719 ;
C -1 ; WX 607 ; N A ; B -14 0 619 695 ;
C -1 ; WX 600 ; N B ; B 74 0 553 683 ;
C -1 ; WX 660 ; N C ; B 35 -13 644 696 ;
C -1 ; WX 770 ; N D ; B 74 0 727 683 ;
C -1 ; WX 502 ; N E ; B 74 0 459 683 ;
C -1 ; WX 496 ; N F ; B 73 0 459 683 ;
C -1 ; WX 743 ; N G ; B 35 -12 695 695 ;
C -1 ; WX 769 ; N H ; B 74 0 693 683 ;
C -1 ; WX 323 ; N I ; B 75 0 248 683 ;
C -1 ; WX 333 ; N J ; B -36 -161 254 683 ;
C -1 ; WX 604 ; N K ; B 74 0 628 683 ;
C -1 ; WX 476 ; N L ; B 74 0 464 683 ;
C -1 ; WX 897 ; N M ; B 35 0 858 683 ;
C -1 ; WX 740 ; N N ; B 64 0 669 683 ;
C -1 ; WX 826 ; N O ; B 35 -13 791 695 ;
C -1 ; WX 560 ; N P ; B 74 0 537 683 ;
C -1 ; WX 826 ; N Q ; B 35 -208 794 695 ;
C -1 ; WX 605 ; N R ; B 73 0 608 684 ;
C -1 ; WX 504 ; N S ; B 37 -13 466 695 ;
C -1 ; WX 576 ; N T ; B 22 0 554 683 ;
C -1 ; WX 753 ; N U ; B 74 -13 680 683 ;
C -1 ; WX 599 ; N V ; B -9 0 619 683 ;
C -1 ; WX 964 ; N W ; B 0 0 972 683 ;
C -1 ; WX 583 ; N X ; B 8 0 576 683 ;
C -1 ; WX 553 ; N Y ; B -13 0 582 683 ;
C -1 ; WX 633 ; N Z ; B 20 0 619 683 ;
C -1 ; WX 333 ; N bracketleft ; B 77 -121 304 683 ;
C -1 ; WX 280 ; N backslash ; B -23 -92 299 750 ;
C -1 ; WX 333 ; N bracketright ; B 28 -121 255 683 ;
C -1 ; WX 1000 ; N asciicircum ; B 204 438 794 712 ;
C -1 ; WX 500 ; N underscore ; B 0 -235 500 -151 ;
C -1 ; WX 500 ; N grave ; B 91 544 354 735 ;
C -1 ; WX 504 ; N a ; B 34 -12 499 492 ;
C -1 ; WX 579 ; N b ; B 65 -13 539 750 ;
C -1 ; WX 467 ; N c ; B 24 -11 453 491 ;
C -1 ; WX 579 ; N d ; B 40 -13 520 750 ;
C -1 ; WX 508 ; N e ; B 28 -12 481 491 ;
C -1 ; WX 312 ; N f ; B 8 0 342 750 ;
C -1 ; WX 513 ; N g ; B 28 -272 515 491 ;
C -1 ; WX 566 ; N h ; B 60 0 503 750 ;
C -1 ; WX 277 ; N i ; B 63 0 214 733 ;
C -1 ; WX 272 ; N j ; B -32 -270 215 733 ;
C -1 ; WX 504 ; N k ; B 61 0 505 750 ;
C -1 ; WX 272 ; N l ; B 62 0 210 750 ;
C -1 ; WX 867 ; N m ; B 61 0 801 488 ;
C -1 ; WX 568 ; N n ; B 61 0 505 488 ;
C -1 ; WX 556 ; N o ; B 27 -12 528 491 ;
C -1 ; WX 579 ; N p ; B 62 -272 541 491 ;
C -1 ; WX 579 ; N q ; B 40 -272 516 491 ;
C -1 ; WX 380 ; N r ; B 61 0 358 491 ;
C -1 ; WX 437 ; N s ; B 41 -13 388 490 ;
C -1 ; WX 321 ; N t ; B 6 -12 317 661 ;
C -1 ; WX 566 ; N u ; B 59 -9 502 479 ;
C -1 ; WX 483 ; N v ; B 3 0 480 479 ;
C -1 ; WX 728 ; N w ; B 1 0 733 479 ;
C -1 ; WX 469 ; N x ; B 2 0 466 479 ;
C -1 ; WX 479 ; N y ; B 3 -272 477 479 ;
C -1 ; WX 464 ; N z ; B 5 0 445 478 ;
C -1 ; WX 500 ; N braceleft ; B 79 -202 426 721 ;
C -1 ; WX 500 ; N bar ; B 207 -235 293 764 ;
C -1 ; WX 500 ; N braceright ; B 74 -202 420 721 ;
C -1 ; WX 833 ; N asciitilde ; B 86 211 747 382 ;
C -1 ; WX 607 ; N Adieresis ; B -14 0 619 904 ;
C -1 ; WX 607 ; N Aring ; B -14 0 619 961 ;
C -1 ; WX 660 ; N Ccedilla ; B 35 -228 644 696 ;
C -1 ; WX 502 ; N Eacute ; B 74 0 459 940 ;
C -1 ; WX 740 ; N Ntilde ; B 64 0 669 915 ;
C -1 ; WX 826 ; N Odieresis ; B 35 -13 791 904 ;
C -1 ; WX 753 ; N Udieresis ; B 74 -13 680 904 ;
C -1 ; WX 504 ; N aacute ; B 34 -12 499 735 ;
C -1 ; WX 504 ; N agrave ; B 34 -12 499 735 ;
C -1 ; WX 504 ; N acircumflex ; B 34 -12 499 726 ;
C -1 ; WX 504 ; N adieresis ; B 34 -12 499 699 ;
C -1 ; WX 504 ; N atilde ; B 34 -12 499 709 ;
C -1 ; WX 504 ; N aring ; B 34 -12 499 763 ;
C -1 ; WX 467 ; N ccedilla ; B 24 -228 453 491 ;
C -1 ; WX 508 ; N eacute ; B 28 -12 481 735 ;
C -1 ; WX 508 ; N egrave ; B 28 -12 481 735 ;
C -1 ; WX 508 ; N ecircumflex ; B 28 -12 481 726 ;
C -1 ; WX 508 ; N edieresis ; B 28 -12 481 699 ;
C -1 ; WX 277 ; N iacute ; B 35 0 297 735 ;
C -1 ; WX 277 ; N igrave ; B -19 0 243 735 ;
C -1 ; WX 277 ; N icircumflex ; B -15 0 292 726 ;
C -1 ; WX 277 ; N idieresis ; B -15 0 293 699 ;
C -1 ; WX 568 ; N ntilde ; B 61 0 505 709 ;
C -1 ; WX 556 ; N oacute ; B 27 -12 528 735 ;
C -1 ; WX 556 ; N ograve ; B 27 -12 528 735 ;
C -1 ; WX 556 ; N ocircumflex ; B 27 -12 528 726 ;
C -1 ; WX 556 ; N odieresis ; B 27 -12 528 699 ;
C -1 ; WX 556 ; N otilde ; B 27 -12 528 709 ;
C -1 ; WX 566 ; N uacute ; B 59 -9 502 735 ;
C -1 ; WX 566 ; N ugrave ; B 59 -9 502 735 ;
C -1 ; WX 566 ; N ucircumflex ; B 59 -9 502 726 ;
C -1 ; WX 566 ; N udieresis ; B 59 -9 502 699 ;
C -1 ; WX 543 ; N dagger ; B 53 0 493 683 ;
C -1 ; WX 329 ; N degree ; B 20 423 309 712 ;
C -1 ; WX 548 ; N cent ; B 62 -102 488 587 ;
C -1 ; WX 548 ; N sterling ; B 37 0 521 666 ;
C -1 ; WX 543 ; N section ; B 67 -119 478 695 ;
C -1 ; WX 589 ; N bullet ; B 149 227 438 516 ;
C -1 ; WX 500 ; N paragraph ; B 26 0 473 722 ;
C -1 ; WX 546 ; N germandbls ; B 51 -14 520 748 ;
C -1 ; WX 833 ; N registered ; B 55 -4 777 717 ;
C -1 ; WX 833 ; N copyright ; B 55 -4 777 717 ;
C -1 ; WX 833 ; N trademark ; B 109 448 694 712 ;
C -1 ; WX 500 ; N acute ; B 145 544 408 735 ;
C -1 ; WX 500 ; N dieresis ; B 95 571 404 699 ;
C -1 ; WX 833 ; N notequal ; B 124 4 708 591 ;
C -1 ; WX 827 ; N AE ; B -47 0 777 683 ;
C -1 ; WX 826 ; N Oslash ; B 35 -58 791 740 ;
C -1 ; WX 833 ; N infinity ; B 104 103 729 494 ;
C -1 ; WX 833 ; N plusminus ; B 124 6 708 588 ;
C -1 ; WX 833 ; N lessequal ; B 126 5 706 597 ;
C -1 ; WX 833 ; N greaterequal ; B 126 5 707 597 ;
C -1 ; WX 560 ; N yen ; B 21 0 530 650 ;
C -1 ; WX 589 ; N mu ; B -44 -209 545 527 ;
C -1 ; WX 524 ; N partialdiff ; B 44 -12 482 651 ;
C -1 ; WX 693 ; N Sigma ; B 16 -191 673 719 ;
C -1 ; WX 770 ; N Pi ; B 75 -191 693 719 ;
C -1 ; WX 667 ; N pi ; B 8 -7 641 527 ;
C -1 ; WX 546 ; N integral ; B 23 -181 523 757 ;
C -1 ; WX 377 ; N ordfeminine ; B 20 208 378 696 ;
C -1 ; WX 416 ; N ordmasculine ; B 16 208 400 695 ;
C -1 ; WX 766 ; N Omega ; B 34 0 731 737 ;
C -1 ; WX 769 ; N ae ; B 33 -15 729 494 ;
C -1 ; WX 556 ; N oslash ; B 4 -77 532 551 ;
C -1 ; WX 439 ; N questiondown ; B 67 -12 375 695 ;
C -1 ; WX 326 ; N exclamdown ; B 83 -12 246 695 ;
C -1 ; WX 833 ; N logicalnot ; B 124 175 708 420 ;
C -1 ; WX 645 ; N radical ; B 32 -20 646 817 ;
C -1 ; WX 548 ; N florin ; B -9 -234 509 666 ;
C -1 ; WX 833 ; N approxequal ; B 86 118 747 478 ;
C -1 ; WX 681 ; N Delta ; B -1 0 683 719 ;
C -1 ; WX 448 ; N guillemotleft ; B 39 2 410 476 ;
C -1 ; WX 448 ; N guillemotright ; B 38 2 409 476 ;
C -1 ; WX 1000 ; N ellipsis ; B 85 -12 914 149 ;
C -1 ; WX 548 ; N nbspace ; B -14 0 619 940 ;
C -1 ; WX 607 ; N Agrave ; B -14 0 619 940 ;
C -1 ; WX 607 ; N Atilde ; B -14 0 619 915 ;
C -1 ; WX 826 ; N Otilde ; B 35 -13 791 915 ;
C -1 ; WX 998 ; N OE ; B 34 -13 971 696 ;
C -1 ; WX 857 ; N oe ; B 26 -12 834 490 ;
C -1 ; WX 500 ; N endash ; B 0 203 506 288 ;
C -1 ; WX 1000 ; N emdash ; B 0 203 1000 288 ;
C -1 ; WX 495 ; N quotedblleft ; B 42 375 445 695 ;
C -1 ; WX 495 ; N quotedblright ; B 56 376 458 696 ;
C -1 ; WX 270 ; N quoteleft ; B 37 375 231 695 ;
C -1 ; WX 270 ; N quoteright ; B 44 376 233 696 ;
C -1 ; WX 833 ; N divide ; B 124 45 708 550 ;
C -1 ; WX 494 ; N lozenge ; B 2 -232 491 807 ;
C -1 ; WX 479 ; N ydieresis ; B 3 -272 477 699 ;
C -1 ; WX 553 ; N Ydieresis ; B -13 0 582 904 ;
C -1 ; WX 166 ; N fraction ; B -166 -92 333 743 ;
C -1 ; WX 605 ; N currency ; B 37 166 570 698 ;
C -1 ; WX 272 ; N guilsinglleft ; B 39 2 234 476 ;
C -1 ; WX 272 ; N guilsinglright ; B 39 2 234 476 ;
C -1 ; WX 577 ; N fi ; B 8 0 514 750 ;
C -1 ; WX 577 ; N fl ; B 8 0 515 761 ;
C -1 ; WX 543 ; N daggerdbl ; B 51 0 491 683 ;
C -1 ; WX 273 ; N periodcentered ; B 53 241 221 409 ;
C -1 ; WX 270 ; N quotesinglbase ; B 24 -166 213 153 ;
C -1 ; WX 495 ; N quotedblbase ; B 35 -166 437 152 ;
C -1 ; WX 1196 ; N perthousand ; B 25 -92 1169 743 ;
C -1 ; WX 607 ; N Acircumflex ; B -14 0 619 931 ;
C -1 ; WX 502 ; N Ecircumflex ; B 74 0 459 931 ;
C -1 ; WX 607 ; N Aacute ; B -14 0 619 940 ;
C -1 ; WX 502 ; N Edieresis ; B 74 0 459 904 ;
C -1 ; WX 502 ; N Egrave ; B 74 0 459 940 ;
C -1 ; WX 323 ; N Iacute ; B 58 0 320 940 ;
C -1 ; WX 323 ; N Icircumflex ; B 7 0 315 931 ;
C -1 ; WX 323 ; N Idieresis ; B 7 0 316 904 ;
C -1 ; WX 323 ; N Igrave ; B 3 0 266 940 ;
C -1 ; WX 826 ; N Oacute ; B 35 -13 791 940 ;
C -1 ; WX 826 ; N Ocircumflex ; B 35 -13 791 931 ;
C -1 ; WX 790 ; N applelogo ; B 55 -17 734 788 ;
C -1 ; WX 826 ; N Ograve ; B 35 -13 791 940 ;
C -1 ; WX 753 ; N Uacute ; B 74 -13 680 940 ;
C -1 ; WX 753 ; N Ucircumflex ; B 74 -13 680 931 ;
C -1 ; WX 753 ; N Ugrave ; B 74 -13 680 940 ;
C -1 ; WX 277 ; N dotlessi ; B 63 0 213 479 ;
C -1 ; WX 500 ; N circumflex ; B 95 544 403 726 ;
C -1 ; WX 500 ; N tilde ; B 97 561 402 709 ;
C -1 ; WX 500 ; N macron ; B 109 597 390 672 ;
C -1 ; WX 500 ; N breve ; B 94 561 404 709 ;
C -1 ; WX 500 ; N dotaccent ; B 184 568 316 702 ;
C -1 ; WX 500 ; N ring ; B 125 541 376 782 ;
C -1 ; WX 500 ; N cedilla ; B 99 -228 374 0 ;
C -1 ; WX 500 ; N hungarumlaut ; B 144 544 479 735 ;
C -1 ; WX 500 ; N ogonek ; B 146 -225 340 15 ;
C -1 ; WX 500 ; N caron ; B 95 544 403 725 ;
C -1 ; WX 479 ; N Lslash ; B -15 0 469 683 ;
C -1 ; WX 282 ; N lslash ; B -15 0 297 750 ;
C -1 ; WX 504 ; N Scaron ; B 37 -13 466 930 ;
C -1 ; WX 437 ; N scaron ; B 41 -13 388 725 ;
C -1 ; WX 633 ; N Zcaron ; B 20 0 619 930 ;
C -1 ; WX 464 ; N zcaron ; B 5 0 445 725 ;
C -1 ; WX 500 ; N brokenbar ; B 207 -170 293 699 ;
C -1 ; WX 773 ; N Eth ; B 0 0 730 683 ;
C -1 ; WX 556 ; N eth ; B 33 -12 521 775 ;
C -1 ; WX 553 ; N Yacute ; B -13 0 582 940 ;
C -1 ; WX 479 ; N yacute ; B 3 -272 477 735 ;
C -1 ; WX 560 ; N Thorn ; B 74 0 537 683 ;
C -1 ; WX 579 ; N thorn ; B 62 -272 541 750 ;
C -1 ; WX 833 ; N minus ; B 124 256 708 339 ;
C -1 ; WX 833 ; N multiply ; B 140 16 703 580 ;
C -1 ; WX 361 ; N onesuperior ; B 40 259 241 668 ;
C -1 ; WX 361 ; N twosuperior ; B 23 259 331 660 ;
C -1 ; WX 361 ; N threesuperior ; B 20 250 317 660 ;
C -1 ; WX 857 ; N onequarter ; B 38 -92 837 743 ;
C -1 ; WX 857 ; N onehalf ; B 38 -92 829 743 ;
C -1 ; WX 858 ; N threequarters ; B 20 -92 837 743 ;
C -1 ; WX 876 ; N franc ; B 73 0 854 683 ;
C -1 ; WX 743 ; N Gbreve ; B 35 -12 695 915 ;
C -1 ; WX 513 ; N gbreve ; B 28 -272 515 709 ;
C -1 ; WX 323 ; N Idot ; B 75 0 248 907 ;
C -1 ; WX 504 ; N Scedilla ; B 37 -228 466 695 ;
C -1 ; WX 437 ; N scedilla ; B 41 -228 388 490 ;
C -1 ; WX 660 ; N Cacute ; B 35 -13 644 940 ;
C -1 ; WX 467 ; N cacute ; B 24 -11 453 735 ;
C -1 ; WX 660 ; N Ccaron ; B 35 -13 644 930 ;
C -1 ; WX 467 ; N ccaron ; B 24 -11 453 725 ;
C -1 ; WX 583 ; N dmacron ; B 40 -13 583 750 ;
C -1 ; WX 333 ; N sfthyphen ; B 43 191 290 298 ;
C -1 ; WX 273 ; N periodcentered ; B 53 241 221 409 ;
EndCharMetrics
StartKernData
StartKernPairs 433
KPX hyphen C 18
KPX hyphen G 18
KPX hyphen O 18
KPX hyphen Q 18
KPX hyphen S -17
KPX hyphen T -72
KPX hyphen Oslash 18
KPX hyphen OE 18
KPX A comma 18
KPX A period 18
KPX A T -54
KPX A U -17
KPX A V -35
KPX A W -17
KPX A Y -17
KPX A v -17
KPX A quotedblleft -54
KPX A quotedblright -54
KPX A quoteleft -54
KPX A quoteright -54
KPX A quotesinglbase 18
KPX A quotedblbase 18
KPX B hyphen 18
KPX B V -17
KPX B W -17
KPX B Y -17
KPX D comma -35
KPX D hyphen 18
KPX D period -35
KPX D A -17
KPX D V -17
KPX D W -17
KPX D Y -17
KPX D Aring -17
KPX D quotesinglbase -35
KPX D quotedblbase -35
KPX F comma -128
KPX F period -128
KPX F A -35
KPX F a -35
KPX F e -17
KPX F i -17
KPX F o -17
KPX F r -44
KPX F u -26
KPX F Aring -35
KPX F ae -35
KPX F oslash -17
KPX F guillemotleft -17
KPX F oe -17
KPX F quotesinglbase -128
KPX F quotedblbase -128
KPX G hyphen 18
KPX K comma 18
KPX K hyphen -17
KPX K period 18
KPX K C -17
KPX K O -17
KPX K e -17
KPX K o -17
KPX K u -17
KPX K y -35
KPX K Oslash -17
KPX K oslash -17
KPX K OE -17
KPX K oe -17
KPX K quotesinglbase 18
KPX K quotedblbase 18
KPX L hyphen -35
KPX L O -35
KPX L T -72
KPX L U -35
KPX L V -72
KPX L W -35
KPX L Y -72
KPX L u -17
KPX L y -54
KPX L Oslash -35
KPX L guillemotleft -17
KPX L OE -35
KPX L quotedblleft -54
KPX L quotedblright -72
KPX L quoteleft -54
KPX L quoteright -72
KPX O comma -17
KPX O hyphen 18
KPX O period -17
KPX O T -17
KPX O X -17
KPX O Y -17
KPX O quotedblleft 18
KPX O quotedblright 18
KPX O quoteleft 18
KPX O quoteright 18
KPX O quotesinglbase -35
KPX O quotedblbase -35
KPX P comma -165
KPX P hyphen -54
KPX P period -165
KPX P A -54
KPX P a -17
KPX P e -17
KPX P o -17
KPX P Aring -54
KPX P ae -17
KPX P oslash -17
KPX P guillemotleft -35
KPX P oe -17
KPX P quotedblleft 18
KPX P quotedblright 18
KPX P quoteleft 18
KPX P quoteright 18
KPX P quotesinglbase -165
KPX P quotedblbase -165
KPX Q comma -17
KPX Q hyphen 18
KPX Q period -17
KPX Q quotedblleft 18
KPX Q quotedblright 18
KPX Q quoteleft 18
KPX Q quoteright 18
KPX R hyphen -35
KPX R Y -17
KPX R u -17
KPX R y -17
KPX R guillemotleft -17
KPX S hyphen 18
KPX S quotesinglbase -17
KPX S quotedblbase -17
KPX T comma -91
KPX T hyphen -72
KPX T period -91
KPX T colon -72
KPX T semicolon -72
KPX T A -54
KPX T C -17
KPX T O -17
KPX T a -109
KPX T c -109
KPX T e -109
KPX T i -17
KPX T o -109
KPX T r -109
KPX T s -104
KPX T u -109
KPX T w -109
KPX T y -95
KPX T Aring -54
KPX T Oslash -17
KPX T ae -109
KPX T oslash -109
KPX T guillemotleft -91
KPX T OE -17
KPX T oe -109
KPX T quotesinglbase -91
KPX T quotedblbase -91
KPX U comma -17
KPX U period -17
KPX U A -17
KPX U Aring -17
KPX U quotesinglbase -35
KPX U quotedblbase -35
KPX V comma -91
KPX V hyphen -35
KPX V period -91
KPX V colon -17
KPX V semicolon -17
KPX V A -35
KPX V a -54
KPX V e -44
KPX V o -44
KPX V u -35
KPX V y -17
KPX V Aring -35
KPX V ae -54
KPX V oslash -44
KPX V guillemotleft -35
KPX V oe -44
KPX V quotedblleft 18
KPX V quoteleft 18
KPX V quotesinglbase -109
KPX V quotedblbase -109
KPX W comma -54
KPX W hyphen -17
KPX W period -54
KPX W colon -17
KPX W semicolon -17
KPX W A -17
KPX W a -54
KPX W e -35
KPX W o -35
KPX W r -26
KPX W u -26
KPX W Aring -17
KPX W ae -54
KPX W oslash -35
KPX W guillemotleft -17
KPX W oe -35
KPX W quotedblleft 18
KPX W quoteleft 18
KPX W quotesinglbase -91
KPX W quotedblbase -91
KPX X hyphen -17
KPX X C -17
KPX X O -17
KPX X e -17
KPX X Oslash -17
KPX X OE -17
KPX X quotedblleft -17
KPX X quotedblright -17
KPX X quoteleft -17
KPX X quoteright -17
KPX Y comma -72
KPX Y hyphen -54
KPX Y period -72
KPX Y colon -35
KPX Y semicolon -35
KPX Y A -17
KPX Y C -17
KPX Y O -17
KPX Y a -72
KPX Y e -72
KPX Y o -72
KPX Y u -72
KPX Y Aring -17
KPX Y Oslash -17
KPX Y ae -72
KPX Y oslash -72
KPX Y guillemotleft -54
KPX Y OE -17
KPX Y oe -72
KPX Y quotesinglbase -91
KPX Y quotedblbase -91
KPX Z hyphen -35
KPX Z guillemotleft -17
KPX Z quotedblleft -17
KPX Z quotedblright -17
KPX Z quoteleft -17
KPX Z quoteright -17
KPX b hyphen 18
KPX c quotedblleft 36
KPX c quotedblright 36
KPX c quoteleft 36
KPX c quoteright 36
KPX e hyphen 18
KPX f comma -17
KPX f hyphen -17
KPX f period -17
KPX f quotedblleft 36
KPX f quotedblright 18
KPX f quoteleft 36
KPX f quoteright 18
KPX f quotesinglbase -35
KPX f quotedblbase -35
KPX g quotedblleft 36
KPX g quotedblright 18
KPX g quoteleft 36
KPX g quoteright 18
KPX g quotesinglbase 36
KPX g quotedblbase 36
KPX k hyphen -17
KPX k quotedblleft 18
KPX k quoteleft 18
KPX o hyphen 18
KPX p hyphen 18
KPX r comma -54
KPX r hyphen -17
KPX r period -54
KPX r quotedblleft 18
KPX r quotedblright 18
KPX r quoteleft 18
KPX r quoteright 18
KPX r quotesinglbase -54
KPX r quotedblbase -54
KPX t hyphen -17
KPX t quotedblleft 36
KPX t quotedblright 18
KPX t quoteleft 36
KPX t quoteright 18
KPX v comma -35
KPX v period -35
KPX v quotedblleft 36
KPX v quotedblright 18
KPX v quoteleft 36
KPX v quoteright 18
KPX v quotesinglbase -91
KPX v quotedblbase -91
KPX w comma -35
KPX w period -35
KPX w quotedblleft 36
KPX w quotedblright 36
KPX w quoteleft 36
KPX w quoteright 36
KPX w quotesinglbase -54
KPX w quotedblbase -54
KPX x hyphen -17
KPX x quotedblleft 18
KPX x quoteleft 18
KPX y comma -35
KPX y period -35
KPX y quotedblleft 36
KPX y quotedblright 36
KPX y quoteleft 36
KPX y quoteright 36
KPX y quotesinglbase -72
KPX y quotedblbase -72
KPX z hyphen -17
KPX z quotedblleft 18
KPX z quoteleft 18
KPX Aring comma 18
KPX Aring period 18
KPX Aring T -54
KPX Aring U -17
KPX Aring V -35
KPX Aring W -17
KPX Aring Y -17
KPX Aring v -17
KPX Aring quotedblleft -54
KPX Aring quotedblright -54
KPX Aring quoteleft -54
KPX Aring quoteright -54
KPX Aring quotesinglbase 18
KPX Aring quotedblbase 18
KPX germandbls hyphen 18
KPX germandbls quotedblleft -17
KPX germandbls quotedblright -35
KPX germandbls quoteleft -17
KPX germandbls quoteright -35
KPX Oslash comma -17
KPX Oslash hyphen 18
KPX Oslash period -17
KPX Oslash T -17
KPX Oslash X -17
KPX Oslash Y -17
KPX Oslash quotedblleft 18
KPX Oslash quotedblright 18
KPX Oslash quoteleft 18
KPX Oslash quoteright 18
KPX Oslash quotesinglbase -35
KPX Oslash quotedblbase -35
KPX ae hyphen 18
KPX oslash hyphen 18
KPX guillemotright C 18
KPX guillemotright G 18
KPX guillemotright S -17
KPX guillemotright T -91
KPX guillemotright V -35
KPX guillemotright W -17
KPX guillemotright Y -54
KPX oe hyphen 18
KPX quotedblleft A -54
KPX quotedblleft T 18
KPX quotedblleft V 18
KPX quotedblleft W 18
KPX quotedblleft Y 18
KPX quotedblleft c -35
KPX quotedblleft d -35
KPX quotedblleft e -35
KPX quotedblleft g -54
KPX quotedblleft o -35
KPX quotedblleft q -35
KPX quotedblleft r -35
KPX quotedblleft s -35
KPX quotedblleft z -35
KPX quotedblleft Aring -54
KPX quotedblleft AE -128
KPX quotedblleft oslash -35
KPX quotedblleft oe -35
KPX quotedblleft dmacron -35
KPX quoteleft A -54
KPX quoteleft T 18
KPX quoteleft V 18
KPX quoteleft W 18
KPX quoteleft Y 18
KPX quoteleft c -35
KPX quoteleft d -35
KPX quoteleft e -35
KPX quoteleft g -54
KPX quoteleft o -35
KPX quoteleft q -35
KPX quoteleft r -35
KPX quoteleft s -35
KPX quoteleft z -35
KPX quoteleft Aring -54
KPX quoteleft AE -128
KPX quoteleft oslash -35
KPX quoteleft oe -35
KPX quoteleft dmacron -35
KPX quotesinglbase A 18
KPX quotesinglbase T -91
KPX quotesinglbase U -17
KPX quotesinglbase V -72
KPX quotesinglbase W -72
KPX quotesinglbase Y -91
KPX quotesinglbase v -54
KPX quotesinglbase w -35
KPX quotesinglbase y -35
KPX quotesinglbase Aring 18
KPX quotesinglbase AE 36
KPX quotedblbase A 18
KPX quotedblbase T -91
KPX quotedblbase U -17
KPX quotedblbase V -72
KPX quotedblbase W -72
KPX quotedblbase Y -91
KPX quotedblbase v -54
KPX quotedblbase w -35
KPX quotedblbase y -35
KPX quotedblbase Aring 18
KPX quotedblbase AE 36
KPX Lslash hyphen -35
KPX Lslash O -35
KPX Lslash T -72
KPX Lslash U -35
KPX Lslash V -72
KPX Lslash W -35
KPX Lslash Y -72
KPX Lslash u -17
KPX Lslash y -54
KPX Lslash guillemotleft -17
KPX Lslash quotedblleft -54
KPX Lslash quotedblright -72
KPX Lslash quoteleft -54
KPX Lslash quoteright -72
KPX Eth comma -35
KPX Eth hyphen 18
KPX Eth period -35
KPX Eth A -17
KPX Eth V -17
KPX Eth W -17
KPX Eth Y -17
KPX Eth quotesinglbase -35
KPX Eth quotedblbase -35
EndKernPairs
EndKernData
EndFontMetrics
