<?xml version="1.0" encoding="UTF-8" standalone="no"?>
<!-- Created with Inkscape (http://www.inkscape.org/) -->
<svg
   xmlns:dc="http://purl.org/dc/elements/1.1/"
   xmlns:cc="http://web.resource.org/cc/"
   xmlns:rdf="http://www.w3.org/1999/02/22-rdf-syntax-ns#"
   xmlns:svg="http://www.w3.org/2000/svg"
   xmlns="http://www.w3.org/2000/svg"
   xmlns:xlink="http://www.w3.org/1999/xlink"
   xmlns:sodipodi="http://sodipodi.sourceforge.net/DTD/sodipodi-0.dtd"
   xmlns:inkscape="http://www.inkscape.org/namespaces/inkscape"
   width="16"
   height="16"
   id="svg2"
   sodipodi:version="0.32"
   inkscape:version="0.45+devel"
   version="1.0"
   sodipodi:docname="bug-buddy.svg"
   sodipodi:docbase="/home/needcoffee/Desktop/bug-buddy (Kopie)/16x16"
   inkscape:output_extension="org.inkscape.output.svg.inkscape"
   inkscape:export-filename="/home/needcoffee/Desktop/bug-buddy (Kopie)/16x16/bug-buddy.png"
   inkscape:export-xdpi="90"
   inkscape:export-ydpi="90"
   sodipodi:modified="TRUE">
  <defs
     id="defs4">
    <linearGradient
       id="linearGradient21252">
      <stop
         id="stop21254"
         offset="0"
         style="stop-color:#ffffff;stop-opacity:1;" />
      <stop
         id="stop21256"
         offset="1"
         style="stop-color:#ffffff;stop-opacity:0;" />
    </linearGradient>
    <linearGradient
       id="linearGradient7862">
      <stop
         style="stop-color:#ffffff;stop-opacity:1;"
         offset="0"
         id="stop7864" />
      <stop
         style="stop-color:#ffffff;stop-opacity:0.46739131;"
         offset="1"
         id="stop7866" />
    </linearGradient>
    <linearGradient
       inkscape:collect="always"
       id="linearGradient9617">
      <stop
         style="stop-color:#ffffff;stop-opacity:1;"
         offset="0"
         id="stop9619" />
      <stop
         style="stop-color:#ffffff;stop-opacity:0;"
         offset="1"
         id="stop9621" />
    </linearGradient>
    <linearGradient
       id="linearGradient3821">
      <stop
         style="stop-color:#ffffff;stop-opacity:1;"
         offset="0"
         id="stop3823" />
      <stop
         style="stop-color:#000000;stop-opacity:1;"
         offset="1"
         id="stop3825" />
    </linearGradient>
    <radialGradient
       inkscape:collect="always"
       xlink:href="#linearGradient3821"
       id="radialGradient5265"
       gradientUnits="userSpaceOnUse"
       gradientTransform="matrix(0.2853925,0.2853925,-0.531506,0.531506,14.369527,-12.196775)"
       cx="24"
       cy="28.363541"
       fx="24"
       fy="28.363541"
       r="6.7860088" />
    <linearGradient
       inkscape:collect="always"
       xlink:href="#linearGradient9617"
       id="linearGradient5267"
       gradientUnits="userSpaceOnUse"
       gradientTransform="matrix(0.2391983,0.2391983,-0.1779554,0.1779554,5.9975371,-1.6074671)"
       x1="30.365795"
       y1="31.133732"
       x2="30.602362"
       y2="58.328846" />
    <radialGradient
       inkscape:collect="always"
       xlink:href="#linearGradient21252"
       id="radialGradient5269"
       gradientUnits="userSpaceOnUse"
       gradientTransform="matrix(0.6247172,0.1853081,-0.4706324,1.5375284,7.702403,-17.902756)"
       cx="9.4155846"
       cy="11.496181"
       fx="9.4155846"
       fy="11.496181"
       r="9.890625" />
    <radialGradient
       inkscape:collect="always"
       xlink:href="#linearGradient7862"
       id="radialGradient5271"
       gradientUnits="userSpaceOnUse"
       gradientTransform="matrix(1,0,0,0.9735542,0,0.2510445)"
       cx="8.0246916"
       cy="9.4927979"
       fx="8.0246916"
       fy="9.4927979"
       r="2.9176955" />
    <radialGradient
       inkscape:collect="always"
       xlink:href="#linearGradient7862"
       id="radialGradient5273"
       gradientUnits="userSpaceOnUse"
       gradientTransform="matrix(1,0,0,0.9735543,0,0.2047911)"
       cx="6.4300413"
       cy="7.7438269"
       fx="6.4300413"
       fy="7.7438269"
       r="2.9176953" />
    <radialGradient
       inkscape:collect="always"
       xlink:href="#linearGradient3821"
       id="radialGradient5275"
       gradientUnits="userSpaceOnUse"
       gradientTransform="matrix(0.1563558,0.1563558,-0.130279,0.130279,8.119959,0.2465524)"
       cx="22.320988"
       cy="8.7810698"
       fx="22.320988"
       fy="8.7810698"
       r="5.8765426" />
    <radialGradient
       inkscape:collect="always"
       xlink:href="#linearGradient3821"
       id="radialGradient2707"
       gradientUnits="userSpaceOnUse"
       gradientTransform="matrix(0.1563558,0.1563558,-0.130279,0.130279,8.119959,0.2465524)"
       cx="22.320988"
       cy="8.7810698"
       fx="22.320988"
       fy="8.7810698"
       r="5.8765426" />
    <radialGradient
       inkscape:collect="always"
       xlink:href="#linearGradient7862"
       id="radialGradient2711"
       gradientUnits="userSpaceOnUse"
       gradientTransform="matrix(1,0,0,0.9735543,-0.2057614,0.1019104)"
       cx="6.4300413"
       cy="7.7438269"
       fx="6.4300413"
       fy="7.7438269"
       r="2.9176953" />
    <radialGradient
       inkscape:collect="always"
       xlink:href="#linearGradient7862"
       id="radialGradient2715"
       gradientUnits="userSpaceOnUse"
       gradientTransform="matrix(1,0,0,0.9735542,0.2572016,0.3024848)"
       cx="8.0246916"
       cy="9.4927979"
       fx="8.0246916"
       fy="9.4927979"
       r="2.9176955" />
    <radialGradient
       inkscape:collect="always"
       xlink:href="#linearGradient21252"
       id="radialGradient2718"
       gradientUnits="userSpaceOnUse"
       gradientTransform="matrix(0.6247172,0.1853081,-0.4706324,1.5375284,7.702403,-17.902756)"
       cx="9.4155846"
       cy="11.496181"
       fx="9.4155846"
       fy="11.496181"
       r="9.890625" />
    <linearGradient
       inkscape:collect="always"
       xlink:href="#linearGradient9617"
       id="linearGradient2723"
       gradientUnits="userSpaceOnUse"
       gradientTransform="matrix(0.2391983,0.2391983,-0.1779554,0.1779554,5.9975371,-1.6074671)"
       x1="30.365795"
       y1="31.133732"
       x2="30.602362"
       y2="58.328846" />
    <radialGradient
       inkscape:collect="always"
       xlink:href="#linearGradient3821"
       id="radialGradient2726"
       gradientUnits="userSpaceOnUse"
       gradientTransform="matrix(0.2853925,0.2853925,-0.531506,0.531506,14.369527,-12.196775)"
       cx="24"
       cy="28.363541"
       fx="24"
       fy="28.363541"
       r="6.7860088" />
    <radialGradient
       inkscape:collect="always"
       xlink:href="#linearGradient3821"
       id="radialGradient2713"
       gradientUnits="userSpaceOnUse"
       gradientTransform="matrix(0.1563558,0.1563558,-0.130279,0.130279,8.119959,0.2465524)"
       cx="22.320988"
       cy="8.7810698"
       fx="22.320988"
       fy="8.7810698"
       r="5.8765426" />
    <radialGradient
       inkscape:collect="always"
       xlink:href="#linearGradient7862"
       id="radialGradient2717"
       gradientUnits="userSpaceOnUse"
       gradientTransform="matrix(1,0,0,0.9735543,-0.2057614,0.1019104)"
       cx="6.4300413"
       cy="7.7438269"
       fx="6.4300413"
       fy="7.7438269"
       r="2.9176953" />
    <radialGradient
       inkscape:collect="always"
       xlink:href="#linearGradient7862"
       id="radialGradient2721"
       gradientUnits="userSpaceOnUse"
       gradientTransform="matrix(1,0,0,0.9735542,0.2572016,0.3024848)"
       cx="8.0246916"
       cy="9.4927979"
       fx="8.0246916"
       fy="9.4927979"
       r="2.9176955" />
    <radialGradient
       inkscape:collect="always"
       xlink:href="#linearGradient21252"
       id="radialGradient2724"
       gradientUnits="userSpaceOnUse"
       gradientTransform="matrix(0.6247172,0.1853081,-0.4706324,1.5375284,7.702403,-17.902756)"
       cx="9.4155846"
       cy="11.496181"
       fx="9.4155846"
       fy="11.496181"
       r="9.890625" />
    <linearGradient
       inkscape:collect="always"
       xlink:href="#linearGradient9617"
       id="linearGradient2729"
       gradientUnits="userSpaceOnUse"
       gradientTransform="matrix(0.2391983,0.2391983,-0.1779554,0.1779554,5.9975371,-1.6074671)"
       x1="30.365795"
       y1="31.133732"
       x2="30.602362"
       y2="58.328846" />
    <radialGradient
       inkscape:collect="always"
       xlink:href="#linearGradient3821"
       id="radialGradient2732"
       gradientUnits="userSpaceOnUse"
       gradientTransform="matrix(0.2853925,0.2853925,-0.531506,0.531506,14.369527,-12.196775)"
       cx="24"
       cy="28.363541"
       fx="24"
       fy="28.363541"
       r="6.7860088" />
  </defs>
  <sodipodi:namedview
     id="base"
     pagecolor="#ffffff"
     bordercolor="#666666"
     borderopacity="1.0"
     inkscape:pageopacity="0.0"
     inkscape:pageshadow="2"
     inkscape:zoom="1"
     inkscape:cx="17.034452"
     inkscape:cy="9.4368974"
     inkscape:document-units="px"
     inkscape:current-layer="layer3"
     width="16px"
     height="16px"
     borderlayer="true"
     inkscape:showpageshadow="false"
     inkscape:window-width="1280"
     inkscape:window-height="952"
     inkscape:window-x="0"
     inkscape:window-y="25" />
  <metadata
     id="metadata7">
    <rdf:RDF>
      <cc:Work
         rdf:about="">
        <dc:format>image/svg+xml</dc:format>
        <dc:type
           rdf:resource="http://purl.org/dc/dcmitype/StillImage" />
        <dc:title>bug-buddy</dc:title>
        <dc:date>2007-11-02</dc:date>
        <dc:creator>
          <cc:Agent>
            <dc:title>Sebastian Kraft</dc:title>
          </cc:Agent>
        </dc:creator>
        <cc:license
           rdf:resource="http://creativecommons.org/licenses/by-sa/2.5/" />
        <dc:rights>
          <cc:Agent>
            <dc:title>Sebastian Kraft</dc:title>
          </cc:Agent>
        </dc:rights>
        <dc:language>de-DE</dc:language>
        <dc:subject>
          <rdf:Bag>
            <rdf:li>bug-buddy</rdf:li>
          </rdf:Bag>
        </dc:subject>
        <dc:description>bug-buddy icon for the Tango Desktop Project</dc:description>
        <dc:contributor>
          <cc:Agent>
            <dc:title>Sebastian Kraft</dc:title>
          </cc:Agent>
        </dc:contributor>
      </cc:Work>
      <cc:License
         rdf:about="http://creativecommons.org/licenses/by-sa/2.5/">
        <cc:permits
           rdf:resource="http://web.resource.org/cc/Reproduction" />
        <cc:permits
           rdf:resource="http://web.resource.org/cc/Distribution" />
        <cc:requires
           rdf:resource="http://web.resource.org/cc/Notice" />
        <cc:requires
           rdf:resource="http://web.resource.org/cc/Attribution" />
        <cc:permits
           rdf:resource="http://web.resource.org/cc/DerivativeWorks" />
        <cc:requires
           rdf:resource="http://web.resource.org/cc/ShareAlike" />
      </cc:License>
    </rdf:RDF>
  </metadata>
  <g
     inkscape:groupmode="layer"
     id="layer3"
     inkscape:label="01">
    <g
       id="g2736">
      <path
         id="path6628"
         d="M 10.560457,0.4642615 L 10.154207,0.6205115 L 9.8104567,1.4017615 L 9.6854567,1.4017615 L 9.7167067,2.1830115 L 9.5604567,2.3080115 L 10.029207,2.8392615 L 9.9354567,2.9330115 L 10.435457,3.2767615 L 10.372957,3.3080115 L 10.685457,3.8392615 L 10.654207,3.8392615 L 10.497957,4.8080115 L 10.841707,4.1205115 L 10.841707,4.0892615 L 10.935457,3.8705115 L 10.779207,3.8392615 L 10.654207,3.1830115 L 10.529207,3.2455115 L 10.154207,2.7142615 L 10.091707,2.7767615 L 9.8104567,2.1205115 L 9.7792067,2.1517615 L 9.9667067,1.3705115 L 9.8729567,1.3705115 L 10.560457,0.4642615 z M 12.091707,5.0580115 L 11.185457,5.4642615 L 12.154207,5.3392615 L 12.154207,5.3080115 L 12.685457,5.5892615 L 12.716707,5.5580115 L 13.029207,6.0267615 L 13.154207,5.9330115 L 13.685457,6.4017615 L 13.747957,6.2767615 L 14.591707,6.3080115 L 14.591707,6.1517615 L 15.372957,5.8392615 L 15.529207,5.4955115 L 14.591707,6.1205115 L 14.591707,6.0267615 L 13.779207,6.2455115 L 13.841707,6.1517615 L 13.185457,5.9017615 L 13.279207,5.8080115 L 12.747957,5.4330115 L 12.810457,5.3392615 L 12.122957,5.2142615 L 12.091707,5.0580115 z"
         style="fill:#000000;fill-opacity:1;stroke:#000000;stroke-width:0.2;stroke-linecap:butt;stroke-linejoin:miter;stroke-miterlimit:4;stroke-dasharray:none;stroke-dashoffset:0;stroke-opacity:1" />
      <path
         sodipodi:nodetypes="cccccccccccccccccccccccccccccccccccccccccccccc"
         id="rect11805"
         d="M 6.8017587,15.535738 L 7.4265897,13.932334 L 7.5979464,13.863885 L 9.6283777,10.36848 L 9.1324789,10.189956 L 7.086206,13.653189 L 7.1488876,13.839767 L 6.8017587,15.535738 z M 0.47079334,9.2775047 L 2.2295786,9.1981612 L 2.3826524,9.294568 L 5.8661641,7.2145685 L 5.6942533,6.7120586 L 2.1719566,8.796273 L 2.1303989,8.9138463 L 0.47079334,9.2775047 z M 3.3556108,5.2698292 L 4.5239336,5.3169317 L 4.6251101,5.4024436 L 7.1554991,5.9252335 L 7.261291,5.1582445 L 4.6845065,4.9335482 L 4.5636055,5.0127809 L 3.3556108,5.2698292 z M 11.449977,12.395051 L 11.387163,11.188366 L 11.432671,11.074519 L 10.765637,8.5700242 L 10.031709,8.8014423 L 10.996945,11.219761 L 11.102848,11.287544 L 11.449977,12.395051 z M 13.096358,8.8378086 L 12.405407,7.6311234 L 12.39484,7.4274698 L 10.368919,7.3930922 L 12.240108,7.9154384 L 12.24672,7.92205 L 13.096358,8.8378086 z M 6.8811025,3.0060468 L 7.849756,3.8821334 L 7.8299203,3.8887455 L 8.3125951,5.7202622 L 8.3496301,3.7181524 L 8.1869664,3.756506 L 6.8811025,3.0060468 z"
         style="fill:#000000;fill-opacity:1;stroke:#000000;stroke-width:0.2;stroke-linecap:butt;stroke-linejoin:miter;stroke-miterlimit:4;stroke-dasharray:none;stroke-dashoffset:0;stroke-opacity:1" />
      <path
         sodipodi:nodetypes="csssc"
         id="path3778"
         d="M 8.7303156,10.603936 C 7.5458123,11.788439 5.3149428,12.694737 4.2458974,11.625692 C 3.1768524,10.556647 4.0831496,8.3257772 5.2676529,7.1412737 C 6.4521567,5.9567699 8.4921143,5.1857938 9.5611597,6.2548387 C 10.630205,7.323884 9.9148189,9.4194332 8.7303156,10.603936 z"
         style="color:#000000;fill:url(#radialGradient2732);fill-opacity:1;fill-rule:evenodd;stroke:#2e3436;stroke-width:1px;stroke-linecap:butt;stroke-linejoin:miter;marker:none;marker-start:none;marker-mid:none;marker-end:none;stroke-miterlimit:4;stroke-dashoffset:0;stroke-opacity:1;visibility:visible;display:inline;overflow:visible;enable-background:accumulate" />
      <path
         sodipodi:nodetypes="csssc"
         style="color:#000000;fill:none;fill-opacity:1;fill-rule:evenodd;stroke:url(#linearGradient2729);stroke-width:1px;stroke-linecap:butt;stroke-linejoin:miter;marker:none;marker-start:none;marker-mid:none;marker-end:none;stroke-miterlimit:4;stroke-dashoffset:0;stroke-opacity:1;visibility:visible;display:inline;overflow:visible;enable-background:accumulate"
         d="M 8.0330088,10.644759 C 6.8236868,11.85408 5.4399688,12.037217 4.665464,11.262711 C 3.8909589,10.488207 4.0175094,9.0479038 5.2268319,7.8385815 C 6.4361539,6.6292589 8.6354945,5.6870848 9.4099999,6.46159 C 10.184505,7.2360954 9.2423304,9.4354369 8.0330088,10.644759 z"
         id="path3804" />
      <path
         id="path3766"
         d="M 10.943407,6.2677282 C 10.723716,6.0495444 10.385872,5.9195139 9.8974329,5.9147924 C 9.7319013,6.0945023 5.3156397,10.896596 4.2247899,12.370312 C 4.5333962,12.343656 6.6333505,13.311434 9.608668,10.336117 C 10.924517,9.0202689 11.742739,7.061575 10.943407,6.2677282 z M 9.8974329,5.9147924 C 9.892852,5.9147481 9.889206,5.9148144 9.884599,5.9147924 L 9.7498416,6.0495499 C 9.7775655,6.0239595 9.8890656,5.9225268 9.8974329,5.9147924 z"
         style="color:#000000;fill:#e9b96e;fill-opacity:1;fill-rule:evenodd;stroke:none;stroke-width:1px;stroke-linecap:butt;stroke-linejoin:miter;marker:none;marker-start:none;marker-mid:none;marker-end:none;stroke-miterlimit:4;stroke-dashoffset:0;stroke-opacity:1;visibility:visible;display:inline;overflow:visible;enable-background:accumulate" />
      <path
         style="color:#000000;fill:#e9b96e;fill-opacity:1;fill-rule:evenodd;stroke:none;stroke-width:1px;stroke-linecap:butt;stroke-linejoin:miter;marker:none;marker-start:none;marker-mid:none;marker-end:none;stroke-miterlimit:4;stroke-dashoffset:0;stroke-opacity:1;visibility:visible;display:inline;overflow:visible;enable-background:accumulate"
         d="M 9.5721229,4.8964441 C 9.7829867,5.1088159 9.905196,5.4388382 9.9016738,5.9190328 C 9.7222009,6.0848019 4.9265565,10.507513 3.4592417,11.604763 C 3.4906108,11.30087 2.5741149,9.2521994 5.5494319,6.2768817 C 6.865281,4.9610321 8.8049095,4.1237451 9.5721229,4.8964441 z M 9.9016738,5.9190328 C 9.9016405,5.9235366 9.9015146,5.9271225 9.9014588,5.9316522 L 9.7667022,6.0664097 C 9.7923274,6.0387213 9.8939281,5.92739 9.9016738,5.9190328 z"
         id="path11796" />
      <path
         id="path6886"
         d="M 9.2531937,4.8341956 C 8.5001741,4.2617001 6.9615974,4.8926078 5.5633776,6.2908274 C 4.5340564,7.320149 3.9812316,8.2499711 3.6935078,9.0412104 C 4.7063703,8.3068389 5.984918,8.0934335 7.1762278,8.4042045 C 8.4370667,7.2672135 9.4179127,6.3687662 9.7231265,6.0870046 C 9.7248822,5.4714162 9.5478539,5.0582156 9.2531937,4.8341956 z M 10.80997,6.4166391 C 10.581816,6.2134907 10.241688,6.0921 9.7615191,6.0868953 C 9.5090727,6.361266 8.6545153,7.2998451 7.5534089,8.5247051 C 8.1399742,8.7365727 8.6961429,9.0770744 9.1693597,9.5502913 C 9.3785518,9.7594834 9.5595546,9.9777925 9.7177567,10.214194 C 10.960569,8.9075624 11.623307,7.1408375 10.80997,6.4166391 z M 9.7615191,6.0868953 C 9.8018577,6.0430535 9.9669002,5.8687529 9.9669002,5.8687529 C 9.9669002,5.8687529 9.7816399,6.0452582 9.7295073,6.0933852 C 9.740951,6.0933792 9.7502266,6.086773 9.7615191,6.0868953 z"
         style="opacity:0.6;color:#000000;fill:url(#radialGradient2724);fill-opacity:1;fill-rule:evenodd;stroke:none;stroke-width:1px;stroke-linecap:butt;stroke-linejoin:miter;marker:none;marker-start:none;marker-mid:none;marker-end:none;stroke-miterlimit:4;stroke-dashoffset:0;stroke-opacity:1;visibility:visible;display:inline;overflow:visible;enable-background:accumulate" />
      <path
         style="opacity:0.6;fill:none;fill-rule:evenodd;stroke:url(#radialGradient2721);stroke-width:1px;stroke-linecap:square;stroke-linejoin:miter;stroke-opacity:1"
         d="M 5.8641975,11.884773 C 5.8641975,11.884773 9.1049382,11.627572 10.699589,7.2037037"
         id="path5238" />
      <path
         sodipodi:nodetypes="cccsccccc"
         style="color:#000000;fill:none;fill-opacity:1;fill-rule:evenodd;stroke:#ce5c00;stroke-width:1px;stroke-linecap:butt;stroke-linejoin:round;marker:none;marker-start:none;marker-mid:none;marker-end:none;stroke-miterlimit:4;stroke-dashoffset:0;stroke-opacity:1;visibility:visible;display:inline;overflow:visible;enable-background:accumulate"
         d="M 10.95914,6.2834615 C 10.734569,6.060398 10.391511,5.9251528 9.8975762,5.9149352 C 9.7322023,6.0948033 5.3202408,10.901197 4.2336581,12.37918 C 4.6198603,12.504574 6.6795488,13.357633 9.6548656,10.382316 C 10.970716,9.0664673 11.776228,7.0950635 10.95914,6.2834615 z M 9.8975762,5.9149352 C 9.8929432,5.9148394 9.8892581,5.9148658 9.884599,5.9147924 L 9.7498416,6.0495499 C 9.7775894,6.0239835 9.8892009,5.922663 9.8975762,5.9149352 z"
         id="path11802" />
      <path
         id="path5236"
         d="M 8.6419752,5.3004115 C 8.6419752,5.3004115 5.4012345,5.5576131 3.8065843,9.9814813"
         style="opacity:0.6;fill:none;fill-rule:evenodd;stroke:url(#radialGradient2717);stroke-width:1px;stroke-linecap:square;stroke-linejoin:miter;stroke-opacity:1" />
      <path
         sodipodi:nodetypes="cccsccccc"
         id="path11800"
         d="M 9.5485233,4.8728444 C 9.7667073,5.0925361 9.8967382,5.4303801 9.9014596,5.9188181 C 9.7217493,6.0843507 4.9196553,10.500612 3.4459399,11.591462 C 3.3609148,11.171175 2.5048171,9.1829015 5.4801344,6.2075837 C 6.7959835,4.8917344 8.7546766,4.0735127 9.5485233,4.8728444 z M 9.9014596,5.9188181 C 9.901503,5.9233998 9.9014371,5.9270451 9.9014596,5.9316522 L 9.7667022,6.0664097 C 9.7922927,6.0386865 9.8937247,5.9271858 9.9014596,5.9188181 z"
         style="color:#000000;fill:none;fill-opacity:1;fill-rule:evenodd;stroke:#ce5c00;stroke-width:1px;stroke-linecap:butt;stroke-linejoin:round;marker:none;marker-start:none;marker-mid:none;marker-end:none;stroke-miterlimit:4;stroke-dashoffset:0;stroke-opacity:1;visibility:visible;display:inline;overflow:visible;enable-background:accumulate" />
      <path
         sodipodi:nodetypes="czcsc"
         id="path3781"
         d="M 11.266202,6.4430506 C 10.281386,5.672321 9.2748929,6.5966969 9.2748929,6.5966969 C 9.2748929,6.5966969 10.12997,5.4747076 9.4285387,4.6053872 C 9.7896751,4.2442513 10.839697,4.2626469 11.224319,4.64727 C 11.608395,5.0313454 11.627338,6.0819148 11.266202,6.4430506 z"
         style="color:#000000;fill:url(#radialGradient2713);fill-opacity:1;fill-rule:evenodd;stroke:none;stroke-width:0.99999994px;stroke-linecap:butt;stroke-linejoin:miter;marker:none;marker-start:none;marker-mid:none;marker-end:none;stroke-miterlimit:4;stroke-dashoffset:0;stroke-opacity:1;visibility:visible;display:inline;overflow:visible;enable-background:accumulate" />
      <path
         style="color:#000000;fill:none;fill-opacity:1;fill-rule:evenodd;stroke:#2e3436;stroke-width:1;stroke-linecap:round;stroke-linejoin:round;marker:none;marker-start:none;marker-mid:none;marker-end:none;stroke-miterlimit:4;stroke-dasharray:none;stroke-dashoffset:0;stroke-opacity:1;visibility:visible;display:inline;overflow:visible;enable-background:accumulate"
         d="M 11.304843,6.4044095 C 10.158331,5.7953749 9.2194313,6.6521574 9.2194313,6.6521574 C 9.2194313,6.6521574 10.076214,5.7594566 9.4671788,4.5667463 C 9.8283152,4.2056104 10.837846,4.1835143 11.26296,4.6086292 C 11.647583,4.9932522 11.665979,6.0432736 11.304843,6.4044095 z"
         id="path9625"
         sodipodi:nodetypes="csczc" />
    </g>
  </g>
</svg>
