%!PS-Adobe-3.0
%%Creator: inkscape 0.44.1
%%Pages: 1
%%Orientation: Portrait
%%BoundingBox: 0 0 596 842
%%HiResBoundingBox: 0 0 596 842
%%DocumentMedia: plain 596 842 0 () ()
%%EndComments
%%Page: 1 1
0 842 translate
0.8 -0.8 scale
gsave [1 0 0 1 0 0] concat
gsave [1 0 0 1 29.69848 74.95332] concat
0 0 0 setrgbcolor
[] 0 setdash
0.99330813 setlinewidth
0 setlinejoin
0 setlinecap
newpath
117.99665 101.86429 moveto
144.13253 74.359001 189.09878 63.858257 197.51776 74.359166 curveto
203.54652 81.878782 172.34181 98.365528 172.34181 98.365528 curveto
168.09856 98.740445 lineto
stroke
gsave
0 0 0 setrgbcolor
newpath
107.125 104.73718 moveto
131.75 90.112181 lineto
118.5 101.48718 lineto
eofill
grestore
0 0 0 setrgbcolor
[] 0 setdash
1 setlinewidth
0 setlinejoin
0 setlinecap
newpath
107.125 104.73718 moveto
131.75 90.112181 lineto
118.5 101.48718 lineto
stroke
gsave [0.919425 0 -0.57536 1.087636 0 0] concat
gsave
0 0 0 setrgbcolor
newpath
208.67302 119.91885 moveto
211.17757 119.91885 211.2739 119.91885 214.26009 120.01518 curveto
217.53527 120.01518 lineto
220.90677 120.01518 lineto
227.64978 120.20784 227.64979 120.20784 229.19105 120.20784 curveto
235.7414 120.20784 240.7505 118.95556 247.20452 115.68039 curveto
255.8741 111.3456 260.11258 105.75852 260.11258 98.822856 curveto
260.11258 95.836667 258.66764 93.043128 256.25943 91.212884 curveto
254.23653 89.671625 252.11729 89.093651 247.49351 88.612007 curveto
257.03005 84.277218 261.8465 78.979125 261.8465 72.814091 curveto
261.8465 66.456399 256.64473 63.662859 244.79631 63.662859 curveto
243.25505 63.662859 lineto
244.02568 60.676667 lineto
236.22305 64.048174 lineto
227.93878 65.300447 223.31499 66.745382 218.88387 69.346256 curveto
211.17758 74.06636 207.22809 80.809386 207.22809 89.286309 curveto
207.22809 91.212882 207.42075 92.657818 207.90239 95.547678 curveto
215.60869 91.983514 lineto
214.74173 87.745053 214.6454 86.68543 214.6454 84.855186 curveto
214.6454 78.304837 216.66831 74.259019 221.58108 71.080173 curveto
225.43422 68.575628 229.28738 67.41968 235.35609 67.034365 curveto
228.22776 95.547678 lineto
224.18196 112.21254 222.54435 114.33179 213.20047 115.29507 curveto
208.67302 119.91885 lineto
236.22305 91.887185 moveto
238.14962 91.694528 239.01658 91.694528 239.97987 91.694528 curveto
247.39717 91.694528 251.73198 95.06604 251.73198 101.03842 curveto
251.73198 104.69891 250.19071 108.93738 247.7825 111.63458 curveto
245.18162 114.62077 241.32847 116.16203 236.51203 116.16203 curveto
234.10382 116.16203 231.31027 115.87304 222.25538 114.90976 curveto
231.69559 106.52916 233.23686 104.21726 235.25976 95.547678 curveto
236.22305 91.887185 lineto
242.58074 66.360064 moveto
247.30085 66.456393 248.36047 66.649051 249.70907 67.323352 curveto
252.02096 68.479296 253.46589 71.272834 253.46589 74.355351 curveto
253.46589 78.882798 251.25033 83.506586 247.87883 86.011131 curveto
244.98897 88.22669 242.0991 89.093651 236.89735 89.18998 curveto
242.58074 66.360064 lineto
fill
grestore
0 0 0 setrgbcolor
[] 0 setdash
1.0000001 setlinewidth
0 setlinejoin
0 setlinecap
newpath
208.67302 119.91885 moveto
211.17757 119.91885 211.2739 119.91885 214.26009 120.01518 curveto
217.53527 120.01518 lineto
220.90677 120.01518 lineto
227.64978 120.20784 227.64979 120.20784 229.19105 120.20784 curveto
235.7414 120.20784 240.7505 118.95556 247.20452 115.68039 curveto
255.8741 111.3456 260.11258 105.75852 260.11258 98.822856 curveto
260.11258 95.836667 258.66764 93.043128 256.25943 91.212884 curveto
254.23653 89.671625 252.11729 89.093651 247.49351 88.612007 curveto
257.03005 84.277218 261.8465 78.979125 261.8465 72.814091 curveto
261.8465 66.456399 256.64473 63.662859 244.79631 63.662859 curveto
243.25505 63.662859 lineto
244.02568 60.676667 lineto
236.22305 64.048174 lineto
227.93878 65.300447 223.31499 66.745382 218.88387 69.346256 curveto
211.17758 74.06636 207.22809 80.809386 207.22809 89.286309 curveto
207.22809 91.212882 207.42075 92.657818 207.90239 95.547678 curveto
215.60869 91.983514 lineto
214.74173 87.745053 214.6454 86.68543 214.6454 84.855186 curveto
214.6454 78.304837 216.66831 74.259019 221.58108 71.080173 curveto
225.43422 68.575628 229.28738 67.41968 235.35609 67.034365 curveto
228.22776 95.547678 lineto
224.18196 112.21254 222.54435 114.33179 213.20047 115.29507 curveto
208.67302 119.91885 lineto
236.22305 91.887185 moveto
238.14962 91.694528 239.01658 91.694528 239.97987 91.694528 curveto
247.39717 91.694528 251.73198 95.06604 251.73198 101.03842 curveto
251.73198 104.69891 250.19071 108.93738 247.7825 111.63458 curveto
245.18162 114.62077 241.32847 116.16203 236.51203 116.16203 curveto
234.10382 116.16203 231.31027 115.87304 222.25538 114.90976 curveto
231.69559 106.52916 233.23686 104.21726 235.25976 95.547678 curveto
236.22305 91.887185 lineto
242.58074 66.360064 moveto
247.30085 66.456393 248.36047 66.649051 249.70907 67.323352 curveto
252.02096 68.479296 253.46589 71.272834 253.46589 74.355351 curveto
253.46589 78.882798 251.25033 83.506586 247.87883 86.011131 curveto
244.98897 88.22669 242.0991 89.093651 236.89735 89.18998 curveto
242.58074 66.360064 lineto
stroke
gsave
0 0 0 setrgbcolor
newpath
266.43265 120.97847 moveto
273.84996 118.18494 lineto
281.07462 90.73124 lineto
284.3498 88.323023 286.56536 87.359733 289.16624 87.359733 curveto
291.28547 87.359733 292.53774 88.130366 294.27166 90.345925 curveto
297.16152 81.194693 lineto
295.33128 80.616721 294.56065 80.424063 293.59736 80.424063 curveto
291.86344 80.424063 289.84054 81.291024 287.23966 83.121268 curveto
283.96449 85.529485 282.61588 86.492775 281.55626 87.263405 curveto
281.65259 86.492775 281.84525 86.011131 281.84525 85.722145 curveto
282.61588 82.543299 282.71221 81.965323 282.71221 81.483679 curveto
282.71221 80.905707 282.13424 80.424063 281.45994 80.424063 curveto
280.20766 80.424063 271.73073 84.566203 265.85468 88.130364 curveto
265.56569 90.73124 lineto
270.76744 88.034037 271.34542 87.841377 272.50136 87.841377 curveto
273.75363 87.841377 274.33161 88.51568 274.33161 89.864281 curveto
274.33161 91.212882 273.36832 95.74034 272.21238 99.882472 curveto
266.43265 120.97847 lineto
fill
grestore
0 0 0 setrgbcolor
[] 0 setdash
1.0000001 setlinewidth
0 setlinejoin
0 setlinecap
newpath
266.43265 120.97847 moveto
273.84996 118.18494 lineto
281.07462 90.73124 lineto
284.3498 88.323023 286.56536 87.359733 289.16624 87.359733 curveto
291.28547 87.359733 292.53774 88.130366 294.27166 90.345925 curveto
297.16152 81.194693 lineto
295.33128 80.616721 294.56065 80.424063 293.59736 80.424063 curveto
291.86344 80.424063 289.84054 81.291024 287.23966 83.121268 curveto
283.96449 85.529485 282.61588 86.492775 281.55626 87.263405 curveto
281.65259 86.492775 281.84525 86.011131 281.84525 85.722145 curveto
282.61588 82.543299 282.71221 81.965323 282.71221 81.483679 curveto
282.71221 80.905707 282.13424 80.424063 281.45994 80.424063 curveto
280.20766 80.424063 271.73073 84.566203 265.85468 88.130364 curveto
265.56569 90.73124 lineto
270.76744 88.034037 271.34542 87.841377 272.50136 87.841377 curveto
273.75363 87.841377 274.33161 88.51568 274.33161 89.864281 curveto
274.33161 91.212882 273.36832 95.74034 272.21238 99.882472 curveto
266.43265 120.97847 lineto
stroke
gsave
0 0 0 setrgbcolor
newpath
310.04851 72.428776 moveto
312.84204 69.924231 313.0347 69.731568 316.30987 67.227023 curveto
315.7319 66.071079 315.25026 65.300448 315.0576 65.011462 curveto
314.47963 63.855518 314.3833 63.759186 313.61267 61.928941 curveto
313.42001 61.543627 313.22735 61.158311 313.0347 60.676667 curveto
312.55305 61.061982 311.97508 61.447298 311.68609 61.736284 curveto
311.30078 62.121598 310.53015 62.699572 309.56686 63.470201 curveto
309.08522 63.855516 308.41092 64.337161 307.54396 64.915133 curveto
307.15864 65.204119 306.77333 65.493106 306.38801 65.685763 curveto
307.06231 67.804993 307.92928 69.346259 310.04851 72.428776 curveto
316.69519 108.84105 moveto
307.54397 113.75381 307.3513 113.85014 306.09903 113.85014 curveto
305.03941 113.85014 304.36511 112.79052 304.36511 111.15294 curveto
304.36511 110.18965 304.6541 108.3594 305.23207 106.24017 curveto
310.14483 86.011151 311.10812 82.15798 311.10812 81.38735 curveto
311.10812 80.809378 310.62648 80.424063 309.95218 80.424063 curveto
308.31459 80.424063 302.63118 83.602917 294.73223 88.900994 curveto
294.53958 91.598199 lineto
300.22297 88.515682 300.70462 88.323021 301.57157 88.323021 curveto
302.3422 88.323021 302.72752 88.900995 302.72752 90.056939 curveto
302.72752 91.309211 302.43853 92.657821 300.9936 98.148554 curveto
296.46616 115.00607 296.46615 115.00609 296.46615 117.41431 curveto
296.46615 119.72619 297.42944 121.26746 298.77804 121.26746 curveto
300.41563 121.26746 303.01651 120.01518 308.12193 116.74 curveto
309.95218 115.58406 311.78243 114.42811 313.61267 113.17584 curveto
314.47963 112.6942 315.34659 112.11622 316.30987 111.53825 curveto
316.69519 108.84105 lineto
fill
grestore
0 0 0 setrgbcolor
[] 0 setdash
1.0000001 setlinewidth
0 setlinejoin
0 setlinecap
newpath
310.04851 72.428776 moveto
312.84204 69.924231 313.0347 69.731568 316.30987 67.227023 curveto
315.7319 66.071079 315.25026 65.300448 315.0576 65.011462 curveto
314.47963 63.855518 314.3833 63.759186 313.61267 61.928941 curveto
313.42001 61.543627 313.22735 61.158311 313.0347 60.676667 curveto
312.55305 61.061982 311.97508 61.447298 311.68609 61.736284 curveto
311.30078 62.121598 310.53015 62.699572 309.56686 63.470201 curveto
309.08522 63.855516 308.41092 64.337161 307.54396 64.915133 curveto
307.15864 65.204119 306.77333 65.493106 306.38801 65.685763 curveto
307.06231 67.804993 307.92928 69.346259 310.04851 72.428776 curveto
316.69519 108.84105 moveto
307.54397 113.75381 307.3513 113.85014 306.09903 113.85014 curveto
305.03941 113.85014 304.36511 112.79052 304.36511 111.15294 curveto
304.36511 110.18965 304.6541 108.3594 305.23207 106.24017 curveto
310.14483 86.011151 311.10812 82.15798 311.10812 81.38735 curveto
311.10812 80.809378 310.62648 80.424063 309.95218 80.424063 curveto
308.31459 80.424063 302.63118 83.602917 294.73223 88.900994 curveto
294.53958 91.598199 lineto
300.22297 88.515682 300.70462 88.323021 301.57157 88.323021 curveto
302.3422 88.323021 302.72752 88.900995 302.72752 90.056939 curveto
302.72752 91.309211 302.43853 92.657821 300.9936 98.148554 curveto
296.46616 115.00607 296.46615 115.00609 296.46615 117.41431 curveto
296.46615 119.72619 297.42944 121.26746 298.77804 121.26746 curveto
300.41563 121.26746 303.01651 120.01518 308.12193 116.74 curveto
309.95218 115.58406 311.78243 114.42811 313.61267 113.17584 curveto
314.47963 112.6942 315.34659 112.11622 316.30987 111.53825 curveto
316.69519 108.84105 lineto
stroke
gsave
0 0 0 setrgbcolor
newpath
346.77234 107.78143 moveto
339.35503 113.07951 334.2496 115.77672 331.16708 115.77672 curveto
327.69925 115.77672 325.67634 113.07951 325.67634 108.45573 curveto
325.67634 103.83196 326.83229 97.666906 328.66253 93.139459 curveto
330.58911 88.03404 333.09366 85.433158 335.88719 85.433158 curveto
338.19908 85.433158 339.45135 87.263409 339.933 91.50187 curveto
345.52007 88.226692 lineto
345.61639 87.745049 345.61639 87.263405 345.61639 87.167076 curveto
345.61639 83.024943 343.49716 80.424063 340.12566 80.424063 curveto
338.39174 80.424063 337.33212 80.80938 333.86429 83.121268 curveto
326.63964 87.648715 325.09837 89.093655 322.97914 93.04313 curveto
320.28193 98.244878 318.25903 106.43283 318.25903 112.40521 curveto
318.25903 117.99227 320.85991 121.26746 325.29103 121.26746 curveto
329.9148 121.26746 337.81377 117.4143 346.57968 110.86395 curveto
346.77234 107.78143 lineto
fill
grestore
0 0 0 setrgbcolor
[] 0 setdash
1.0000001 setlinewidth
0 setlinejoin
0 setlinecap
newpath
346.77234 107.78143 moveto
339.35503 113.07951 334.2496 115.77672 331.16708 115.77672 curveto
327.69925 115.77672 325.67634 113.07951 325.67634 108.45573 curveto
325.67634 103.83196 326.83229 97.666906 328.66253 93.139459 curveto
330.58911 88.03404 333.09366 85.433158 335.88719 85.433158 curveto
338.19908 85.433158 339.45135 87.263409 339.933 91.50187 curveto
345.52007 88.226692 lineto
345.61639 87.745049 345.61639 87.263405 345.61639 87.167076 curveto
345.61639 83.024943 343.49716 80.424063 340.12566 80.424063 curveto
338.39174 80.424063 337.33212 80.80938 333.86429 83.121268 curveto
326.63964 87.648715 325.09837 89.093655 322.97914 93.04313 curveto
320.28193 98.244878 318.25903 106.43283 318.25903 112.40521 curveto
318.25903 117.99227 320.85991 121.26746 325.29103 121.26746 curveto
329.9148 121.26746 337.81377 117.4143 346.57968 110.86395 curveto
346.77234 107.78143 lineto
stroke
gsave
0 0 0 setrgbcolor
newpath
365.92672 72.428776 moveto
368.72025 69.924231 368.91291 69.731568 372.18809 67.227023 curveto
371.61011 66.071079 371.12847 65.300448 370.93581 65.011462 curveto
370.35784 63.855518 370.26151 63.759186 369.49088 61.928941 curveto
369.29822 61.543627 369.10557 61.158311 368.91291 60.676667 curveto
368.43127 61.061982 367.85329 61.447298 367.56431 61.736284 curveto
367.17899 62.121598 366.40836 62.699572 365.44507 63.470201 curveto
364.96343 63.855516 364.28913 64.337161 363.42217 64.915133 curveto
363.03686 65.204119 362.65154 65.493106 362.26622 65.685763 curveto
362.94053 67.804993 363.80749 69.346259 365.92672 72.428776 curveto
372.5734 108.84105 moveto
363.42218 113.75381 363.22951 113.85014 361.97724 113.85014 curveto
360.91762 113.85014 360.24332 112.79052 360.24332 111.15294 curveto
360.24332 110.18965 360.53231 108.3594 361.11028 106.24017 curveto
366.02304 86.011151 366.98633 82.15798 366.98633 81.38735 curveto
366.98633 80.809378 366.50469 80.424063 365.83039 80.424063 curveto
364.1928 80.424063 358.5094 83.602917 350.61045 88.900994 curveto
350.41779 91.598199 lineto
356.10118 88.515682 356.58283 88.323021 357.44979 88.323021 curveto
358.22042 88.323021 358.60573 88.900995 358.60573 90.056939 curveto
358.60573 91.309211 358.31674 92.657821 356.87181 98.148554 curveto
352.34437 115.00607 352.34436 115.00609 352.34436 117.41431 curveto
352.34436 119.72619 353.30765 121.26746 354.65625 121.26746 curveto
356.29384 121.26746 358.89472 120.01518 364.00014 116.74 curveto
365.83039 115.58406 367.66064 114.42811 369.49088 113.17584 curveto
370.35784 112.6942 371.2248 112.11622 372.18809 111.53825 curveto
372.5734 108.84105 lineto
fill
grestore
0 0 0 setrgbcolor
[] 0 setdash
1.0000001 setlinewidth
0 setlinejoin
0 setlinecap
newpath
365.92672 72.428776 moveto
368.72025 69.924231 368.91291 69.731568 372.18809 67.227023 curveto
371.61011 66.071079 371.12847 65.300448 370.93581 65.011462 curveto
370.35784 63.855518 370.26151 63.759186 369.49088 61.928941 curveto
369.29822 61.543627 369.10557 61.158311 368.91291 60.676667 curveto
368.43127 61.061982 367.85329 61.447298 367.56431 61.736284 curveto
367.17899 62.121598 366.40836 62.699572 365.44507 63.470201 curveto
364.96343 63.855516 364.28913 64.337161 363.42217 64.915133 curveto
363.03686 65.204119 362.65154 65.493106 362.26622 65.685763 curveto
362.94053 67.804993 363.80749 69.346259 365.92672 72.428776 curveto
372.5734 108.84105 moveto
363.42218 113.75381 363.22951 113.85014 361.97724 113.85014 curveto
360.91762 113.85014 360.24332 112.79052 360.24332 111.15294 curveto
360.24332 110.18965 360.53231 108.3594 361.11028 106.24017 curveto
366.02304 86.011151 366.98633 82.15798 366.98633 81.38735 curveto
366.98633 80.809378 366.50469 80.424063 365.83039 80.424063 curveto
364.1928 80.424063 358.5094 83.602917 350.61045 88.900994 curveto
350.41779 91.598199 lineto
356.10118 88.515682 356.58283 88.323021 357.44979 88.323021 curveto
358.22042 88.323021 358.60573 88.900995 358.60573 90.056939 curveto
358.60573 91.309211 358.31674 92.657821 356.87181 98.148554 curveto
352.34437 115.00607 352.34436 115.00609 352.34436 117.41431 curveto
352.34436 119.72619 353.30765 121.26746 354.65625 121.26746 curveto
356.29384 121.26746 358.89472 120.01518 364.00014 116.74 curveto
365.83039 115.58406 367.66064 114.42811 369.49088 113.17584 curveto
370.35784 112.6942 371.2248 112.11622 372.18809 111.53825 curveto
372.5734 108.84105 lineto
stroke
gsave
0 0 0 setrgbcolor
newpath
400.33866 80.424063 moveto
396.48552 80.424063 390.32047 83.217601 384.63707 87.456062 curveto
378.47204 92.079838 374.13724 102.09804 374.13724 111.63458 curveto
374.13724 117.51063 377.41242 121.26746 382.51784 121.26746 curveto
385.21504 121.26746 387.91226 120.30417 392.34337 117.99228 curveto
397.15981 115.29508 400.33866 112.88685 402.07258 110.57496 curveto
405.92573 105.37322 409.00825 95.932986 409.00825 89.286309 curveto
409.00825 84.084561 405.44408 80.424063 400.33866 80.424063 curveto
395.32957 84.951514 moveto
399.18271 84.951514 401.59094 88.708342 401.59094 94.488062 curveto
401.59094 98.533865 400.24233 103.54297 397.83411 108.26307 curveto
395.13691 113.75381 391.66907 116.74 388.00858 116.74 curveto
384.05911 116.74 381.55455 113.17584 381.55455 107.6851 curveto
381.55455 96.510977 388.58656 84.951514 395.32957 84.951514 curveto
fill
grestore
0 0 0 setrgbcolor
[] 0 setdash
1.0000001 setlinewidth
0 setlinejoin
0 setlinecap
newpath
400.33866 80.424063 moveto
396.48552 80.424063 390.32047 83.217601 384.63707 87.456062 curveto
378.47204 92.079838 374.13724 102.09804 374.13724 111.63458 curveto
374.13724 117.51063 377.41242 121.26746 382.51784 121.26746 curveto
385.21504 121.26746 387.91226 120.30417 392.34337 117.99228 curveto
397.15981 115.29508 400.33866 112.88685 402.07258 110.57496 curveto
405.92573 105.37322 409.00825 95.932986 409.00825 89.286309 curveto
409.00825 84.084561 405.44408 80.424063 400.33866 80.424063 curveto
395.32957 84.951514 moveto
399.18271 84.951514 401.59094 88.708342 401.59094 94.488062 curveto
401.59094 98.533865 400.24233 103.54297 397.83411 108.26307 curveto
395.13691 113.75381 391.66907 116.74 388.00858 116.74 curveto
384.05911 116.74 381.55455 113.17584 381.55455 107.6851 curveto
381.55455 96.510977 388.58656 84.951514 395.32957 84.951514 curveto
stroke
gsave
0 0 0 setrgbcolor
newpath
433.89869 107.58877 moveto
432.55009 108.3594 431.68313 108.93738 431.29781 109.13003 curveto
424.36215 113.46482 423.59151 113.85014 422.24291 113.85014 curveto
421.37595 113.85014 420.50899 112.6942 420.50899 111.34559 curveto
420.50899 110.47864 lineto
420.50899 109.61168 lineto
420.50899 107.87776 424.84379 89.189966 428.40795 75.607625 curveto
432.16477 61.447312 433.03173 59.71338 437.2702 59.71338 curveto
438.52247 59.71338 439.48576 59.809709 441.9903 60.387681 curveto
446.13244 55.282257 lineto
444.10954 54.800614 443.04992 54.704284 441.79765 54.704284 curveto
437.9445 54.704284 434.86197 56.245549 430.2382 60.387681 curveto
425.99973 64.240828 424.94011 65.685766 423.68784 69.153598 curveto
422.91721 71.465486 420.79798 79.268122 419.83469 83.506583 curveto
412.89902 113.65748 lineto
412.80269 114.23546 412.70636 114.81343 412.70636 115.3914 curveto
412.70636 118.28126 414.34395 121.26746 415.88521 121.26746 curveto
416.46318 121.26746 lineto
416.75217 121.26746 lineto
417.71546 121.26746 421.76128 118.47391 433.89869 109.70801 curveto
433.89869 107.58877 lineto
fill
grestore
0 0 0 setrgbcolor
[] 0 setdash
1.0000001 setlinewidth
0 setlinejoin
0 setlinecap
newpath
433.89869 107.58877 moveto
432.55009 108.3594 431.68313 108.93738 431.29781 109.13003 curveto
424.36215 113.46482 423.59151 113.85014 422.24291 113.85014 curveto
421.37595 113.85014 420.50899 112.6942 420.50899 111.34559 curveto
420.50899 110.47864 lineto
420.50899 109.61168 lineto
420.50899 107.87776 424.84379 89.189966 428.40795 75.607625 curveto
432.16477 61.447312 433.03173 59.71338 437.2702 59.71338 curveto
438.52247 59.71338 439.48576 59.809709 441.9903 60.387681 curveto
446.13244 55.282257 lineto
444.10954 54.800614 443.04992 54.704284 441.79765 54.704284 curveto
437.9445 54.704284 434.86197 56.245549 430.2382 60.387681 curveto
425.99973 64.240828 424.94011 65.685766 423.68784 69.153598 curveto
422.91721 71.465486 420.79798 79.268122 419.83469 83.506583 curveto
412.89902 113.65748 lineto
412.80269 114.23546 412.70636 114.81343 412.70636 115.3914 curveto
412.70636 118.28126 414.34395 121.26746 415.88521 121.26746 curveto
416.46318 121.26746 lineto
416.75217 121.26746 lineto
417.71546 121.26746 421.76128 118.47391 433.89869 109.70801 curveto
433.89869 107.58877 lineto
stroke
gsave
0 0 0 setrgbcolor
newpath
450.7788 72.428776 moveto
453.57233 69.924231 453.76499 69.731568 457.04017 67.227023 curveto
456.4622 66.071079 455.98055 65.300448 455.78789 65.011462 curveto
455.20992 63.855518 455.11359 63.759186 454.34296 61.928941 curveto
454.15031 61.543627 453.95765 61.158311 453.76499 60.676667 curveto
453.28335 61.061982 452.70537 61.447298 452.41639 61.736284 curveto
452.03107 62.121598 451.26044 62.699572 450.29716 63.470201 curveto
449.81551 63.855516 449.14121 64.337161 448.27425 64.915133 curveto
447.88894 65.204119 447.50362 65.493106 447.11831 65.685763 curveto
447.79261 67.804993 448.65957 69.346259 450.7788 72.428776 curveto
457.42548 108.84105 moveto
448.27426 113.75381 448.08159 113.85014 446.82932 113.85014 curveto
445.7697 113.85014 445.0954 112.79052 445.0954 111.15294 curveto
445.0954 110.18965 445.38439 108.3594 445.96236 106.24017 curveto
450.87512 86.011151 451.83842 82.15798 451.83842 81.38735 curveto
451.83842 80.809378 451.35677 80.424063 450.68247 80.424063 curveto
449.04488 80.424063 443.36148 83.602917 435.46253 88.900994 curveto
435.26987 91.598199 lineto
440.95326 88.515682 441.43491 88.323021 442.30187 88.323021 curveto
443.0725 88.323021 443.45781 88.900995 443.45781 90.056939 curveto
443.45781 91.309211 443.16883 92.657821 441.7239 98.148554 curveto
437.19645 115.00607 437.19644 115.00609 437.19644 117.41431 curveto
437.19644 119.72619 438.15973 121.26746 439.50833 121.26746 curveto
441.14592 121.26746 443.7468 120.01518 448.85222 116.74 curveto
450.68247 115.58406 452.51272 114.42811 454.34296 113.17584 curveto
455.20992 112.6942 456.07688 112.11622 457.04017 111.53825 curveto
457.42548 108.84105 lineto
fill
grestore
0 0 0 setrgbcolor
[] 0 setdash
1.0000001 setlinewidth
0 setlinejoin
0 setlinecap
newpath
450.7788 72.428776 moveto
453.57233 69.924231 453.76499 69.731568 457.04017 67.227023 curveto
456.4622 66.071079 455.98055 65.300448 455.78789 65.011462 curveto
455.20992 63.855518 455.11359 63.759186 454.34296 61.928941 curveto
454.15031 61.543627 453.95765 61.158311 453.76499 60.676667 curveto
453.28335 61.061982 452.70537 61.447298 452.41639 61.736284 curveto
452.03107 62.121598 451.26044 62.699572 450.29716 63.470201 curveto
449.81551 63.855516 449.14121 64.337161 448.27425 64.915133 curveto
447.88894 65.204119 447.50362 65.493106 447.11831 65.685763 curveto
447.79261 67.804993 448.65957 69.346259 450.7788 72.428776 curveto
457.42548 108.84105 moveto
448.27426 113.75381 448.08159 113.85014 446.82932 113.85014 curveto
445.7697 113.85014 445.0954 112.79052 445.0954 111.15294 curveto
445.0954 110.18965 445.38439 108.3594 445.96236 106.24017 curveto
450.87512 86.011151 451.83842 82.15798 451.83842 81.38735 curveto
451.83842 80.809378 451.35677 80.424063 450.68247 80.424063 curveto
449.04488 80.424063 443.36148 83.602917 435.46253 88.900994 curveto
435.26987 91.598199 lineto
440.95326 88.515682 441.43491 88.323021 442.30187 88.323021 curveto
443.0725 88.323021 443.45781 88.900995 443.45781 90.056939 curveto
443.45781 91.309211 443.16883 92.657821 441.7239 98.148554 curveto
437.19645 115.00607 437.19644 115.00609 437.19644 117.41431 curveto
437.19644 119.72619 438.15973 121.26746 439.50833 121.26746 curveto
441.14592 121.26746 443.7468 120.01518 448.85222 116.74 curveto
450.68247 115.58406 452.51272 114.42811 454.34296 113.17584 curveto
455.20992 112.6942 456.07688 112.11622 457.04017 111.53825 curveto
457.42548 108.84105 lineto
stroke
gsave
0 0 0 setrgbcolor
newpath
466.40664 118.18494 moveto
472.09003 95.547678 lineto
484.13111 87.937714 484.42011 87.841377 485.76872 87.841377 curveto
486.44302 87.841377 486.82833 88.323022 486.82833 89.093651 curveto
486.82833 90.538581 486.0577 94.199086 483.26417 105.18055 curveto
481.14494 113.7538 480.75962 115.3914 480.75962 117.22165 curveto
480.75962 118.57025 481.14494 119.82253 482.20455 121.55644 curveto
486.63567 119.53354 493.28237 115.3914 500.02537 110.38231 curveto
500.69967 107.6851 lineto
491.06681 113.17584 490.68148 113.3685 489.71819 113.3685 curveto
488.75491 113.3685 488.17693 112.30888 488.17693 110.76762 curveto
488.17693 108.74472 488.85124 105.56586 490.68148 98.919184 curveto
495.20893 82.735969 495.20893 82.735952 495.20893 82.061652 curveto
495.20893 81.002036 494.53463 80.424063 493.28236 80.424063 curveto
491.83743 80.424063 489.71819 81.291024 486.25036 83.506583 curveto
484.51644 84.566198 480.08531 87.263409 473.05332 91.694528 curveto
473.92028 88.515682 475.36521 82.446966 475.36521 81.676337 curveto
475.36521 81.002036 474.78724 80.424063 474.11294 80.424063 curveto
473.05332 80.424063 466.11764 83.988231 458.98932 88.226692 curveto
458.41135 90.73124 lineto
464.57638 87.937709 464.9617 87.841377 465.82866 87.841377 curveto
466.50296 87.841377 466.98461 88.419351 466.98461 89.18998 curveto
466.98461 91.212882 465.15436 99.208179 462.74614 107.97409 curveto
460.53058 115.77672 lineto
460.33792 116.45102 459.85628 118.28127 459.18198 120.97847 curveto
466.40664 118.18494 lineto
fill
grestore
0 0 0 setrgbcolor
[] 0 setdash
1.0000001 setlinewidth
0 setlinejoin
0 setlinecap
newpath
466.40664 118.18494 moveto
472.09003 95.547678 lineto
484.13111 87.937714 484.42011 87.841377 485.76872 87.841377 curveto
486.44302 87.841377 486.82833 88.323022 486.82833 89.093651 curveto
486.82833 90.538581 486.0577 94.199086 483.26417 105.18055 curveto
481.14494 113.7538 480.75962 115.3914 480.75962 117.22165 curveto
480.75962 118.57025 481.14494 119.82253 482.20455 121.55644 curveto
486.63567 119.53354 493.28237 115.3914 500.02537 110.38231 curveto
500.69967 107.6851 lineto
491.06681 113.17584 490.68148 113.3685 489.71819 113.3685 curveto
488.75491 113.3685 488.17693 112.30888 488.17693 110.76762 curveto
488.17693 108.74472 488.85124 105.56586 490.68148 98.919184 curveto
495.20893 82.735969 495.20893 82.735952 495.20893 82.061652 curveto
495.20893 81.002036 494.53463 80.424063 493.28236 80.424063 curveto
491.83743 80.424063 489.71819 81.291024 486.25036 83.506583 curveto
484.51644 84.566198 480.08531 87.263409 473.05332 91.694528 curveto
473.92028 88.515682 475.36521 82.446966 475.36521 81.676337 curveto
475.36521 81.002036 474.78724 80.424063 474.11294 80.424063 curveto
473.05332 80.424063 466.11764 83.988231 458.98932 88.226692 curveto
458.41135 90.73124 lineto
464.57638 87.937709 464.9617 87.841377 465.82866 87.841377 curveto
466.50296 87.841377 466.98461 88.419351 466.98461 89.18998 curveto
466.98461 91.212882 465.15436 99.208179 462.74614 107.97409 curveto
460.53058 115.77672 lineto
460.33792 116.45102 459.85628 118.28127 459.18198 120.97847 curveto
466.40664 118.18494 lineto
stroke
gsave
0 0 0 setrgbcolor
newpath
531.6152 106.81814 moveto
524.39055 113.07951 519.76676 115.77672 516.10627 115.77672 curveto
513.69805 115.77672 511.67514 114.13913 511.00084 111.63458 curveto
510.61553 110.09332 510.5192 109.0337 510.5192 106.24017 curveto
514.85399 103.54297 517.74386 101.52006 523.42725 97.281596 curveto
528.629 93.33212 530.65191 90.153263 530.65191 85.818473 curveto
530.65191 82.44697 528.53267 80.424063 525.16117 80.424063 curveto
523.04194 80.424063 521.50068 80.905708 519.28512 82.157981 curveto
515.62463 84.277211 512.34944 86.878092 510.32654 89.18998 curveto
506.66605 93.621098 503.39087 104.21727 503.39087 112.0199 curveto
503.39087 117.70329 506.37707 121.26746 511.28983 121.26746 curveto
516.97322 121.26746 524.00523 117.22164 531.6152 109.61168 curveto
531.6152 106.81814 lineto
510.80819 102.77233 moveto
512.44577 92.465168 516.8769 84.469871 521.01903 84.469871 curveto
522.65662 84.469871 523.71624 86.107462 523.71624 88.41935 curveto
523.71624 93.235783 521.11535 96.125657 510.80819 102.77233 curveto
fill
grestore
0 0 0 setrgbcolor
[] 0 setdash
1.0000001 setlinewidth
0 setlinejoin
0 setlinecap
newpath
531.6152 106.81814 moveto
524.39055 113.07951 519.76676 115.77672 516.10627 115.77672 curveto
513.69805 115.77672 511.67514 114.13913 511.00084 111.63458 curveto
510.61553 110.09332 510.5192 109.0337 510.5192 106.24017 curveto
514.85399 103.54297 517.74386 101.52006 523.42725 97.281596 curveto
528.629 93.33212 530.65191 90.153263 530.65191 85.818473 curveto
530.65191 82.44697 528.53267 80.424063 525.16117 80.424063 curveto
523.04194 80.424063 521.50068 80.905708 519.28512 82.157981 curveto
515.62463 84.277211 512.34944 86.878092 510.32654 89.18998 curveto
506.66605 93.621098 503.39087 104.21727 503.39087 112.0199 curveto
503.39087 117.70329 506.37707 121.26746 511.28983 121.26746 curveto
516.97322 121.26746 524.00523 117.22164 531.6152 109.61168 curveto
531.6152 106.81814 lineto
510.80819 102.77233 moveto
512.44577 92.465168 516.8769 84.469871 521.01903 84.469871 curveto
522.65662 84.469871 523.71624 86.107462 523.71624 88.41935 curveto
523.71624 93.235783 521.11535 96.125657 510.80819 102.77233 curveto
stroke
gsave
0 0 0 setrgbcolor
newpath
540.65505 111.44192 moveto
540.1734 111.82724 539.30644 112.50154 538.05417 113.46483 curveto
538.8248 115.58406 540.75138 118.66658 542.58162 120.88214 curveto
546.24211 118.18494 547.10908 117.51063 549.70995 114.81343 curveto
548.55401 113.17584 547.59072 111.63458 547.49439 111.53825 curveto
546.82009 110.47864 546.33844 109.708 545.1825 107.6851 curveto
544.89351 107.97409 544.41187 108.3594 543.8339 108.84105 curveto
543.06327 109.41902 542.29264 110.09332 541.52201 110.76762 curveto
540.65505 111.44192 lineto
fill
grestore
0 0 0 setrgbcolor
[] 0 setdash
1.0000001 setlinewidth
0 setlinejoin
0 setlinecap
newpath
540.65505 111.44192 moveto
540.1734 111.82724 539.30644 112.50154 538.05417 113.46483 curveto
538.8248 115.58406 540.75138 118.66658 542.58162 120.88214 curveto
546.24211 118.18494 547.10908 117.51063 549.70995 114.81343 curveto
548.55401 113.17584 547.59072 111.63458 547.49439 111.53825 curveto
546.82009 110.47864 546.33844 109.708 545.1825 107.6851 curveto
544.89351 107.97409 544.41187 108.3594 543.8339 108.84105 curveto
543.06327 109.41902 542.29264 110.09332 541.52201 110.76762 curveto
540.65505 111.44192 lineto
stroke
gsave
0 0 0 setrgbcolor
newpath
561.91509 111.44192 moveto
561.43344 111.82724 560.56648 112.50154 559.31421 113.46483 curveto
560.08484 115.58406 562.01142 118.66658 563.84166 120.88214 curveto
567.50215 118.18494 568.36912 117.51063 570.96999 114.81343 curveto
569.81405 113.17584 568.85076 111.63458 568.75443 111.53825 curveto
568.08013 110.47864 567.59848 109.708 566.44254 107.6851 curveto
566.15355 107.97409 565.67191 108.3594 565.09394 108.84105 curveto
564.32331 109.41902 563.55268 110.09332 562.78205 110.76762 curveto
561.91509 111.44192 lineto
fill
grestore
0 0 0 setrgbcolor
[] 0 setdash
1.0000001 setlinewidth
0 setlinejoin
0 setlinecap
newpath
561.91509 111.44192 moveto
561.43344 111.82724 560.56648 112.50154 559.31421 113.46483 curveto
560.08484 115.58406 562.01142 118.66658 563.84166 120.88214 curveto
567.50215 118.18494 568.36912 117.51063 570.96999 114.81343 curveto
569.81405 113.17584 568.85076 111.63458 568.75443 111.53825 curveto
568.08013 110.47864 567.59848 109.708 566.44254 107.6851 curveto
566.15355 107.97409 565.67191 108.3594 565.09394 108.84105 curveto
564.32331 109.41902 563.55268 110.09332 562.78205 110.76762 curveto
561.91509 111.44192 lineto
stroke
gsave
0 0 0 setrgbcolor
newpath
583.17516 111.44192 moveto
582.69352 111.82724 581.82655 112.50154 580.57428 113.46483 curveto
581.34491 115.58406 583.27149 118.66658 585.10173 120.88214 curveto
588.76222 118.18494 589.62919 117.51063 592.23006 114.81343 curveto
591.07412 113.17584 590.11083 111.63458 590.0145 111.53825 curveto
589.3402 110.47864 588.85855 109.708 587.70261 107.6851 curveto
587.41362 107.97409 586.93198 108.3594 586.35401 108.84105 curveto
585.58338 109.41902 584.81275 110.09332 584.04212 110.76762 curveto
583.17516 111.44192 lineto
fill
grestore
0 0 0 setrgbcolor
[] 0 setdash
1.0000001 setlinewidth
0 setlinejoin
0 setlinecap
newpath
583.17516 111.44192 moveto
582.69352 111.82724 581.82655 112.50154 580.57428 113.46483 curveto
581.34491 115.58406 583.27149 118.66658 585.10173 120.88214 curveto
588.76222 118.18494 589.62919 117.51063 592.23006 114.81343 curveto
591.07412 113.17584 590.11083 111.63458 590.0145 111.53825 curveto
589.3402 110.47864 588.85855 109.708 587.70261 107.6851 curveto
587.41362 107.97409 586.93198 108.3594 586.35401 108.84105 curveto
585.58338 109.41902 584.81275 110.09332 584.04212 110.76762 curveto
583.17516 111.44192 lineto
stroke
grestore
0 0 0 setrgbcolor
[] 0 setdash
1 setlinewidth
0 setlinejoin
0 setlinecap
newpath
107.5 104.61218 moveto
118.25 101.61218 118.25 101.61218 118.25 101.61218 curveto
stroke
grestore
grestore
showpage
%%EOF
