<?xml version="1.0" encoding="UTF-8" standalone="no"?>
<svg
   xmlns:dc="http://purl.org/dc/elements/1.1/"
   xmlns:cc="http://web.resource.org/cc/"
   xmlns:rdf="http://www.w3.org/1999/02/22-rdf-syntax-ns#"
   xmlns:svg="http://www.w3.org/2000/svg"
   xmlns="http://www.w3.org/2000/svg"
   xmlns:sodipodi="http://sodipodi.sourceforge.net/DTD/sodipodi-0.dtd"
   xmlns:inkscape="http://www.inkscape.org/namespaces/inkscape"
   width="45cm"
   height="41cm"
   viewBox="-46 -19 45 41"
   id="svg2"
   sodipodi:version="0.32"
   inkscape:version="0.45.1"
   sodipodi:docname="logo_small.svg"
   sodipodi:docbase="/home/greg/src/boxen/logo"
   inkscape:output_extension="org.inkscape.output.svg.inkscape">
  <metadata
     id="metadata75">
    <rdf:RDF>
      <cc:Work
         rdf:about="">
        <dc:format>image/svg+xml</dc:format>
        <dc:type
           rdf:resource="http://purl.org/dc/dcmitype/StillImage" />
      </cc:Work>
    </rdf:RDF>
  </metadata>
  <defs
     id="defs73">
    <filter
       inkscape:collect="always"
       id="filter6070">
      <feGaussianBlur
         inkscape:collect="always"
         stdDeviation="0.063947221"
         id="feGaussianBlur6072" />
    </filter>
    <filter
       inkscape:collect="always"
       x="-0.10566069"
       width="1.2113214"
       y="-0.11089345"
       height="1.2217869"
       id="filter6074">
      <feGaussianBlur
         inkscape:collect="always"
         stdDeviation="0.063947221"
         id="feGaussianBlur6076" />
    </filter>
    <filter
       inkscape:collect="always"
       id="filter6078">
      <feGaussianBlur
         inkscape:collect="always"
         stdDeviation="0.063947221"
         id="feGaussianBlur6080" />
    </filter>
    <filter
       inkscape:collect="always"
       x="-0.10497412"
       width="1.2099482"
       y="-0.11304993"
       height="1.2260999"
       id="filter6082">
      <feGaussianBlur
         inkscape:collect="always"
         stdDeviation="0.063947221"
         id="feGaussianBlur6084" />
    </filter>
    <filter
       inkscape:collect="always"
       id="filter6086">
      <feGaussianBlur
         inkscape:collect="always"
         stdDeviation="0.063947221"
         id="feGaussianBlur6088" />
    </filter>
    <filter
       inkscape:collect="always"
       x="-0.11246094"
       width="1.2249219"
       y="-0.10506107"
       height="1.2101221"
       id="filter6090">
      <feGaussianBlur
         inkscape:collect="always"
         stdDeviation="0.063947221"
         id="feGaussianBlur6092" />
    </filter>
    <filter
       inkscape:collect="always"
       id="filter6094">
      <feGaussianBlur
         inkscape:collect="always"
         stdDeviation="0.063947221"
         id="feGaussianBlur6096" />
    </filter>
    <filter
       inkscape:collect="always"
       x="-0.10912176"
       width="1.2182435"
       y="-0.10571964"
       height="1.2114393"
       id="filter6098">
      <feGaussianBlur
         inkscape:collect="always"
         stdDeviation="0.063947221"
         id="feGaussianBlur6100" />
    </filter>
    <filter
       inkscape:collect="always"
       id="filter6102">
      <feGaussianBlur
         inkscape:collect="always"
         stdDeviation="0.063947221"
         id="feGaussianBlur6104" />
    </filter>
    <filter
       inkscape:collect="always"
       id="filter6106">
      <feGaussianBlur
         inkscape:collect="always"
         stdDeviation="0.063947221"
         id="feGaussianBlur6108" />
    </filter>
    <filter
       inkscape:collect="always"
       x="-0.10629295"
       width="1.2125859"
       y="-0.10802571"
       height="1.2160514"
       id="filter6110">
      <feGaussianBlur
         inkscape:collect="always"
         stdDeviation="0.063947221"
         id="feGaussianBlur6112" />
    </filter>
    <filter
       inkscape:collect="always"
       id="filter6114">
      <feGaussianBlur
         inkscape:collect="always"
         stdDeviation="0.063947221"
         id="feGaussianBlur6116" />
    </filter>
    <filter
       inkscape:collect="always"
       x="-0.10597442"
       width="1.2119488"
       y="-0.10856828"
       height="1.2171366"
       id="filter6118">
      <feGaussianBlur
         inkscape:collect="always"
         stdDeviation="0.063947221"
         id="feGaussianBlur6120" />
    </filter>
    <filter
       inkscape:collect="always"
       id="filter6122">
      <feGaussianBlur
         inkscape:collect="always"
         stdDeviation="0.063947221"
         id="feGaussianBlur6124" />
    </filter>
    <filter
       inkscape:collect="always"
       x="-0.1061151"
       width="1.2122302"
       y="-0.10830778"
       height="1.2166156"
       id="filter6126">
      <feGaussianBlur
         inkscape:collect="always"
         stdDeviation="0.063947221"
         id="feGaussianBlur6128" />
    </filter>
    <filter
       inkscape:collect="always"
       id="filter6130">
      <feGaussianBlur
         inkscape:collect="always"
         stdDeviation="0.063947221"
         id="feGaussianBlur6132" />
    </filter>
    <filter
       inkscape:collect="always"
       x="-0.10614299"
       width="1.212286"
       y="-0.10826957"
       height="1.2165391"
       id="filter6134">
      <feGaussianBlur
         inkscape:collect="always"
         stdDeviation="0.063947221"
         id="feGaussianBlur6136" />
    </filter>
    <filter
       inkscape:collect="always"
       id="filter6138">
      <feGaussianBlur
         inkscape:collect="always"
         stdDeviation="0.063947221"
         id="feGaussianBlur6140" />
    </filter>
    <filter
       inkscape:collect="always"
       id="filter6142">
      <feGaussianBlur
         inkscape:collect="always"
         stdDeviation="0.063947221"
         id="feGaussianBlur6144" />
    </filter>
    <filter
       inkscape:collect="always"
       id="filter6146">
      <feGaussianBlur
         inkscape:collect="always"
         stdDeviation="0.063947221"
         id="feGaussianBlur6148" />
    </filter>
    <filter
       inkscape:collect="always"
       id="filter6150">
      <feGaussianBlur
         inkscape:collect="always"
         stdDeviation="0.063947221"
         id="feGaussianBlur6152" />
    </filter>
    <filter
       inkscape:collect="always"
       id="filter6154">
      <feGaussianBlur
         inkscape:collect="always"
         stdDeviation="0.063947221"
         id="feGaussianBlur6156" />
    </filter>
    <filter
       inkscape:collect="always"
       id="filter6158">
      <feGaussianBlur
         inkscape:collect="always"
         stdDeviation="0.063947221"
         id="feGaussianBlur6160" />
    </filter>
    <filter
       inkscape:collect="always"
       id="filter6162">
      <feGaussianBlur
         inkscape:collect="always"
         stdDeviation="0.063947221"
         id="feGaussianBlur6164" />
    </filter>
    <filter
       inkscape:collect="always"
       id="filter6166">
      <feGaussianBlur
         inkscape:collect="always"
         stdDeviation="0.063947221"
         id="feGaussianBlur6168" />
    </filter>
    <filter
       inkscape:collect="always"
       id="filter6170">
      <feGaussianBlur
         inkscape:collect="always"
         stdDeviation="0.063947221"
         id="feGaussianBlur6172" />
    </filter>
    <filter
       inkscape:collect="always"
       id="filter6174">
      <feGaussianBlur
         inkscape:collect="always"
         stdDeviation="0.063947221"
         id="feGaussianBlur6176" />
    </filter>
    <filter
       inkscape:collect="always"
       x="-0.11094876"
       width="1.2218975"
       y="-0.10562433"
       height="1.2112487"
       id="filter6178">
      <feGaussianBlur
         inkscape:collect="always"
         stdDeviation="0.063947221"
         id="feGaussianBlur6180" />
    </filter>
    <filter
       inkscape:collect="always"
       id="filter6182">
      <feGaussianBlur
         inkscape:collect="always"
         stdDeviation="0.063947221"
         id="feGaussianBlur6184" />
    </filter>
    <filter
       inkscape:collect="always"
       x="-0.10506754"
       width="1.2101351"
       y="-0.11245023"
       height="1.2249005"
       id="filter6186">
      <feGaussianBlur
         inkscape:collect="always"
         stdDeviation="0.063947221"
         id="feGaussianBlur6188" />
    </filter>
    <filter
       inkscape:collect="always"
       id="filter6190">
      <feGaussianBlur
         inkscape:collect="always"
         stdDeviation="0.063947221"
         id="feGaussianBlur6192" />
    </filter>
    <filter
       inkscape:collect="always"
       x="-0.11048073"
       width="1.2209615"
       y="-0.10600282"
       height="1.2120056"
       id="filter6194">
      <feGaussianBlur
         inkscape:collect="always"
         stdDeviation="0.063947221"
         id="feGaussianBlur6196" />
    </filter>
    <filter
       inkscape:collect="always"
       id="filter6198">
      <feGaussianBlur
         inkscape:collect="always"
         stdDeviation="0.063947221"
         id="feGaussianBlur6200" />
    </filter>
    <filter
       inkscape:collect="always"
       x="-0.10496694"
       width="1.2099339"
       y="-0.1136527"
       height="1.2273054"
       id="filter6202">
      <feGaussianBlur
         inkscape:collect="always"
         stdDeviation="0.063947221"
         id="feGaussianBlur6204" />
    </filter>
  </defs>
  <sodipodi:namedview
     inkscape:window-height="825"
     inkscape:window-width="1246"
     inkscape:pageshadow="2"
     inkscape:pageopacity="0.0"
     guidetolerance="10.0"
     gridtolerance="10.0"
     objecttolerance="10.0"
     borderopacity="1.0"
     bordercolor="#666666"
     pagecolor="#ffffff"
     id="base"
     inkscape:zoom="0.36797148"
     inkscape:cx="874.83918"
     inkscape:cy="771.79659"
     inkscape:window-x="426"
     inkscape:window-y="46"
     inkscape:current-layer="svg2" />
  <line
     style="fill:none;fill-opacity:0;stroke:#d5c8b0;stroke-width:0.90311116;stroke-miterlimit:0.1;stroke-dasharray:none;filter:url(#filter6070)"
     x1="-45.190498"
     y1="16.0793"
     x2="-14.891"
     y2="7.4458899"
     id="line4"
     transform="matrix(0.9879126,0,0,0.9982199,-0.5493738,-0.2652353)" />
  <polyline
     style="fill:none;fill-opacity:0;stroke:#d5c8b0;stroke-width:0.90311116;stroke-miterlimit:0.1;stroke-dasharray:none;filter:url(#filter6074)"
     points="-15.0346,7.74674 -14.6222,7.36929 -15.1716,7.26588 "
     id="polyline6"
     transform="matrix(0.9879126,0,0,0.9982199,-0.5493738,-0.2652353)" />
  <line
     style="fill:none;fill-opacity:0;stroke:#d5c8b0;stroke-width:0.90311116;stroke-miterlimit:0.1;stroke-dasharray:none;filter:url(#filter6078)"
     x1="-45.190498"
     y1="-17.980301"
     x2="-14.8478"
     y2="-1.96824"
     id="line8"
     transform="matrix(0.9879126,0,0,0.9982199,-0.5493738,-0.2652353)" />
  <polyline
     style="fill:none;fill-opacity:0;stroke:#d5c8b0;stroke-width:0.90311116;stroke-miterlimit:0.1;stroke-dasharray:none;filter:url(#filter6082)"
     points="-15.1595,-1.85004 -14.6006,-1.83779 -14.9261,-2.29225 "
     id="polyline10"
     transform="matrix(0.9879126,0,0,0.9982199,-0.5493738,-0.2652353)" />
  <line
     style="fill:none;fill-opacity:0;stroke:#d5c8b0;stroke-width:0.90311116;stroke-miterlimit:0.1;stroke-dasharray:none;filter:url(#filter6086)"
     x1="-11.131"
     y1="-17.980301"
     x2="-4.5683098"
     y2="-2.2233901"
     id="line12"
     transform="matrix(0.9879126,0,0,0.9982199,-0.5493738,-0.2652353)" />
  <polyline
     style="fill:none;fill-opacity:0;stroke:#d5c8b0;stroke-width:0.90311116;stroke-miterlimit:0.1;stroke-dasharray:none;filter:url(#filter6090)"
     points="-4.88387,-2.33081 -4.46085,-1.96536 -4.4223,-2.52305 "
     id="polyline14"
     transform="matrix(0.9879126,0,0,0.9982199,-0.5493738,-0.2652353)" />
  <line
     style="fill:none;fill-opacity:0;stroke:#d5c8b0;stroke-width:0.90311116;stroke-miterlimit:0.1;stroke-dasharray:none;filter:url(#filter6094)"
     x1="-11.131"
     y1="16.0793"
     x2="-4.6948099"
     y2="7.7353301"
     id="line16"
     transform="matrix(0.9879126,0,0,0.9982199,-0.5493738,-0.2652353)" />
  <polyline
     style="fill:none;fill-opacity:0;stroke:#d5c8b0;stroke-width:0.90311116;stroke-miterlimit:0.1;stroke-dasharray:none;filter:url(#filter6098)"
     points="-4.63153,8.06261 -4.5241,7.51402 -5.02743,7.75723 "
     id="polyline18"
     transform="matrix(0.9879126,0,0,0.9982199,-0.5493738,-0.2652353)" />
  <rect
     style="fill:none;fill-opacity:0;stroke:#4e814e;stroke-width:0.90311116;stroke-miterlimit:0.1;stroke-dasharray:none;filter:url(#filter6102)"
     x="-45.190498"
     y="-17.980301"
     width="34.059601"
     height="34.059601"
     rx="1.1754904e-39"
     ry="1.1754904e-39"
     id="rect20"
     transform="matrix(0.9879126,0,0,0.9982199,-0.5493738,-0.2652353)" />
  <line
     style="fill:none;fill-opacity:0;stroke:#4e814e;stroke-width:0.90311116;stroke-miterlimit:0.1;stroke-dasharray:none;filter:url(#filter6106)"
     x1="-11.1309"
     y1="-17.980301"
     x2="-5.05124"
     y2="-12.6489"
     id="line22"
     transform="matrix(0.9879126,0,0,0.9982199,-0.5493738,-0.2652353)" />
  <polyline
     style="fill:none;fill-opacity:0;stroke:#4e814e;stroke-width:0.90311116;stroke-miterlimit:0.1;stroke-dasharray:none;filter:url(#filter6110)"
     points="-5.38185,-12.6063 -4.84109,-12.4646 -5.05219,-12.9822 "
     id="polyline24"
     transform="matrix(0.9879126,0,0,0.9982199,-0.5493738,-0.2652353)" />
  <line
     style="fill:none;fill-opacity:0;stroke:#4e814e;stroke-width:0.90311116;stroke-miterlimit:0.1;stroke-dasharray:none;filter:url(#filter6114)"
     x1="-45.190498"
     y1="16.0793"
     x2="-38.9226"
     y2="21.2246"
     id="line26"
     transform="matrix(0.9879126,0,0,0.9982199,-0.5493738,-0.2652353)" />
  <polyline
     style="fill:none;fill-opacity:0;stroke:#4e814e;stroke-width:0.90311116;stroke-miterlimit:0.1;stroke-dasharray:none;filter:url(#filter6118)"
     points="-39.2516,21.2779 -38.7065,21.402 -38.9344,20.8915 "
     id="polyline28"
     transform="matrix(0.9879126,0,0,0.9982199,-0.5493738,-0.2652353)" />
  <line
     style="fill:none;fill-opacity:0;stroke:#4e814e;stroke-width:0.90311116;stroke-miterlimit:0.1;stroke-dasharray:none;filter:url(#filter6122)"
     x1="-11.1309"
     y1="16.0793"
     x2="-5.0576801"
     y2="21.218201"
     id="line30"
     transform="matrix(0.9879126,0,0,0.9982199,-0.5493738,-0.2652353)" />
  <polyline
     style="fill:none;fill-opacity:0;stroke:#4e814e;stroke-width:0.90311116;stroke-miterlimit:0.1;stroke-dasharray:none;filter:url(#filter6126)"
     points="-5.38749,21.2666 -4.84431,21.3988 -5.06452,20.8849 "
     id="polyline32"
     transform="matrix(0.9879126,0,0,0.9982199,-0.5493738,-0.2652353)" />
  <line
     style="fill:none;fill-opacity:0;stroke:#4e814e;stroke-width:0.90311116;stroke-miterlimit:0.1;stroke-dasharray:none;filter:url(#filter6130)"
     x1="-45.190498"
     y1="-17.980301"
     x2="-38.916302"
     y2="-12.6425"
     id="line34"
     transform="matrix(0.9879126,0,0,0.9982199,-0.5493738,-0.2652353)" />
  <polyline
     style="fill:none;fill-opacity:0;stroke:#4e814e;stroke-width:0.90311116;stroke-miterlimit:0.1;stroke-dasharray:none;filter:url(#filter6134)"
     points="-39.2462,-12.595 -38.7034,-12.4614 -38.9222,-12.9758 "
     id="polyline36"
     transform="matrix(0.9879126,0,0,0.9982199,-0.5493738,-0.2652353)" />
  <polygon
     style="fill:#ffffff;stroke-width:0.90311116;stroke-miterlimit:0.1;stroke-dasharray:none;filter:url(#filter6138)"
     points="-14.3534,-1.70734 -4.35338,-1.70734 -4.35338,7.2927 -14.3534,7.2927 -14.3534,-1.70734 "
     id="polygon38"
     transform="matrix(0.9879126,0,0,0.9982199,-0.5493738,-0.2652353)" />
  <polygon
     style="fill:none;fill-opacity:0;stroke:#425b79;stroke-width:0.90311116;stroke-miterlimit:0.1;stroke-dasharray:none;filter:url(#filter6142)"
     points="-14.3534,-1.70734 -4.35338,-1.70734 -4.35338,7.2927 -14.3534,7.2927 -14.3534,-1.70734 "
     id="polygon40"
     transform="matrix(0.9879126,0,0,0.9982199,-0.5493738,-0.2652353)" />
  <polygon
     style="fill:#ffffff;stroke-width:0.90311116;stroke-miterlimit:0.1;stroke-dasharray:none;filter:url(#filter6146)"
     points="-11.3534,1.29266 -1.3534,1.29266 -1.3534,10.2927 -11.3534,10.2927 -11.3534,1.29266 "
     id="polygon42"
     transform="matrix(0.9879126,0,0,0.9982199,-0.5493738,-0.2652353)" />
  <polygon
     style="fill:none;fill-opacity:0;stroke:#425b79;stroke-width:0.90311116;stroke-miterlimit:0.1;stroke-dasharray:none;filter:url(#filter6150)"
     points="-11.3534,1.29266 -1.3534,1.29266 -1.3534,10.2927 -11.3534,10.2927 -11.3534,1.29266 "
     id="polygon44"
     transform="matrix(0.9879126,0,0,0.9982199,-0.5493738,-0.2652353)" />
  <polygon
     style="fill:#ffffff;stroke-width:0.90311116;stroke-miterlimit:0.1;stroke-dasharray:none;filter:url(#filter6154)"
     points="-14.3534,-1.70734 -4.35338,-1.70734 -1.3534,1.29266 -11.3534,1.29266 -14.3534,-1.70734 "
     id="polygon46"
     transform="matrix(0.9879126,0,0,0.9982199,-0.5493738,-0.2652353)" />
  <polygon
     style="fill:none;fill-opacity:0;stroke:#425b79;stroke-width:0.90311116;stroke-miterlimit:0.1;stroke-dasharray:none;filter:url(#filter6158)"
     points="-14.3534,-1.70734 -4.35338,-1.70734 -1.3534,1.29266 -11.3534,1.29266 -14.3534,-1.70734 "
     id="polygon48"
     transform="matrix(0.9879126,0,0,0.9982199,-0.5493738,-0.2652353)" />
  <polygon
     style="fill:#ffffff;stroke-width:0.90311116;stroke-miterlimit:0.1;stroke-dasharray:none;filter:url(#filter6162)"
     points="-14.3534,-1.70734 -11.3534,1.29266 -11.3534,10.2927 -14.3534,7.2927 -14.3534,-1.70734 "
     id="polygon50"
     transform="matrix(0.9879126,0,0,0.9982199,-0.5493738,-0.2652353)" />
  <polygon
     style="fill:none;fill-opacity:0;stroke:#425b79;stroke-width:0.90311116;stroke-miterlimit:0.1;stroke-dasharray:none;filter:url(#filter6166)"
     points="-14.3534,-1.70734 -11.3534,1.29266 -11.3534,10.2927 -14.3534,7.2927 -14.3534,-1.70734 "
     id="polygon52"
     transform="matrix(0.9879126,0,0,0.9982199,-0.5493738,-0.2652353)" />
  <rect
     style="fill:none;fill-opacity:0;stroke:#4e814e;stroke-width:0.90311116;stroke-miterlimit:0.1;stroke-dasharray:none;filter:url(#filter6170)"
     x="-38.490501"
     y="-12.2803"
     width="33.8596"
     height="33.8596"
     rx="1.1754904e-39"
     ry="1.1754904e-39"
     id="rect54"
     transform="matrix(0.9879126,0,0,0.9982199,-0.5493738,-0.2652353)" />
  <line
     style="fill:none;fill-opacity:0;stroke:#d5c8b0;stroke-width:0.90311116;stroke-miterlimit:0.1;stroke-dasharray:none;filter:url(#filter6174)"
     x1="-4.63095"
     y1="21.5793"
     x2="-1.50929"
     y2="10.8295"
     id="line56"
     transform="matrix(0.9879126,0,0,0.9982199,-0.5493738,-0.2652353)" />
  <polyline
     style="fill:none;fill-opacity:0;stroke:#d5c8b0;stroke-width:0.90311116;stroke-miterlimit:0.1;stroke-dasharray:none;filter:url(#filter6178)"
     points="-1.3307,11.111 -1.43135,10.5611 -1.81087,10.9716 "
     id="polyline58"
     transform="matrix(0.9879126,0,0,0.9982199,-0.5493738,-0.2652353)" />
  <line
     style="fill:none;fill-opacity:0;stroke:#d5c8b0;stroke-width:0.90311116;stroke-miterlimit:0.1;stroke-dasharray:none;filter:url(#filter6182)"
     x1="-38.490501"
     y1="21.5793"
     x2="-11.8696"
     y2="10.5074"
     id="line60"
     transform="matrix(0.9879126,0,0,0.9982199,-0.5493738,-0.2652353)" />
  <polyline
     style="fill:none;fill-opacity:0;stroke:#d5c8b0;stroke-width:0.90311116;stroke-miterlimit:0.1;stroke-dasharray:none;filter:url(#filter6186)"
     points="-11.9771,10.8229 -11.6115,10.4 -12.1691,10.3612 "
     id="polyline62"
     transform="matrix(0.9879126,0,0,0.9982199,-0.5493738,-0.2652353)" />
  <line
     style="fill:none;fill-opacity:0;stroke:#d5c8b0;stroke-width:0.90311116;stroke-miterlimit:0.1;stroke-dasharray:none;filter:url(#filter6190)"
     x1="-4.63095"
     y1="-12.2803"
     x2="-1.48462"
     y2="0.74926198"
     id="line64"
     transform="matrix(0.9879126,0,0,0.9982199,-0.5493738,-0.2652353)" />
  <polyline
     style="fill:none;fill-opacity:0;stroke:#d5c8b0;stroke-width:0.90311116;stroke-miterlimit:0.1;stroke-dasharray:none;filter:url(#filter6194)"
     points="-1.77939,0.593613 -1.41901,1.02096 -1.29336,0.476248 "
     id="polyline66"
     transform="matrix(0.9879126,0,0,0.9982199,-0.5493738,-0.2652353)" />
  <line
     style="fill:none;fill-opacity:0;stroke:#d5c8b0;stroke-width:0.90311116;stroke-miterlimit:0.1;stroke-dasharray:none;filter:url(#filter6198)"
     x1="-38.490501"
     y1="-12.2803"
     x2="-11.8534"
     y2="1.0426"
     id="line68"
     transform="matrix(0.9879126,0,0,0.9982199,-0.5493738,-0.2652353)" />
  <polyline
     style="fill:none;fill-opacity:0;stroke:#d5c8b0;stroke-width:0.90311116;stroke-miterlimit:0.1;stroke-dasharray:none;filter:url(#filter6202)"
     points="-12.1624,1.16755 -11.6034,1.16763 -11.9387,0.72037 "
     id="polyline70"
     transform="matrix(0.9879126,0,0,0.9982199,-0.5493738,-0.2652353)" />
</svg>
