Sequences
Sequences/Concepts
Sequences/Classes
Sequences/Views
Sequences/Intrinsic Metafunctions
Iterators
Iterators/Concepts
Iterators/Iterator Metafunctions
Algorithms
Algorithms/Concepts
Algorithms/Inserters
Algorithms/Iteration Algorithms
Algorithms/Querying Algorithms
Algorithms/Transformation Algorithms
Algorithms/Runtime Algorithms
Metafunctions
Metafunctions/Concepts
Metafunctions/Type Selection
Metafunctions/Invocation
Metafunctions/Composition and Argument Binding
Metafunctions/Arithmetic Operations
Metafunctions/Comparisons
Metafunctions/Logical Operations
Metafunctions/Bitwise Operations
Metafunctions/Trivial
Metafunctions/String Operations
Metafunctions/Miscellaneous
Data Types
Data Types/Concepts
Data Types/Numeric
Data Types/Miscellaneous
Macros
Macros/Asserts
Macros/Introspection
Macros/Configuration
Macros/Broken Compiler Workarounds 
Terminology
Categorized Index
Acknowledgements
