{
  "bounds": [800, 600],
  "children": [
    {
      "bounds": [800, 600],
      "contentsOpaque": true,
      "drawsContent": true,
      "children": [
        {
          "position": [8, 8],
          "bounds": [200, 200],
          "drawsContent": true,
          "repaintRects": [
            [0, 0, 185, 200]
          ],
          "paintInvalidationClients": [
            "LayoutBlockFlow DIV id='indicator'"
          ],
          "children": [
            {
              "bounds": [185, 185],
              "children": [
                {
                  "bounds": [185, 1200],
                  "shouldFlattenTransform": false,
                  "drawsContent": true,
                  "repaintRects": [
                    [0, 0, 185, 200]
                  ],
                  "paintInvalidationClients": [
                    "LayoutBlockFlow DIV id='indicator'"
                  ],
                  "children": [
                    {
                      "shouldFlattenTransform": false
                    }
                  ]
                }
              ]
            },
            {
              "children": [
                {
                  "position": [0, 185],
                  "bounds": [185, 15],
                  "drawsContent": true
                },
                {
                  "position": [185, 0],
                  "bounds": [15, 185],
                  "drawsContent": true,
                  "repaintRects": [
                    [0, 0, 15, 185]
                  ],
                  "paintInvalidationClients": [
                    "##ALL##"
                  ]
                },
                {
                  "position": [185, 185],
                  "bounds": [15, 15],
                  "drawsContent": true
                }
              ]
            }
          ]
        }
      ]
    }
  ]
}

