layer at (0,0) size 800x600 clip at (0,0) size 785x600 scrollHeight 699
  LayoutView at (0,0) size 800x600
layer at (0,0) size 785x699 backgroundClip at (0,0) size 785x600 clip at (0,0) size 785x600
  LayoutBlockFlow {HTML} at (0,0) size 785x699
    LayoutBlockFlow {BODY} at (8,8) size 769x671 [bgcolor=#CCCCCC]
      LayoutBlockFlow {P} at (0,0) size 769x18
        LayoutText {#text} at (0,0) size 363x18
          text run at (0,0) width 363: "The style declarations which apply to the text below are:"
      LayoutBlockFlow {PRE} at (0,31) size 769x195
        LayoutText {#text} at (0,0) size 500x195
          text run at (0,0) width 383: "P { margin: 0; padding: 0; text-align:  justify;}"
          text run at (382,0) width 1: " "
          text run at (0,15) width 0: " "
          text run at (0,30) width 328: "DIV.yellow, DIV.blue, DIV.red, DIV.green {"
          text run at (327,30) width 1: " "
          text run at (0,45) width 328: " width: 60px; padding: 20px; margin: 10px;"
          text run at (327,45) width 1: " "
          text run at (0,60) width 461: " border: 20px solid black; float: left; text-align: center;"
          text run at (460,60) width 1: " "
          text run at (0,75) width 352: " font-family: \"Times New Roman\",Times,serif;}"
          text run at (351,75) width 1: " "
          text run at (0,90) width 500: "DIV.yellow {margin-left: 0px; background: yellow; color: black;}"
          text run at (499,90) width 1: " "
          text run at (0,105) width 328: "DIV.blue {background: blue; color: white;}"
          text run at (327,105) width 1: " "
          text run at (0,120) width 313: "DIV.red {background: red; color: black;}"
          text run at (312,120) width 1: " "
          text run at (0,135) width 344: "DIV.green {background: green; color: white;}"
          text run at (343,135) width 1: " "
          text run at (0,150) width 188: "DIV.below {clear: both;}"
          text run at (187,150) width 1: " "
          text run at (0,165) width 196: "TABLE {margin: 20px 0px;}"
          text run at (195,165) width 1: " "
          text run at (0,180) width 0: " "
      LayoutBlockFlow {HR} at (0,239) size 769x2 [border: (1px inset #EEEEEE)]
      LayoutBlockFlow {P} at (0,249) size 769x36
        LayoutText {#text} at (0,0) size 769x36
          text run at (0,0) width 769: "The four floating DIV elements below should appear next to each other horizontally. The table at the bottom of this"
          text run at (0,18) width 447: "page indicates how the DIV elements should be laid out horizontally. "
          text run at (447,18) width 223: "They should align with each other."
      LayoutBlockFlow (floating) {DIV} at (0,295) size 140x98 [bgcolor=#FFFF00] [border: (20px solid #000000)]
        LayoutBlockFlow {P} at (40,40) size 60x18
          LayoutText {#text} at (0,0) size 48x17
            text run at (0,0) width 48: "Yellow"
      LayoutBlockFlow (floating) {DIV} at (160,295) size 140x98 [color=#FFFFFF] [bgcolor=#0000FF] [border: (20px solid #000000)]
        LayoutBlockFlow {P} at (40,40) size 60x18
          LayoutText {#text} at (0,0) size 31x17
            text run at (0,0) width 31: "Blue"
      LayoutBlockFlow (floating) {DIV} at (320,295) size 140x98 [bgcolor=#FF0000] [border: (20px solid #000000)]
        LayoutBlockFlow {P} at (40,40) size 60x18
          LayoutText {#text} at (0,0) size 26x17
            text run at (0,0) width 26: "Red"
      LayoutBlockFlow (floating) {DIV} at (480,295) size 140x98 [color=#FFFFFF] [bgcolor=#008000] [border: (20px solid #000000)]
        LayoutBlockFlow {P} at (40,40) size 60x18
          LayoutText {#text} at (0,0) size 40x17
            text run at (0,0) width 40: "Green"
      LayoutBlockFlow {DIV} at (0,403) size 769x19
        LayoutTable {TABLE} at (0,0) size 620x19
          LayoutTableSection {TBODY} at (0,0) size 620x19
            LayoutTableRow {TR} at (0,0) size 620x19
              LayoutTableCell {TD} at (0,9) size 20x1 [bgcolor=#000000] [r=0 c=0 rs=1 cs=1]
                LayoutBlockFlow {IMG} at (0,0) size 20x1
              LayoutTableCell {TD} at (20,9) size 100x1 [bgcolor=#FFFF00] [r=0 c=1 rs=1 cs=1]
                LayoutBlockFlow {IMG} at (0,0) size 100x1
              LayoutTableCell {TD} at (120,9) size 20x0 [bgcolor=#000000] [r=0 c=2 rs=1 cs=1]
              LayoutTableCell {TD} at (140,9) size 20x1 [bgcolor=#FFFFFF] [r=0 c=3 rs=1 cs=1]
                LayoutBlockFlow {IMG} at (0,0) size 20x1
              LayoutTableCell {TD} at (160,9) size 20x1 [bgcolor=#000000] [r=0 c=4 rs=1 cs=1]
                LayoutBlockFlow {IMG} at (0,0) size 20x1
              LayoutTableCell {TD} at (180,9) size 100x1 [bgcolor=#0000FF] [r=0 c=5 rs=1 cs=1]
                LayoutBlockFlow {IMG} at (0,0) size 100x1
              LayoutTableCell {TD} at (280,9) size 20x1 [bgcolor=#000000] [r=0 c=6 rs=1 cs=1]
                LayoutBlockFlow {IMG} at (0,0) size 20x1
              LayoutTableCell {TD} at (300,9) size 20x1 [bgcolor=#FFFFFF] [r=0 c=7 rs=1 cs=1]
                LayoutBlockFlow {IMG} at (0,0) size 20x1
              LayoutTableCell {TD} at (320,9) size 20x1 [bgcolor=#000000] [r=0 c=8 rs=1 cs=1]
                LayoutBlockFlow {IMG} at (0,0) size 20x1
              LayoutTableCell {TD} at (340,9) size 100x1 [bgcolor=#FF0000] [r=0 c=9 rs=1 cs=1]
                LayoutBlockFlow {IMG} at (0,0) size 100x1
              LayoutTableCell {TD} at (440,0) size 20x19 [bgcolor=#000000] [r=0 c=10 rs=1 cs=1]
                LayoutBlockFlow {IMG} at (0,0) size 20x1
                LayoutText {#text} at (0,1) size 5x18
                  text run at (0,1) width 5: ";"
              LayoutTableCell {TD} at (460,9) size 20x1 [bgcolor=#FFFFFF] [r=0 c=11 rs=1 cs=1]
                LayoutBlockFlow {IMG} at (0,0) size 20x1
              LayoutTableCell {TD} at (480,9) size 20x1 [bgcolor=#000000] [r=0 c=12 rs=1 cs=1]
                LayoutBlockFlow {IMG} at (0,0) size 20x1
              LayoutTableCell {TD} at (500,9) size 100x1 [bgcolor=#008000] [r=0 c=13 rs=1 cs=1]
                LayoutBlockFlow {IMG} at (0,0) size 100x1
              LayoutTableCell {TD} at (600,9) size 20x1 [bgcolor=#000000] [r=0 c=14 rs=1 cs=1]
                LayoutBlockFlow {IMG} at (0,0) size 20x1
      LayoutTable {TABLE} at (0,442) size 769x229 [border: (1px outset #808080)]
        LayoutTableSection {TBODY} at (1,1) size 767x227
          LayoutTableRow {TR} at (0,0) size 767x26
            LayoutTableCell {TD} at (0,0) size 767x26 [bgcolor=#C0C0C0] [border: (1px inset #808080)] [r=0 c=0 rs=1 cs=2]
              LayoutInline {STRONG} at (0,0) size 163x18
                LayoutText {#text} at (4,4) size 163x18
                  text run at (4,4) width 163: "TABLE Testing Section"
          LayoutTableRow {TR} at (0,26) size 767x201
            LayoutTableCell {TD} at (0,113) size 12x26 [bgcolor=#C0C0C0] [border: (1px inset #808080)] [r=1 c=0 rs=1 cs=1]
              LayoutText {#text} at (4,4) size 4x18
                text run at (4,4) width 4: " "
            LayoutTableCell {TD} at (12,26) size 755x201 [border: (1px inset #808080)] [r=1 c=1 rs=1 cs=1]
              LayoutBlockFlow {P} at (4,4) size 747x36
                LayoutText {#text} at (0,0) size 747x36
                  text run at (0,0) width 747: "The four floating DIV elements below should appear next to each other horizontally. The table at the bottom of this"
                  text run at (0,18) width 447: "page indicates how the DIV elements should be laid out horizontally. "
                  text run at (447,18) width 223: "They should align with each other."
              LayoutBlockFlow (floating) {DIV} at (4,50) size 140x98 [bgcolor=#FFFF00] [border: (20px solid #000000)]
                LayoutBlockFlow {P} at (40,40) size 60x18
                  LayoutText {#text} at (0,0) size 48x17
                    text run at (0,0) width 48: "Yellow"
              LayoutBlockFlow (floating) {DIV} at (164,50) size 140x98 [color=#FFFFFF] [bgcolor=#0000FF] [border: (20px solid #000000)]
                LayoutBlockFlow {P} at (40,40) size 60x18
                  LayoutText {#text} at (0,0) size 31x17
                    text run at (0,0) width 31: "Blue"
              LayoutBlockFlow (floating) {DIV} at (324,50) size 140x98 [bgcolor=#FF0000] [border: (20px solid #000000)]
                LayoutBlockFlow {P} at (40,40) size 60x18
                  LayoutText {#text} at (0,0) size 26x17
                    text run at (0,0) width 26: "Red"
              LayoutBlockFlow (floating) {DIV} at (484,50) size 140x98 [color=#FFFFFF] [bgcolor=#008000] [border: (20px solid #000000)]
                LayoutBlockFlow {P} at (40,40) size 60x18
                  LayoutText {#text} at (0,0) size 40x17
                    text run at (0,0) width 40: "Green"
              LayoutBlockFlow {DIV} at (4,158) size 747x19
                LayoutTable {TABLE} at (0,0) size 620x19
                  LayoutTableSection {TBODY} at (0,0) size 620x19
                    LayoutTableRow {TR} at (0,0) size 620x19
                      LayoutTableCell {TD} at (0,9) size 20x1 [bgcolor=#000000] [r=0 c=0 rs=1 cs=1]
                        LayoutBlockFlow {IMG} at (0,0) size 20x1
                      LayoutTableCell {TD} at (20,9) size 100x1 [bgcolor=#FFFF00] [r=0 c=1 rs=1 cs=1]
                        LayoutBlockFlow {IMG} at (0,0) size 100x1
                      LayoutTableCell {TD} at (120,9) size 20x0 [bgcolor=#000000] [r=0 c=2 rs=1 cs=1]
                      LayoutTableCell {TD} at (140,9) size 20x1 [bgcolor=#FFFFFF] [r=0 c=3 rs=1 cs=1]
                        LayoutBlockFlow {IMG} at (0,0) size 20x1
                      LayoutTableCell {TD} at (160,9) size 20x1 [bgcolor=#000000] [r=0 c=4 rs=1 cs=1]
                        LayoutBlockFlow {IMG} at (0,0) size 20x1
                      LayoutTableCell {TD} at (180,9) size 100x1 [bgcolor=#0000FF] [r=0 c=5 rs=1 cs=1]
                        LayoutBlockFlow {IMG} at (0,0) size 100x1
                      LayoutTableCell {TD} at (280,9) size 20x1 [bgcolor=#000000] [r=0 c=6 rs=1 cs=1]
                        LayoutBlockFlow {IMG} at (0,0) size 20x1
                      LayoutTableCell {TD} at (300,9) size 20x1 [bgcolor=#FFFFFF] [r=0 c=7 rs=1 cs=1]
                        LayoutBlockFlow {IMG} at (0,0) size 20x1
                      LayoutTableCell {TD} at (320,9) size 20x1 [bgcolor=#000000] [r=0 c=8 rs=1 cs=1]
                        LayoutBlockFlow {IMG} at (0,0) size 20x1
                      LayoutTableCell {TD} at (340,9) size 100x1 [bgcolor=#FF0000] [r=0 c=9 rs=1 cs=1]
                        LayoutBlockFlow {IMG} at (0,0) size 100x1
                      LayoutTableCell {TD} at (440,0) size 20x19 [bgcolor=#000000] [r=0 c=10 rs=1 cs=1]
                        LayoutBlockFlow {IMG} at (0,0) size 20x1
                        LayoutText {#text} at (0,1) size 5x18
                          text run at (0,1) width 5: ";"
                      LayoutTableCell {TD} at (460,9) size 20x1 [bgcolor=#FFFFFF] [r=0 c=11 rs=1 cs=1]
                        LayoutBlockFlow {IMG} at (0,0) size 20x1
                      LayoutTableCell {TD} at (480,9) size 20x1 [bgcolor=#000000] [r=0 c=12 rs=1 cs=1]
                        LayoutBlockFlow {IMG} at (0,0) size 20x1
                      LayoutTableCell {TD} at (500,9) size 100x1 [bgcolor=#008000] [r=0 c=13 rs=1 cs=1]
                        LayoutBlockFlow {IMG} at (0,0) size 100x1
                      LayoutTableCell {TD} at (600,9) size 20x1 [bgcolor=#000000] [r=0 c=14 rs=1 cs=1]
                        LayoutBlockFlow {IMG} at (0,0) size 20x1
layer at (8,420) size 20x4 clip at (9,421) size 18x2 scrollHeight 18
  LayoutBlockFlow {DIV} at (0,0) size 20x4 [border: (1px solid #C0C0C0)]
    LayoutImage (floating) {IMG} at (2,2) size 16x16
layer at (26,422) size 0x0
  LayoutBlockFlow {DIV} at (18,2) size 0x0
layer at (28,420) size 100x4 clip at (29,421) size 98x2 scrollHeight 18
  LayoutBlockFlow {DIV} at (0,0) size 100x4 [border: (1px solid #C0C0C0)]
    LayoutImage (floating) {IMG} at (2,2) size 16x16
layer at (46,422) size 80x0
  LayoutBlockFlow {DIV} at (18,2) size 80x0
layer at (148,420) size 20x4 clip at (149,421) size 18x2 scrollHeight 18
  LayoutBlockFlow {DIV} at (0,0) size 20x4 [border: (1px solid #C0C0C0)]
    LayoutImage (floating) {IMG} at (2,2) size 16x16
layer at (166,422) size 0x0
  LayoutBlockFlow {DIV} at (18,2) size 0x0
layer at (168,420) size 20x4 clip at (169,421) size 18x2 scrollHeight 18
  LayoutBlockFlow {DIV} at (0,0) size 20x4 [border: (1px solid #C0C0C0)]
    LayoutImage (floating) {IMG} at (2,2) size 16x16
layer at (186,422) size 0x0
  LayoutBlockFlow {DIV} at (18,2) size 0x0
layer at (188,420) size 100x4 clip at (189,421) size 98x2 scrollHeight 18
  LayoutBlockFlow {DIV} at (0,0) size 100x4 [border: (1px solid #C0C0C0)]
    LayoutImage (floating) {IMG} at (2,2) size 16x16
layer at (206,422) size 80x0
  LayoutBlockFlow {DIV} at (18,2) size 80x0
layer at (288,420) size 20x4 clip at (289,421) size 18x2 scrollHeight 18
  LayoutBlockFlow {DIV} at (0,0) size 20x4 [border: (1px solid #C0C0C0)]
    LayoutImage (floating) {IMG} at (2,2) size 16x16
layer at (306,422) size 0x0
  LayoutBlockFlow {DIV} at (18,2) size 0x0
layer at (308,420) size 20x4 clip at (309,421) size 18x2 scrollHeight 18
  LayoutBlockFlow {DIV} at (0,0) size 20x4 [border: (1px solid #C0C0C0)]
    LayoutImage (floating) {IMG} at (2,2) size 16x16
layer at (326,422) size 0x0
  LayoutBlockFlow {DIV} at (18,2) size 0x0
layer at (328,420) size 20x4 clip at (329,421) size 18x2 scrollHeight 18
  LayoutBlockFlow {DIV} at (0,0) size 20x4 [border: (1px solid #C0C0C0)]
    LayoutImage (floating) {IMG} at (2,2) size 16x16
layer at (346,422) size 0x0
  LayoutBlockFlow {DIV} at (18,2) size 0x0
layer at (348,420) size 100x4 clip at (349,421) size 98x2 scrollHeight 18
  LayoutBlockFlow {DIV} at (0,0) size 100x4 [border: (1px solid #C0C0C0)]
    LayoutImage (floating) {IMG} at (2,2) size 16x16
layer at (366,422) size 80x0
  LayoutBlockFlow {DIV} at (18,2) size 80x0
layer at (448,411) size 20x4 clip at (449,412) size 18x2 scrollHeight 18
  LayoutBlockFlow {DIV} at (0,0) size 20x4 [border: (1px solid #C0C0C0)]
    LayoutImage (floating) {IMG} at (2,2) size 16x16
layer at (466,413) size 0x0
  LayoutBlockFlow {DIV} at (18,2) size 0x0
layer at (468,420) size 20x4 clip at (469,421) size 18x2 scrollHeight 18
  LayoutBlockFlow {DIV} at (0,0) size 20x4 [border: (1px solid #C0C0C0)]
    LayoutImage (floating) {IMG} at (2,2) size 16x16
layer at (486,422) size 0x0
  LayoutBlockFlow {DIV} at (18,2) size 0x0
layer at (488,420) size 20x4 clip at (489,421) size 18x2 scrollHeight 18
  LayoutBlockFlow {DIV} at (0,0) size 20x4 [border: (1px solid #C0C0C0)]
    LayoutImage (floating) {IMG} at (2,2) size 16x16
layer at (506,422) size 0x0
  LayoutBlockFlow {DIV} at (18,2) size 0x0
layer at (508,420) size 100x4 clip at (509,421) size 98x2 scrollHeight 18
  LayoutBlockFlow {DIV} at (0,0) size 100x4 [border: (1px solid #C0C0C0)]
    LayoutImage (floating) {IMG} at (2,2) size 16x16
layer at (526,422) size 80x0
  LayoutBlockFlow {DIV} at (18,2) size 80x0
layer at (608,420) size 20x4 clip at (609,421) size 18x2 scrollHeight 18
  LayoutBlockFlow {DIV} at (0,0) size 20x4 [border: (1px solid #C0C0C0)]
    LayoutImage (floating) {IMG} at (2,2) size 16x16
layer at (626,422) size 0x0
  LayoutBlockFlow {DIV} at (18,2) size 0x0
layer at (25,644) size 20x4 backgroundClip at (0,0) size 0x0 clip at (0,0) size 0x0 scrollHeight 18
  LayoutBlockFlow {DIV} at (0,0) size 20x4 [border: (1px solid #C0C0C0)]
    LayoutImage (floating) {IMG} at (2,2) size 16x16
layer at (43,646) size 0x0
  LayoutBlockFlow {DIV} at (18,2) size 0x0
layer at (45,644) size 100x4 backgroundClip at (0,0) size 0x0 clip at (0,0) size 0x0 scrollHeight 18
  LayoutBlockFlow {DIV} at (0,0) size 100x4 [border: (1px solid #C0C0C0)]
    LayoutImage (floating) {IMG} at (2,2) size 16x16
layer at (63,646) size 80x0
  LayoutBlockFlow {DIV} at (18,2) size 80x0
layer at (165,644) size 20x4 backgroundClip at (0,0) size 0x0 clip at (0,0) size 0x0 scrollHeight 18
  LayoutBlockFlow {DIV} at (0,0) size 20x4 [border: (1px solid #C0C0C0)]
    LayoutImage (floating) {IMG} at (2,2) size 16x16
layer at (183,646) size 0x0
  LayoutBlockFlow {DIV} at (18,2) size 0x0
layer at (185,644) size 20x4 backgroundClip at (0,0) size 0x0 clip at (0,0) size 0x0 scrollHeight 18
  LayoutBlockFlow {DIV} at (0,0) size 20x4 [border: (1px solid #C0C0C0)]
    LayoutImage (floating) {IMG} at (2,2) size 16x16
layer at (203,646) size 0x0
  LayoutBlockFlow {DIV} at (18,2) size 0x0
layer at (205,644) size 100x4 backgroundClip at (0,0) size 0x0 clip at (0,0) size 0x0 scrollHeight 18
  LayoutBlockFlow {DIV} at (0,0) size 100x4 [border: (1px solid #C0C0C0)]
    LayoutImage (floating) {IMG} at (2,2) size 16x16
layer at (223,646) size 80x0
  LayoutBlockFlow {DIV} at (18,2) size 80x0
layer at (305,644) size 20x4 backgroundClip at (0,0) size 0x0 clip at (0,0) size 0x0 scrollHeight 18
  LayoutBlockFlow {DIV} at (0,0) size 20x4 [border: (1px solid #C0C0C0)]
    LayoutImage (floating) {IMG} at (2,2) size 16x16
layer at (323,646) size 0x0
  LayoutBlockFlow {DIV} at (18,2) size 0x0
layer at (325,644) size 20x4 backgroundClip at (0,0) size 0x0 clip at (0,0) size 0x0 scrollHeight 18
  LayoutBlockFlow {DIV} at (0,0) size 20x4 [border: (1px solid #C0C0C0)]
    LayoutImage (floating) {IMG} at (2,2) size 16x16
layer at (343,646) size 0x0
  LayoutBlockFlow {DIV} at (18,2) size 0x0
layer at (345,644) size 20x4 backgroundClip at (0,0) size 0x0 clip at (0,0) size 0x0 scrollHeight 18
  LayoutBlockFlow {DIV} at (0,0) size 20x4 [border: (1px solid #C0C0C0)]
    LayoutImage (floating) {IMG} at (2,2) size 16x16
layer at (363,646) size 0x0
  LayoutBlockFlow {DIV} at (18,2) size 0x0
layer at (365,644) size 100x4 backgroundClip at (0,0) size 0x0 clip at (0,0) size 0x0 scrollHeight 18
  LayoutBlockFlow {DIV} at (0,0) size 100x4 [border: (1px solid #C0C0C0)]
    LayoutImage (floating) {IMG} at (2,2) size 16x16
layer at (383,646) size 80x0
  LayoutBlockFlow {DIV} at (18,2) size 80x0
layer at (465,635) size 20x4 backgroundClip at (0,0) size 0x0 clip at (0,0) size 0x0 scrollHeight 18
  LayoutBlockFlow {DIV} at (0,0) size 20x4 [border: (1px solid #C0C0C0)]
    LayoutImage (floating) {IMG} at (2,2) size 16x16
layer at (483,637) size 0x0
  LayoutBlockFlow {DIV} at (18,2) size 0x0
layer at (485,644) size 20x4 backgroundClip at (0,0) size 0x0 clip at (0,0) size 0x0 scrollHeight 18
  LayoutBlockFlow {DIV} at (0,0) size 20x4 [border: (1px solid #C0C0C0)]
    LayoutImage (floating) {IMG} at (2,2) size 16x16
layer at (503,646) size 0x0
  LayoutBlockFlow {DIV} at (18,2) size 0x0
layer at (505,644) size 20x4 backgroundClip at (0,0) size 0x0 clip at (0,0) size 0x0 scrollHeight 18
  LayoutBlockFlow {DIV} at (0,0) size 20x4 [border: (1px solid #C0C0C0)]
    LayoutImage (floating) {IMG} at (2,2) size 16x16
layer at (523,646) size 0x0
  LayoutBlockFlow {DIV} at (18,2) size 0x0
layer at (525,644) size 100x4 backgroundClip at (0,0) size 0x0 clip at (0,0) size 0x0 scrollHeight 18
  LayoutBlockFlow {DIV} at (0,0) size 100x4 [border: (1px solid #C0C0C0)]
    LayoutImage (floating) {IMG} at (2,2) size 16x16
layer at (543,646) size 80x0
  LayoutBlockFlow {DIV} at (18,2) size 80x0
layer at (625,644) size 20x4 backgroundClip at (0,0) size 0x0 clip at (0,0) size 0x0 scrollHeight 18
  LayoutBlockFlow {DIV} at (0,0) size 20x4 [border: (1px solid #C0C0C0)]
    LayoutImage (floating) {IMG} at (2,2) size 16x16
layer at (643,646) size 0x0
  LayoutBlockFlow {DIV} at (18,2) size 0x0
