layer at (0,0) size 480x360
  LayoutView at (0,0) size 480x360
layer at (0,0) size 480x360
  LayoutSVGRoot {svg} at (0,0) size 480x360
    LayoutSVGText {text} at (63,19) size 354x20 contains 1 chunk(s)
      LayoutSVGInlineText {#text} at (0,0) size 353x20
        chunk 1 (middle anchor) text run 1 at (63.55,35.00) startOffset 0 endOffset 51 width 352.90: "Testing stroke inclusion for 'clip-path' and 'mask'"
    LayoutSVGHiddenContainer {defs} at (0,0) size 0x0
      LayoutSVGResourceClipper {clipPath} [id="one"] [clipPathUnits=objectBoundingBox]
        LayoutSVGEllipse {circle} at (0,0) size 2x2 [stroke={[type=SOLID] [color=#FF0000] [stroke width=0.15]}] [cx=0.30] [cy=0.50] [r=0.20]
        LayoutSVGEllipse {circle} at (0,0) size 1x1 [cx=0.70] [cy=0.50] [r=0.20]
    LayoutSVGRect {rect} at (155,45) size 175x110 [fill={[type=SOLID] [color=#00008B]}] [x=150.00] [y=0.00] [width=200.00] [height=200.00]
      [clipPath="one"] LayoutSVGResourceClipper {clipPath} at (155,45) size 175x110
    LayoutSVGText {text} at (50,96) size 115x17 contains 1 chunk(s)
      LayoutSVGInlineText {#text} at (0,0) size 115x17
        chunk 1 text run 1 at (50.00,110.00) startOffset 0 endOffset 19 width 114.17: "With a 'clip-path':"
    LayoutSVGHiddenContainer {defs} at (0,0) size 0x0
      LayoutSVGResourceMasker {mask} [id="two"] [maskUnits=objectBoundingBox] [maskContentUnits=objectBoundingBox]
        LayoutSVGEllipse {circle} at (0,0) size 2x2 [stroke={[type=SOLID] [color=#FF0000] [stroke width=0.15]}] [fill={[type=SOLID] [color=#0000FF]}] [cx=0.30] [cy=0.50] [r=0.20]
        LayoutSVGEllipse {circle} at (0,0) size 1x1 [fill={[type=SOLID] [color=#0000FF]}] [cx=0.70] [cy=0.50] [r=0.20]
    LayoutSVGRect {rect} at (155,195) size 175x110 [fill={[type=SOLID] [color=#00008B]}] [x=150.00] [y=150.00] [width=200.00] [height=200.00]
      [masker="two"] LayoutSVGResourceMasker {mask} at (155,195) size 175x110
    LayoutSVGText {text} at (50,246) size 92x17 contains 1 chunk(s)
      LayoutSVGInlineText {#text} at (0,0) size 92x17
        chunk 1 text run 1 at (50.00,260.00) startOffset 0 endOffset 14 width 91.08: "With a 'mask':"
    LayoutSVGText {text} at (10,304) size 264x45 contains 1 chunk(s)
      LayoutSVGInlineText {#text} at (0,0) size 264x45
        chunk 1 text run 1 at (10.00,340.00) startOffset 0 endOffset 16 width 263.34: "$Revision: 1.7 $"
    LayoutSVGRect {rect} at (0,0) size 480x360 [stroke={[type=SOLID] [color=#000000]}] [x=1.00] [y=1.00] [width=478.00] [height=358.00]
