{
  "bounds": [800, 600],
  "children": [
    {
      "bounds": [800, 600],
      "contentsOpaque": true,
      "drawsContent": true,
      "children": [
        {
          "position": [8, 8],
          "bounds": [202, 202],
          "drawsContent": true,
          "children": [
            {
              "position": [1, 1],
              "bounds": [185, 185],
              "children": [
                {
                  "bounds": [185, 1025],
                  "shouldFlattenTransform": false,
                  "drawsContent": true,
                  "children": [
                    {
                      "shouldFlattenTransform": false
                    }
                  ]
                }
              ]
            },
            {
              "children": [
                {
                  "position": [1, 186],
                  "bounds": [185, 15],
                  "drawsContent": true
                },
                {
                  "position": [186, 1],
                  "bounds": [15, 185],
                  "drawsContent": true,
                  "repaintRects": [
                    [0, 0, 15, 185],
                    [0, 0, 15, 185],
                    [0, 0, 15, 185]
                  ],
                  "paintInvalidationClients": [
                    "##ALL##",
                    "##ALL##",
                    "##ALL##"
                  ]
                },
                {
                  "position": [186, 186],
                  "bounds": [15, 15],
                  "drawsContent": true
                }
              ]
            }
          ]
        }
      ]
    }
  ]
}

