layer at (0,0) size 800x600
  LayoutView at (0,0) size 800x600
layer at (0,0) size 800x600
  LayoutSVGRoot {svg} at (0,0) size 800x600
    LayoutSVGContainer {g} at (8,6) size 785x530
      LayoutSVGText {text} at (5,4) size 471x45 contains 1 chunk(s)
        LayoutSVGInlineText {#text} at (0,0) size 471x45
          chunk 1 text run 1 at (5.00,40.00) startOffset 0 endOffset 29 width 470.40: "Test 'text-anchor' (vertical)"
      LayoutSVGContainer {g} at (252,79) size 196x457
        LayoutSVGContainer {g} at (252,79) size 196x457 [transform={m=((1.00,0.00)(0.00,1.00)) t=(160.00,150.00)}]
          LayoutSVGContainer {g} at (252,245) size 29x291
            LayoutSVGEllipse {circle} at (261,245) size 11x10 [fill={[type=SOLID] [color=#000000]}] [cx=0.00] [cy=0.00] [r=3.00]
            LayoutSVGText {text} at (-9,0) size 18x172 contains 1 chunk(s)
              LayoutSVGInlineText {#text} at (0,0) size 17x172
                chunk 1 (vertical) text run 1 at (-10.50,0.00) startOffset 0 endOffset 1 height 34.20: "s"
                chunk 1 (vertical) text run 2 at (-10.50,34.20) startOffset 1 endOffset 2 height 34.20: "t"
                chunk 1 (vertical) text run 3 at (-10.50,68.40) startOffset 2 endOffset 3 height 34.20: "a"
                chunk 1 (vertical) text run 4 at (-10.50,102.60) startOffset 3 endOffset 4 height 34.20: "r"
                chunk 1 (vertical) text run 5 at (-10.50,136.80) startOffset 4 endOffset 5 height 34.20: "t"
          LayoutSVGContainer {g} at (330,79) size 40x343 [transform={m=((1.00,0.00)(0.00,1.00)) t=(50.00,0.00)}]
            LayoutSVGEllipse {circle} at (345,245) size 10x10 [fill={[type=SOLID] [color=#000000]}] [cx=0.00] [cy=0.00] [r=3.00]
            LayoutSVGText {text} at (-12,-103) size 24x206 contains 1 chunk(s)
              LayoutSVGInlineText {#text} at (0,0) size 24x206
                chunk 1 (middle anchor, vertical) text run 1 at (-10.50,-102.60) startOffset 0 endOffset 1 height 34.20: "m"
                chunk 1 (middle anchor, vertical) text run 2 at (-10.50,-68.40) startOffset 1 endOffset 2 height 34.20: "i"
                chunk 1 (middle anchor, vertical) text run 3 at (-10.50,-34.20) startOffset 2 endOffset 3 height 34.20: "d"
                chunk 1 (middle anchor, vertical) text run 4 at (-10.50,0.00) startOffset 3 endOffset 4 height 34.20: "d"
                chunk 1 (middle anchor, vertical) text run 5 at (-10.50,34.20) startOffset 4 endOffset 5 height 34.20: "l"
                chunk 1 (middle anchor, vertical) text run 6 at (-10.50,68.40) startOffset 5 endOffset 6 height 34.20: "e"
          LayoutSVGContainer {g} at (419,79) size 29x176 [transform={m=((1.00,0.00)(0.00,1.00)) t=(100.00,0.00)}]
            LayoutSVGEllipse {circle} at (428,245) size 11x10 [fill={[type=SOLID] [color=#000000]}] [cx=0.00] [cy=0.00] [r=3.00]
            LayoutSVGText {text} at (-9,-103) size 18x104 contains 1 chunk(s)
              LayoutSVGInlineText {#text} at (0,0) size 17x103
                chunk 1 (end anchor, vertical) text run 1 at (-10.50,-102.60) startOffset 0 endOffset 1 height 34.20: "e"
                chunk 1 (end anchor, vertical) text run 2 at (-10.50,-68.40) startOffset 1 endOffset 2 height 34.20: "n"
                chunk 1 (end anchor, vertical) text run 3 at (-10.50,-34.20) startOffset 2 endOffset 3 height 34.20: "d"
    LayoutSVGText {text} at (10,304) size 266x46 contains 1 chunk(s)
      LayoutSVGInlineText {#text} at (0,0) size 266x46
        chunk 1 text run 1 at (10.00,340.00) startOffset 0 endOffset 16 width 265.80: "$Revision: 1.5 $"
    LayoutSVGRect {rect} at (0,0) size 800x600 [stroke={[type=SOLID] [color=#000000]}] [x=1.00] [y=1.00] [width=478.00] [height=358.00]
selection start: position 0 of child 0 {#text} of child 1 {text} of child 13 {g} of child 27 {svg} of document
selection end:   position 16 of child 0 {#text} of child 15 {text} of child 27 {svg} of document
