layer at (0,0) size 800x600 clip at (0,0) size 785x600 scrollHeight 1015
  LayoutView at (0,0) size 800x600
layer at (0,0) size 785x1015 backgroundClip at (0,0) size 785x600 clip at (0,0) size 785x600
  LayoutBlockFlow {HTML} at (0,0) size 785x1015
    LayoutBlockFlow {BODY} at (8,8) size 769x999 [bgcolor=#CCCCCC]
      LayoutBlockFlow {P} at (0,0) size 769x18
        LayoutText {#text} at (0,0) size 363x17
          text run at (0,0) width 363: "The style declarations which apply to the text below are:"
      LayoutBlockFlow {PRE} at (0,34) size 769x96
        LayoutText {#text} at (0,0) size 416x96
          text run at (0,0) width 400: ".zero {background-color: silver; padding-left: 0;}"
          text run at (400,0) width 0: " "
          text run at (0,16) width 408: ".one {padding-left: 0.5in; background-color: aqua;}"
          text run at (408,16) width 0: " "
          text run at (0,32) width 400: ".two {padding-left: 25px; background-color: aqua;}"
          text run at (400,32) width 0: " "
          text run at (0,48) width 408: ".three {padding-left: 5em; background-color: aqua;}"
          text run at (408,48) width 0: " "
          text run at (0,64) width 400: ".four {padding-left: 25%; background-color: aqua;}"
          text run at (400,64) width 0: " "
          text run at (0,80) width 416: ".five {padding-left: -20px; background-color: aqua;}"
          text run at (416,80) width 0: " "
      LayoutBlockFlow {HR} at (0,143) size 769x2 [border: (1px inset #EEEEEE)]
      LayoutBlockFlow {P} at (0,161) size 769x18 [bgcolor=#C0C0C0]
        LayoutText {#text} at (0,0) size 208x17
          text run at (0,0) width 208: "This element has a class of zero."
      LayoutBlockFlow {P} at (0,195) size 769x36 [bgcolor=#00FFFF]
        LayoutText {#text} at (48,0) size 702x35
          text run at (48,0) width 647: "This element should have a left padding of half an inch, which will require extra text in order to test. "
          text run at (694,0) width 56: "Both the"
          text run at (48,18) width 413: "content background and the padding should be aqua (light blue)."
      LayoutBlockFlow {P} at (0,247) size 769x36 [bgcolor=#00FFFF]
        LayoutText {#text} at (25,0) size 736x35
          text run at (25,0) width 630: "This element should have a left padding of 25 pixels, which will require extra text in order to test. "
          text run at (654,0) width 107: "Both the content"
          text run at (25,18) width 362: "background and the padding should be aqua (light blue)."
      LayoutBlockFlow {P} at (0,299) size 769x36 [bgcolor=#00FFFF]
        LayoutText {#text} at (80,0) size 654x35
          text run at (80,0) width 599: "This element should have a left padding of 5em, which will require extra text in order to test. "
          text run at (678,0) width 56: "Both the"
          text run at (80,18) width 413: "content background and the padding should be aqua (light blue)."
      LayoutBlockFlow {P} at (0,351) size 769x54 [bgcolor=#00FFFF]
        LayoutText {#text} at (192,0) size 576x53
          text run at (192,0) width 560: "This element should have a left padding of 25%, which is calculated with respect to the"
          text run at (192,18) width 185: "width of the parent element. "
          text run at (376,18) width 392: "Both the content background and the padding should be aqua"
          text run at (192,36) width 76: "(light blue)."
      LayoutBlockFlow {UL} at (0,421) size 769x72 [bgcolor=#808080]
        LayoutListItem {LI} at (25,0) size 744x18
          LayoutListMarker (anonymous) at (-17,0) size 7x17: bullet
          LayoutText {#text} at (0,0) size 732x17
            text run at (0,0) width 732: "The left padding on this unordered list has been set to 25 pixels, which will require some extra test in order to test."
        LayoutListItem {LI} at (25,18) size 744x54 [bgcolor=#FFFFFF]
          LayoutListMarker (anonymous) at (-17,0) size 7x17: bullet
          LayoutText {#text} at (25,0) size 714x53
            text run at (25,0) width 670: "Another list item might not be such a bad idea, either, considering that such things do need to be double-"
            text run at (25,18) width 61: "checked. "
            text run at (85,18) width 654: "This list item has its left padding also set to 25 pixels, which should combine with the list's padding to"
            text run at (25,36) width 168: "make 50 pixels of margin."
      LayoutBlockFlow {P} at (0,509) size 769x36 [bgcolor=#00FFFF]
        LayoutText {#text} at (0,0) size 761x35
          text run at (0,0) width 575: "This element should have no left padding, since negative padding values are not allowed. "
          text run at (574,0) width 187: "Both the content background"
          text run at (0,18) width 332: "and the normal padding should be aqua (light blue)."
      LayoutTable {TABLE} at (0,561) size 769x438 [border: (1px outset #808080)]
        LayoutTableSection {TBODY} at (1,1) size 767x436
          LayoutTableRow {TR} at (0,0) size 767x26
            LayoutTableCell {TD} at (0,0) size 767x26 [bgcolor=#C0C0C0] [border: (1px inset #808080)] [r=0 c=0 rs=1 cs=2]
              LayoutInline {STRONG} at (0,0) size 163x17
                LayoutText {#text} at (4,4) size 163x17
                  text run at (4,4) width 163: "TABLE Testing Section"
          LayoutTableRow {TR} at (0,26) size 767x410
            LayoutTableCell {TD} at (0,218) size 12x26 [bgcolor=#C0C0C0] [border: (1px inset #808080)] [r=1 c=0 rs=1 cs=1]
              LayoutText {#text} at (4,4) size 4x17
                text run at (4,4) width 4: " "
            LayoutTableCell {TD} at (12,26) size 755x410 [border: (1px inset #808080)] [r=1 c=1 rs=1 cs=1]
              LayoutBlockFlow {P} at (4,4) size 747x18 [bgcolor=#C0C0C0]
                LayoutText {#text} at (0,0) size 208x17
                  text run at (0,0) width 208: "This element has a class of zero."
              LayoutBlockFlow {P} at (4,38) size 747x36 [bgcolor=#00FFFF]
                LayoutText {#text} at (48,0) size 679x35
                  text run at (48,0) width 647: "This element should have a left padding of half an inch, which will require extra text in order to test. "
                  text run at (694,0) width 33: "Both"
                  text run at (48,18) width 436: "the content background and the padding should be aqua (light blue)."
              LayoutBlockFlow {P} at (4,90) size 747x36 [bgcolor=#00FFFF]
                LayoutText {#text} at (25,0) size 685x35
                  text run at (25,0) width 630: "This element should have a left padding of 25 pixels, which will require extra text in order to test. "
                  text run at (654,0) width 56: "Both the"
                  text run at (25,18) width 413: "content background and the padding should be aqua (light blue)."
              LayoutBlockFlow {P} at (4,142) size 747x36 [bgcolor=#00FFFF]
                LayoutText {#text} at (80,0) size 654x35
                  text run at (80,0) width 599: "This element should have a left padding of 5em, which will require extra text in order to test. "
                  text run at (678,0) width 56: "Both the"
                  text run at (80,18) width 413: "content background and the padding should be aqua (light blue)."
              LayoutBlockFlow {P} at (4,194) size 747x54 [bgcolor=#00FFFF]
                LayoutText {#text} at (186,0) size 560x53
                  text run at (186,0) width 560: "This element should have a left padding of 25%, which is calculated with respect to the"
                  text run at (186,18) width 185: "width of the parent element. "
                  text run at (370,18) width 358: "Both the content background and the padding should be"
                  text run at (186,36) width 111: "aqua (light blue)."
              LayoutBlockFlow {UL} at (4,264) size 747x90 [bgcolor=#808080]
                LayoutListItem {LI} at (25,0) size 722x36
                  LayoutListMarker (anonymous) at (-17,0) size 7x17: bullet
                  LayoutText {#text} at (0,0) size 702x35
                    text run at (0,0) width 702: "The left padding on this unordered list has been set to 25 pixels, which will require some extra test in order to"
                    text run at (0,18) width 27: "test."
                LayoutListItem {LI} at (25,36) size 722x54 [bgcolor=#FFFFFF]
                  LayoutListMarker (anonymous) at (-17,0) size 7x17: bullet
                  LayoutText {#text} at (25,0) size 670x53
                    text run at (25,0) width 670: "Another list item might not be such a bad idea, either, considering that such things do need to be double-"
                    text run at (25,18) width 61: "checked. "
                    text run at (85,18) width 582: "This list item has its left padding also set to 25 pixels, which should combine with the list's"
                    text run at (25,36) width 240: "padding to make 50 pixels of margin."
              LayoutBlockFlow {P} at (4,370) size 747x36 [bgcolor=#00FFFF]
                LayoutText {#text} at (0,0) size 681x35
                  text run at (0,0) width 575: "This element should have no left padding, since negative padding values are not allowed. "
                  text run at (574,0) width 107: "Both the content"
                  text run at (0,18) width 411: "background and the normal padding should be aqua (light blue)."
