layer at (0,0) size 800x600
  LayoutView at (0,0) size 800x600
layer at (0,0) size 800x346
  LayoutBlockFlow {html} at (0,0) size 800x346
    LayoutBlockFlow {body} at (8,16) size 784x322
      LayoutBlockFlow {p} at (0,0) size 784x18
        LayoutText {#text} at (0,0) size 204x18
          text run at (0,0) width 204: "TFOOT VALIGN=BASELINE"
      LayoutTable {table} at (0,34) size 784x288 [border: (1px outset #808080)]
        LayoutTableSection {thead} at (1,1) size 782x26
          LayoutTableRow {tr} at (0,2) size 782x22
            LayoutTableCell {td} at (2,2) size 217x22 [border: (1px inset #808080)] [r=0 c=0 rs=1 cs=1]
              LayoutText {#text} at (2,2) size 55x18
                text run at (2,2) width 55: "THEAD"
            LayoutTableCell {td} at (221,2) size 559x22 [border: (1px inset #808080)] [r=0 c=1 rs=1 cs=1]
              LayoutText {#text} at (2,2) size 55x18
                text run at (2,2) width 55: "THEAD"
        LayoutTableSection {tfoot} at (1,51) size 782x236
          LayoutTableRow {tr} at (0,0) size 782x234
            LayoutTableCell {td} at (2,22) size 217x94 [border: (1px inset #808080)] [r=0 c=0 rs=1 cs=1]
              LayoutText {#text} at (2,2) size 213x90
                text run at (2,2) width 210: "Compare the baseline of the first"
                text run at (2,20) width 144: "line of text in this cell "
                text run at (145,20) width 53: "with the"
                text run at (2,38) width 213: "baseline of the first line of text in"
                text run at (2,56) width 119: "the next cell: they "
                text run at (120,56) width 62: "should be"
                text run at (2,74) width 112: "vertically aligned"
            LayoutTableCell {td} at (221,0) size 559x234 [border: (1px inset #808080)] [r=0 c=1 rs=1 cs=1]
              LayoutText {#text} at (2,2) size 533x230
                text run at (2,2) width 524: "Compare the baseline of the first"
                text run at (2,48) width 70: "line "
                text run at (71,48) width 421: "of text in this cell with the"
                text run at (2,94) width 533: "baseline of the first line of text in"
                text run at (2,140) width 519: "the previous cell: they should be"
                text run at (2,186) width 279: "vertically aligned"
        LayoutTableSection {tbody} at (1,27) size 782x24
          LayoutTableRow {tr} at (0,0) size 782x22
            LayoutTableCell {td} at (2,0) size 217x22 [border: (1px inset #808080)] [r=0 c=0 rs=1 cs=1]
              LayoutText {#text} at (2,2) size 56x18
                text run at (2,2) width 56: "TBODY"
            LayoutTableCell {td} at (221,0) size 559x22 [border: (1px inset #808080)] [r=0 c=1 rs=1 cs=1]
              LayoutText {#text} at (2,2) size 56x18
                text run at (2,2) width 56: "TBODY"
