layer at (0,0) size 800x600
  LayoutView at (0,0) size 800x600
layer at (0,0) size 800x600
  LayoutBlockFlow {HTML} at (0,0) size 800x600
    LayoutFrameSet {FRAMESET} at (0,0) size 800x600
      LayoutFrameSet {FRAMESET} at (0,0) size 800x500
        LayoutFrameSet {FRAMESET} at (0,0) size 74x500
        LayoutFrameSet {FRAMESET} at (80,0) size 74x500
        LayoutFrameSet {FRAMESET} at (160,0) size 74x500
        LayoutFrameSet {FRAMESET} at (240,0) size 74x500
        LayoutFrameSet {FRAMESET} at (320,0) size 74x500
        LayoutFrameSet {FRAMESET} at (400,0) size 74x500
        LayoutFrameSet {FRAMESET} at (480,0) size 74x500
        LayoutFrameSet {FRAMESET} at (560,0) size 74x500
        LayoutFrameSet {FRAMESET} at (640,0) size 74x500
        LayoutFrameSet {FRAMESET} at (720,0) size 80x500
layer at (0,0) size 74x500
  LayoutFrame {FRAME} at (0,0) size 74x500
    layer at (0,0) size 74x500
      LayoutView at (0,0) size 74x500
    layer at (0,0) size 74x500
      LayoutBlockFlow {HTML} at (0,0) size 74x500
        LayoutBlockFlow {BODY} at (8,8) size 58x484
layer at (80,0) size 74x500
  LayoutFrame {FRAME} at (0,0) size 74x500
    layer at (0,0) size 74x500
      LayoutView at (0,0) size 74x500
    layer at (0,0) size 74x500
      LayoutBlockFlow {HTML} at (0,0) size 74x500
        LayoutBlockFlow {BODY} at (8,8) size 58x484
layer at (160,0) size 74x500
  LayoutFrame {FRAME} at (0,0) size 74x500
    layer at (0,0) size 74x500
      LayoutView at (0,0) size 74x500
    layer at (0,0) size 74x500
      LayoutBlockFlow {HTML} at (0,0) size 74x500
        LayoutBlockFlow {BODY} at (8,8) size 58x484
layer at (240,0) size 74x500
  LayoutFrame {FRAME} at (0,0) size 74x500
    layer at (0,0) size 74x500
      LayoutView at (0,0) size 74x500
    layer at (0,0) size 74x500
      LayoutBlockFlow {HTML} at (0,0) size 74x500
        LayoutBlockFlow {BODY} at (8,8) size 58x484
layer at (320,0) size 74x247
  LayoutFrame {FRAME} at (0,0) size 74x247
    layer at (0,0) size 74x247
      LayoutView at (0,0) size 74x247
    layer at (0,0) size 74x247
      LayoutBlockFlow {HTML} at (0,0) size 74x247
        LayoutBlockFlow {BODY} at (8,8) size 58x231
layer at (320,253) size 74x247
  LayoutFrame {FRAME} at (0,253) size 74x247
    layer at (0,0) size 74x247
      LayoutView at (0,0) size 74x247
    layer at (0,0) size 74x247
      LayoutBlockFlow {HTML} at (0,0) size 74x247
        LayoutBlockFlow {BODY} at (8,8) size 58x231
layer at (400,0) size 74x247
  LayoutFrame {FRAME} at (0,0) size 74x247
    layer at (0,0) size 74x247
      LayoutView at (0,0) size 74x247
    layer at (0,0) size 74x247
      LayoutBlockFlow {HTML} at (0,0) size 74x247
        LayoutBlockFlow {BODY} at (8,8) size 58x231
layer at (400,253) size 74x247
  LayoutFrame {FRAME} at (0,253) size 74x247
    layer at (0,0) size 74x247
      LayoutView at (0,0) size 74x247
    layer at (0,0) size 74x247
      LayoutBlockFlow {HTML} at (0,0) size 74x247
        LayoutBlockFlow {BODY} at (8,8) size 58x231
layer at (480,0) size 74x395
  LayoutFrame {FRAME} at (0,0) size 74x395
    layer at (0,0) size 74x395
      LayoutView at (0,0) size 74x395
    layer at (0,0) size 74x395
      LayoutBlockFlow {HTML} at (0,0) size 74x395
        LayoutBlockFlow {BODY} at (8,8) size 58x379
layer at (480,401) size 74x99
  LayoutFrame {FRAME} at (0,401) size 74x99
    layer at (0,0) size 74x99
      LayoutView at (0,0) size 74x99
    layer at (0,0) size 74x99
      LayoutBlockFlow {HTML} at (0,0) size 74x99
        LayoutBlockFlow {BODY} at (8,8) size 58x83
layer at (560,0) size 74x197
  LayoutFrame {FRAME} at (0,0) size 74x197
    layer at (0,0) size 74x197
      LayoutView at (0,0) size 74x197
    layer at (0,0) size 74x197
      LayoutBlockFlow {HTML} at (0,0) size 74x197
        LayoutBlockFlow {BODY} at (8,8) size 58x181
layer at (560,203) size 74x297
  LayoutFrame {FRAME} at (0,203) size 74x297
    layer at (0,0) size 74x297
      LayoutView at (0,0) size 74x297
    layer at (0,0) size 74x297
      LayoutBlockFlow {HTML} at (0,0) size 74x297
        LayoutBlockFlow {BODY} at (8,8) size 58x281
layer at (640,0) size 74x488
  LayoutFrame {FRAME} at (0,0) size 74x488
    layer at (0,0) size 74x488
      LayoutView at (0,0) size 74x488
    layer at (0,0) size 74x488
      LayoutBlockFlow {HTML} at (0,0) size 74x488
        LayoutBlockFlow {BODY} at (8,8) size 58x472
layer at (720,0) size 80x244
  LayoutFrame {FRAME} at (0,0) size 80x244
    layer at (0,0) size 80x244
      LayoutView at (0,0) size 80x244
    layer at (0,0) size 80x244
      LayoutBlockFlow {HTML} at (0,0) size 80x244
        LayoutBlockFlow {BODY} at (8,8) size 64x228
layer at (720,250) size 80x81
  LayoutFrame {FRAME} at (0,250) size 80x81
    layer at (0,0) size 80x81
      LayoutView at (0,0) size 80x81
    layer at (0,0) size 80x81
      LayoutBlockFlow {HTML} at (0,0) size 80x81
        LayoutBlockFlow {BODY} at (8,8) size 64x65
layer at (720,337) size 80x163
  LayoutFrame {FRAME} at (0,337) size 80x163
    layer at (0,0) size 80x163
      LayoutView at (0,0) size 80x163
    layer at (0,0) size 80x163
      LayoutBlockFlow {HTML} at (0,0) size 80x163
        LayoutBlockFlow {BODY} at (8,8) size 64x147
layer at (0,506) size 800x94
  LayoutFrame {FRAME} at (0,506) size 800x94
    layer at (0,0) size 800x94
      LayoutView at (0,0) size 800x94
    layer at (0,0) size 800x94
      LayoutBlockFlow {HTML} at (0,0) size 800x94
        LayoutBlockFlow {BODY} at (8,8) size 784x78
