{
  "bounds": [800, 600],
  "children": [
    {
      "bounds": [800, 600],
      "contentsOpaque": true,
      "drawsContent": true,
      "paintInvalidationClients": [
        "LayoutBlockFlow HTML",
        "LayoutBlockFlow BODY"
      ],
      "children": [
        {
          "position": [8, 8],
          "bounds": [200, 200],
          "contentsOpaque": true,
          "drawsContent": true,
          "backgroundColor": "#D3D3D3",
          "repaintRects": [
            [0, 160, 23, 18]
          ],
          "paintInvalidationClients": [
            "LayoutBlockFlow DIV id='scroller'",
            "LayoutBlockFlow DIV id='target'",
            "LayoutText #text",
            "InlineTextBox 'test'"
          ],
          "children": [
            {
              "bounds": [185, 185],
              "children": [
                {
                  "bounds": [200, 1620],
                  "shouldFlattenTransform": false,
                  "drawsContent": true,
                  "repaintRects": [
                    [0, 610, 23, 18]
                  ],
                  "paintInvalidationClients": [
                    "LayoutBlockFlow DIV id='scroller'",
                    "LayoutBlockFlow DIV id='target'",
                    "LayoutText #text",
                    "InlineTextBox 'test'"
                  ],
                  "children": [
                    {
                      "shouldFlattenTransform": false
                    }
                  ]
                }
              ]
            },
            {
              "children": [
                {
                  "position": [0, 185],
                  "bounds": [185, 15]
                },
                {
                  "position": [185, 0],
                  "bounds": [15, 185]
                },
                {
                  "position": [185, 185],
                  "bounds": [15, 15],
                  "drawsContent": true
                }
              ]
            }
          ]
        }
      ]
    }
  ]
}

