{
  "bounds": [800, 600],
  "children": [
    {
      "bounds": [800, 600],
      "contentsOpaque": true,
      "drawsContent": true,
      "children": [
        {
          "position": [8, 57],
          "bounds": [200, 200],
          "drawsContent": true,
          "repaintRects": [
            [0, 0, 47, 615]
          ],
          "paintInvalidationClients": [
            "LayoutText #text",
            "InlineTextBox '  Text'",
            "InlineTextBox '\n'",
            "InlineTextBox '  Text'",
            "InlineTextBox '\n'",
            "InlineTextBox '  Text'",
            "InlineTextBox '\n'",
            "InlineTextBox '  Text'",
            "InlineTextBox '\n'",
            "InlineTextBox '  Text'",
            "InlineTextBox '\n'",
            "InlineTextBox '  Text'",
            "InlineTextBox '\n'",
            "InlineTextBox '  Text'",
            "InlineTextBox '\n'",
            "InlineTextBox '  Text'",
            "InlineTextBox '\n'",
            "InlineTextBox '  Text'",
            "InlineTextBox '\n'",
            "InlineTextBox '  Text'",
            "InlineTextBox '\n'",
            "InlineTextBox '  Text'",
            "InlineTextBox '\n'",
            "InlineTextBox '  Text'",
            "InlineTextBox '\n'",
            "InlineTextBox '  Text'",
            "InlineTextBox '\n'",
            "InlineTextBox '  Text'",
            "InlineTextBox '\n'",
            "InlineTextBox '  Text'",
            "InlineTextBox '\n'",
            "InlineTextBox '  Text'",
            "InlineTextBox '\n'",
            "InlineTextBox '  Text'",
            "InlineTextBox '\n'",
            "InlineTextBox '  Text'",
            "InlineTextBox '\n'",
            "InlineTextBox '  Text'",
            "InlineTextBox '\n'",
            "InlineTextBox '  Text'",
            "InlineTextBox '\n'",
            "InlineTextBox '  Text'",
            "InlineTextBox '\n'",
            "InlineTextBox '  Text'",
            "InlineTextBox '\n'",
            "InlineTextBox '  Text'",
            "InlineTextBox '\n'",
            "InlineTextBox '  Text'",
            "InlineTextBox '\n'",
            "InlineTextBox '  Text'",
            "InlineTextBox '\n'",
            "InlineTextBox '  Text'",
            "InlineTextBox '\n'",
            "InlineTextBox '  Text'",
            "InlineTextBox '\n'",
            "InlineTextBox '  Text'",
            "InlineTextBox '\n'",
            "InlineTextBox '  Text'",
            "InlineTextBox '\n'",
            "InlineTextBox '  Text'",
            "InlineTextBox '\n'",
            "InlineTextBox '  Text'",
            "InlineTextBox '\n'",
            "InlineTextBox '  Text'",
            "InlineTextBox '\n'",
            "InlineTextBox '  Text'",
            "InlineTextBox '\n'",
            "InlineTextBox '  Text'",
            "InlineTextBox '\n'",
            "InlineTextBox '  Text'",
            "InlineTextBox '\n'",
            "InlineTextBox '  Text'",
            "InlineTextBox '\n'",
            "InlineTextBox '  Text'",
            "InlineTextBox '\n'",
            "InlineTextBox '  Text'",
            "InlineTextBox '\n'",
            "InlineTextBox '  Text'",
            "InlineTextBox '\n'",
            "InlineTextBox '  Text'",
            "InlineTextBox '\n'",
            "InlineTextBox '  Text'",
            "InlineTextBox '\n'"
          ],
          "children": [
            {
              "bounds": [185, 185],
              "children": [
                {
                  "bounds": [185, 615],
                  "shouldFlattenTransform": false,
                  "drawsContent": true,
                  "repaintRects": [
                    [0, 0, 47, 615]
                  ],
                  "paintInvalidationClients": [
                    "LayoutText #text",
                    "InlineTextBox '  Text'",
                    "InlineTextBox '\n'",
                    "InlineTextBox '  Text'",
                    "InlineTextBox '\n'",
                    "InlineTextBox '  Text'",
                    "InlineTextBox '\n'",
                    "InlineTextBox '  Text'",
                    "InlineTextBox '\n'",
                    "InlineTextBox '  Text'",
                    "InlineTextBox '\n'",
                    "InlineTextBox '  Text'",
                    "InlineTextBox '\n'",
                    "InlineTextBox '  Text'",
                    "InlineTextBox '\n'",
                    "InlineTextBox '  Text'",
                    "InlineTextBox '\n'",
                    "InlineTextBox '  Text'",
                    "InlineTextBox '\n'",
                    "InlineTextBox '  Text'",
                    "InlineTextBox '\n'",
                    "InlineTextBox '  Text'",
                    "InlineTextBox '\n'",
                    "InlineTextBox '  Text'",
                    "InlineTextBox '\n'",
                    "InlineTextBox '  Text'",
                    "InlineTextBox '\n'",
                    "InlineTextBox '  Text'",
                    "InlineTextBox '\n'",
                    "InlineTextBox '  Text'",
                    "InlineTextBox '\n'",
                    "InlineTextBox '  Text'",
                    "InlineTextBox '\n'",
                    "InlineTextBox '  Text'",
                    "InlineTextBox '\n'",
                    "InlineTextBox '  Text'",
                    "InlineTextBox '\n'",
                    "InlineTextBox '  Text'",
                    "InlineTextBox '\n'",
                    "InlineTextBox '  Text'",
                    "InlineTextBox '\n'",
                    "InlineTextBox '  Text'",
                    "InlineTextBox '\n'",
                    "InlineTextBox '  Text'",
                    "InlineTextBox '\n'",
                    "InlineTextBox '  Text'",
                    "InlineTextBox '\n'",
                    "InlineTextBox '  Text'",
                    "InlineTextBox '\n'",
                    "InlineTextBox '  Text'",
                    "InlineTextBox '\n'",
                    "InlineTextBox '  Text'",
                    "InlineTextBox '\n'",
                    "InlineTextBox '  Text'",
                    "InlineTextBox '\n'",
                    "InlineTextBox '  Text'",
                    "InlineTextBox '\n'",
                    "InlineTextBox '  Text'",
                    "InlineTextBox '\n'",
                    "InlineTextBox '  Text'",
                    "InlineTextBox '\n'",
                    "InlineTextBox '  Text'",
                    "InlineTextBox '\n'",
                    "InlineTextBox '  Text'",
                    "InlineTextBox '\n'",
                    "InlineTextBox '  Text'",
                    "InlineTextBox '\n'",
                    "InlineTextBox '  Text'",
                    "InlineTextBox '\n'",
                    "InlineTextBox '  Text'",
                    "InlineTextBox '\n'",
                    "InlineTextBox '  Text'",
                    "InlineTextBox '\n'",
                    "InlineTextBox '  Text'",
                    "InlineTextBox '\n'",
                    "InlineTextBox '  Text'",
                    "InlineTextBox '\n'",
                    "InlineTextBox '  Text'",
                    "InlineTextBox '\n'",
                    "InlineTextBox '  Text'",
                    "InlineTextBox '\n'",
                    "InlineTextBox '  Text'",
                    "InlineTextBox '\n'"
                  ],
                  "children": [
                    {
                      "shouldFlattenTransform": false
                    }
                  ]
                }
              ]
            },
            {
              "children": [
                {
                  "position": [0, 185],
                  "bounds": [185, 15],
                  "drawsContent": true
                },
                {
                  "position": [185, 0],
                  "bounds": [15, 185],
                  "drawsContent": true
                },
                {
                  "position": [185, 185],
                  "bounds": [15, 15],
                  "drawsContent": true
                }
              ]
            }
          ]
        }
      ]
    }
  ]
}

