layer at (0,0) size 480x360
  LayoutView at (0,0) size 480x360
layer at (0,0) size 480x360
  LayoutSVGRoot {svg} at (0,0) size 480x360
    LayoutSVGContainer {g} at (98,1) size 312x334
      LayoutSVGHiddenContainer {defs} at (0,0) size 0x0
      LayoutSVGText {text} at (98,1) size 284x31 contains 1 chunk(s)
        LayoutSVGInlineText {#text} at (0,0) size 132x31
          chunk 1 (middle anchor) text run 1 at (98.10,25.00) startOffset 0 endOffset 12 width 131.42: "Text Cursor "
        LayoutSVGInline {a} at (0,0) size 153x31
          LayoutSVGInlineText {#text} at (131,0) size 153x31
            chunk 1 (middle anchor) text run 1 at (229.52,25.00) startOffset 0 endOffset 14 width 152.38: "Pointer Cursor"
        LayoutSVGInlineText {#text} at (0,0) size 0x0
      LayoutSVGRect {rect} at (118,38) size 244x240 [stroke={[type=SOLID] [color=#666666] [stroke width=3.00]}] [x=120.00] [y=40.00] [width=240.00] [height=236.00]
      LayoutSVGContainer {g} at (148,70) size 184x176
        LayoutSVGContainer {g} at (148,70) size 80x32
          LayoutSVGRect {rect} at (148,70) size 80x32 [fill={[type=SOLID] [color=#666666]}] [x=148.00] [y=70.00] [width=80.00] [height=32.00]
          LayoutSVGText {text} at (154,74) size 70x20 contains 1 chunk(s)
            LayoutSVGInlineText {#text} at (0,0) size 70x20
              chunk 1 text run 1 at (154.00,90.00) startOffset 0 endOffset 9 width 69.02: "crosshair"
        LayoutSVGContainer {g} at (148,118) size 80x32
          LayoutSVGRect {rect} at (148,118) size 80x32 [fill={[type=SOLID] [color=#666666]}] [x=148.00] [y=118.00] [width=80.00] [height=32.00]
          LayoutSVGText {text} at (154,122) size 55x20 contains 1 chunk(s)
            LayoutSVGInlineText {#text} at (0,0) size 55x20
              chunk 1 text run 1 at (154.00,138.00) startOffset 0 endOffset 7 width 54.13: "default"
        LayoutSVGContainer {g} at (148,166) size 80x32
          LayoutSVGRect {rect} at (148,166) size 80x32 [fill={[type=SOLID] [color=#666666]}] [x=148.00] [y=166.00] [width=80.00] [height=32.00]
          LayoutSVGText {text} at (154,170) size 55x20 contains 1 chunk(s)
            LayoutSVGInlineText {#text} at (0,0) size 55x20
              chunk 1 text run 1 at (154.00,186.00) startOffset 0 endOffset 7 width 54.91: "pointer"
        LayoutSVGContainer {g} at (148,214) size 80x32
          LayoutSVGRect {rect} at (148,214) size 80x32 [fill={[type=SOLID] [color=#666666]}] [x=148.00] [y=214.00] [width=80.00] [height=32.00]
          LayoutSVGText {text} at (154,219) size 43x20 contains 1 chunk(s)
            LayoutSVGInlineText {#text} at (0,0) size 43x20
              chunk 1 text run 1 at (154.00,235.00) startOffset 0 endOffset 4 width 42.24: "move"
        LayoutSVGContainer {g} at (252,70) size 80x32
          LayoutSVGRect {rect} at (252,70) size 80x32 [fill={[type=SOLID] [color=#666666]}] [x=252.00] [y=70.00] [width=80.00] [height=32.00]
          LayoutSVGText {text} at (258,74) size 32x20 contains 1 chunk(s)
            LayoutSVGInlineText {#text} at (0,0) size 32x20
              chunk 1 text run 1 at (258.00,90.00) startOffset 0 endOffset 4 width 31.88: "text"
        LayoutSVGContainer {g} at (252,118) size 80x32
          LayoutSVGRect {rect} at (252,118) size 80x32 [fill={[type=SOLID] [color=#666666]}] [x=252.00] [y=118.00] [width=80.00] [height=32.00]
          LayoutSVGText {text} at (258,122) size 33x20 contains 1 chunk(s)
            LayoutSVGInlineText {#text} at (0,0) size 33x20
              chunk 1 text run 1 at (258.00,138.00) startOffset 0 endOffset 4 width 32.19: "wait"
        LayoutSVGContainer {g} at (252,166) size 80x32
          LayoutSVGRect {rect} at (252,166) size 80x32 [fill={[type=SOLID] [color=#666666]}] [x=252.00] [y=166.00] [width=80.00] [height=32.00]
          LayoutSVGText {text} at (258,170) size 32x20 contains 1 chunk(s)
            LayoutSVGInlineText {#text} at (0,0) size 32x20
              chunk 1 text run 1 at (258.00,186.00) startOffset 0 endOffset 4 width 31.94: "help"
        LayoutSVGContainer {g} at (252,214) size 80x32
          LayoutSVGRect {rect} at (252,214) size 80x32 [fill={[type=SOLID] [color=#666666]}] [x=252.00] [y=214.00] [width=80.00] [height=32.00]
          LayoutSVGText {text} at (258,219) size 41x20 contains 1 chunk(s)
            LayoutSVGInlineText {#text} at (0,0) size 41x20
              chunk 1 text run 1 at (258.00,235.00) startOffset 0 endOffset 5 width 40.60: "<url>"
      LayoutSVGContainer {g} at (115,35) size 250x246
        LayoutSVGPath {polygon} at (115,35) size 35x35 [stroke={[type=SOLID] [color=#000000]}] [fill={[type=SOLID] [color=#990000]}] [points="116 36 116 68 148 36"]
        LayoutSVGPath {polygon} at (330,35) size 35x35 [stroke={[type=SOLID] [color=#000000]}] [fill={[type=SOLID] [color=#990000]}] [points="364 36 364 68 332 36"]
        LayoutSVGPath {polygon} at (330,246) size 35x35 [stroke={[type=SOLID] [color=#000000]}] [fill={[type=SOLID] [color=#990000]}] [points="364 280 332 280 364 248"]
        LayoutSVGPath {polygon} at (115,246) size 35x35 [stroke={[type=SOLID] [color=#000000]}] [fill={[type=SOLID] [color=#990000]}] [points="116 280 148 280 116 248"]
        LayoutSVGPath {polygon} at (339,132) size 26x52 [stroke={[type=SOLID] [color=#000000]}] [fill={[type=SOLID] [color=#990000]}] [points="340 134 340 182 364 158"]
        LayoutSVGPath {polygon} at (115,132) size 26x52 [stroke={[type=SOLID] [color=#000000]}] [fill={[type=SOLID] [color=#990000]}] [points="116 158 140 134 140 182"]
        LayoutSVGPath {polygon} at (212,35) size 54x29 [stroke={[type=SOLID] [color=#000000]}] [fill={[type=SOLID] [color=#990000]}] [points="240 36 264 63.3 214 63.3"]
        LayoutSVGPath {polygon} at (212,252) size 54x29 [stroke={[type=SOLID] [color=#000000]}] [fill={[type=SOLID] [color=#990000]}] [points="240 280 264 252.7 214 252.7"]
      LayoutSVGContainer {g} at (370,295) size 40x40
        LayoutSVGEllipse {circle} at (374,299) size 32x32 [fill={[type=SOLID] [color=#FFFFCC]}] [cx=390.00] [cy=315.00] [r=16.00]
        LayoutSVGPath {polyline} at (389,295) size 2x40 [stroke={[type=SOLID] [color=#000000]}] [fill={[type=SOLID] [color=#000000]}] [points="390 295 390 335"]
        LayoutSVGPath {polyline} at (370,314) size 40x2 [stroke={[type=SOLID] [color=#000000]}] [fill={[type=SOLID] [color=#000000]}] [points="370 315 410 315"]
        LayoutSVGEllipse {circle} at (384,309) size 12x12 [fill={[type=SOLID] [color=#FFFFFF]}] [cx=390.00] [cy=315.00] [r=6.00]
        LayoutSVGContainer {a} at (388,313) size 4x4
          LayoutSVGEllipse {circle} at (388,313) size 4x4 [fill={[type=SOLID] [color=#000000]}] [cx=390.00] [cy=315.00] [r=2.00]
    LayoutSVGText {text} at (10,304) size 264x46 contains 1 chunk(s)
      LayoutSVGInlineText {#text} at (0,0) size 264x46
        chunk 1 text run 1 at (10.00,340.00) startOffset 0 endOffset 16 width 263.34: "$Revision: 1.1 $"
    LayoutSVGRect {rect} at (0,0) size 480x360 [stroke={[type=SOLID] [color=#000000]}] [x=1.00] [y=1.00] [width=478.00] [height=358.00]
