layer at (0,0) size 480x360
  LayoutView at (0,0) size 480x360
layer at (0,0) size 480x360
  LayoutSVGRoot {svg} at (0,0) size 480x360
    LayoutSVGHiddenContainer {defs} at (0,0) size 0x0
    LayoutSVGContainer {g} at (10,13) size 430x278
      LayoutSVGText {text} at (10,13) size 302x21 contains 1 chunk(s)
        LayoutSVGInlineText {#text} at (0,0) size 302x21
          chunk 1 text run 1 at (10.00,30.00) startOffset 0 endOffset 35 width 301.11: "Testing liveness of SVG DOM objects"
      LayoutSVGContainer {g} at (90,40) size 350x251 [transform={m=((0.00,1.00)(-1.00,0.00)) t=(500.00,0.00)}]
        LayoutSVGRect {rect} at (420,40) size 20x20 [fill={[type=SOLID] [color=#008000]}] [x=40.00] [y=60.00] [width=20.00] [height=20.00]
        LayoutSVGText {text} at (70,62) size 161x16 contains 1 chunk(s)
          LayoutSVGInlineText {#text} at (0,0) size 161x16
            chunk 1 text run 1 at (70.00,75.00) startOffset 0 endOffset 21 width 160.29: "SVGAnimatedNumberList"
        LayoutSVGRect {rect} at (390,40) size 20x20 [fill={[type=SOLID] [color=#008000]}] [x=40.00] [y=90.00] [width=20.00] [height=20.00]
        LayoutSVGText {text} at (70,92) size 132x16 contains 1 chunk(s)
          LayoutSVGInlineText {#text} at (0,0) size 132x16
            chunk 1 text run 1 at (70.00,105.00) startOffset 0 endOffset 17 width 131.53: "SVGAnimatedLength"
        LayoutSVGRect {rect} at (360,40) size 20x20 [fill={[type=SOLID] [color=#008000]}] [x=40.00] [y=120.00] [width=20.00] [height=20.00]
        LayoutSVGText {text} at (70,122) size 154x16 contains 1 chunk(s)
          LayoutSVGInlineText {#text} at (0,0) size 154x16
            chunk 1 text run 1 at (70.00,135.00) startOffset 0 endOffset 21 width 153.32: "SVGAnimatedLengthList"
        LayoutSVGRect {rect} at (330,40) size 20x20 [fill={[type=SOLID] [color=#008000]}] [x=40.00] [y=150.00] [width=20.00] [height=20.00]
        LayoutSVGText {text} at (70,152) size 125x16 contains 1 chunk(s)
          LayoutSVGInlineText {#text} at (0,0) size 125x16
            chunk 1 text run 1 at (70.00,165.00) startOffset 0 endOffset 16 width 124.52: "SVGAnimatedAngle"
        LayoutSVGRect {rect} at (300,40) size 20x20 [fill={[type=SOLID] [color=#008000]}] [x=40.00] [y=180.00] [width=20.00] [height=20.00]
        LayoutSVGText {text} at (70,182) size 118x16 contains 1 chunk(s)
          LayoutSVGInlineText {#text} at (0,0) size 118x16
            chunk 1 text run 1 at (70.00,195.00) startOffset 0 endOffset 15 width 117.50: "SVGAnimatedRect"
        LayoutSVGRect {rect} at (270,40) size 20x20 [fill={[type=SOLID] [color=#008000]}] [x=40.00] [y=210.00] [width=20.00] [height=20.00]
        LayoutSVGText {text} at (70,212) size 175x16 contains 1 chunk(s)
          LayoutSVGInlineText {#text} at (0,0) size 175x16
            chunk 1 text run 1 at (70.00,225.00) startOffset 0 endOffset 24 width 174.28: "SVGAnimatedTransformList"
        LayoutSVGRect {rect} at (240,40) size 20x20 [fill={[type=SOLID] [color=#008000]}] [x=40.00] [y=240.00] [width=20.00] [height=20.00]
        LayoutSVGText {text} at (70,242) size 221x16 contains 1 chunk(s)
          LayoutSVGInlineText {#text} at (0,0) size 221x16
            chunk 1 text run 1 at (70.00,255.00) startOffset 0 endOffset 30 width 220.21: "SVGAnimatedPreserveAspectRatio"
        LayoutSVGRect {rect} at (210,40) size 20x20 [fill={[type=SOLID] [color=#008000]}] [x=40.00] [y=270.00] [width=20.00] [height=20.00]
        LayoutSVGText {text} at (70,272) size 141x16 contains 1 chunk(s)
          LayoutSVGInlineText {#text} at (0,0) size 141x16
            chunk 1 text run 1 at (70.00,285.00) startOffset 0 endOffset 18 width 140.09: "SVGAnimatedBoolean"
        LayoutSVGRect {rect} at (180,40) size 20x20 [fill={[type=SOLID] [color=#008000]}] [x=40.00] [y=300.00] [width=20.00] [height=20.00]
        LayoutSVGText {text} at (70,302) size 126x16 contains 1 chunk(s)
          LayoutSVGInlineText {#text} at (0,0) size 126x16
            chunk 1 text run 1 at (70.00,315.00) startOffset 0 endOffset 17 width 125.28: "SVGAnimatedString"
        LayoutSVGRect {rect} at (150,40) size 20x20 [fill={[type=SOLID] [color=#008000]}] [x=40.00] [y=330.00] [width=20.00] [height=20.00]
        LayoutSVGText {text} at (70,332) size 169x16 contains 1 chunk(s)
          LayoutSVGInlineText {#text} at (0,0) size 169x16
            chunk 1 text run 1 at (70.00,345.00) startOffset 0 endOffset 22 width 168.09: "SVGAnimatedEnumeration"
        LayoutSVGRect {rect} at (120,40) size 20x20 [fill={[type=SOLID] [color=#008000]}] [x=40.00] [y=360.00] [width=20.00] [height=20.00]
        LayoutSVGText {text} at (70,362) size 133x16 contains 1 chunk(s)
          LayoutSVGInlineText {#text} at (0,0) size 133x16
            chunk 1 text run 1 at (70.00,375.00) startOffset 0 endOffset 18 width 132.30: "SVGAnimatedInteger"
        LayoutSVGRect {rect} at (90,40) size 20x20 [fill={[type=SOLID] [color=#008000]}] [x=40.00] [y=390.00] [width=20.00] [height=20.00]
        LayoutSVGText {text} at (70,392) size 139x16 contains 1 chunk(s)
          LayoutSVGInlineText {#text} at (0,0) size 139x16
            chunk 1 text run 1 at (70.00,405.00) startOffset 0 endOffset 17 width 138.50: "SVGAnimatedNumber"
      LayoutSVGHiddenContainer {g} at (0,0) size 0x0
        LayoutSVGText {text} at (10,-17) size 35x25 contains 1 chunk(s)
          LayoutSVGInlineText {#text} at (0,0) size 35x25
            chunk 1 text run 1 at (10.00,0.00) startOffset 0 endOffset 1 width 10.01: "a"
            chunk 1 text run 2 at (20.01,0.00) startOffset 1 endOffset 2 width 10.01: "b"
            chunk 1 text run 3 at (30.02,0.00) startOffset 2 endOffset 3 width 9.00: "c"
        LayoutSVGEllipse {circle} at (0,0) size 100x100 [fill={[type=SOLID] [color=#000000]}] [cx=0.00] [cy=0.00] [r=100.00]
        LayoutSVGResourceMarker {marker} [id="marker"] [markerUnits=strokeWidth] [ref at (0,0)] [angle=60.00]
        LayoutSVGViewportContainer {svg} at (0,0) size 0x0
        LayoutSVGResourceFilter {filter} [id=""] [filterUnits=objectBoundingBox] [primitiveUnits=userSpaceOnUse]
          [feConvolveMatrix order="width=3 height=3" kernelMatrix="[1.00, 1.00, 1.00, 1.00, 1.00, 1.00, 1.00, 1.00, 1.00]" divisor="9.00" bias="0.00" target="(1,1)" edgeMode="DUPLICATE" preserveAlpha="1"]
            [feTurbulence type="TURBULENCE" baseFrequency="4.00, 5.00" seed="0.00" numOctaves="1" stitchTiles="0"]
    LayoutSVGContainer {g} at (10,310) size 230x37
      LayoutSVGText {text} at (10,310) size 230x37 contains 1 chunk(s)
        LayoutSVGInlineText {#text} at (0,0) size 230x37
          chunk 1 text run 1 at (10.00,340.00) startOffset 0 endOffset 16 width 229.47: "$Revision: 1.7 $"
    LayoutSVGRect {rect} at (0,0) size 480x360 [stroke={[type=SOLID] [color=#000000]}] [x=1.00] [y=1.00] [width=478.00] [height=358.00]
