{
  "bounds": [800, 600],
  "children": [
    {
      "bounds": [800, 600],
      "contentsOpaque": true,
      "drawsContent": true,
      "repaintRects": [
        [30, 30, 200, 23],
        [30, 30, 46, 23],
        [30, 30, 41, 23],
        [8, 8, 244, 67]
      ],
      "paintInvalidationClients": [
        "InlineTextBox ''",
        "RootInlineBox",
        "LayoutTextControl (positioned) INPUT id='input'",
        "LayoutBlockFlow DIV id='inner-editor'",
        "LayoutText #text",
        "InlineTextBox 'NEW'"
      ]
    }
  ]
}

