layer at (0,0) size 800x600
  LayoutView at (0,0) size 800x600
layer at (0,0) size 800x600
  LayoutSVGRoot {svg} at (50,5) size 700x56
    LayoutSVGContainer {g} at (406,5) size 144x56
      LayoutSVGPath {svg:line} at (406,5) size 6x56 [stroke={[type=SOLID] [color=#008000]}] [fill={[type=SOLID] [color=#000000]}] [x1=81.79] [y1=1.00] [x2=81.79] [y2=12.20]
      LayoutSVGPath {svg:line} at (544,5) size 6x56 [stroke={[type=SOLID] [color=#008000]}] [fill={[type=SOLID] [color=#000000]}] [x1=109.30] [y1=1.00] [x2=109.30] [y2=12.20]
      LayoutSVGRect {svg:rect} at (408,5) size 139x56 [fill={[type=SOLID] [color=#FF0000] [opacity=0.40]}] [x=81.79] [y=1.00] [width=27.51] [height=11.20]
    LayoutSVGText {text} at (10,1) size 140x12 contains 1 chunk(s)
      LayoutSVGInlineText {#text} at (0,0) size 140x12
        chunk 1 text run 1 at (10.00,10.00) startOffset 0 endOffset 15 width 65.02: "Text to Stretch"
selection start: position 8 of child 0 {#text} of child 5 {text} of child 0 {svg} of document
selection end:   position 11 of child 0 {#text} of child 5 {text} of child 0 {svg} of document
