CONSOLE WARNING: SVG's SMIL animations (<animate>, <set>, etc.) are deprecated and will be removed. Please use CSS animations or Web animations instead.
layer at (0,0) size 480x360
  LayoutView at (0,0) size 480x360
layer at (0,0) size 480x360
  LayoutSVGRoot {svg} at (0,0) size 480x360
    LayoutSVGText {text} at (10,304) size 264x45 contains 1 chunk(s)
      LayoutSVGInlineText {#text} at (0,0) size 264x45
        chunk 1 text run 1 at (10.00,340.00) startOffset 0 endOffset 16 width 263.34: "$Revision: 1.6 $"
    LayoutSVGRect {rect} at (0,0) size 480x360 [stroke={[type=SOLID] [color=#000000]}] [x=1.00] [y=1.00] [width=478.00] [height=358.00]
    LayoutSVGText {text} at (171,11) size 138x17 contains 1 chunk(s)
      LayoutSVGInlineText {#text} at (0,0) size 137x17
        chunk 1 (middle anchor) text run 1 at (171.89,25.00) startOffset 0 endOffset 18 width 136.22: "<animateTransform>"
    LayoutSVGHiddenContainer {defs} at (0,0) size 0x0
      LayoutSVGContainer {g} at (0,0) size 45x45
        LayoutSVGEllipse {circle} at (0,0) size 41x41 [stroke={[type=SOLID] [color=#C0C0C0] [stroke width=2.00]}] [cx=0.00] [cy=0.00] [r=40.00]
        LayoutSVGPath {line} at (0,0) size 45x1 [stroke={[type=SOLID] [color=#C0C0C0]}] [x1=-45.00] [y1=0.00] [x2=45.00] [y2=0.00]
        LayoutSVGPath {line} at (0,0) size 1x45 [stroke={[type=SOLID] [color=#C0C0C0]}] [x1=0.00] [y1=-45.00] [x2=0.00] [y2=45.00]
    LayoutSVGContainer {g} at (6,56) size 469x242
      LayoutSVGContainer {g} at (6,56) size 108x97 [transform={m=((1.00,0.00)(0.00,1.00)) t=(60.00,90.00)}]
        LayoutSVGRect {rect} at (43,73) size 34x34 [stroke={[type=SOLID] [color=#808080] [stroke width=4.00]}] [fill={[type=SOLID] [color=#E6E6E6]}] [x=-15.00] [y=-15.00] [width=30.00] [height=30.00]
        LayoutSVGRect {rect} at (26,56) size 68x68 [transform={m=((2.00,0.00)(0.00,2.00)) t=(0.00,0.00)}] [stroke={[type=SOLID] [color=#FFB400] [stroke width=4.00]}] [x=-15.00] [y=-15.00] [width=30.00] [height=30.00]
        LayoutSVGText {text} at (-54,46) size 108x17 contains 1 chunk(s)
          LayoutSVGInlineText {#text} at (0,0) size 107x17
            chunk 1 (middle anchor) text run 1 at (-53.37,60.00) startOffset 0 endOffset 16 width 106.74: "additive=replace"
      LayoutSVGContainer {g} at (126,56) size 108x97 [transform={m=((1.00,0.00)(0.00,1.00)) t=(180.00,90.00)}]
        LayoutSVGRect {rect} at (153,73) size 54x34 [transform={m=((1.00,0.00)(0.58,1.00)) t=(0.00,0.00)}] [stroke={[type=SOLID] [color=#808080] [stroke width=4.00]}] [fill={[type=SOLID] [color=#E6E6E6]}] [x=-15.00] [y=-15.00] [width=30.00] [height=30.00]
        LayoutSVGRect {rect} at (126,56) size 108x68 [transform={m=((1.15,2.00)(-2.00,0.00)) t=(0.00,0.00)}] [stroke={[type=SOLID] [color=#FFB400] [stroke width=4.00]}] [x=-15.00] [y=-15.00] [width=30.00] [height=30.00]
        LayoutSVGText {text} at (-44,46) size 88x17 contains 1 chunk(s)
          LayoutSVGInlineText {#text} at (0,0) size 88x17
            chunk 1 (middle anchor) text run 1 at (-43.62,60.00) startOffset 0 endOffset 12 width 87.23: "additive=sum"
      LayoutSVGContainer {g} at (243,56) size 114x112 [transform={m=((1.00,0.00)(0.00,1.00)) t=(300.00,90.00)}]
        LayoutSVGRect {rect} at (283,73) size 34x34 [stroke={[type=SOLID] [color=#808080] [stroke width=4.00]}] [fill={[type=SOLID] [color=#E6E6E6]}] [x=-15.00] [y=-15.00] [width=30.00] [height=30.00]
        LayoutSVGRect {rect} at (266,56) size 68x68 [transform={m=((2.00,0.00)(0.00,2.00)) t=(0.00,0.00)}] [stroke={[type=SOLID] [color=#FFB400] [stroke width=4.00]}] [x=-15.00] [y=-15.00] [width=30.00] [height=30.00]
        LayoutSVGText {text} at (-57,46) size 114x17 contains 1 chunk(s)
          LayoutSVGInlineText {#text} at (0,0) size 113x17
            chunk 1 (middle anchor) text run 1 at (-56.48,60.00) startOffset 0 endOffset 15 width 112.97: "accumulate=none"
        LayoutSVGText {text} at (-54,61) size 108x17 contains 1 chunk(s)
          LayoutSVGInlineText {#text} at (0,0) size 107x17
            chunk 1 (middle anchor) text run 1 at (-53.37,75.00) startOffset 0 endOffset 16 width 106.74: "additive=replace"
      LayoutSVGContainer {g} at (365,56) size 110x112 [transform={m=((1.00,0.00)(0.00,1.00)) t=(420.00,90.00)}]
        LayoutSVGRect {rect} at (411,81) size 18x18 [stroke={[type=SOLID] [color=#808080] [stroke width=2.00]}] [fill={[type=SOLID] [color=#E6E6E6]}] [x=-7.50] [y=-7.50] [width=15.00] [height=15.00]
        LayoutSVGRect {rect} at (386,56) size 68x68 [transform={m=((4.00,0.00)(0.00,4.00)) t=(0.00,0.00)}] [stroke={[type=SOLID] [color=#FFB400] [stroke width=2.00]}] [x=-7.50] [y=-7.50] [width=15.00] [height=15.00]
        LayoutSVGText {text} at (-55,46) size 110x17 contains 1 chunk(s)
          LayoutSVGInlineText {#text} at (0,0) size 109x17
            chunk 1 (middle anchor) text run 1 at (-54.27,60.00) startOffset 0 endOffset 14 width 108.54: "accumulate=sum"
        LayoutSVGText {text} at (-54,61) size 108x17 contains 1 chunk(s)
          LayoutSVGInlineText {#text} at (0,0) size 107x17
            chunk 1 (middle anchor) text run 1 at (-53.37,75.00) startOffset 0 endOffset 16 width 106.74: "additive=replace"
      LayoutSVGContainer {g} at (243,186) size 114x112 [transform={m=((1.00,0.00)(0.00,1.00)) t=(300.00,220.00)}]
        LayoutSVGRect {rect} at (273,203) size 54x34 [transform={m=((1.00,0.00)(0.58,1.00)) t=(0.00,0.00)}] [stroke={[type=SOLID] [color=#808080] [stroke width=4.00]}] [fill={[type=SOLID] [color=#E6E6E6]}] [x=-15.00] [y=-15.00] [width=30.00] [height=30.00]
        LayoutSVGRect {rect} at (246,186) size 108x68 [transform={m=((2.00,0.00)(1.15,2.00)) t=(0.00,0.00)}] [stroke={[type=SOLID] [color=#FFB400] [stroke width=4.00]}] [x=-15.00] [y=-15.00] [width=30.00] [height=30.00]
        LayoutSVGText {text} at (-57,46) size 114x17 contains 1 chunk(s)
          LayoutSVGInlineText {#text} at (0,0) size 113x17
            chunk 1 (middle anchor) text run 1 at (-56.48,60.00) startOffset 0 endOffset 15 width 112.97: "accumulate=none"
        LayoutSVGText {text} at (-44,61) size 88x17 contains 1 chunk(s)
          LayoutSVGInlineText {#text} at (0,0) size 88x17
            chunk 1 (middle anchor) text run 1 at (-43.62,75.00) startOffset 0 endOffset 12 width 87.23: "additive=sum"
      LayoutSVGContainer {g} at (365,186) size 110x112 [transform={m=((1.00,0.00)(0.00,1.00)) t=(420.00,220.00)}]
        LayoutSVGRect {rect} at (406,211) size 28x18 [transform={m=((1.00,0.00)(0.58,1.00)) t=(0.00,0.00)}] [stroke={[type=SOLID] [color=#808080] [stroke width=2.00]}] [fill={[type=SOLID] [color=#E6E6E6]}] [x=-7.50] [y=-7.50] [width=15.00] [height=15.00]
        LayoutSVGRect {rect} at (366,186) size 108x68 [transform={m=((4.00,0.00)(2.31,4.00)) t=(0.00,0.00)}] [stroke={[type=SOLID] [color=#FFB400] [stroke width=2.00]}] [x=-7.50] [y=-7.50] [width=15.00] [height=15.00]
        LayoutSVGText {text} at (-55,46) size 110x17 contains 1 chunk(s)
          LayoutSVGInlineText {#text} at (0,0) size 109x17
            chunk 1 (middle anchor) text run 1 at (-54.27,60.00) startOffset 0 endOffset 14 width 108.54: "accumulate=sum"
        LayoutSVGText {text} at (-44,61) size 88x17 contains 1 chunk(s)
          LayoutSVGInlineText {#text} at (0,0) size 88x17
            chunk 1 (middle anchor) text run 1 at (-43.62,75.00) startOffset 0 endOffset 12 width 87.23: "additive=sum"
