layer at (0,0) size 800x600
  LayoutView at (0,0) size 800x600
layer at (0,0) size 800x600
  LayoutBlockFlow {HTML} at (0,0) size 800x600
    LayoutBlockFlow {BODY} at (8,8) size 784x584
      LayoutBlockFlow {P} at (0,0) size 784x36
        LayoutText {#text} at (0,0) size 742x36
          text run at (0,0) width 457: "This tests clicking to place a caret in the padding of an editable region. "
          text run at (456,0) width 286: "The eventSender clicks to the left of the first"
          text run at (0,18) width 665: "paragraph in the left padding of the editable region and the caret should be at the start of that paragraph."
      LayoutBlockFlow {DIV} at (0,52) size 784x116 [border: (1px solid #000000)]
        LayoutBlockFlow {DIV} at (26,26) size 732x18
          LayoutText {#text} at (0,0) size 100x18
            text run at (0,0) width 100: "Paragraph One."
        LayoutTable {TABLE} at (26,44) size 92x28 [border: (1px solid #BBBBBB)]
          LayoutTableSection {TBODY} at (1,1) size 90x26
            LayoutTableRow {TR} at (0,2) size 90x22 [border: (1px solid #BBBBBB)]
              LayoutTableCell {TD} at (2,2) size 8x22 [border: (1px solid #BBBBBB)] [r=0 c=0 rs=1 cs=1]
                LayoutText {#text} at (2,2) size 4x18
                  text run at (2,2) width 4: " "
              LayoutTableCell {TD} at (12,2) size 76x22 [border: (1px solid #BBBBBB)] [r=0 c=1 rs=1 cs=1]
                LayoutText {#text} at (2,2) size 72x18
                  text run at (2,2) width 72: "ToDo One."
        LayoutBlockFlow {DIV} at (26,72) size 732x18
          LayoutText {#text} at (0,0) size 103x18
            text run at (0,0) width 103: "Paragraph Two."
caret: position 0 of child 0 {#text} of child 1 {DIV} of child 3 {DIV} of body
