{
  "bounds": [800, 600],
  "children": [
    {
      "bounds": [800, 600],
      "contentsOpaque": true,
      "drawsContent": true,
      "repaintRects": [
        [10, 183, 317, 254],
        [10, 183, 317, 254],
        [10, 183, 317, 254],
        [10, 183, 317, 254],
        [10, 183, 317, 254],
        [10, 183, 317, 254],
        [10, 183, 317, 254],
        [10, 183, 317, 254],
        [10, 183, 317, 254],
        [10, 183, 317, 254],
        [10, 63, 317, 374],
        [10, 63, 317, 374],
        [10, 63, 317, 374],
        [10, 63, 317, 374],
        [10, 63, 317, 374],
        [10, 63, 317, 374],
        [10, 63, 317, 374],
        [10, 63, 317, 374],
        [10, 63, 317, 374],
        [10, 63, 317, 374],
        [10, 63, 317, 374]
      ],
      "paintInvalidationClients": [
        "InlineTextBox 'FAIL'",
        "LayoutSVGInlineText #text",
        "RootInlineBox",
        "InlineFlowBox",
        "InlineTextBox ''",
        "InlineFlowBox",
        "InlineTextBox 'PASS'",
        "InlineTextBox ''",
        "InlineFlowBox",
        "InlineTextBox 'PASS'",
        "LayoutSVGRoot (positioned) svg",
        "LayoutSVGText text",
        "LayoutSVGTSpan tspan id='modify'",
        "LayoutSVGInlineText #text",
        "LayoutSVGTSpan tspan",
        "InlineFlowBox",
        "LayoutSVGInlineText #text",
        "InlineTextBox 'PASS'",
        "LayoutSVGInlineText #text",
        "InlineTextBox ' '",
        "LayoutSVGTSpan tspan",
        "InlineFlowBox",
        "LayoutSVGInlineText #text",
        "InlineTextBox 'PASS'",
        "LayoutSVGInlineText #text"
      ]
    }
  ]
}

