layer at (0,0) size 800x600
  LayoutView at (0,0) size 800x600
layer at (0,0) size 800x600
  LayoutSVGRoot {svg} at (50,5) size 250x56
    LayoutSVGContainer {g} at (123,5) size 35x56
      LayoutSVGPath {svg:line} at (123,5) size 6x56 [stroke={[type=SOLID] [color=#008000]}] [fill={[type=SOLID] [color=#000000]}] [x1=25.26] [y1=1.00] [x2=25.26] [y2=12.20]
      LayoutSVGPath {svg:line} at (152,5) size 6x56 [stroke={[type=SOLID] [color=#008000]}] [fill={[type=SOLID] [color=#000000]}] [x1=30.99] [y1=1.00] [x2=30.99] [y2=12.20]
      LayoutSVGRect {svg:rect} at (126,5) size 29x56 [fill={[type=SOLID] [color=#FF0000] [opacity=0.40]}] [x=25.26] [y=1.00] [width=5.73] [height=11.20]
    LayoutSVGText {text} at (10,1) size 50x12 contains 1 chunk(s)
      LayoutSVGInlineText {#text} at (0,0) size 50x12
        chunk 1 text run 1 at (10.00,10.00) startOffset 0 endOffset 15 width 72.82: "Text to Squeeze"
selection start: position 5 of child 0 {#text} of child 5 {text} of child 0 {svg} of document
selection end:   position 7 of child 0 {#text} of child 5 {text} of child 0 {svg} of document
