CONSOLE WARNING: SVG's SMIL animations (<animate>, <set>, etc.) are deprecated and will be removed. Please use CSS animations or Web animations instead.
layer at (0,0) size 800x600
  LayoutView at (0,0) size 800x600
layer at (0,0) size 800x600
  LayoutSVGRoot {svg} at (0,20) size 768x576
    LayoutSVGContainer {g} at (0,20) size 768x576
      LayoutSVGRect {rect} at (0,20) size 768x576 [fill={[type=SOLID] [color=#FFFFFF]}] [x=0.00] [y=0.00] [width=480.00] [height=360.00]
      LayoutSVGContainer {g} at (560,153) size 203x196 [transform={m=((0.45,0.00)(0.00,0.45)) t=(40.00,-20.00)}]
        LayoutSVGContainer {g} at (661,153) size 102x102
          LayoutSVGEllipse {circle} at (661,153) size 102x102 [transform={m=((1.00,0.00)(0.00,1.00)) t=(900.00,300.00)}] [fill={[type=SOLID] [color=#FF0000]}] [cx=0.00] [cy=0.00] [r=70.00]
          LayoutSVGEllipse {circle} at (661,153) size 102x102 [transform={m=((0.00,-1.00)(1.00,0.00)) t=(900.00,300.00)}] [stroke={[type=SOLID] [color=#0000FF] [stroke width=21.00]}] [fill={[type=SOLID] [color=#FF0000]}] [cx=0.00] [cy=0.00] [r=60.00]
          LayoutSVGEllipse {circle} at (675,167) size 74x74 [transform={m=((-0.00,1.00)(-1.00,-0.00)) t=(900.00,300.00)}] [stroke={[type=SOLID] [color=#0000FF] [stroke width=21.00]}] [fill={[type=SOLID] [color=#FF0000]}] [cx=0.00] [cy=0.00] [r=40.00]
          LayoutSVGEllipse {circle} at (690,182) size 44x44 [transform={m=((1.00,0.00)(0.00,1.00)) t=(900.00,300.00)}] [stroke={[type=SOLID] [color=#0000FF] [stroke width=21.00]}] [fill={[type=SOLID] [color=#FF0000]}] [cx=0.00] [cy=0.00] [r=20.00]
        LayoutSVGContainer {g} at (560,196) size 160x153
          LayoutSVGPath {path} at (560,196) size 160x153 [stroke={[type=SOLID] [color=#888888] [stroke width=20.00] [line cap=ROUND] [line join=ROUND]}] [data="M 700 300 C 700 500 900 500 900 300"]
