{
  "bounds": [800, 600],
  "children": [
    {
      "bounds": [800, 600],
      "contentsOpaque": true,
      "drawsContent": true,
      "repaintRects": [
        [33, 22, 700, 196]
      ],
      "paintInvalidationClients": [
        "RootInlineBox",
        "InlineTextBox 'Gradient on fill'",
        "LayoutSVGText text",
        "LayoutSVGResourceLinearGradient linearGradient id='dynGrad'",
        "LayoutSVGGradientStop stop",
        "LayoutSVGGradientStop stop"
      ]
    }
  ]
}

