{
  "bounds": [800, 600],
  "children": [
    {
      "bounds": [800, 600],
      "contentsOpaque": true,
      "drawsContent": true,
      "repaintRects": [
        [242, 253, 167, 200],
        [242, 53, 167, 200],
        [67, 253, 42, 67],
        [67, 186, 42, 67],
        [42, 119, 334, 268],
        [42, 119, 334, 268],
        [42, 119, 334, 268],
        [17, 219, 84, 68],
        [17, 219, 84, 68],
        [17, 219, 84, 68],
        [9, 253, 167, 200],
        [9, 253, 42, 67],
        [9, 186, 42, 67],
        [9, 53, 167, 200],
        [8, 52, 402, 405],
        [8, 52, 102, 405]
      ]
    }
  ]
}

