layer at (0,0) size 800x600 clip at (0,0) size 785x600 scrollHeight 1037
  LayoutView at (0,0) size 800x600
layer at (0,0) size 785x1037 backgroundClip at (0,0) size 785x600 clip at (0,0) size 785x600
  LayoutBlockFlow {HTML} at (0,0) size 785x1037
    LayoutBlockFlow {BODY} at (8,8) size 769x1021 [bgcolor=#CCCCCC]
      LayoutBlockFlow {P} at (0,0) size 769x18
        LayoutInline {<pseudo:first-letter>} at (0,0) size 10x17 [color=#800000]
          LayoutTextFragment (anonymous) at (0,0) size 10x17
            text run at (0,0) width 10: "T"
        LayoutTextFragment {#text} at (9,0) size 354x17
          text run at (9,0) width 354: "he style declarations which apply to the text below are:"
      LayoutBlockFlow {PRE} at (0,34) size 769x112
        LayoutText {#text} at (0,0) size 368x112
          text run at (0,0) width 224: "P:first-line {color: green;}"
          text run at (224,0) width 0: " "
          text run at (0,16) width 248: "P:first-letter {color: maroon;}"
          text run at (248,16) width 0: " "
          text run at (0,32) width 272: ".two:first-line {font-size: 200%;}"
          text run at (272,32) width 0: " "
          text run at (0,48) width 288: ".two:first-letter {font-size: 350%;}"
          text run at (288,48) width 0: " "
          text run at (0,64) width 312: "P.three:first-letter {font-size: 350%;}"
          text run at (312,64) width 0: " "
          text run at (0,80) width 368: "P.three:first-line {font-variant: small-caps;}"
          text run at (368,80) width 0: " "
          text run at (0,96) width 0: " "
      LayoutBlockFlow {HR} at (0,159) size 769x2 [border: (1px inset #EEEEEE)]
      LayoutBlockFlow {P} at (0,177) size 769x54
        LayoutInline {<pseudo:first-letter>} at (0,0) size 10x17 [color=#800000]
          LayoutTextFragment (anonymous) at (0,0) size 10x17
            text run at (0,0) width 10: "T"
        LayoutTextFragment {#text} at (9,0) size 744x53
          text run at (9,0) width 735: "he first letter of this paragraph, and only that one, should be maroon (dark red), while the entire first line should be"
          text run at (0,18) width 44: "green. "
          text run at (43,18) width 525: "If this precise combination does not occur, then the user agent has failed this test. "
          text run at (567,18) width 170: "Remember that in order to"
          text run at (0,36) width 505: "ensure a complete test, the paragraph must be displayed on more than one line."
      LayoutBlockFlow {P} at (0,247) size 769x183
        LayoutInline {<pseudo:first-letter>} at (0,0) size 69x124 [color=#800000]
          LayoutTextFragment (anonymous) at (0,2) size 69x124
            text run at (0,2) width 69: "T"
        LayoutTextFragment {#text} at (68,73) size 766x109
          text run at (68,73) width 634: "he first letter of this paragraph, and only that one,"
          text run at (0,129) width 754: "should be 350% bigger than the rest of the first line of this paragraph and maroon (dark red), while the entire first line"
          text run at (0,147) width 304: "should be 200% bigger than normal and green. "
          text run at (303,147) width 463: "If this precise combination does not occur, then the user agent has failed"
          text run at (0,165) width 58: "this test. "
          text run at (57,165) width 678: "Remember that in order to ensure a complete test, the paragraph must be displayed on more than one line."
      LayoutBlockFlow {P} at (0,446) size 769x118
        LayoutInline {<pseudo:first-letter>} at (0,0) size 76x62 [color=#800000]
          LayoutTextFragment (anonymous) at (0,1) size 76x62
            text run at (0,1) width 76: "\"W"
        LayoutTextFragment {#text} at (75,37) size 757x80
          text run at (75,37) width 340: "e should check for quotation support,\" it was said. "
          text run at (414,37) width 305: "The first two characters in this paragraph-- a"
          text run at (0,64) width 741: "double-quote mark and a capital 'W'-- should be 350% bigger than the rest of the paragraph, and maroon (dark red)."
          text run at (0,82) width 757: "Note that the inclusion of both the quotation mark and the 'W' in the first-letter style is not required under CSS1, but it"
          text run at (0,100) width 114: "is recommended. "
          text run at (113,100) width 462: "In addition, the entire first line should be in a small-caps font and green."
      LayoutTable {TABLE} at (0,580) size 769x441 [border: (1px outset #808080)]
        LayoutTableSection {TBODY} at (1,1) size 767x439
          LayoutTableRow {TR} at (0,0) size 767x26
            LayoutTableCell {TD} at (0,0) size 767x26 [bgcolor=#C0C0C0] [border: (1px inset #808080)] [r=0 c=0 rs=1 cs=2]
              LayoutInline {STRONG} at (0,0) size 163x17
                LayoutText {#text} at (4,4) size 163x17
                  text run at (4,4) width 163: "TABLE Testing Section"
          LayoutTableRow {TR} at (0,26) size 767x413
            LayoutTableCell {TD} at (0,219) size 12x26 [bgcolor=#C0C0C0] [border: (1px inset #808080)] [r=1 c=0 rs=1 cs=1]
              LayoutText {#text} at (4,4) size 4x17
                text run at (4,4) width 4: " "
            LayoutTableCell {TD} at (12,26) size 755x413 [border: (1px inset #808080)] [r=1 c=1 rs=1 cs=1]
              LayoutBlockFlow {P} at (4,4) size 747x54
                LayoutInline {<pseudo:first-letter>} at (0,0) size 10x17 [color=#800000]
                  LayoutTextFragment (anonymous) at (0,0) size 10x17
                    text run at (0,0) width 10: "T"
                LayoutTextFragment {#text} at (9,0) size 744x53
                  text run at (9,0) width 735: "he first letter of this paragraph, and only that one, should be maroon (dark red), while the entire first line should be"
                  text run at (0,18) width 44: "green. "
                  text run at (43,18) width 525: "If this precise combination does not occur, then the user agent has failed this test. "
                  text run at (567,18) width 170: "Remember that in order to"
                  text run at (0,36) width 505: "ensure a complete test, the paragraph must be displayed on more than one line."
              LayoutBlockFlow {P} at (4,74) size 747x201
                LayoutInline {<pseudo:first-letter>} at (0,0) size 69x124 [color=#800000]
                  LayoutTextFragment (anonymous) at (0,2) size 69x124
                    text run at (0,2) width 69: "T"
                LayoutTextFragment {#text} at (68,73) size 742x127
                  text run at (68,73) width 634: "he first letter of this paragraph, and only that one,"
                  text run at (0,129) width 726: "should be 350% bigger than the rest of the first line of this paragraph and maroon (dark red), while the entire first"
                  text run at (0,147) width 332: "line should be 200% bigger than normal and green. "
                  text run at (331,147) width 398: "If this precise combination does not occur, then the user agent"
                  text run at (0,165) width 124: "has failed this test. "
                  text run at (123,165) width 619: "Remember that in order to ensure a complete test, the paragraph must be displayed on more than"
                  text run at (0,183) width 56: "one line."
              LayoutBlockFlow {P} at (4,291) size 747x118
                LayoutInline {<pseudo:first-letter>} at (0,0) size 76x62 [color=#800000]
                  LayoutTextFragment (anonymous) at (0,1) size 76x62
                    text run at (0,1) width 76: "\"W"
                LayoutTextFragment {#text} at (75,37) size 744x80
                  text run at (75,37) width 340: "e should check for quotation support,\" it was said. "
                  text run at (414,37) width 305: "The first two characters in this paragraph-- a"
                  text run at (0,64) width 741: "double-quote mark and a capital 'W'-- should be 350% bigger than the rest of the paragraph, and maroon (dark red)."
                  text run at (0,82) width 744: "Note that the inclusion of both the quotation mark and the 'W' in the first-letter style is not required under CSS1, but"
                  text run at (0,100) width 127: "it is recommended. "
                  text run at (126,100) width 462: "In addition, the entire first line should be in a small-caps font and green."
