layer at (0,0) size 800x600
  LayoutView at (0,0) size 800x600
layer at (0,0) size 800x142
  LayoutBlockFlow {html} at (0,0) size 800x142
    LayoutBlockFlow {body} at (8,16) size 784x118
      LayoutBlockFlow {p} at (0,0) size 784x18
        LayoutText {#text} at (0,0) size 492x18
          text run at (0,0) width 414: "There should be rules around each row and column group in the "
          text run at (413,0) width 79: "table below."
      LayoutTable {table} at (0,34) size 181x84 [border: none]
        LayoutTableCol {colgroup} at (0,0) size 0x0 [border: none (1px solid #000000) none (1px solid #000000)]
          LayoutTableCol {col} at (0,0) size 0x0
        LayoutTableCol {colgroup} at (0,0) size 0x0 [border: none (1px solid #000000) none (1px solid #000000)]
          LayoutTableCol {col} at (0,0) size 0x0
        LayoutTableCol {colgroup} at (0,0) size 0x0 [border: none (1px solid #000000) none (1px solid #000000)]
          LayoutTableCol {col} at (0,0) size 0x0
        LayoutTableSection {thead} at (0,0) size 180x21 [border: (1px solid #808080) none (1px solid #808080) none]
          LayoutTableRow {tr} at (0,0) size 180x21
            LayoutTableCell {th} at (0,0) size 60x21 [border: (1px none #000000)] [r=0 c=0 rs=1 cs=1]
              LayoutText {#text} at (2,2) size 57x18
                text run at (2,2) width 57: "THEAD"
            LayoutTableCell {th} at (60,0) size 60x21 [border: (1px none #000000)] [r=0 c=1 rs=1 cs=1]
              LayoutText {#text} at (2,2) size 57x18
                text run at (2,2) width 57: "THEAD"
            LayoutTableCell {th} at (120,0) size 60x21 [border: (1px none #000000)] [r=0 c=2 rs=1 cs=1]
              LayoutText {#text} at (2,2) size 57x18
                text run at (2,2) width 57: "THEAD"
        LayoutTableSection {tfoot} at (0,62) size 180x21 [border: (1px solid #808080) none (1px solid #808080) none]
          LayoutTableRow {tr} at (0,0) size 180x21
            LayoutTableCell {td} at (0,0) size 60x21 [border: (1px none #000000)] [r=0 c=0 rs=1 cs=1]
              LayoutText {#text} at (2,2) size 52x18
                text run at (2,2) width 52: "TFOOT"
            LayoutTableCell {td} at (60,0) size 60x21 [border: (1px none #000000)] [r=0 c=1 rs=1 cs=1]
              LayoutText {#text} at (2,2) size 52x18
                text run at (2,2) width 52: "TFOOT"
            LayoutTableCell {td} at (120,0) size 60x21 [border: (1px none #000000)] [r=0 c=2 rs=1 cs=1]
              LayoutText {#text} at (2,2) size 52x18
                text run at (2,2) width 52: "TFOOT"
        LayoutTableSection {tbody} at (0,21) size 180x41 [border: (1px solid #808080) none (1px solid #808080) none]
          LayoutTableRow {tr} at (0,0) size 180x21
            LayoutTableCell {td} at (0,0) size 60x21 [border: (1px none #000000)] [r=0 c=0 rs=1 cs=1]
              LayoutText {#text} at (2,2) size 56x18
                text run at (2,2) width 56: "TBODY"
            LayoutTableCell {td} at (60,0) size 60x21 [border: (1px none #000000)] [r=0 c=1 rs=1 cs=1]
              LayoutText {#text} at (2,2) size 56x18
                text run at (2,2) width 56: "TBODY"
            LayoutTableCell {td} at (120,0) size 60x21 [border: (1px none #000000)] [r=0 c=2 rs=1 cs=1]
              LayoutText {#text} at (2,2) size 56x18
                text run at (2,2) width 56: "TBODY"
          LayoutTableRow {tr} at (0,21) size 180x20
            LayoutTableCell {td} at (0,21) size 60x20 [border: none] [r=1 c=0 rs=1 cs=1]
              LayoutText {#text} at (2,1) size 56x18
                text run at (2,1) width 56: "TBODY"
            LayoutTableCell {td} at (60,21) size 60x20 [border: none] [r=1 c=1 rs=1 cs=1]
              LayoutText {#text} at (2,1) size 56x18
                text run at (2,1) width 56: "TBODY"
            LayoutTableCell {td} at (120,21) size 60x20 [border: none] [r=1 c=2 rs=1 cs=1]
              LayoutText {#text} at (2,1) size 56x18
                text run at (2,1) width 56: "TBODY"
