<li class="quit">[<a href="#T00:16:13" id="T00:16:13"><abbr title="2008-01-16T00:16:13+00:00">00:16:13</abbr></a>] <span>* PibbRelay (n=supybot@nat/janrain/x-c272b8f4c30891d0) Quit (Read error: 104 (Connection reset by peer))</span></li>
<li class="join">[<a href="#T00:18:57" id="T00:18:57"><abbr title="2008-01-16T00:18:57+00:00">00:18:57</abbr></a>] <span>* PibbRelay (n=supybot@nat/janrain/x-ebcc49df196d5cc2) has joined #beagle</span></li>
<li class="quit">[<a href="#T00:53:41" id="T00:53:41"><abbr title="2008-01-16T00:53:41+00:00">00:53:41</abbr></a>] <span>* PibbRelay (n=supybot@nat/janrain/x-ebcc49df196d5cc2) Quit (Connection reset by peer)</span></li>
<li class="join">[<a href="#T00:56:10" id="T00:56:10"><abbr title="2008-01-16T00:56:10+00:00">00:56:10</abbr></a>] <span>* PibbRelay (n=supybot@nat/janrain/x-6e49a3dcd1bfc5a5) has joined #beagle</span></li>
<li class="quit">[<a href="#T01:55:48" id="T01:55:48"><abbr title="2008-01-16T01:55:48+00:00">01:55:48</abbr></a>] <span>* PibbRelay (n=supybot@nat/janrain/x-6e49a3dcd1bfc5a5) Quit (Read error: 104 (Connection reset by peer))</span></li>
<li class="join">[<a href="#T01:56:23" id="T01:56:23"><abbr title="2008-01-16T01:56:23+00:00">01:56:23</abbr></a>] <span>* PibbRelay (n=supybot@nat/janrain/x-814789b994adf074) has joined #beagle</span></li>
<li class="quit">[<a href="#T02:30:01" id="T02:30:01"><abbr title="2008-01-16T02:30:01+00:00">02:30:01</abbr></a>] <span>* PibbRelay (n=supybot@nat/janrain/x-814789b994adf074) Quit (Success)</span></li>
<li class="join">[<a href="#T02:32:44" id="T02:32:44"><abbr title="2008-01-16T02:32:44+00:00">02:32:44</abbr></a>] <span>* PibbRelay (n=supybot@nat/janrain/x-439222029c14fc40) has joined #beagle</span></li>
<li class="quit">[<a href="#T02:55:09" id="T02:55:09"><abbr title="2008-01-16T02:55:09+00:00">02:55:09</abbr></a>] <span>* PibbRelay (n=supybot@nat/janrain/x-439222029c14fc40) Quit (Read error: 104 (Connection reset by peer))</span></li>
<li class="join">[<a href="#T02:58:29" id="T02:58:29"><abbr title="2008-01-16T02:58:29+00:00">02:58:29</abbr></a>] <span>* PibbRelay (n=supybot@nat/janrain/x-6dc0f6eda6cf382b) has joined #beagle</span></li>
<li class="quit">[<a href="#T10:13:35" id="T10:13:35"><abbr title="2008-01-16T10:13:35+00:00">10:13:35</abbr></a>] <span>* PibbRelay (n=supybot@nat/janrain/x-6dc0f6eda6cf382b) Quit (SendQ exceeded)</span></li>
<li class="join">[<a href="#T14:02:56" id="T14:02:56"><abbr title="2008-01-16T14:02:56+00:00">14:02:56</abbr></a>] <span>* jkridner (n=a0321898@nat/ti/x-3d73da65d2bb2812) has joined #beagle</span></li>
<li class="join">[<a href="#T18:12:42" id="T18:12:42"><abbr title="2008-01-16T18:12:42+00:00">18:12:42</abbr></a>] <span>* PibbRelay (n=supybot@nat/janrain/x-ef1d4c33a4ba0646) has joined #beagle</span></li>
