%!PS-Adobe-3.0 EPSF-3.0
%%Title: EAGLE Drawing /home/salvix/eagle/digi/digi_led/led.brd
%%Creator: EAGLE
%%Pages: 1
%%BoundingBox: 0 0 91 158
%%EndComments

% Coordinate transfer:

/EU { 254 div 0.072 mul } def
/inch { 72 mul } def

% Linestyle:

1 setlinecap
1 setlinejoin

% Drawing functions:

/l {  % draw a line
   /lw exch def
   /y2 exch def
   /x2 exch def
   /y1 exch def
   /x1 exch def
   newpath
   x1 EU y1 EU moveto
   x2 EU y2 EU lineto
   lw EU setlinewidth
   stroke
   } def

/h {  % draw a hole
   /d  exch def
   /y  exch def
   /x  exch def
   d 0 gt {
     newpath
     x EU y EU d 2 div EU 0 360 arc
     currentgray dup
     1 exch sub setgray
     fill
     setgray
     } if
   } def

/b {  % draw a bar
   /an exch def
   /y2 exch def
   /x2 exch def
   /y1 exch def
   /x1 exch def
   /w2 x2 x1 sub 2 div EU def
   /h2 y2 y1 sub 2 div EU def
   gsave
   x1 x2 add 2 div EU y1 y2 add 2 div EU translate
   an rotate
   newpath
   w2     h2     moveto
   w2 neg h2     lineto
   w2 neg h2 neg lineto
   w2     h2 neg lineto
   closepath
   fill
   grestore
   } def

/c {  % draw a circle
   /lw exch def
   /rd exch def
   /y  exch def
   /x  exch def
   newpath
   lw EU setlinewidth
   x EU y EU rd EU 0 360 arc
   stroke
   } def

/a {  % draw an arc
   /lc exch def
   /ae exch def
   /as exch def
   /lw exch def
   /rd exch def
   /y  exch def
   /x  exch def
   lw rd 2 mul gt {
     /rd rd lw 2 div add 2 div def
     /lw rd 2 mul def
     } if
   currentlinecap currentlinejoin
   lc setlinecap 0 setlinejoin
   newpath
   lw EU setlinewidth
   x EU y EU rd EU as ae arc
   stroke
   setlinejoin setlinecap
   } def

/p {  % draw a pie
   /d exch def
   /y exch def
   /x exch def
   newpath
   x EU y EU d 2 div EU 0 360 arc
   fill
   } def

/edge { 0.20710678119 mul } def

/o {  % draw an octagon
   /an exch def
   /dy exch def
   /dx exch def
   /y  exch def
   /x  exch def
   gsave
   x EU y EU translate
   an dx dy lt { 90 add /dx dy /dy dx def def } if rotate
   newpath
      0 dx 2 div sub EU                    0 dy edge  add EU moveto
      0 dx dy sub 2 div sub dy edge sub EU 0 dy 2 div add EU lineto
      0 dx dy sub 2 div add dy edge add EU 0 dy 2 div add EU lineto
      0 dx 2 div add EU                    0 dy edge  add EU lineto
      0 dx 2 div add EU                    0 dy edge  sub EU lineto
      0 dx dy sub 2 div add dy edge add EU 0 dy 2 div sub EU lineto
      0 dx dy sub 2 div sub dy edge sub EU 0 dy 2 div sub EU lineto
      0 dx 2 div sub EU                    0 dy edge  sub EU lineto
   closepath
   fill
   grestore
   } def

2540 2540 316740 2540 0 l
316740 2540 316740 548540 0 l
316740 548540 2540 548540 0 l
2540 548540 2540 2540 0 l
142240 523240 18796 p
167640 523240 18796 p
193040 523240 18796 p
167640 154940 18796 p
142240 154940 18796 p
66040 383540 18796 p
85090 370840 18796 p
66040 358140 18796 p
256540 408940 20320 p
256540 332740 20320 p
167640 332740 20320 p
167640 408940 20320 p
171958 415036 171958 518160 12700 l
171958 518160 167640 523240 12700 l
171958 415036 167640 408940 12700 l
171958 326644 171958 157226 12700 l
171958 157226 167640 154940 12700 l
171958 326644 167640 332740 12700 l
68834 223520 68834 356108 12700 l
135128 157226 68834 223520 12700 l
68834 356108 66040 358140 12700 l
135128 157226 142240 154940 12700 l
68834 451866 68834 385572 12700 l
135128 518160 68834 451866 12700 l
68834 385572 66040 383540 12700 l
135128 518160 142240 523240 12700 l
216154 370840 85090 370840 12700 l
252984 334010 216154 370840 12700 l
252984 334010 256540 332740 12700 l
194056 473964 194056 518160 12700 l
252984 415036 194056 473964 12700 l
194056 518160 193040 523240 12700 l
252984 415036 256540 408940 12700 l
