%!PS-Adobe-3.0 EPSF-3.0
%%Title: EAGLE Drawing /home/salvix/eagle/digi/digi_led/led.brd
%%Creator: EAGLE
%%Pages: 1
%%BoundingBox: 0 0 91 158
%%EndComments

% Coordinate transfer:

/EU { 254 div 0.072 mul } def
/inch { 72 mul } def

% Linestyle:

1 setlinecap
1 setlinejoin

% Drawing functions:

/l {  % draw a line
   /lw exch def
   /y2 exch def
   /x2 exch def
   /y1 exch def
   /x1 exch def
   newpath
   x1 EU y1 EU moveto
   x2 EU y2 EU lineto
   lw EU setlinewidth
   stroke
   } def

/h {  % draw a hole
   /d  exch def
   /y  exch def
   /x  exch def
   d 0 gt {
     newpath
     x EU y EU d 2 div EU 0 360 arc
     currentgray dup
     1 exch sub setgray
     fill
     setgray
     } if
   } def

/b {  % draw a bar
   /an exch def
   /y2 exch def
   /x2 exch def
   /y1 exch def
   /x1 exch def
   /w2 x2 x1 sub 2 div EU def
   /h2 y2 y1 sub 2 div EU def
   gsave
   x1 x2 add 2 div EU y1 y2 add 2 div EU translate
   an rotate
   newpath
   w2     h2     moveto
   w2 neg h2     lineto
   w2 neg h2 neg lineto
   w2     h2 neg lineto
   closepath
   fill
   grestore
   } def

/c {  % draw a circle
   /lw exch def
   /rd exch def
   /y  exch def
   /x  exch def
   newpath
   lw EU setlinewidth
   x EU y EU rd EU 0 360 arc
   stroke
   } def

/a {  % draw an arc
   /lc exch def
   /ae exch def
   /as exch def
   /lw exch def
   /rd exch def
   /y  exch def
   /x  exch def
   lw rd 2 mul gt {
     /rd rd lw 2 div add 2 div def
     /lw rd 2 mul def
     } if
   currentlinecap currentlinejoin
   lc setlinecap 0 setlinejoin
   newpath
   lw EU setlinewidth
   x EU y EU rd EU as ae arc
   stroke
   setlinejoin setlinecap
   } def

/p {  % draw a pie
   /d exch def
   /y exch def
   /x exch def
   newpath
   x EU y EU d 2 div EU 0 360 arc
   fill
   } def

/edge { 0.20710678119 mul } def

/o {  % draw an octagon
   /an exch def
   /dy exch def
   /dx exch def
   /y  exch def
   /x  exch def
   gsave
   x EU y EU translate
   an dx dy lt { 90 add /dx dy /dy dx def def } if rotate
   newpath
      0 dx 2 div sub EU                    0 dy edge  add EU moveto
      0 dx dy sub 2 div sub dy edge sub EU 0 dy 2 div add EU lineto
      0 dx dy sub 2 div add dy edge add EU 0 dy 2 div add EU lineto
      0 dx 2 div add EU                    0 dy edge  add EU lineto
      0 dx 2 div add EU                    0 dy edge  sub EU lineto
      0 dx dy sub 2 div add dy edge add EU 0 dy 2 div sub EU lineto
      0 dx dy sub 2 div sub dy edge sub EU 0 dy 2 div sub EU lineto
      0 dx 2 div sub EU                    0 dy edge  sub EU lineto
   closepath
   fill
   grestore
   } def

316740 2540 2540 2540 0 l
2540 2540 2540 548540 0 l
2540 548540 316740 548540 0 l
316740 548540 316740 2540 0 l
174593 468044 176542 466095 1016 l
176542 466095 176542 462197 1016 l
176542 462197 174593 460248 1016 l
174593 460248 166797 460248 1016 l
166797 460248 164848 462197 1016 l
164848 462197 164848 466095 1016 l
164848 466095 166797 468044 1016 l
166797 468044 170695 468044 1016 l
170695 468044 170695 464146 1016 l
164848 471942 176542 471942 1016 l
176542 471942 164848 479738 1016 l
164848 479738 176542 479738 1016 l
176542 483636 164848 483636 1016 l
164848 483636 164848 489483 1016 l
164848 489483 166797 491432 1016 l
166797 491432 174593 491432 1016 l
174593 491432 176542 489483 1016 l
176542 489483 176542 483636 1016 l
151142 460248 143346 460248 1016 l
143346 460248 139448 464146 1016 l
139448 464146 143346 468044 1016 l
143346 468044 151142 468044 1016 l
149193 479738 151142 477789 1016 l
151142 477789 151142 473891 1016 l
151142 473891 149193 471942 1016 l
149193 471942 141397 471942 1016 l
141397 471942 139448 473891 1016 l
139448 473891 139448 477789 1016 l
139448 477789 141397 479738 1016 l
149193 491432 151142 489483 1016 l
151142 489483 151142 485585 1016 l
151142 485585 149193 483636 1016 l
149193 483636 141397 483636 1016 l
141397 483636 139448 485585 1016 l
139448 485585 139448 489483 1016 l
139448 489483 141397 491432 1016 l
125742 460248 114048 460248 1016 l
114048 460248 114048 466095 1016 l
114048 466095 115997 468044 1016 l
115997 468044 123793 468044 1016 l
123793 468044 125742 466095 1016 l
125742 466095 125742 460248 1016 l
114048 471942 121844 471942 1016 l
121844 471942 125742 475840 1016 l
125742 475840 121844 479738 1016 l
121844 479738 114048 479738 1016 l
119895 471942 119895 479738 1016 l
114048 487534 125742 487534 1016 l
125742 483636 125742 491432 1016 l
114048 495330 121844 495330 1016 l
121844 495330 125742 499228 1016 l
125742 499228 121844 503126 1016 l
121844 503126 114048 503126 1016 l
119895 495330 119895 503126 1016 l
279656 422656 279656 434350 2032 l
279656 434350 283554 438248 2032 l
283554 438248 287452 434350 2032 l
287452 434350 287452 426554 2032 l
287452 426554 291350 422656 2032 l
291350 422656 295248 426554 2032 l
295248 426554 295248 438248 2032 l
295248 449942 295248 457738 2032 l
295248 457738 291350 461636 2032 l
291350 461636 279656 461636 2032 l
279656 461636 279656 449942 2032 l
279656 449942 283554 446044 2032 l
283554 446044 287452 449942 2032 l
287452 449942 287452 461636 2032 l
303044 469432 303044 473330 2032 l
303044 473330 279656 473330 2032 l
279656 469432 279656 477228 2032 l
295248 485024 279656 492820 2032 l
279656 492820 295248 500616 2032 l
295248 508412 295248 512310 2032 l
295248 512310 279656 512310 2032 l
279656 508412 279656 516208 2032 l
306942 512310 303044 512310 2032 l
295248 524004 279656 539596 2032 l
279656 524004 295248 539596 2032 l
88884 511556 104476 511556 2032 l
104476 511556 88884 527148 2032 l
88884 527148 88884 531046 2032 l
88884 531046 92782 534944 2032 l
92782 534944 100578 534944 2032 l
100578 534944 104476 531046 2032 l
81088 515454 81088 531046 2032 l
81088 531046 77190 534944 2032 l
77190 534944 69394 534944 2032 l
69394 534944 65496 531046 2032 l
65496 531046 65496 515454 2032 l
65496 515454 69394 511556 2032 l
69394 511556 77190 511556 2032 l
77190 511556 81088 515454 2032 l
81088 515454 65496 531046 2032 l
57700 527148 49904 534944 2032 l
49904 534944 49904 511556 2032 l
57700 511556 42108 511556 2032 l
34312 531046 30414 534944 2032 l
30414 534944 22618 534944 2032 l
22618 534944 18720 531046 2032 l
18720 531046 18720 527148 2032 l
18720 527148 22618 523250 2032 l
22618 523250 18720 519352 2032 l
18720 519352 18720 515454 2032 l
18720 515454 22618 511556 2032 l
22618 511556 30414 511556 2032 l
30414 511556 34312 515454 2032 l
34312 515454 34312 519352 2032 l
34312 519352 30414 523250 2032 l
30414 523250 34312 527148 2032 l
34312 527148 34312 531046 2032 l
30414 523250 22618 523250 2032 l
304040 15240 11940 15240 1524 l
11940 15240 11940 294640 1524 l
11940 294640 304040 294640 1524 l
304040 294640 304040 15240 1524 l
138940 529590 132590 535940 2032 l
132590 535940 119890 535940 2032 l
119890 535940 113540 529590 2032 l
113540 516890 119890 510540 2032 l
119890 510540 132590 510540 2032 l
132590 510540 138940 516890 2032 l
183390 535940 170690 535940 2032 l
170690 535940 164340 529590 2032 l
164340 516890 170690 510540 2032 l
164340 529590 157990 535940 2032 l
157990 535940 145290 535940 2032 l
145290 535940 138940 529590 2032 l
138940 516890 145290 510540 2032 l
145290 510540 157990 510540 2032 l
157990 510540 164340 516890 2032 l
189740 529590 189740 516890 2032 l
183390 535940 189740 529590 2032 l
189740 516890 183390 510540 2032 l
170690 510540 183390 510540 2032 l
113540 529590 113540 516890 2032 l
177040 523240 18796 p
151640 523240 18796 p
126240 523240 18796 p
123700 520700 128780 525780 180.0 b
149100 520700 154180 525780 180.0 b
174500 520700 179580 525780 180.0 b
164340 154940 11430 1524 180.00 270.00 0 a
164340 154940 11430 1524 0.00 90.00 0 a
164340 154940 16510 1524 180.00 270.00 0 a
164340 154940 16510 1524 0.00 90.00 0 a
164340 154940 21590 1524 180.00 270.00 0 a
164340 154940 21590 1524 0.00 90.00 0 a
151640 154940 18796 p
177040 154940 18796 p
174304 193509 175109 194314 1270 l
175109 194314 176719 194314 1270 l
176719 194314 177524 193509 1270 l
177524 193509 177524 190289 1270 l
177524 190289 176719 189484 1270 l
176719 189484 175109 189484 1270 l
175109 189484 174304 190289 1270 l
174304 190289 174304 191899 1270 l
174304 191899 175914 191899 1270 l
171911 189484 171911 192704 1270 l
171911 191094 170301 192704 1270 l
170301 192704 169496 192704 1270 l
164818 189484 166428 189484 1270 l
166428 189484 167233 190289 1270 l
167233 190289 167233 191899 1270 l
167233 191899 166428 192704 1270 l
166428 192704 164818 192704 1270 l
164818 192704 164013 191899 1270 l
164013 191899 164013 191094 1270 l
164013 191094 167233 191094 1270 l
159205 189484 160815 189484 1270 l
160815 189484 161620 190289 1270 l
161620 190289 161620 191899 1270 l
161620 191899 160815 192704 1270 l
160815 192704 159205 192704 1270 l
159205 192704 158400 191899 1270 l
158400 191899 158400 191094 1270 l
158400 191094 161620 191094 1270 l
156007 189484 156007 192704 1270 l
156007 192704 153592 192704 1270 l
153592 192704 152787 191899 1270 l
152787 191899 152787 189484 1270 l
189740 173990 189740 135890 2032 l
164340 154940 31750 2540 36.87 323.13 0 a
164340 154940 25400 1524 c
189740 173990 189740 135890 2032 l
253240 370840 26670 2032 51.75 162.85 1 a
253240 370840 26670 2032 197.15 308.25 1 a
269750 391785 269750 349895 2032 l
255780 397389 255780 393377 2032 l
255780 373703 255780 367977 2032 l
255780 348303 255780 344291 2032 l
253240 383540 18796 p
234190 370840 18796 p
253240 358140 18796 p
272925 349436 272925 346216 1270 l
272925 346216 276145 349436 1270 l
276145 349436 276950 349436 1270 l
276950 349436 277755 348631 1270 l
277755 348631 277755 347021 1270 l
277755 347021 276950 346216 1270 l
273730 351829 276950 351829 1270 l
276950 351829 277755 352634 1270 l
277755 352634 277755 354244 1270 l
277755 354244 276950 355049 1270 l
276950 355049 273730 355049 1270 l
273730 355049 272925 354244 1270 l
272925 354244 272925 352634 1270 l
272925 352634 273730 351829 1270 l
273730 351829 276950 355049 1270 l
273730 357442 276950 357442 1270 l
276950 357442 277755 358247 1270 l
277755 358247 277755 359857 1270 l
277755 359857 276950 360662 1270 l
276950 360662 273730 360662 1270 l
273730 360662 272925 359857 1270 l
272925 359857 272925 358247 1270 l
272925 358247 273730 357442 1270 l
273730 357442 276950 360662 1270 l
272925 363055 276145 363055 1270 l
276145 363055 276145 363860 1270 l
276145 363860 275340 364665 1270 l
275340 364665 272925 364665 1270 l
275340 364665 276145 365470 1270 l
276145 365470 275340 366275 1270 l
275340 366275 272925 366275 1270 l
272925 368668 276145 368668 1270 l
276145 368668 277755 370278 1270 l
277755 370278 276145 371888 1270 l
276145 371888 272925 371888 1270 l
275340 368668 275340 371888 1270 l
272925 374281 277755 377502 1270 l
272925 382310 277755 382310 1270 l
277755 382310 275340 379895 1270 l
275340 379895 275340 383115 1270 l
273730 385508 276950 385508 1270 l
276950 385508 277755 386313 1270 l
277755 386313 277755 387923 1270 l
277755 387923 276950 388728 1270 l
276950 388728 273730 388728 1270 l
273730 388728 272925 387923 1270 l
272925 387923 272925 386313 1270 l
272925 386313 273730 385508 1270 l
273730 385508 276950 388728 1270 l
277755 391121 274535 391121 1270 l
274535 391121 272925 392731 1270 l
272925 392731 274535 394341 1270 l
274535 394341 277755 394341 1270 l
50040 396240 50040 345440 2540 l
50040 345440 62740 345440 2540 l
62740 345440 75440 345440 2540 l
75440 345440 75440 396240 2540 l
75440 396240 62740 396240 2540 l
62740 396240 50040 396240 2540 l
62740 345440 62740 342900 2540 l
62740 396240 62740 398780 2540 l
62740 408940 20320 p
62740 332740 20320 p
81835 360717 83445 362327 1270 l
83445 362327 78615 362327 1270 l
78615 360717 78615 363937 1270 l
79420 366330 82640 366330 1270 l
82640 366330 83445 367135 1270 l
83445 367135 83445 368745 1270 l
83445 368745 82640 369550 1270 l
82640 369550 79420 369550 1270 l
79420 369550 78615 368745 1270 l
78615 368745 78615 367135 1270 l
78615 367135 79420 366330 1270 l
79420 366330 82640 369550 1270 l
79420 371943 82640 371943 1270 l
82640 371943 83445 372748 1270 l
83445 372748 83445 374358 1270 l
83445 374358 82640 375163 1270 l
82640 375163 79420 375163 1270 l
79420 375163 78615 374358 1270 l
78615 374358 78615 372748 1270 l
78615 372748 79420 371943 1270 l
79420 371943 82640 375163 1270 l
78615 377556 83445 377556 1270 l
78615 379971 80225 377556 1270 l
80225 377556 81835 379971 1270 l
164340 345440 164340 396240 2540 l
164340 396240 151640 396240 2540 l
151640 396240 138940 396240 2540 l
138940 396240 138940 345440 2540 l
138940 345440 151640 345440 2540 l
151640 345440 164340 345440 2540 l
151640 396240 151640 398780 2540 l
151640 345440 151640 342900 2540 l
151640 332740 20320 p
151640 408940 20320 p
130939 365470 135769 365470 1270 l
135769 365470 133354 363055 1270 l
133354 363055 133354 366275 1270 l
135769 368668 135769 371889 1270 l
135769 371889 134964 371889 1270 l
134964 371889 131744 368668 1270 l
131744 368668 130939 368668 1270 l
131744 374282 134964 374282 1270 l
134964 374282 135769 375087 1270 l
135769 375087 135769 376697 1270 l
135769 376697 134964 377502 1270 l
134964 377502 131744 377502 1270 l
131744 377502 130939 376697 1270 l
130939 376697 130939 375087 1270 l
130939 375087 131744 374282 1270 l
131744 374282 134964 377502 1270 l
