graph "dot" {

"methanobacterium alcaliphilum" -- "-1"
"methanobacterium subterraneum" -- "-1"

"methanobrevibacter millerae" -- "-2"
"methanobrevibacter smithi" -- "-2"

"-1" -- "-3"
"-2" -- "-3"

"thermococcus atlanticus" -- "-4"
"thermococcus pacificus" -- "-4"

"-3" -- "-5"
"-4" -- "-5"

"leifsonia xyli" -- "-6"
"leifsonia rubra" -- "-6"

"kocuria flava" -- "-7"
"kocuria rosea" -- "-7"

"-6" -- "-8"
"-7" -- "-8"

"mycobacterium agri" -- "-9"
"mycobacterium avium" -- "-9"

"-8" -- "-10"
"-9" -- "-10"

"-5" -- "-11"
"-10" -- "-11"


}
