# arrow grub conf
default 0
timeout 3
password --md5 $1$V6NxV$/tkPfVXx7SZENIOR4C6xy0
color light-green/brown blink-red/blue
#color magenta/blue black/magent

title sbu31 2.6.25.4
root (hd0,4)
kernel /arrow/bzImage-2.6.25.4-smp root=/dev/sda7 ro quiet

title windows vista
root (hd0,1)
makeactive
chainloader +1

title slk 12.0
lock
root (hd0,4)
kernel /vmlinuz-huge-smp-2.6.21.5-smp root=/dev/sda7 ro quiet

title sbu31 2.6.24.4
lock
root (hd0,4)
kernel /arrow/bzImage-2.6.24.4-smp root=/dev/sda7 ro quiet

